FailedConsole Output

Skipping 7,946 KB.. Full Log
pes/TestSignedTypes.py (430 of 1785)
PASS: lldb-unit :: Utility/./UtilityTests/BinaryStreamTest.PutULEB128SixBytes (431 of 1785)
PASS: lldb-unit :: Utility/./UtilityTests/ScalarTest.CastOperations (432 of 1785)
PASS: lldb-unit :: debugserver/./debugserverTests/RNBSocket.LoopBackConnectIPv6 (433 of 1785)
PASS: lldb-unit :: Utility/./UtilityTests/StreamTest.PutCharWhitespace (434 of 1785)
PASS: lldb-unit :: Utility/./UtilityTests/StreamTest.PutRawBytesToLittleEndian (435 of 1785)
PASS: lldb-unit :: Utility/./UtilityTests/EventTest.DumpEventDataBytes (436 of 1785)
PASS: lldb-unit :: Symbol/./SymbolTests/DWARFCallFrameInfoTest.Basic_dwarf3 (437 of 1785)
PASS: lldb-api :: functionalities/source-map/TestTargetSourceMap.py (438 of 1785)
PASS: lldb-shell :: BuildScript/script-args.test (439 of 1785)
PASS: lldb-api :: functionalities/data-formatter/data-formatter-skip-summary/TestDataFormatterSkipSummary.py (440 of 1785)
PASS: lldb-unit :: UnwindAssembly/x86/./UnwindAssemblyx86Tests/Testx86AssemblyInspectionEngine.TestPushRBX (441 of 1785)
PASS: lldb-shell :: ObjectFile/PECOFF/uuid.yaml (442 of 1785)
PASS: lldb-unit :: Symbol/./SymbolTests/TestClangASTContext.TestIsClangType (443 of 1785)
PASS: lldb-unit :: ScriptInterpreter/Python/./ScriptInterpreterPythonTests/PythonDataObjectsTest.TestGlobalNameResolutionNoDot (444 of 1785)
PASS: lldb-unit :: Process/gdb-remote/./ProcessGdbRemoteTests/GDBRemoteCommunicationServerTest.SendErrorResponse_StringError (445 of 1785)
PASS: lldb-unit :: Utility/./UtilityTests/StreamTest.PutMaxHex64ByteOrderBig (446 of 1785)
PASS: lldb-unit :: Target/./TargetTests/PathMappingListTest.RemapRoot (447 of 1785)
PASS: lldb-api :: commands/expression/call-function/TestCallUserDefinedFunction.py (448 of 1785)
PASS: lldb-api :: functionalities/data-formatter/varscript_formatting/TestDataFormatterVarScriptFormatting.py (449 of 1785)
PASS: lldb-unit :: Utility/./UtilityTests/DataExtractorTest.GetCStrAtEnd (450 of 1785)
PASS: lldb-api :: functionalities/param_entry_vals/basic_entry_values_x86_64/TestBasicEntryValuesX86_64.py (451 of 1785)
PASS: lldb-api :: macosx/safe-to-func-call/TestSafeFuncCalls.py (452 of 1785)
PASS: lldb-api :: functionalities/thread/exit_during_step/TestExitDuringStep.py (453 of 1785)
PASS: lldb-api :: commands/source/info/TestSourceInfo.py (454 of 1785)
PASS: lldb-unit :: ObjectFile/Breakpad/./ObjectFileBreakpadTests/FileRecord.parse (455 of 1785)
PASS: lldb-api :: functionalities/memory-region/TestMemoryRegion.py (456 of 1785)
PASS: lldb-api :: commands/watchpoints/watchpoint_commands/command/TestWatchpointCommandPython.py (457 of 1785)
PASS: lldb-api :: functionalities/thread/concurrent_events/TestConcurrentDelayWatchBreak.py (458 of 1785)
PASS: lldb-api :: functionalities/data-formatter/data-formatter-objc/TestDataFormatterObjCKVO.py (459 of 1785)
PASS: lldb-api :: functionalities/data-formatter/data-formatter-objc/TestDataFormatterObjCNSDate.py (460 of 1785)
PASS: lldb-api :: functionalities/tail_call_frames/disambiguate_call_site/TestDisambiguateCallSite.py (461 of 1785)
PASS: lldb-unit :: Utility/./UtilityTests/SerializationRountripTest.SerializeDeserializePod (462 of 1785)
PASS: lldb-api :: functionalities/breakpoint/breakpoint_command/TestRegexpBreakCommand.py (463 of 1785)
PASS: lldb-shell :: SymbolFile/DWARF/find-inline-method.s (464 of 1785)
PASS: lldb-api :: lang/objc/objc-struct-argument/TestObjCStructArgument.py (465 of 1785)
PASS: lldb-unit :: Host/./HostTests/Host.GetEnvironment (466 of 1785)
PASS: lldb-unit :: ObjectFile/Breakpad/./ObjectFileBreakpadTests/StackCFIRecord.parse (467 of 1785)
PASS: lldb-shell :: ObjectFile/ELF/aarch64-relocations.yaml (468 of 1785)
PASS: lldb-unit :: Utility/./UtilityTests/RangeTest.DoesAdjoinOrIntersect (469 of 1785)
PASS: lldb-unit :: Language/Highlighting/./HighlighterTests/HighlighterTest.ClangStringLiterals (470 of 1785)
UNSUPPORTED: lldb-api :: linux/thread/create_during_instruction_step/TestCreateDuringInstructionStep.py (471 of 1785)
UNSUPPORTED: lldb-api :: functionalities/darwin_log/format/TestDarwinLogMessageFormat.py (472 of 1785)
PASS: lldb-unit :: Process/gdb-remote/./ProcessGdbRemoteTests/GDBRemoteCommunicationClientTest.GetMemoryRegionInfoInvalidResponse (473 of 1785)
PASS: lldb-unit :: Utility/./UtilityTests/StringListTest.LongestCommonPrefixEmpty (474 of 1785)
PASS: lldb-unit :: UnwindAssembly/x86/./UnwindAssemblyx86Tests/Testx86AssemblyInspectionEngine.TestPopR14 (475 of 1785)
PASS: lldb-api :: functionalities/data-formatter/data-formatter-objc/TestDataFormatterObjCExpr.py (476 of 1785)
UNSUPPORTED: lldb-shell :: SymbolFile/PDB/enums-layout.test (477 of 1785)
UNSUPPORTED: lldb-api :: functionalities/darwin_log/filter/exact_match/subsystem/TestDarwinLogFilterMatchSubsystem.py (478 of 1785)
PASS: lldb-unit :: Utility/./UtilityTests/StringListTest.SplitIntoLines (479 of 1785)
PASS: lldb-api :: lang/objc/objc-runtime-ivars/TestRuntimeIvars.py (480 of 1785)
PASS: lldb-unit :: Process/gdb-remote/./ProcessGdbRemoteTests/GDBRemoteClientBaseTest.SendContinueAndWait (481 of 1785)
PASS: lldb-api :: functionalities/modern-type-lookup/libcxx/TestLibCxxModernTypeLookup.py (482 of 1785)
UNSUPPORTED: lldb-api :: python_api/event/TestEvents.py (483 of 1785)
PASS: lldb-unit :: ScriptInterpreter/Python/./ScriptInterpreterPythonTests/PythonDataObjectsTest.TestObjectAttributes (484 of 1785)
UNSUPPORTED: lldb-shell :: Breakpoint/case-insensitive.test (485 of 1785)
UNSUPPORTED: lldb-api :: functionalities/data-formatter/data-formatter-stl/libstdcpp/unique_ptr/TestDataFormatterStdUniquePtr.py (486 of 1785)
PASS: lldb-api :: functionalities/gdb_remote_client/TestThreadSelectionBug.py (487 of 1785)
PASS: lldb-api :: functionalities/abbreviation/TestAbbreviations.py (488 of 1785)
PASS: lldb-api :: python_api/breakpoint/TestBreakpointAPI.py (489 of 1785)
PASS: lldb-unit :: SymbolFile/DWARF/./SymbolFileDWARFTests/SymbolFileDWARFTests.TestAbbrevInvalidNULLTag (490 of 1785)
UNSUPPORTED: lldb-api :: macosx/macabi/TestMacABImacOSFramework.py (491 of 1785)
PASS: lldb-unit :: Utility/./UtilityTests/UriParserTest.SchemeHostSeparator (492 of 1785)
PASS: lldb-unit :: Utility/./UtilityTests/RangeTest.Copy (493 of 1785)
PASS: lldb-shell :: Settings/TestModuleCacheSanity.test (494 of 1785)
PASS: lldb-api :: python_api/frame/inlines/TestInlinedFrame.py (495 of 1785)
PASS: lldb-unit :: Language/Highlighting/./HighlighterTests/HighlighterTest.ClangOperators (496 of 1785)
PASS: lldb-unit :: Utility/./UtilityTests/CompletionRequest.DuplicateFiltering (497 of 1785)
PASS: lldb-api :: lang/objc/objc-ivar-offsets/TestObjCIvarOffsets.py (498 of 1785)
UNSUPPORTED: lldb-api :: commands/expression/completion-crash1/TestCompletionCrash1.py (499 of 1785)
PASS: lldb-unit :: Utility/./UtilityTests/BinaryStreamTest.PutSLEB128Zero (500 of 1785)
PASS: lldb-unit :: Host/./HostTests/NativeProcessProtocolTest.SetBreakpoint (501 of 1785)
PASS: lldb-api :: functionalities/data-formatter/ostypeformatting/TestFormattersOsType.py (502 of 1785)
PASS: lldb-unit :: Host/./HostTests/SocketTest.DomainGetConnectURI (503 of 1785)
PASS: lldb-api :: lang/c/inlines/TestRedefinitionsInInlines.py (504 of 1785)
PASS: lldb-api :: functionalities/thread/thread_exit/TestThreadExit.py (505 of 1785)
PASS: lldb-api :: python_api/frame/TestFrames.py (506 of 1785)
PASS: lldb-api :: commands/settings/quoting/TestQuoting.py (507 of 1785)
PASS: lldb-shell :: Driver/TestProcessAttach.test (508 of 1785)
PASS: lldb-shell :: SymbolFile/DWARF/debug-types-dwarf5.s (509 of 1785)
PASS: lldb-unit :: ScriptInterpreter/Python/./ScriptInterpreterPythonTests/PythonDataObjectsTest.TestPythonListValueEquality (510 of 1785)
PASS: lldb-unit :: Host/./HostTests/SocketTest.TCPGetAddress (511 of 1785)
PASS: lldb-unit :: ScriptInterpreter/Python/./ScriptInterpreterPythonTests/PythonDataObjectsTest.TestCallable (512 of 1785)
PASS: lldb-unit :: Utility/./UtilityTests/RegularExpression.CopyAssignment (513 of 1785)
PASS: lldb-unit :: Utility/./UtilityTests/CompletionRequest.ShiftArguments (514 of 1785)
PASS: lldb-unit :: Utility/./UtilityTests/BroadcasterTest.BroadcastEvent (515 of 1785)
PASS: lldb-shell :: SymbolFile/NativePDB/globals-fundamental.cpp (516 of 1785)
UNSUPPORTED: lldb-api :: android/platform/TestDefaultCacheLineSize.py (517 of 1785)
UNSUPPORTED: lldb-shell :: Unwind/eh-frame-small-fde.test (518 of 1785)
PASS: lldb-unit :: Utility/./UtilityTests/StringExtractorTest.GetHexU8_Underflow (519 of 1785)
UNSUPPORTED: lldb-api :: arm/breakpoint-it/TestBreakpointIt.py (520 of 1785)
PASS: lldb-unit :: UnwindAssembly/x86/./UnwindAssemblyx86Tests/Testx86AssemblyInspectionEngine.TestSimple32bitFrameFunction (521 of 1785)
PASS: lldb-unit :: Utility/./UtilityTests/StringExtractorTest.GetHexBytesAvail_OddPair (522 of 1785)
PASS: lldb-api :: functionalities/thread/concurrent_events/TestConcurrentSignalWatchBreak.py (523 of 1785)
PASS: lldb-unit :: Process/minidump/./LLDBMinidumpTests/MinidumpParserTest.GetPidWow64 (524 of 1785)
PASS: lldb-unit :: Utility/./UtilityTests/StatusTest.ErrorConversion (525 of 1785)
PASS: lldb-unit :: SymbolFile/NativePDB/./SymbolFileNativePDBTests/PDBFPOProgramToDWARFExpressionTests.InvalidAssignmentMultiple (526 of 1785)
PASS: lldb-unit :: Language/Highlighting/./HighlighterTests/HighlighterTest.ClangCursorPos (527 of 1785)
PASS: lldb-unit :: Core/./LLDBCoreTests/MangledTest.ResultForValidName (528 of 1785)
UNSUPPORTED: lldb-api :: tools/lldb-server/thread-name/TestGdbRemoteThreadName.py (529 of 1785)
PASS: lldb-unit :: Utility/./UtilityTests/ScalarTest.Scalar_512 (530 of 1785)
PASS: lldb-unit :: ScriptInterpreter/Python/./ScriptInterpreterPythonTests/PythonDataObjectsTest.TestPythonCallableInvoke (531 of 1785)
PASS: lldb-shell :: SymbolFile/DWARF/find-variable-dwo.cpp (532 of 1785)
UNSUPPORTED: lldb-api :: functionalities/data-formatter/data-formatter-stl/libstdcpp/tuple/TestDataFormatterStdTuple.py (533 of 1785)
PASS: lldb-api :: functionalities/thread/concurrent_events/TestConcurrentSignalNWatchNBreak.py (534 of 1785)
PASS: lldb-shell :: SymbolFile/DWARF/split-dwarf-inlining.cpp (535 of 1785)
PASS: lldb-shell :: SymbolFile/NativePDB/disassembly.cpp (536 of 1785)
UNSUPPORTED: lldb-api :: functionalities/darwin_log/source/info/TestDarwinLogSourceInfo.py (537 of 1785)
PASS: lldb-unit :: Language/Highlighting/./HighlighterTests/HighlighterTest.ClangUnterminatedString (538 of 1785)
PASS: lldb-api :: lang/objc/modules-auto-import/TestModulesAutoImport.py (539 of 1785)
PASS: lldb-api :: commands/expression/dollar-in-variable/TestDollarInVariable.py (540 of 1785)
PASS: lldb-api :: lang/cpp/stl/TestStdCXXDisassembly.py (541 of 1785)
PASS: lldb-api :: commands/settings/TestSettings.py (542 of 1785)
PASS: lldb-unit :: Language/CPlusPlus/./LanguageCPlusPlusTests/CPlusPlusLanguage.MethodNameParsing (543 of 1785)
PASS: lldb-unit :: Utility/./UtilityTests/StringListTest.CopyListSingle (544 of 1785)
PASS: lldb-api :: functionalities/data-formatter/data-formatter-stl/libcxx/tuple/TestDataFormatterLibcxxTuple.py (545 of 1785)
PASS: lldb-api :: lang/objc/radar-9691614/TestObjCMethodReturningBOOL.py (546 of 1785)
PASS: lldb-api :: commands/expression/import-std-module/queue/TestQueue.py (547 of 1785)
PASS: lldb-unit :: Utility/./UtilityTests/BinaryStreamTest.PutULEB128FiveBytes (548 of 1785)
PASS: lldb-api :: sample_test/TestSampleInlineTest.py (549 of 1785)
PASS: lldb-unit :: Utility/./UtilityTests/RegularExpression.Invalid (550 of 1785)
PASS: lldb-api :: functionalities/history/TestHistoryRecall.py (551 of 1785)
PASS: lldb-shell :: ObjectFile/ELF/section-overlap.yaml (552 of 1785)
PASS: lldb-shell :: Commands/command-script-import.test (553 of 1785)
PASS: lldb-shell :: Python/crashlog.test (554 of 1785)
PASS: lldb-api :: lang/cpp/char1632_t/TestChar1632T.py (555 of 1785)
PASS: lldb-unit :: Utility/./UtilityTests/ConstStringTest.NullAndEmptyStates (556 of 1785)
PASS: lldb-unit :: Process/gdb-remote/./ProcessGdbRemoteTests/GDBRemoteClientBaseTest.SendContinueAndAsyncPacket (557 of 1785)
PASS: lldb-api :: functionalities/data-formatter/format-propagation/TestFormatPropagation.py (558 of 1785)
PASS: lldb-unit :: UnwindAssembly/x86/./UnwindAssemblyx86Tests/Testx86AssemblyInspectionEngine.Test32bitFramelessBigStackFrame (559 of 1785)
PASS: lldb-unit :: Process/gdb-remote/./ProcessGdbRemoteTests/GDBRemoteCommunicationClientTest.WriteRegisterNoSuffix (560 of 1785)
PASS: lldb-unit :: Host/./HostTests/NativeProcessProtocolTest.ReadMemoryWithoutTrap (561 of 1785)
UNSUPPORTED: lldb-api :: tools/lldb-vscode/step/TestVSCode_step.py (562 of 1785)
UNSUPPORTED: lldb-shell :: Register/x86-64-xmm16-write.test (563 of 1785)
UNSUPPORTED: lldb-api :: functionalities/thread/create_during_step/TestCreateDuringStep.py (564 of 1785)
PASS: lldb-unit :: Utility/./UtilityTests/FileSpecTest.FileAndDirectoryComponents (565 of 1785)
PASS: lldb-api :: functionalities/thread/concurrent_events/TestConcurrentBreakpointDelayBreakpointOneSignal.py (566 of 1785)
PASS: lldb-api :: commands/expression/import-std-module/empty-module/TestEmptyStdModule.py (567 of 1785)
PASS: lldb-unit :: Utility/./UtilityTests/RangeTest.ContainsAddr (568 of 1785)
PASS: lldb-api :: lang/objc/foundation/TestObjCMethodsNSArray.py (569 of 1785)
UNSUPPORTED: lldb-api :: benchmarks/stepping/TestSteppingSpeed.py (570 of 1785)
PASS: lldb-unit :: Host/./HostTests/ConnectionFileDescriptorTest.TCPGetURIv6 (571 of 1785)
PASS: lldb-api :: functionalities/data-formatter/poarray/TestPrintObjectArray.py (572 of 1785)
PASS: lldb-shell :: Reproducer/Functionalities/TestDataFormatter.test (573 of 1785)
PASS: lldb-unit :: ScriptInterpreter/Python/./ScriptInterpreterPythonTests/PythonDataObjectsTest.TestPythonTupleInitializerList2 (574 of 1785)
UNSUPPORTED: lldb-api :: functionalities/tty/TestTerminal.py (575 of 1785)
PASS: lldb-unit :: Utility/./UtilityTests/RangeTest.NotEqual (576 of 1785)
PASS: lldb-api :: functionalities/thread/concurrent_events/TestConcurrentManyWatchpoints.py (577 of 1785)
PASS: lldb-api :: commands/command/delete/TestCommandDelete.py (578 of 1785)
PASS: lldb-unit :: Utility/./UtilityTests/LogChannelEnabledTest.log_options (579 of 1785)
PASS: lldb-api :: python_api/thread/TestThreadAPI.py (580 of 1785)
PASS: lldb-unit :: Symbol/./SymbolTests/LineEntryTest.GetSameLineContiguousAddressRangeNoInlines (581 of 1785)
PASS: lldb-unit :: UnwindAssembly/x86/./UnwindAssemblyx86Tests/Testx86AssemblyInspectionEngine.TestSpArithx86_64Augmented (582 of 1785)
PASS: lldb-shell :: Minidump/Windows/find-module.test (583 of 1785)
PASS: lldb-api :: lang/cpp/const_this/TestConstThis.py (584 of 1785)
UNSUPPORTED: lldb-shell :: SymbolFile/PDB/variables-locations.test (585 of 1785)
PASS: lldb-api :: lang/c/stepping/TestThreadStepping.py (586 of 1785)
PASS: lldb-api :: python_api/sbvalue_const_addrof/TestSBValueConstAddrOf.py (587 of 1785)
PASS: lldb-unit :: Utility/./UtilityTests/UserIDResolver.GetGroupName (588 of 1785)
PASS: lldb-api :: commands/watchpoints/step_over_watchpoint/TestStepOverWatchpoint.py (589 of 1785)
PASS: lldb-unit :: Utility/./UtilityTests/ListenerTest.GetEventWait (590 of 1785)
PASS: lldb-unit :: ScriptInterpreter/Python/./ScriptInterpreterPythonTests/PythonExceptionStateTest.TestResetSemantics (591 of 1785)
PASS: lldb-unit :: UnwindAssembly/x86/./UnwindAssemblyx86Tests/Testx86AssemblyInspectionEngine.TestMovRSPtoRBP (592 of 1785)
PASS: lldb-api :: macosx/version_zero/TestGetVersionZeroVersion.py (593 of 1785)
XFAIL: lldb-shell :: Register/x86-64-ymm-write.test (594 of 1785)
PASS: lldb-unit :: Utility/./UtilityTests/VASprintfTest.BufferResize (595 of 1785)
UNSUPPORTED: lldb-api :: lang/objc/rdar-12408181/TestRdar12408181.py (596 of 1785)
UNSUPPORTED: lldb-api :: functionalities/data-formatter/data-formatter-stl/libcxx/function/TestLibCxxFunction.py (597 of 1785)
FAIL: lldb-api :: tools/lldb-server/commandline/TestStubSetSID.py (598 of 1785)
******************** TEST 'lldb-api :: tools/lldb-server/commandline/TestStubSetSID.py' FAILED ********************
lldb version 10.0.99 (http://labmaster3.local/git/llvm-project.git revision e6125fc0ec3418d6529b52f15853a06e000d478d)
  clang revision b1b7a2f7b63db915fbc0e7ee5e1811b8846fbd9b
  llvm revision b1b7a2f7b63db915fbc0e7ee5e1811b8846fbd9b
LLDB library dir: /Users/buildslave/jenkins/workspace/lldb-cmake-sanitized/lldb-build/bin
LLDB import library dir: /Users/buildslave/jenkins/workspace/lldb-cmake-sanitized/lldb-build/bin
libstdcxx tests will not be run because: Don't know how to build with libstdcxx on macosx
Skipping following debug info categories: ['dwo']

Hide Details

Session logs for test failures/errors/unexpected successes will go into directory '/Users/buildslave/jenkins/workspace/lldb-cmake-sanitized/test/logs' Command invoked: /Users/buildslave/jenkins/workspace/lldb-cmake-sanitized/llvm-project/lldb/test/API/dotest.py --arch=x86_64 -s /Users/buildslave/jenkins/workspace/lldb-cmake-sanitized/lldb-build/lldb-test-traces -S nm -u CXXFLAGS -u CFLAGS --executable /Users/buildslave/jenkins/workspace/lldb-cmake-sanitized/lldb-build/./bin/lldb --dsymutil /Users/buildslave/jenkins/workspace/lldb-cmake-sanitized/lldb-build/./bin/dsymutil --filecheck /Users/buildslave/jenkins/workspace/lldb-cmake-sanitized/lldb-build/./bin/FileCheck -C /Users/buildslave/jenkins/workspace/lldb-cmake-sanitized/host-compiler/bin/clang --codesign-identity lldb_codesign --server /Users/buildslave/jenkins/workspace/lldb-cmake-sanitized/lldb-build/./bin/debugserver --arch x86_64 --build-dir /Users/buildslave/jenkins/workspace/lldb-cmake-sanitized/lldb-build/lldb-test-build.noindex -s=/Users/buildslave/jenkins/workspace/lldb-cmake-sanitized/test/logs -t --env TERM=vt100 --env LLVM_LIBS_DIR=/Users/buildslave/jenkins/workspace/lldb-cmake-sanitized/lldb-build/./lib --build-dir /Users/buildslave/jenkins/workspace/lldb-cmake-sanitized/lldb-build/tools/lldb/lldb-test-build.noindex --lldb-module-cache-dir /Users/buildslave/jenkins/workspace/lldb-cmake-sanitized/lldb-build/tools/lldb/lldb-test-build.noindex/module-cache-lldb/lldb-api --clang-module-cache-dir /Users/buildslave/jenkins/workspace/lldb-cmake-sanitized/lldb-build/tools/lldb/lldb-test-build.noindex/module-cache-clang/lldb-api /Users/buildslave/jenkins/workspace/lldb-cmake-sanitized/llvm-project/lldb/packages/Python/lldbsuite/test/tools/lldb-server/commandline -p TestStubSetSID.py Change dir to: /Users/buildslave/jenkins/workspace/lldb-cmake-sanitized/llvm-project/lldb/packages/Python/lldbsuite/test/tools/lldb-server/commandline runCmd: settings set symbols.enable-external-lookup false output:

Hide Details

runCmd: settings set plugin.process.gdb-remote.packet-timeout 60 output:

Hide Details

runCmd: settings set symbols.clang-modules-cache-path "/Users/buildslave/jenkins/workspace/lldb-cmake-sanitized/lldb-build/tools/lldb/lldb-test-build.noindex/module-cache-lldb/lldb-api" output:

Hide Details

runCmd: settings set use-color false output:

Hide Details

Adding tearDown hook: def shutdown_named_pipe(): # Close the pipe. try: named_pipe.close() except: print("failed to close named pipe") None

Hide Details

# Delete the pipe. try: os.remove(named_pipe_path) except: print("failed to delete named pipe: {}".format(named_pipe_path)) None

Hide Details

# Delete the temp directory. try: os.rmdir(temp_dir) except: print( "failed to delete temp dir: {}, directory contents: '{}'".format( temp_dir, os.listdir(temp_dir))) None

Hide Details

Hide Details

Adding tearDown hook: def cleanupSubprocesses(self): # Ensure any subprocesses are cleaned up for p in self.subprocesses: p.terminate() del p del self.subprocesses[:] # Ensure any forked processes are cleaned up for pid in self.forkedProcessPids: if os.path.exists("/proc/" + str(pid)): os.kill(pid, signal.SIGTERM)

Hide Details

Hide Details

Executing tearDown hook: def cleanupSubprocesses(self): # Ensure any subprocesses are cleaned up for p in self.subprocesses: p.terminate() del p del self.subprocesses[:] # Ensure any forked processes are cleaned up for pid in self.forkedProcessPids: if os.path.exists("/proc/" + str(pid)): os.kill(pid, signal.SIGTERM)

Hide Details

Hide Details

Executing tearDown hook: def shutdown_named_pipe(): # Close the pipe. try: named_pipe.close() except: print("failed to close named pipe") None

Hide Details

# Delete the pipe. try: os.remove(named_pipe_path) except: print("failed to delete named pipe: {}".format(named_pipe_path)) None

Hide Details

# Delete the temp directory. try: os.rmdir(temp_dir) except: print( "failed to delete temp dir: {}, directory contents: '{}'".format( temp_dir, os.listdir(temp_dir))) None

Hide Details

Hide Details

PASS: LLDB (/Users/buildslave/jenkins/workspace/lldb-cmake-sanitized/host-compiler/bin/clang-10-x86_64) :: test_sid_is_different_with_S_debugserver (TestStubSetSID.TestStubSetSIDTestCase) runCmd: settings set symbols.enable-external-lookup false output:

Hide Details

runCmd: settings set plugin.process.gdb-remote.packet-timeout 60 output:

Hide Details

runCmd: settings set symbols.clang-modules-cache-path "/Users/buildslave/jenkins/workspace/lldb-cmake-sanitized/lldb-build/tools/lldb/lldb-test-build.noindex/module-cache-lldb/lldb-api" output:

Hide Details

runCmd: settings set use-color false output:

Hide Details

UNSUPPORTED: LLDB (/Users/buildslave/jenkins/workspace/lldb-cmake-sanitized/host-compiler/bin/clang-10-x86_64) :: test_sid_is_different_with_S_llgs (TestStubSetSID.TestStubSetSIDTestCase) (llgs tests) runCmd: settings set symbols.enable-external-lookup false output:

Hide Details

runCmd: settings set plugin.process.gdb-remote.packet-timeout 60 output:

Hide Details

runCmd: settings set symbols.clang-modules-cache-path "/Users/buildslave/jenkins/workspace/lldb-cmake-sanitized/lldb-build/tools/lldb/lldb-test-build.noindex/module-cache-lldb/lldb-api" output:

Hide Details

runCmd: settings set use-color false output:

Hide Details

Adding tearDown hook: def shutdown_named_pipe(): # Close the pipe. try: named_pipe.close() except: print("failed to close named pipe") None

Hide Details

# Delete the pipe. try: os.remove(named_pipe_path) except: print("failed to delete named pipe: {}".format(named_pipe_path)) None

Hide Details

# Delete the temp directory. try: os.rmdir(temp_dir) except: print( "failed to delete temp dir: {}, directory contents: '{}'".format( temp_dir, os.listdir(temp_dir))) None

Hide Details

Hide Details

Adding tearDown hook: def cleanupSubprocesses(self): # Ensure any subprocesses are cleaned up for p in self.subprocesses: p.terminate() del p del self.subprocesses[:] # Ensure any forked processes are cleaned up for pid in self.forkedProcessPids: if os.path.exists("/proc/" + str(pid)): os.kill(pid, signal.SIGTERM)

Hide Details

Hide Details

Executing tearDown hook: def cleanupSubprocesses(self): # Ensure any subprocesses are cleaned up for p in self.subprocesses: p.terminate() del p del self.subprocesses[:] # Ensure any forked processes are cleaned up for pid in self.forkedProcessPids: if os.path.exists("/proc/" + str(pid)): os.kill(pid, signal.SIGTERM)

Hide Details

Hide Details

Executing tearDown hook: def shutdown_named_pipe(): # Close the pipe. try: named_pipe.close() except: print("failed to close named pipe") None

Hide Details

# Delete the pipe. try: os.remove(named_pipe_path) except: print("failed to delete named pipe: {}".format(named_pipe_path)) None

Hide Details

# Delete the temp directory. try: os.rmdir(temp_dir) except: print( "failed to delete temp dir: {}, directory contents: '{}'".format( temp_dir, os.listdir(temp_dir))) None

Hide Details

Hide Details

PASS: LLDB (/Users/buildslave/jenkins/workspace/lldb-cmake-sanitized/host-compiler/bin/clang-10-x86_64) :: test_sid_is_different_with_setsid_debugserver (TestStubSetSID.TestStubSetSIDTestCase) runCmd: settings set symbols.enable-external-lookup false output:

Hide Details

runCmd: settings set plugin.process.gdb-remote.packet-timeout 60 output:

Hide Details

runCmd: settings set symbols.clang-modules-cache-path "/Users/buildslave/jenkins/workspace/lldb-cmake-sanitized/lldb-build/tools/lldb/lldb-test-build.noindex/module-cache-lldb/lldb-api" output:

Hide Details

runCmd: settings set use-color false output:

Hide Details

UNSUPPORTED: LLDB (/Users/buildslave/jenkins/workspace/lldb-cmake-sanitized/host-compiler/bin/clang-10-x86_64) :: test_sid_is_different_with_setsid_llgs (TestStubSetSID.TestStubSetSIDTestCase) (llgs tests) runCmd: settings set symbols.enable-external-lookup false output:

Hide Details

runCmd: settings set plugin.process.gdb-remote.packet-timeout 60 output:

Hide Details

runCmd: settings set symbols.clang-modules-cache-path "/Users/buildslave/jenkins/workspace/lldb-cmake-sanitized/lldb-build/tools/lldb/lldb-test-build.noindex/module-cache-lldb/lldb-api" output:

Hide Details

runCmd: settings set use-color false output:

Hide Details

Adding tearDown hook: def shutdown_named_pipe(): # Close the pipe. try: named_pipe.close() except: print("failed to close named pipe") None

Hide Details

# Delete the pipe. try: os.remove(named_pipe_path) except: print("failed to delete named pipe: {}".format(named_pipe_path)) None

Hide Details

# Delete the temp directory. try: os.rmdir(temp_dir) except: print( "failed to delete temp dir: {}, directory contents: '{}'".format( temp_dir, os.listdir(temp_dir))) None

Hide Details

Hide Details

Adding tearDown hook: def cleanupSubprocesses(self): # Ensure any subprocesses are cleaned up for p in self.subprocesses: p.terminate() del p del self.subprocesses[:] # Ensure any forked processes are cleaned up for pid in self.forkedProcessPids: if os.path.exists("/proc/" + str(pid)): os.kill(pid, signal.SIGTERM)

Hide Details

Hide Details

FAIL: LLDB (/Users/buildslave/jenkins/workspace/lldb-cmake-sanitized/host-compiler/bin/clang-10-x86_64) :: test_sid_is_same_without_setsid_debugserver (TestStubSetSID.TestStubSetSIDTestCase) Executing tearDown hook: def cleanupSubprocesses(self): # Ensure any subprocesses are cleaned up for p in self.subprocesses: p.terminate() del p del self.subprocesses[:] # Ensure any forked processes are cleaned up for pid in self.forkedProcessPids: if os.path.exists("/proc/" + str(pid)): os.kill(pid, signal.SIGTERM)

Hide Details

Hide Details

Executing tearDown hook: def shutdown_named_pipe(): # Close the pipe. try: named_pipe.close() except: print("failed to close named pipe") None

Hide Details

# Delete the pipe. try: os.remove(named_pipe_path) except: print("failed to delete named pipe: {}".format(named_pipe_path)) None

Hide Details

# Delete the temp directory. try: os.rmdir(temp_dir) except: print( "failed to delete temp dir: {}, directory contents: '{}'".format( temp_dir, os.listdir(temp_dir))) None

Hide Details

Hide Details

runCmd: settings set symbols.enable-external-lookup false output:

Hide Details

runCmd: settings set plugin.process.gdb-remote.packet-timeout 60 output:

Hide Details

runCmd: settings set symbols.clang-modules-cache-path "/Users/buildslave/jenkins/workspace/lldb-cmake-sanitized/lldb-build/tools/lldb/lldb-test-build.noindex/module-cache-lldb/lldb-api" output:

Hide Details

runCmd: settings set use-color false output:

Hide Details

UNSUPPORTED: LLDB (/Users/buildslave/jenkins/workspace/lldb-cmake-sanitized/host-compiler/bin/clang-10-x86_64) :: test_sid_is_same_without_setsid_llgs (TestStubSetSID.TestStubSetSIDTestCase) (llgs tests) Restore dir to: /Users/buildslave/jenkins/workspace/lldb-cmake-sanitized/lldb-build/tools/lldb/test ====================================================================== FAIL: test_sid_is_same_without_setsid_debugserver (TestStubSetSID.TestStubSetSIDTestCase) ---------------------------------------------------------------------- Traceback (most recent call last): File "/Users/buildslave/jenkins/workspace/lldb-cmake-sanitized/llvm-project/lldb/packages/Python/lldbsuite/test/decorators.py", line 141, in wrapper func(*args, **kwargs) File "/Users/buildslave/jenkins/workspace/lldb-cmake-sanitized/llvm-project/lldb/packages/Python/lldbsuite/test/decorators.py", line 141, in wrapper func(*args, **kwargs) File "/Users/buildslave/jenkins/workspace/lldb-cmake-sanitized/llvm-project/lldb/packages/Python/lldbsuite/test/tools/lldb-server/commandline/TestStubSetSID.py", line 48, in test_sid_is_same_without_setsid_debugserver self.sid_is_same_without_setsid() File "/Users/buildslave/jenkins/workspace/lldb-cmake-sanitized/llvm-project/lldb/packages/Python/lldbsuite/test/tools/lldb-server/commandline/TestStubSetSID.py", line 32, in sid_is_same_without_setsid stub_sid = self.get_stub_sid() File "/Users/buildslave/jenkins/workspace/lldb-cmake-sanitized/llvm-project/lldb/packages/Python/lldbsuite/test/tools/lldb-server/commandline/TestStubSetSID.py", line 26, in get_stub_sid server.pid, True)) AssertionError: False is not True Config=x86_64-/Users/buildslave/jenkins/workspace/lldb-cmake-sanitized/host-compiler/bin/clang-10 ---------------------------------------------------------------------- Ran 6 tests in 18.699s

Hide Details

RESULT: FAILED (2 passes, 1 failures, 0 errors, 3 skipped, 0 expected failures, 0 unexpected successes)

Hide Details

******************** PASS: lldb-api :: functionalities/tsan/global_location/TestTsanGlobalLocation.py (599 of 1785) PASS: lldb-api :: functionalities/postmortem/elf-core/TestLinuxCore.py (600 of 1785) PASS: lldb-api :: lang/cpp/global_variables/TestCPPGlobalVariables.py (601 of 1785) PASS: lldb-unit :: Utility/./UtilityTests/StringExtractorTest.GetHexU8_Exact_NoEof (602 of 1785) PASS: lldb-api :: functionalities/data-formatter/data-formatter-advanced/TestDataFormatterAdv.py (603 of 1785) PASS: lldb-unit :: UnwindAssembly/x86/./UnwindAssemblyx86Tests/Testx86AssemblyInspectionEngine.TestPopRBPWithREX (604 of 1785) PASS: lldb-unit :: Utility/./UtilityTests/ArgsTest.TestUnknownEscape (605 of 1785) UNSUPPORTED: lldb-api :: commands/watchpoints/variable_out_of_scope/TestWatchedVarHitWhenInScope.py (606 of 1785) PASS: lldb-shell :: SymbolFile/Breakpad/symtab-macho.test (607 of 1785) PASS: lldb-unit :: Process/gdb-remote/./ProcessGdbRemoteTests/GDBRemoteCommunicationServerTest.SendErrorResponse_Status (608 of 1785) PASS: lldb-api :: functionalities/breakpoint/breakpoint_command/TestBreakpointCommand.py (609 of 1785) PASS: lldb-api :: functionalities/archives/TestBSDArchives.py (610 of 1785) PASS: lldb-shell :: SymbolFile/DWARF/parallel-indexing-stress.s (611 of 1785) PASS: lldb-unit :: Host/./HostTests/NativeProcessProtocolTest.SetBreakpointFailWrite (612 of 1785) PASS: lldb-unit :: SymbolFile/DWARF/./SymbolFileDWARFTests/SymbolFileDWARFTests.TestAbbrevOrder1Start1 (613 of 1785) PASS: lldb-api :: lang/cpp/operator-overload/TestOperatorOverload.py (614 of 1785) PASS: lldb-unit :: Utility/./UtilityTests/StringListTest.SplitIntoLinesEmpty (615 of 1785) PASS: lldb-unit :: Utility/./UtilityTests/VMRange.ContainsAddr (616 of 1785) PASS: lldb-unit :: Host/./HostTests/FileSystemTest.OpenErrno (617 of 1785) PASS: lldb-unit :: ObjectFile/Breakpad/./ObjectFileBreakpadTests/FuncRecord.parse (618 of 1785) PASS: lldb-api :: lang/c/modules/TestCModules.py (619 of 1785) PASS: lldb-unit :: Process/gdb-remote/./ProcessGdbRemoteTests/GDBRemoteCommunicationClientTest.SendGetMetaDataPacket (620 of 1785) PASS: lldb-api :: commands/command/invalid-args/TestInvalidArgsCommand.py (621 of 1785) PASS: lldb-api :: types/TestDoubleTypes.py (622 of 1785) PASS: lldb-unit :: Utility/./UtilityTests/BinaryStreamTest.PutSLEB128FiveBytes (623 of 1785) PASS: lldb-shell :: Driver/TestSingleQuote.test (624 of 1785) PASS: lldb-unit :: SymbolFile/NativePDB/./SymbolFileNativePDBTests/PDBFPOProgramToDWARFExpressionTests.UnsupportedRASearch (625 of 1785) PASS: lldb-api :: commands/expression/function_template_specialization_temp_args/TestFunctionTemplateSpecializationTempArgs.py (626 of 1785) PASS: lldb-shell :: Quit/TestQuitExitCodeHex0.test (627 of 1785) PASS: lldb-unit :: Utility/./UtilityTests/StreamTest.PutBytesAsRawHex8ToLittleEndian (628 of 1785) PASS: lldb-api :: commands/expression/call-function/TestCallStdStringFunction.py (629 of 1785) PASS: lldb-unit :: Utility/./UtilityTests/StreamTest.PutBytesAsRawHex8ToBigEndian (630 of 1785) PASS: lldb-unit :: Utility/./UtilityTests/StringListTest.SplitIntoLinesSingleTrailingCR (631 of 1785) PASS: lldb-unit :: UnwindAssembly/x86/./UnwindAssemblyx86Tests/Testx86AssemblyInspectionEngine.TestStackRealign32BitDisp_x86_64 (632 of 1785) XFAIL: lldb-shell :: Register/x86-mm-xmm-read.test (633 of 1785) PASS: lldb-unit :: Utility/./UtilityTests/NameMatchesTest.Ignore (634 of 1785) PASS: lldb-unit :: Utility/./UtilityTests/OptionsWithRawTest.SingleWordSuffix (635 of 1785) PASS: lldb-api :: lang/cpp/thread_local/TestThreadLocal.py (636 of 1785) PASS: lldb-shell :: Minidump/fb-dump.test (637 of 1785) PASS: lldb-unit :: Expression/./ExpressionTests/CppModuleConfigurationTest.IgnoreLibStdCpp (638 of 1785) PASS: lldb-unit :: Expression/./ExpressionTests/DiagnosticManagerTest.AddDiagnostic (639 of 1785) PASS: lldb-unit :: Utility/./UtilityTests/StringListTest.ShiftCString (640 of 1785) PASS: lldb-api :: commands/reproducer/invalid-args/TestInvalidArgsReproducer.py (641 of 1785) PASS: lldb-shell :: SymbolFile/NativePDB/ast-functions.cpp (642 of 1785) PASS: lldb-unit :: Symbol/./SymbolTests/TestClangASTContext.TestUnifyAccessSpecifiers (643 of 1785) PASS: lldb-unit :: Utility/./UtilityTests/FileSpecTest.RemoveLastPathComponent (644 of 1785) PASS: lldb-api :: functionalities/thread/concurrent_events/TestConcurrentNWatchNBreak.py (645 of 1785) PASS: lldb-api :: functionalities/breakpoint/global_constructor/TestBreakpointInGlobalConstructor.py (646 of 1785) UNSUPPORTED: lldb-shell :: SymbolFile/PDB/type-quals.test (647 of 1785) XFAIL: lldb-shell :: Unwind/prefer-debug-over-eh-frame.test (648 of 1785) UNSUPPORTED: lldb-api :: functionalities/unwind/standard/TestStandardUnwind.py (649 of 1785) PASS: lldb-api :: functionalities/tail_call_frames/unambiguous_sequence/TestUnambiguousTailCalls.py (650 of 1785) PASS: lldb-api :: types/TestFloatTypesExpr.py (651 of 1785) PASS: lldb-unit :: Utility/./UtilityTests/UUIDTest.RelationalOperators (652 of 1785) PASS: lldb-unit :: Utility/./UtilityTests/StreamTeeTest.AppendStream (653 of 1785) PASS: lldb-api :: functionalities/dynamic_value_child_count/TestDynamicValueChildCount.py (654 of 1785) PASS: lldb-shell :: ObjectFile/ELF/gnu-debuglink.yaml (655 of 1785) PASS: lldb-unit :: Utility/./UtilityTests/RangeDataVector.FindEntryThatContains_Overlap (656 of 1785) PASS: lldb-unit :: Utility/./UtilityTests/SerializationRountripTest.SerializeDeserializePodReferences (657 of 1785) PASS: lldb-api :: functionalities/data-formatter/pyobjsynthprovider/TestPyObjSynthProvider.py (658 of 1785) UNSUPPORTED: lldb-api :: functionalities/darwin_log/filter/regex/message/TestDarwinLogFilterRegexMessage.py (659 of 1785) PASS: lldb-api :: functionalities/testid/TestTestId.py (660 of 1785) PASS: lldb-unit :: Utility/./UtilityTests/EnvironmentTest.EnvpConstruction (661 of 1785) PASS: lldb-api :: functionalities/asan/TestMemoryHistory.py (662 of 1785) UNSUPPORTED: lldb-api :: functionalities/darwin_log/filter/exact_match/activity-chain/TestDarwinLogFilterMatchActivityChain.py (663 of 1785) PASS: lldb-unit :: Host/./HostTests/SocketTest.TCPListen0ConnectAccept (664 of 1785) PASS: lldb-unit :: UnwindAssembly/x86/./UnwindAssemblyx86Tests/Testx86AssemblyInspectionEngine.TestSimplex86_64Augmented (665 of 1785) PASS: lldb-unit :: Utility/./UtilityTests/BinaryStreamTest.PutULEB128ThreeBytes (666 of 1785) PASS: lldb-shell :: Driver/LocalLLDBInit.test (667 of 1785) PASS: lldb-shell :: SymbolFile/DWARF/debug-types-address-ranges.s (668 of 1785) PASS: lldb-unit :: Utility/./UtilityTests/ArgsTest.TestSingleQuotedArgWithSpace (669 of 1785) PASS: lldb-shell :: Quit/TestQuitExitCodeNonInt.test (670 of 1785) PASS: lldb-shell :: Reproducer/TestDriverOptions.test (671 of 1785) UNSUPPORTED: lldb-api :: tools/lldb-server/platform-process-connect/TestPlatformProcessConnect.py (672 of 1785) PASS: lldb-unit :: Utility/./UtilityTests/StringLexerTest.Next (673 of 1785) PASS: lldb-unit :: Utility/./UtilityTests/UriParserTest.SchemeHostSeparator3 (674 of 1785) PASS: lldb-api :: functionalities/breakpoint/breakpoint_by_line_and_column/TestBreakpointByLineAndColumn.py (675 of 1785) PASS: lldb-api :: functionalities/data-formatter/refpointer-recursion/TestDataFormatterRefPtrRecursion.py (676 of 1785) PASS: lldb-unit :: Utility/./UtilityTests/ProcessInstanceInfo.DumpTable (677 of 1785) PASS: lldb-unit :: Utility/./UtilityTests/StringExtractorTest.DecodeHexU8_Underflow2 (678 of 1785) PASS: lldb-shell :: ObjectFile/ELF/section-types.yaml (679 of 1785) PASS: lldb-api :: functionalities/unwind/noreturn/module-end/TestNoReturnModuleEnd.py (680 of 1785) PASS: lldb-api :: commands/expression/unicode-in-variable/TestUnicodeInVariable.py (681 of 1785) PASS: lldb-unit :: ScriptInterpreter/Python/./ScriptInterpreterPythonTests/PythonDataObjectsTest.TestPythonString (682 of 1785) PASS: lldb-unit :: Language/Highlighting/./HighlighterTests/HighlighterTest.HighlighterSelectionPath (683 of 1785) PASS: lldb-unit :: Utility/./UtilityTests/OptionsWithRawTest.ArgsButNoDelimiter (684 of 1785) PASS: lldb-api :: commands/frame/diagnose/dereference-function-return/TestDiagnoseDereferenceFunctionReturn.py (685 of 1785) PASS: lldb-api :: lang/objc/foundation/TestObjCMethodsString.py (686 of 1785) XFAIL: lldb-shell :: Register/x86-mm-xmm-write.test (687 of 1785) PASS: lldb-unit :: Utility/./UtilityTests/StringExtractorTest.GetHexU8_Underflow2_NoEof (688 of 1785) UNSUPPORTED: lldb-api :: functionalities/data-formatter/data-formatter-stl/libstdcpp/vector/TestDataFormatterStdVector.py (689 of 1785) PASS: lldb-unit :: Utility/./UtilityTests/StringExtractorTest.GetHexBytesAvail_Underflow (690 of 1785) UNSUPPORTED: lldb-shell :: SymbolFile/PDB/typedefs.test (691 of 1785) PASS: lldb-unit :: Utility/./UtilityTests/StringListTest.JoinEmpty (692 of 1785) PASS: lldb-unit :: Process/gdb-remote/./ProcessGdbRemoteTests/GDBRemoteCommunicationClientTest.GetMemoryRegionInfo (693 of 1785) PASS: lldb-unit :: UnwindAssembly/x86/./UnwindAssemblyx86Tests/Testx86AssemblyInspectionEngine.TestPopEBX (694 of 1785) PASS: lldb-api :: lang/objc/foundation/TestObjCMethods2.py (695 of 1785) PASS: lldb-unit :: Expression/./ExpressionTests/CppModuleConfigurationTest.LinuxLocalLibCpp (696 of 1785) UNSUPPORTED: lldb-api :: tools/lldb-vscode/breakpoint/TestVSCode_setFunctionBreakpoints.py (697 of 1785) UNSUPPORTED: lldb-api :: functionalities/exec/TestExec.py (698 of 1785) PASS: lldb-api :: functionalities/breakpoint/scripted_bkpt/TestScriptedResolver.py (699 of 1785) PASS: lldb-shell :: SymbolFile/NativePDB/function-types-builtins.cpp (700 of 1785) PASS: lldb-api :: functionalities/data-formatter/type_summary_list_arg/TestTypeSummaryListArg.py (701 of 1785) PASS: lldb-shell :: SymbolFile/NativePDB/globals-bss.cpp (702 of 1785) PASS: lldb-unit :: UnwindAssembly/x86/./UnwindAssemblyx86Tests/Testx86AssemblyInspectionEngine.TestPushR13 (703 of 1785) PASS: lldb-api :: functionalities/tail_call_frames/ambiguous_tail_call_seq1/TestAmbiguousTailCallSeq1.py (704 of 1785) PASS: lldb-unit :: Host/./HostTests/SocketTest.TCPListen0GetPort (705 of 1785) PASS: lldb-unit :: Utility/./UtilityTests/StreamTeeTest.Write (706 of 1785) PASS: lldb-unit :: Utility/./UtilityTests/TimerTest.CategoryTimes2 (707 of 1785) UNSUPPORTED: lldb-shell :: SymbolFile/PDB/ast-restore.test (708 of 1785) PASS: lldb-api :: lang/cpp/this/TestCPPThis.py (709 of 1785) PASS: lldb-api :: commands/platform/basic/TestPlatformCommand.py (710 of 1785) PASS: lldb-shell :: SymbolFile/Breakpad/symtab.test (711 of 1785) PASS: lldb-shell :: ObjectFile/ELF/base-address.yaml (712 of 1785) PASS: lldb-api :: lang/objc/conflicting-definition/TestConflictingDefinition.py (713 of 1785) PASS: lldb-unit :: UnwindAssembly/x86/./UnwindAssemblyx86Tests/Testx86AssemblyInspectionEngine.TestLEAVE (714 of 1785) PASS: lldb-unit :: Process/minidump/./LLDBMinidumpTests/RegisterContextMinidump.ConvertMinidumpContext_x86_32 (715 of 1785) PASS: lldb-unit :: Utility/./UtilityTests/RangeTest.ContainsRange (716 of 1785) PASS: lldb-unit :: Utility/./UtilityTests/StreamTest.PutULEB128 (717 of 1785) UNSUPPORTED: lldb-api :: commands/expression/multiline-completion/TestMultilineCompletion.py (718 of 1785) PASS: lldb-shell :: SymbolFile/NativePDB/tag-types.cpp (719 of 1785) PASS: lldb-unit :: Utility/./UtilityTests/StreamTest.PutCString (720 of 1785) PASS: lldb-api :: functionalities/thread/create_after_attach/TestCreateAfterAttach.py (721 of 1785) PASS: lldb-api :: functionalities/breakpoint/breakpoint_ignore_count/TestBreakpointIgnoreCount.py (722 of 1785) PASS: lldb-unit :: UnwindAssembly/x86/./UnwindAssemblyx86Tests/Testx86AssemblyInspectionEngine.TestCALLNextInsn (723 of 1785) PASS: lldb-unit :: Expression/./ExpressionTests/DiagnosticManagerTest.AppendMessageNoDiag (724 of 1785) PASS: lldb-shell :: Reproducer/TestDump.test (725 of 1785) UNSUPPORTED: lldb-api :: commands/expression/call-restarts/TestCallThatRestarts.py (726 of 1785) PASS: lldb-api :: functionalities/set-data/TestSetData.py (727 of 1785) PASS: lldb-unit :: Symbol/./SymbolTests/PostfixExpression.ToDWARF (728 of 1785) UNSUPPORTED: lldb-shell :: SymbolFile/NativePDB/stack_unwinding01.cpp (729 of 1785) PASS: lldb-api :: commands/expression/radar_9531204/TestPrintfAfterUp.py (730 of 1785) PASS: lldb-unit :: Utility/./UtilityTests/CompletionRequest.FakeLastArg (731 of 1785) PASS: lldb-unit :: Utility/./UtilityTests/StringExtractorTest.DecodeHexU8_InvalidHex (732 of 1785) PASS: lldb-unit :: Process/gdb-remote/./ProcessGdbRemoteTests/GDBRemoteCommunicationClientTest.GetModulesInfo (733 of 1785) PASS: lldb-api :: python_api/watchpoint/condition/TestWatchpointConditionAPI.py (734 of 1785) PASS: lldb-api :: functionalities/data-formatter/vector-types/TestVectorTypesFormatting.py (735 of 1785) PASS: lldb-api :: commands/command/script/TestCommandScript.py (736 of 1785) PASS: lldb-shell :: SymbolFile/Breakpad/unwind-via-stack-cfi.test (737 of 1785) PASS: lldb-api :: macosx/function-starts/TestFunctionStarts.py (738 of 1785) PASS: lldb-unit :: Utility/./UtilityTests/ScalarTest.Promotion (739 of 1785) PASS: lldb-unit :: Utility/./UtilityTests/RecordReplayTest.InstrumentedBar (740 of 1785) PASS: lldb-unit :: Utility/./UtilityTests/StreamTest.PutMaxHex64ByteOrderLittle (741 of 1785) PASS: lldb-unit :: Symbol/./SymbolTests/PostfixExpression.ParseOneExpression (742 of 1785) PASS: lldb-unit :: Process/gdb-remote/./ProcessGdbRemoteTests/GDBRemoteCommunicationClientTest.SendGetDataPacket (743 of 1785) PASS: lldb-api :: commands/frame/diagnose/dereference-argument/TestDiagnoseDereferenceArgument.py (744 of 1785) PASS: lldb-shell :: SymbolFile/DWARF/deterministic-build.cpp (745 of 1785) PASS: lldb-api :: tools/lldb-server/TestLldbGdbServer.py (746 of 1785) PASS: lldb-unit :: Utility/./UtilityTests/StringListTest.AppendListCStringArrayEmpty (747 of 1785) UNSUPPORTED: lldb-api :: functionalities/data-formatter/data-formatter-stl/libstdcpp/list/TestDataFormatterStdList.py (748 of 1785) PASS: lldb-unit :: Utility/./UtilityTests/FileSpecTest.PrependPathComponent (749 of 1785) PASS: lldb-api :: functionalities/postmortem/netbsd-core/TestNetBSDCore.py (750 of 1785) PASS: lldb-unit :: Process/minidump/./LLDBMinidumpTests/MinidumpParserTest.GetPid (751 of 1785) PASS: lldb-api :: commands/expression/import-std-module/stack/TestStack.py (752 of 1785) PASS: lldb-api :: lang/objc/objc-class-method/TestObjCClassMethod.py (753 of 1785) PASS: lldb-api :: functionalities/breakpoint/step_over_breakpoint/TestStepOverBreakpoint.py (754 of 1785) PASS: lldb-api :: macosx/find-app-in-bundle/TestFindAppInBundle.py (755 of 1785) PASS: lldb-unit :: Utility/./UtilityTests/StringExtractorTest.GetHexU8_Extra (756 of 1785) PASS: lldb-unit :: Host/./HostTests/TaskPoolTest.RunTasks (757 of 1785) PASS: lldb-unit :: Utility/./UtilityTests/UriParserTest.MinimalPath (758 of 1785) PASS: lldb-shell :: ObjectFile/MachO/lc_build_version.yaml (759 of 1785) PASS: lldb-shell :: ObjectFile/ELF/PT_LOAD-empty.yaml (760 of 1785) PASS: lldb-unit :: Process/minidump/./LLDBMinidumpTests/MinidumpParserTest.MinidumpModuleOrder (761 of 1785) PASS: lldb-unit :: Utility/./UtilityTests/RangeTest.EqualInvalid (762 of 1785) PASS: lldb-api :: functionalities/data-formatter/data-formatter-stl/libcxx/list/loop/TestDataFormatterLibcxxListLoop.py (763 of 1785) PASS: lldb-api :: lang/objc/objc-property/TestObjCProperty.py (764 of 1785) PASS: lldb-api :: commands/frame/var-scope/TestFrameVariableScope.py (765 of 1785) PASS: lldb-api :: functionalities/multidebugger_commands/TestMultipleDebuggersCommands.py (766 of 1785) PASS: lldb-unit :: SymbolFile/NativePDB/./SymbolFileNativePDBTests/PDBFPOProgramToDWARFExpressionTests.SingleAssignmentRegisterRef (767 of 1785) UNSUPPORTED: lldb-shell :: Register/x86-64-ymm16-write.test (768 of 1785) PASS: lldb-unit :: UnwindAssembly/x86/./UnwindAssemblyx86Tests/Testx86AssemblyInspectionEngine.Test32bitFramelessSmallStackFrame (769 of 1785) PASS: lldb-shell :: SymbolFile/DWARF/find-basic-variable.cpp (770 of 1785) PASS: lldb-shell :: SymbolFile/DWARF/dwarf5_locations.s (771 of 1785) PASS: lldb-api :: python_api/function_symbol/TestSymbolAPI.py (772 of 1785) PASS: lldb-unit :: SymbolFile/DWARF/./SymbolFileDWARFTests/DWARFASTParserClangTests.EnsureAllDIEsInDeclContextHaveBeenParsedParsesOnlyMatchingEntries (773 of 1785) UNSUPPORTED: lldb-shell :: Register/x86-zmm-write.test (774 of 1785) PASS: lldb-unit :: Utility/./UtilityTests/StringListTest.InsertStringAtIndexStart (775 of 1785) PASS: lldb-api :: api/check_public_api_headers/TestPublicAPIHeaders.py (776 of 1785) PASS: lldb-api :: functionalities/data-formatter/language_category_updates/TestDataFormatterLanguageCategoryUpdates.py (777 of 1785) PASS: lldb-api :: lang/cpp/class-template-parameter-pack/TestClassTemplateParameterPack.py (778 of 1785) PASS: lldb-unit :: Utility/./UtilityTests/StringListTest.AppendStringStdString (779 of 1785) PASS: lldb-api :: python_api/sblaunchinfo/TestSBLaunchInfo.py (780 of 1785) PASS: lldb-api :: tools/lldb-server/TestGdbRemoteThreadsInStopReply.py (781 of 1785) PASS: lldb-shell :: SymbolFile/DWARF/dir-separator-posix.s (782 of 1785) PASS: lldb-unit :: Process/minidump/./LLDBMinidumpTests/MinidumpParserTest.FindMemoryRangeWithFullMemoryMinidump (783 of 1785) PASS: lldb-unit :: Language/Highlighting/./HighlighterTests/HighlighterTest.ClangCommas (784 of 1785) PASS: lldb-shell :: ObjectFile/ELF/PT_LOAD-overlap.yaml (785 of 1785) PASS: lldb-api :: functionalities/memory/cache/TestMemoryCache.py (786 of 1785) UNSUPPORTED: lldb-api :: functionalities/unwind/ehframe/TestEhFrameUnwind.py (787 of 1785) PASS: lldb-unit :: Utility/./UtilityTests/UriParserTest.MinimalPort (788 of 1785) PASS: lldb-unit :: Process/gdb-remote/./ProcessGdbRemoteTests/GDBRemoteClientBaseTest.SendContinueAndAsyncSignal (789 of 1785) PASS: lldb-unit :: Utility/./UtilityTests/ScalarTest.Equality (790 of 1785) PASS: lldb-unit :: ScriptInterpreter/Python/./ScriptInterpreterPythonTests/PythonDataObjectsTest.TestGlobalNameResolutionWithDot (791 of 1785) PASS: lldb-unit :: Utility/./UtilityTests/ArgsTest.ReplaceArgumentAtIndexLonger (792 of 1785) PASS: lldb-unit :: Utility/./UtilityTests/AnsiTerminal.KnownPrefix (793 of 1785) PASS: lldb-unit :: Utility/./UtilityTests/UUIDTest.Validity (794 of 1785) PASS: lldb-api :: lang/objc/modules-cache/TestClangModulesCache.py (795 of 1785) PASS: lldb-api :: lang/cpp/template/TestTemplateArgs.py (796 of 1785) PASS: lldb-unit :: Utility/./UtilityTests/StringListTest.LongestCommonPrefix (797 of 1785) PASS: lldb-unit :: Utility/./UtilityTests/LogChannelTest.EnableOptions (798 of 1785) PASS: lldb-unit :: tools/lldb-server/tests/./LLDBServerTests/StandardStartupTest.TestStopReplyContainsThreadPcs (799 of 1785) UNSUPPORTED: lldb-api :: lang/c/typedef/Testtypedef.py (800 of 1785) PASS: lldb-unit :: ScriptInterpreter/Python/./ScriptInterpreterPythonTests/PythonDataObjectsTest.TestPythonDictionaryToStructuredDictionary (801 of 1785) PASS: lldb-unit :: ScriptInterpreter/Python/./ScriptInterpreterPythonTests/PythonDataObjectsTest.TestPythonBoolean (802 of 1785) PASS: lldb-api :: functionalities/signal/handle-abrt/TestHandleAbort.py (803 of 1785) PASS: lldb-unit :: Utility/./UtilityTests/ArgsTest.ReplaceArgumentAtIndexEqual (804 of 1785) PASS: lldb-unit :: Process/gdb-remote/./ProcessGdbRemoteTests/GDBRemoteCommunicationClientTest.SyncThreadState (805 of 1785) PASS: lldb-unit :: ScriptInterpreter/Python/./ScriptInterpreterPythonTests/PythonDataObjectsTest.TestInstanceNameResolutionNoDot (806 of 1785) PASS: lldb-unit :: Utility/./UtilityTests/StringExtractorTest.GetHexU8_InvalidHex (807 of 1785) PASS: lldb-unit :: Utility/./UtilityTests/StreamTest.ChangingByteOrder (808 of 1785) PASS: lldb-unit :: Expression/./ExpressionTests/CppModuleConfigurationTest.MissingUsrInclude (809 of 1785) PASS: lldb-unit :: Utility/./UtilityTests/StringExtractorTest.DecodeHexU8_Extra (810 of 1785) PASS: lldb-unit :: ScriptInterpreter/Python/./ScriptInterpreterPythonTests/PythonExceptionStateTest.TestAutoRestoreSemantics (811 of 1785) PASS: lldb-unit :: Utility/./UtilityTests/UserIDResolver.GetUserName (812 of 1785) PASS: lldb-api :: functionalities/thread/concurrent_events/TestConcurrentSignalBreak.py (813 of 1785) PASS: lldb-api :: functionalities/thread/concurrent_events/TestConcurrentTwoWatchpointThreads.py (814 of 1785) PASS: lldb-api :: functionalities/modern-type-lookup/basic/TestBasicModernTypeLookup.py (815 of 1785) PASS: lldb-api :: python_api/lldbutil/iter/TestRegistersIterator.py (816 of 1785) PASS: lldb-unit :: UnwindAssembly/x86/./UnwindAssemblyx86Tests/Testx86AssemblyInspectionEngine.Testi386IgnoredRegisters (817 of 1785) PASS: lldb-api :: commands/expression/import-std-module/vector-of-vectors/TestVectorOfVectors.py (818 of 1785) PASS: lldb-api :: functionalities/breakpoint/debugbreak/TestDebugBreak.py (819 of 1785) PASS: lldb-shell :: ObjectFile/Breakpad/discontiguous-sections.test (820 of 1785) PASS: lldb-shell :: SymbolFile/NativePDB/break-by-line.cpp (821 of 1785) PASS: lldb-unit :: Utility/./UtilityTests/OptionsWithRawTest.UnterminatedQuote (822 of 1785) PASS: lldb-unit :: Utility/./UtilityTests/BinaryStreamTest.PutULEB128SevenBytes (823 of 1785) PASS: lldb-shell :: ObjectFile/PECOFF/sections-names.yaml (824 of 1785) PASS: lldb-unit :: Utility/./UtilityTests/LogTest.Unregister (825 of 1785) PASS: lldb-shell :: Driver/TestCommands.test (826 of 1785) PASS: lldb-unit :: Symbol/./SymbolTests/DWARFCallFrameInfoTest.Basic_dwarf4 (827 of 1785) PASS: lldb-shell :: SymbolFile/DWARF/find-function-regex.cpp (828 of 1785) PASS: lldb-unit :: SymbolFile/DWARF/./SymbolFileDWARFTests/SymbolFileDWARFTests.TestAbbrevNullAttrValidForm (829 of 1785) PASS: lldb-shell :: ObjectFile/ELF/minidebuginfo-find-symbols.yaml (830 of 1785) PASS: lldb-api :: functionalities/data-formatter/hexcaps/TestDataFormatterHexCaps.py (831 of 1785) PASS: lldb-unit :: Utility/./UtilityTests/LogChannelTest.Enable (832 of 1785) PASS: lldb-unit :: SymbolFile/NativePDB/./SymbolFileNativePDBTests/PDBFPOProgramToDWARFExpressionTests.UnresolvedRegisterReference (833 of 1785) PASS: lldb-api :: commands/watchpoints/watchpoint_commands/condition/TestWatchpointConditionCmd.py (834 of 1785) PASS: lldb-shell :: SymbolFile/DWARF/apple-index-is-used.cpp (835 of 1785) PASS: lldb-api :: arm/emulation/TestEmulations.py (836 of 1785) PASS: lldb-api :: python_api/signals/TestSignalsAPI.py (837 of 1785) FAIL: lldb-shell :: Reproducer/Functionalities/TestImageList.test (838 of 1785) ******************** TEST 'lldb-shell :: Reproducer/Functionalities/TestImageList.test' FAILED ******************** Script: -- : 'RUN: at line 6'; /Users/buildslave/jenkins/workspace/lldb-cmake-sanitized/lldb-build/bin/clang -isysroot /Applications/Xcode.app/Contents/Developer/Platforms/MacOSX.platform/Developer/SDKs/MacOSX.sdk -fmodules-cache-path=/Users/buildslave/jenkins/workspace/lldb-cmake-sanitized/lldb-build/tools/lldb/lldb-test-build.noindex/module-cache-clang/lldb-shell /Users/buildslave/jenkins/workspace/lldb-cmake-sanitized/llvm-project/lldb/test/Shell/Reproducer/Functionalities/Inputs/stepping.c -g -o /Users/buildslave/jenkins/workspace/lldb-cmake-sanitized/lldb-build/tools/lldb/test/Reproducer/Functionalities/Output/TestImageList.test.tmp.out : 'RUN: at line 8'; rm -rf /Users/buildslave/jenkins/workspace/lldb-cmake-sanitized/lldb-build/tools/lldb/test/Reproducer/Functionalities/Output/TestImageList.test.tmp.txt : 'RUN: at line 10'; echo "CAPTURE" >> /Users/buildslave/jenkins/workspace/lldb-cmake-sanitized/lldb-build/tools/lldb/test/Reproducer/Functionalities/Output/TestImageList.test.tmp.txt : 'RUN: at line 11'; /Users/buildslave/jenkins/workspace/lldb-cmake-sanitized/lldb-build/bin/lldb --no-lldbinit -S /Users/buildslave/jenkins/workspace/lldb-cmake-sanitized/lldb-build/tools/lldb/test/Shell/lit-lldb-init -x -b --capture --capture-path /Users/buildslave/jenkins/workspace/lldb-cmake-sanitized/lldb-build/tools/lldb/test/Reproducer/Functionalities/Output/TestImageList.test.tmp.repro -o 'run' -o 'image list' -o 'reproducer generate' /Users/buildslave/jenkins/workspace/lldb-cmake-sanitized/lldb-build/tools/lldb/test/Reproducer/Functionalities/Output/TestImageList.test.tmp.out >> /Users/buildslave/jenkins/workspace/lldb-cmake-sanitized/lldb-build/tools/lldb/test/Reproducer/Functionalities/Output/TestImageList.test.tmp.txt 2>&1 : 'RUN: at line 17'; echo "REPLAY" >> /Users/buildslave/jenkins/workspace/lldb-cmake-sanitized/lldb-build/tools/lldb/test/Reproducer/Functionalities/Output/TestImageList.test.tmp.txt : 'RUN: at line 18'; /Users/buildslave/jenkins/workspace/lldb-cmake-sanitized/lldb-build/bin/lldb --no-lldbinit -S /Users/buildslave/jenkins/workspace/lldb-cmake-sanitized/lldb-build/tools/lldb/test/Shell/lit-lldb-init -x -b --replay /Users/buildslave/jenkins/workspace/lldb-cmake-sanitized/lldb-build/tools/lldb/test/Reproducer/Functionalities/Output/TestImageList.test.tmp.repro >> /Users/buildslave/jenkins/workspace/lldb-cmake-sanitized/lldb-build/tools/lldb/test/Reproducer/Functionalities/Output/TestImageList.test.tmp.txt 2>&1 : 'RUN: at line 20'; cat /Users/buildslave/jenkins/workspace/lldb-cmake-sanitized/lldb-build/tools/lldb/test/Reproducer/Functionalities/Output/TestImageList.test.tmp.txt | /Users/buildslave/jenkins/workspace/lldb-cmake-sanitized/lldb-build/bin/FileCheck /Users/buildslave/jenkins/workspace/lldb-cmake-sanitized/llvm-project/lldb/test/Shell/Reproducer/Functionalities/TestImageList.test -- Exit Code: 134

Hide Details

Command Output (stderr): -- clang-10: warning: argument unused during compilation: '-fmodules-cache-path=/Users/buildslave/jenkins/workspace/lldb-cmake-sanitized/lldb-build/tools/lldb/lldb-test-build.noindex/module-cache-clang/lldb-shell' [-Wunused-command-line-argument] /Users/buildslave/jenkins/workspace/lldb-cmake-sanitized/lldb-build/tools/lldb/test/Reproducer/Functionalities/Output/TestImageList.test.script: line 7: 29153 Abort trap: 6 /Users/buildslave/jenkins/workspace/lldb-cmake-sanitized/lldb-build/bin/lldb --no-lldbinit -S /Users/buildslave/jenkins/workspace/lldb-cmake-sanitized/lldb-build/tools/lldb/test/Shell/lit-lldb-init -x -b --replay /Users/buildslave/jenkins/workspace/lldb-cmake-sanitized/lldb-build/tools/lldb/test/Reproducer/Functionalities/Output/TestImageList.test.tmp.repro >> /Users/buildslave/jenkins/workspace/lldb-cmake-sanitized/lldb-build/tools/lldb/test/Reproducer/Functionalities/Output/TestImageList.test.tmp.txt 2>&1

Hide Details

--

Hide Details

******************** PASS: lldb-unit :: UnwindAssembly/x86/./UnwindAssemblyx86Tests/Testx86AssemblyInspectionEngine.TestPopR15 (839 of 1785) PASS: lldb-api :: functionalities/data-formatter/type_summary_list_script/TestTypeSummaryListScript.py (840 of 1785) PASS: lldb-unit :: Utility/./UtilityTests/StreamTest.PutHex32ByteOrderLittle (841 of 1785) PASS: lldb-unit :: ScriptInterpreter/Python/./ScriptInterpreterPythonTests/PythonDataObjectsTest.TestPythonStringToStr (842 of 1785) PASS: lldb-api :: functionalities/data-formatter/ptr_ref_typedef/TestPtrRef2Typedef.py (843 of 1785) PASS: lldb-api :: functionalities/breakpoint/cpp/TestCPPBreakpointLocations.py (844 of 1785) PASS: lldb-unit :: Utility/./UtilityTests/StringLexerTest.Peek (845 of 1785) PASS: lldb-unit :: Utility/./UtilityTests/ArgsTest.ReplaceArgumentAtIndexOutOfRange (846 of 1785) PASS: lldb-unit :: ObjectFile/Breakpad/./ObjectFileBreakpadTests/StackWinRecord.parse (847 of 1785) PASS: lldb-api :: functionalities/avoids-fd-leak/TestFdLeak.py (848 of 1785) PASS: lldb-api :: commands/expression/radar_9673664/TestExprHelpExamples.py (849 of 1785) PASS: lldb-unit :: Expression/./ExpressionTests/CppModuleConfigurationTest.AmbiguousCLib (850 of 1785) PASS: lldb-unit :: Utility/./UtilityTests/TildeExpressionResolver.ResolveFullPath (851 of 1785) PASS: lldb-api :: functionalities/object-file/TestImageListMultiArchitecture.py (852 of 1785) PASS: lldb-unit :: Process/gdb-remote/./ProcessGdbRemoteTests/GDBRemoteCommunicationClientTest.GetModulesInfoInvalidResponse (853 of 1785) PASS: lldb-unit :: Expression/./ExpressionTests/CppModuleConfigurationTest.Sysroot (854 of 1785) PASS: lldb-unit :: Host/./HostTests/HostInfoTest.GetHostname (855 of 1785) PASS: lldb-api :: lang/cpp/inlines/TestInlines.py (856 of 1785) PASS: lldb-unit :: Utility/./UtilityTests/StringListTest.GetMaxStringLengthDecreasingSize (857 of 1785) PASS: lldb-shell :: Breakpoint/split-dwarf-5-addrbase.test (858 of 1785) PASS: lldb-api :: commands/log/invalid-args/TestInvalidArgsLog.py (859 of 1785) PASS: lldb-unit :: Utility/./UtilityTests/RangeTest.SlideZero (860 of 1785) UNSUPPORTED: lldb-shell :: Process/Windows/exception_access_violation.cpp (861 of 1785) PASS: lldb-api :: functionalities/pre_run_dylibs/TestPreRunDylibs.py (862 of 1785) PASS: lldb-unit :: Language/Highlighting/./HighlighterTests/HighlighterTest.ClangIdentifiers (863 of 1785) PASS: lldb-api :: lang/c/tls_globals/TestTlsGlobals.py (864 of 1785) PASS: lldb-unit :: Language/Highlighting/./HighlighterTests/HighlighterTest.ClangCursorPosBeforeOtherToken (865 of 1785) PASS: lldb-unit :: Expression/./ExpressionTests/DiagnosticManagerTest.PutStringSeverities (866 of 1785) PASS: lldb-api :: lang/objc/unicode-string/TestUnicodeString.py (867 of 1785) PASS: lldb-api :: commands/expression/call-function/TestCallBuiltinFunction.py (868 of 1785) PASS: lldb-api :: functionalities/data-formatter/data-formatter-stl/libcxx/bitset/TestDataFormatterLibcxxBitset.py (869 of 1785) PASS: lldb-api :: functionalities/data-formatter/boolreference/TestFormattersBoolRefPtr.py (870 of 1785) PASS: lldb-unit :: Process/minidump/./LLDBMinidumpTests/MinidumpParserTest.GetExceptionStream (871 of 1785) UNSUPPORTED: lldb-api :: tools/lldb-vscode/stackTrace/TestVSCode_stackTrace.py (872 of 1785) PASS: lldb-api :: functionalities/data-formatter/data-formatter-objc/TestDataFormatterObjCNSContainer.py (873 of 1785) PASS: lldb-api :: python_api/sbvalue_persist/TestSBValuePersist.py (874 of 1785) PASS: lldb-api :: lang/objc/objc-optimized/TestObjcOptimized.py (875 of 1785) PASS: lldb-unit :: SymbolFile/DWARF/./SymbolFileDWARFTests/SymbolFileDWARFTests.TestAbbrevOrder1Start5 (876 of 1785) PASS: lldb-api :: commands/target/basic/TestTargetCommand.py (877 of 1785) PASS: lldb-unit :: Utility/./UtilityTests/StreamTeeTest.DefaultConstructor (878 of 1785) PASS: lldb-unit :: Utility/./UtilityTests/StreamTest.PutSLEB128 (879 of 1785) PASS: lldb-shell :: SymbolFile/DWARF/compilercontext.ll (880 of 1785) PASS: lldb-api :: commands/expression/import-std-module/basic/TestImportStdModule.py (881 of 1785) PASS: lldb-shell :: Settings/TestStopCommandSourceOnError.test (882 of 1785) PASS: lldb-shell :: Quit/TestQuitExitCode0.test (883 of 1785) PASS: lldb-unit :: Utility/./UtilityTests/ScalarTest.RightShiftOperator (884 of 1785) PASS: lldb-api :: lang/objc/objc-static-method/TestObjCStaticMethod.py (885 of 1785) UNSUPPORTED: lldb-api :: tools/lldb-server/libraries-svr4/TestGdbRemoteLibrariesSvr4Support.py (886 of 1785) PASS: lldb-api :: functionalities/wrong_commands/TestWrongCommands.py (887 of 1785) PASS: lldb-api :: commands/expression/class_template_specialization_empty_pack/TestClassTemplateSpecializationParametersHandling.py (888 of 1785) PASS: lldb-unit :: Utility/./UtilityTests/RangeTest.ClearWithStarAddress (889 of 1785) PASS: lldb-unit :: Host/./HostTests/FileActionTest.Open (890 of 1785) PASS: lldb-api :: lang/cpp/offsetof/TestOffsetofCpp.py (891 of 1785) PASS: lldb-api :: functionalities/memory/find/TestMemoryFind.py (892 of 1785) PASS: lldb-api :: python_api/exprpath_synthetic/TestExprPathSynthetic.py (893 of 1785) PASS: lldb-unit :: UnwindAssembly/x86/./UnwindAssemblyx86Tests/Testx86AssemblyInspectionEngine.TestPushR14 (894 of 1785) PASS: lldb-unit :: ScriptInterpreter/Python/./ScriptInterpreterPythonTests/PythonDataObjectsTest.TestPythonTupleInitializerList (895 of 1785) PASS: lldb-unit :: Utility/./UtilityTests/FileSpecTest.AppendPathComponent (896 of 1785) PASS: lldb-api :: lang/cpp/gmodules-templates/TestGModules.py (897 of 1785) PASS: lldb-api :: functionalities/inferior-changed/TestInferiorChanged.py (898 of 1785) PASS: lldb-api :: commands/add-dsym/uuid/TestAddDsymCommand.py (899 of 1785) PASS: lldb-unit :: UnwindAssembly/x86/./UnwindAssemblyx86Tests/Testx86AssemblyInspectionEngine.TestSubESP (900 of 1785) PASS: lldb-unit :: Host/./HostTests/SocketTest.UDPGetConnectURI (901 of 1785) PASS: lldb-api :: lang/cpp/enum_types/TestCPP11EnumTypes.py (902 of 1785) PASS: lldb-api :: functionalities/tsan/basic/TestTsanBasic.py (903 of 1785) PASS: lldb-api :: commands/expression/scoped_enums/TestScopedEnumType.py (904 of 1785) PASS: lldb-unit :: Expression/./ExpressionTests/DiagnosticManagerTest.GetStringMultipleDiags (905 of 1785) PASS: lldb-unit :: Utility/./UtilityTests/EnvironmentTest.EnvpConversion (906 of 1785) PASS: lldb-shell :: Quit/TestQuitExitCode-30.test (907 of 1785) PASS: lldb-api :: commands/disassemble/basic/TestFrameDisassemble.py (908 of 1785) PASS: lldb-unit :: Language/Highlighting/./HighlighterTests/HighlighterTest.ClangSquareBrackets (909 of 1785) PASS: lldb-unit :: Host/./HostTests/HostInfoTest.GetAugmentedArchSpec (910 of 1785) PASS: lldb-api :: commands/expression/import-std-module/no-std-module/TestMissingStdModule.py (911 of 1785) PASS: lldb-api :: commands/expression/import-std-module/list-dbg-info-content/TestDbgInfoContentList.py (912 of 1785) UNSUPPORTED: lldb-api :: tools/lldb-server/TestGdbRemoteModuleInfo.py (913 of 1785) PASS: lldb-unit :: ObjectFile/Breakpad/./ObjectFileBreakpadTests/InfoRecord.parse (914 of 1785) PASS: lldb-api :: commands/expression/import-std-module/vector-bool/TestBoolVector.py (915 of 1785) PASS: lldb-api :: commands/expression/import-std-module/unique_ptr/TestUniquePtr.py (916 of 1785) PASS: lldb-api :: lang/objc/foundation/TestObjCMethodsNSError.py (917 of 1785) PASS: lldb-shell :: Heap/heap-cstr.test (918 of 1785) PASS: lldb-unit :: Utility/./UtilityTests/StreamTest.ShiftOperatorChars (919 of 1785) PASS: lldb-api :: functionalities/breakpoint/breakpoint_command/TestBreakpointCommandsFromPython.py (920 of 1785) PASS: lldb-unit :: Utility/./UtilityTests/RangeTest.LessThan (921 of 1785) PASS: lldb-unit :: Process/minidump/./LLDBMinidumpTests/MinidumpParserTest.GetMemory (922 of 1785) PASS: lldb-shell :: SymbolFile/DWARF/debug-types-missing-signature.test (923 of 1785) PASS: lldb-unit :: Utility/./UtilityTests/ArgsTest.TestTrailingBackslash (924 of 1785) PASS: lldb-unit :: UnwindAssembly/x86/./UnwindAssemblyx86Tests/Testx86AssemblyInspectionEngine.TestPushImm (925 of 1785) PASS: lldb-api :: lang/c/register_variables/TestRegisterVariables.py (926 of 1785) PASS: lldb-unit :: Utility/./UtilityTests/DataExtractorTest.GetMaxU64_unchecked (927 of 1785) PASS: lldb-unit :: Utility/./UtilityTests/CompletionRequest.Constructor (928 of 1785) PASS: lldb-unit :: Utility/./UtilityTests/ConstStringTest.FromMidOfBufferStringRef (929 of 1785) PASS: lldb-shell :: ObjectFile/ELF/build-id-case.yaml (930 of 1785) PASS: lldb-unit :: Utility/./UtilityTests/UriParserTest.BadPort2 (931 of 1785) PASS: lldb-api :: functionalities/gdb_remote_client/TestRecognizeBreakpoint.py (932 of 1785) PASS: lldb-api :: functionalities/process_group/TestChangeProcessGroup.py (933 of 1785) PASS: lldb-shell :: Quit/TestQuitExitCodeImplicit0.test (934 of 1785) UNSUPPORTED: lldb-api :: tools/lldb-vscode/breakpoint/TestVSCode_setBreakpoints.py (935 of 1785) PASS: lldb-unit :: Utility/./UtilityTests/OptionsWithRawTest.SingleWhitespaceInput (936 of 1785) PASS: lldb-unit :: Symbol/./SymbolTests/TestClangASTContext.TestConvertAccessTypeToAccessSpecifier (937 of 1785) PASS: lldb-shell :: Reproducer/TestReuseDirectory.test (938 of 1785) PASS: lldb-shell :: SymbolFile/NativePDB/source-list.cpp (939 of 1785) PASS: lldb-shell :: ObjectFile/ELF/compressed-sections.yaml (940 of 1785) PASS: lldb-unit :: ScriptInterpreter/Python/./ScriptInterpreterPythonTests/PythonDataObjectsTest.TestPythonCallableCheck (941 of 1785) PASS: lldb-shell :: ObjectFile/Breakpad/uuid-matching-mac.test (942 of 1785) PASS: lldb-shell :: SymbolFile/DWARF/dir-separator-no-comp-dir.s (943 of 1785) PASS: lldb-api :: python_api/debugger/TestDebuggerAPI.py (944 of 1785) PASS: lldb-api :: lang/cpp/lambdas/TestLambdas.py (945 of 1785) PASS: lldb-unit :: Utility/./UtilityTests/Flags.AnyClear (946 of 1785) PASS: lldb-unit :: Utility/./UtilityTests/ArchSpecTest.OperatorBool (947 of 1785) PASS: lldb-api :: lang/c/unicode/TestUnicodeSymbols.py (948 of 1785) PASS: lldb-unit :: Utility/./UtilityTests/ArchSpecTest.TripleComponentsWereSpecified (949 of 1785) PASS: lldb-unit :: Utility/./UtilityTests/NameMatchesTest.RegularExpression (950 of 1785) UNSUPPORTED: lldb-shell :: Register/x86-gp-read.test (951 of 1785) PASS: lldb-unit :: ScriptInterpreter/Python/./ScriptInterpreterPythonTests/PythonDataObjectsTest.TestPythonDictionaryValueEquality (952 of 1785) PASS: lldb-unit :: Host/./HostTests/NativeProcessProtocolTest.ReadCStringFromMemory_MaxSize (953 of 1785) PASS: lldb-api :: functionalities/multiword-commands/TestMultiWordCommands.py (954 of 1785) PASS: lldb-unit :: Utility/./UtilityTests/CompletionRequest.TryCompleteCurrentArgMode (955 of 1785) PASS: lldb-shell :: ObjectFile/ELF/many-sections.s (956 of 1785) PASS: lldb-unit :: ObjectFile/ELF/./ObjectFileELFTests/ObjectFileELFTest.SectionsResolveConsistently (957 of 1785) PASS: lldb-api :: api/multiple-targets/TestMultipleTargets.py (958 of 1785) PASS: lldb-api :: tools/lldb-server/TestGdbRemoteKill.py (959 of 1785) UNSUPPORTED: lldb-api :: functionalities/darwin_log/filter/regex/activity-chain/TestDarwinLogFilterRegexActivityChain.py (960 of 1785) PASS: lldb-unit :: Utility/./UtilityTests/LogChannelEnabledTest.LogThread (961 of 1785) PASS: lldb-unit :: Expression/./ExpressionTests/DiagnosticManagerTest.GetStringSeverityLabels (962 of 1785) PASS: lldb-api :: lang/c/function_types/TestFunctionTypes.py (963 of 1785) PASS: lldb-unit :: Utility/./UtilityTests/StringLexerTest.AdvanceIf (964 of 1785) PASS: lldb-api :: commands/expression/cast_int_to_anonymous_enum/TestCastIntToAnonymousEnum.py (965 of 1785) PASS: lldb-api :: functionalities/data-formatter/data-formatter-stl/libstdcpp/unique_ptr/invalid/TestDataFormatterInvalidStdUniquePtr.py (966 of 1785) PASS: lldb-api :: functionalities/step-avoids-no-debug/TestStepNoDebug.py (967 of 1785) PASS: lldb-unit :: Process/minidump/./LLDBMinidumpTests/MinidumpParserTest.GetThreadContext_x86_32 (968 of 1785) PASS: lldb-api :: tools/lldb-server/TestGdbRemote_qThreadStopInfo.py (969 of 1785) UNSUPPORTED: lldb-shell :: SymbolFile/DWARF/debug-types-expressions.test (970 of 1785) PASS: lldb-unit :: Utility/./UtilityTests/RegisterValueTest.GetSet8 (971 of 1785) PASS: lldb-api :: lang/c/anonymous/TestAnonymous.py (972 of 1785) PASS: lldb-shell :: SymbolFile/NativePDB/ast-methods.cpp (973 of 1785) PASS: lldb-unit :: Process/gdb-remote/./ProcessGdbRemoteTests/GDBRemoteClientBaseTest.SendContinueDelegateStructuredDataReceipt (974 of 1785) PASS: lldb-unit :: Utility/./UtilityTests/StatusTest.ErrorConstructor (975 of 1785) PASS: lldb-unit :: Utility/./UtilityTests/StreamTest.PutHex16ByteOrderBig (976 of 1785) UNSUPPORTED: lldb-api :: commands/expression/completion-crash2/TestCompletionCrash2.py (977 of 1785) PASS: lldb-api :: functionalities/breakpoint/dummy_target_breakpoints/TestBreakpointsWithNoTargets.py (978 of 1785) PASS: lldb-api :: commands/expression/char/TestExprsChar.py (979 of 1785) PASS: lldb-api :: lang/objc/objc-super/TestObjCSuper.py (980 of 1785) PASS: lldb-unit :: Expression/./ExpressionTests/DiagnosticManagerTest.GetStringMultiline (981 of 1785) PASS: lldb-unit :: ScriptInterpreter/Python/./ScriptInterpreterPythonTests/PythonDataObjectsTest.TestExtractingUInt64ThroughStructuredData (982 of 1785) PASS: lldb-api :: functionalities/data-formatter/data-formatter-ptr-to-array/TestPtrToArrayFormatting.py (983 of 1785) PASS: lldb-unit :: Utility/./UtilityTests/ArgsTest.EscapeLLDBCommandArgument (984 of 1785) UNSUPPORTED: lldb-api :: benchmarks/turnaround/TestCompileRunToBreakpointTurnaround.py (985 of 1785) PASS: lldb-api :: lang/cpp/function_refs/TestFunctionRefs.py (986 of 1785) PASS: lldb-api :: lang/c/strings/TestCStrings.py (987 of 1785) PASS: lldb-api :: functionalities/show_location/TestShowLocationDwarf5.py (988 of 1785) UNSUPPORTED: lldb-api :: functionalities/darwin_log/filter/exact_match/category/TestDarwinLogFilterMatchCategory.py (989 of 1785) PASS: lldb-unit :: Utility/./UtilityTests/Flags.IsClear (990 of 1785) PASS: lldb-api :: commands/expression/expr-in-syscall/TestExpressionInSyscall.py (991 of 1785) PASS: lldb-unit :: Utility/./UtilityTests/BroadcasterTest.EventTypeHasListeners (992 of 1785) PASS: lldb-api :: commands/expression/entry-bp/TestExprEntryBP.py (993 of 1785) PASS: lldb-unit :: Utility/./UtilityTests/StreamTest.PutRawBytesToBigEndian (994 of 1785) PASS: lldb-shell :: ObjectFile/ELF/PT_LOAD-overlap-PT_INTERP.yaml (995 of 1785) PASS: lldb-unit :: Utility/./UtilityTests/StringListTest.DefaultConstructor (996 of 1785) UNSUPPORTED: lldb-api :: functionalities/data-formatter/data-formatter-stl/libstdcpp/iterator/TestDataFormatterStdIterator.py (997 of 1785) PASS: lldb-unit :: UnwindAssembly/x86/./UnwindAssemblyx86Tests/Testx86AssemblyInspectionEngine.TestPopRBP (998 of 1785) PASS: lldb-api :: functionalities/stats_api/TestStatisticsAPI.py (999 of 1785) PASS: lldb-unit :: Utility/./UtilityTests/StringExtractorTest.GetNameColonValueNoColon (1000 of 1785) PASS: lldb-unit :: Host/./HostTests/NativeProcessProtocolTest.ReadCStringFromMemory (1001 of 1785) PASS: lldb-api :: python_api/interpreter/TestCommandInterpreterAPI.py (1002 of 1785) PASS: lldb-shell :: SymbolFile/Breakpad/stack-cfi-parsing.test (1003 of 1785) PASS: lldb-unit :: Utility/./UtilityTests/StringListTest.SetSize (1004 of 1785) PASS: lldb-unit :: Utility/./UtilityTests/StreamTeeTest.Flush (1005 of 1785) PASS: lldb-api :: functionalities/data-formatter/data-formatter-stl/libcxx/forward_list/TestDataFormatterLibcxxForwardList.py (1006 of 1785) PASS: lldb-api :: python_api/sbstructureddata/TestStructuredDataAPI.py (1007 of 1785) PASS: lldb-unit :: Utility/./UtilityTests/ScalarTest.ExtractBitfield (1008 of 1785) PASS: lldb-unit :: Utility/./UtilityTests/StringExtractorTest.GetHexU8_Extra_NoEof (1009 of 1785) PASS: lldb-api :: commands/frame/diagnose/inheritance/TestDiagnoseInheritance.py (1010 of 1785) PASS: lldb-api :: functionalities/return-value/TestReturnValue.py (1011 of 1785) PASS: lldb-api :: macosx/add-dsym/TestAddDsymMidExecutionCommand.py (1012 of 1785) PASS: lldb-api :: functionalities/thread/concurrent_events/TestConcurrentTwoBreakpointsOneDelaySignal.py (1013 of 1785) PASS: lldb-api :: functionalities/breakpoint/serialize/TestBreakpointSerialization.py (1014 of 1785) PASS: lldb-api :: functionalities/inferior-crashing/recursive-inferior/TestRecursiveInferiorStep.py (1015 of 1785) PASS: lldb-api :: lang/cpp/exceptions/TestCPPExceptionBreakpoints.py (1016 of 1785) PASS: lldb-unit :: ScriptInterpreter/Python/./ScriptInterpreterPythonTests/PythonDataObjectsTest.TestPythonListToStructuredList (1017 of 1785) PASS: lldb-unit :: SymbolFile/NativePDB/./SymbolFileNativePDBTests/PDBFPOProgramToDWARFExpressionTests.MissingTargetRegister (1018 of 1785) PASS: lldb-api :: lang/cpp/frame-var-anon-unions/TestFrameVariableAnonymousUnions.py (1019 of 1785) PASS: lldb-unit :: Utility/./UtilityTests/StringListTest.GetMaxStringLengthEqualSize (1020 of 1785) PASS: lldb-unit :: Utility/./UtilityTests/LogChannelTest.List (1021 of 1785) PASS: lldb-unit :: Expression/./ExpressionTests/CppModuleConfigurationTest.UnknownLibCppFile (1022 of 1785) PASS: lldb-unit :: Utility/./UtilityTests/StringExtractorTest.DecodeHexU8_Exact (1023 of 1785) PASS: lldb-api :: commands/frame/diagnose/virtual-method-call/TestDiagnoseDereferenceVirtualMethodCall.py (1024 of 1785) PASS: lldb-unit :: UnwindAssembly/x86/./UnwindAssemblyx86Tests/Testx86AssemblyInspectionEngine.TestDisassemblyJunkBytes (1025 of 1785) PASS: lldb-api :: python_api/type/TestTypeList.py (1026 of 1785) PASS: lldb-unit :: Symbol/./SymbolTests/SymbolsTest.TerminateLocateExecutableSymbolFileForUnknownExecutableAndUnknownSymbolFile (1027 of 1785) UNSUPPORTED: lldb-shell :: ObjectFile/ELF/minidebuginfo-set-and-hit-breakpoint.test (1028 of 1785) PASS: lldb-api :: commands/expression/completion/TestExprCompletion.py (1029 of 1785) PASS: lldb-api :: functionalities/data-formatter/data-formatter-smart-array/TestDataFormatterSmartArray.py (1030 of 1785) PASS: lldb-unit :: Language/Highlighting/./HighlighterTests/HighlighterTest.Colons (1031 of 1785) PASS: lldb-unit :: SymbolFile/DWARF/./SymbolFileDWARFTests/SymbolFileDWARFTests.TestAbbrevValidAttrNullForm (1032 of 1785) PASS: lldb-unit :: ScriptInterpreter/Python/./ScriptInterpreterPythonTests/PythonDataObjectsTest.TestPythonListManipulation (1033 of 1785) UNSUPPORTED: lldb-api :: functionalities/thread/concurrent_events/TestConcurrentManySignals.py (1034 of 1785) PASS: lldb-unit :: Utility/./UtilityTests/RangeTest.SetRangeBase (1035 of 1785) PASS: lldb-shell :: Breakpoint/single-file-split-dwarf.test (1036 of 1785) PASS: lldb-unit :: UnwindAssembly/x86/./UnwindAssemblyx86Tests/Testx86AssemblyInspectionEngine.TestSimplei386ugmented (1037 of 1785) PASS: lldb-api :: python_api/watchpoint/TestWatchpointIgnoreCount.py (1038 of 1785) PASS: lldb-unit :: Utility/./UtilityTests/NameMatchesTest.Contains (1039 of 1785) PASS: lldb-unit :: Utility/./UtilityTests/StringListTest.Assignment (1040 of 1785) PASS: lldb-api :: commands/watchpoints/watchpoint_disable/TestWatchpointDisable.py (1041 of 1785) PASS: lldb-api :: lang/objc/modules/TestObjCModules.py (1042 of 1785) PASS: lldb-shell :: SymbolFile/DWARF/find-method-local-struct.cpp (1043 of 1785) PASS: lldb-api :: functionalities/breakpoint/breakpoint_hit_count/TestBreakpointHitCount.py (1044 of 1785) PASS: lldb-api :: lang/cpp/std-function-step-into-callable/TestStdFunctionStepIntoCallable.py (1045 of 1785) PASS: lldb-api :: commands/expression/import-std-module/vector-basic/TestBasicVector.py (1046 of 1785) UNSUPPORTED: lldb-shell :: Register/x86-64-ymm16-read.test (1047 of 1785) PASS: lldb-api :: python_api/process/TestProcessAPI.py (1048 of 1785) PASS: lldb-unit :: UnwindAssembly/x86/./UnwindAssemblyx86Tests/Testx86AssemblyInspectionEngine.TestPushRBP (1049 of 1785) PASS: lldb-api :: commands/expression/persistent_ptr_update/TestPersistentPtrUpdate.py (1050 of 1785) PASS: lldb-api :: tools/lldb-server/inferior-crash/TestGdbRemoteAbort.py (1051 of 1785) PASS: lldb-api :: types/TestDoubleTypesExpr.py (1052 of 1785) PASS: lldb-unit :: Process/minidump/./LLDBMinidumpTests/MinidumpParserTest.GetMiscInfo_no_stream (1053 of 1785) PASS: lldb-unit :: Utility/./UtilityTests/ScalarTest.GetValue (1054 of 1785) UNSUPPORTED: lldb-api :: linux/add-symbols/TestTargetSymbolsAddCommand.py (1055 of 1785) PASS: lldb-unit :: Utility/./UtilityTests/BinaryStreamTest.PutSLEB128MaxValue (1056 of 1785) PASS: lldb-unit :: Utility/./UtilityTests/StringListTest.InsertStringAtIndexOutOfBounds (1057 of 1785) PASS: lldb-unit :: Expression/./ExpressionTests/DiagnosticManagerTest.PutString (1058 of 1785) PASS: lldb-unit :: Language/Highlighting/./HighlighterTests/HighlighterTest.ClangCursorPosEndOfLine (1059 of 1785) PASS: lldb-api :: functionalities/backticks/TestBackticksWithoutATarget.py (1060 of 1785) PASS: lldb-unit :: Utility/./UtilityTests/StringExtractorTest.GetU64LittleEndian (1061 of 1785) PASS: lldb-api :: functionalities/thread/concurrent_events/TestConcurrentDelayedCrashWithBreakpointSignal.py (1062 of 1785) PASS: lldb-api :: functionalities/breakpoint/require_hw_breakpoints/TestRequireHWBreakpoints.py (1063 of 1785) PASS: lldb-api :: commands/expression/ir-interpreter/TestIRInterpreter.py (1064 of 1785) PASS: lldb-unit :: Process/gdb-remote/./ProcessGdbRemoteTests/GDBRemoteCommunicationClientTest.ReadRegister (1065 of 1785) PASS: lldb-unit :: Utility/./UtilityTests/DataExtractorTest.GetCStrEmpty (1066 of 1785) UNSUPPORTED: lldb-shell :: SymbolFile/PDB/pointers.test (1067 of 1785) PASS: lldb-api :: lang/c/offsetof/TestOffsetof.py (1068 of 1785) PASS: lldb-unit :: Process/gdb-remote/./ProcessGdbRemoteTests/GDBRemoteClientBaseTest.SendContinueAndLateInterrupt (1069 of 1785) PASS: lldb-api :: python_api/sbtype_typeclass/TestSBTypeTypeClass.py (1070 of 1785) PASS: lldb-api :: lang/cpp/breakpoint-commands/TestCPPBreakpointCommands.py (1071 of 1785) PASS: lldb-unit :: Process/minidump/./LLDBMinidumpTests/MinidumpParserTest.GetMemoryRegionInfoFromMemory64List (1072 of 1785) PASS: lldb-unit :: Utility/./UtilityTests/StringExtractorTest.DecodeHexU8_InvalidHex2 (1073 of 1785) PASS: lldb-unit :: Symbol/./SymbolTests/TestClangASTContext.TestGetBasicTypeFromName (1074 of 1785) PASS: lldb-unit :: Utility/./UtilityTests/StringListTest.AppendListCStringArray (1075 of 1785) PASS: lldb-unit :: Utility/./UtilityTests/ReproducerTest.SetCapture (1076 of 1785) PASS: lldb-unit :: Utility/./UtilityTests/OptionsWithRawTest.LeadingSpaceArgs (1077 of 1785) PASS: lldb-api :: functionalities/data-formatter/data-formatter-stl/libcxx/multiset/TestDataFormatterLibcxxMultiSet.py (1078 of 1785) PASS: lldb-unit :: Process/minidump/./LLDBMinidumpTests/RegisterContextMinidump.CheckRegisterContextMinidump_ARM (1079 of 1785) PASS: lldb-shell :: Breakpoint/jitbp_elf.test (1080 of 1785) PASS: lldb-unit :: Utility/./UtilityTests/ScalarTest.ComparisonFloat (1081 of 1785) UNSUPPORTED: lldb-shell :: SymbolFile/PDB/calling-conventions.test (1082 of 1785) PASS: lldb-unit :: Utility/./UtilityTests/StringListTest.LongestCommonPrefixSingleElement (1083 of 1785) PASS: lldb-api :: lang/cpp/dynamic-value-same-basename/TestDynamicValueSameBase.py (1084 of 1785) PASS: lldb-api :: functionalities/data-formatter/typedef_array/TestTypedefArray.py (1085 of 1785) PASS: lldb-shell :: Expr/TestIRMemoryMap.test (1086 of 1785) PASS: lldb-unit :: Symbol/./SymbolTests/TestClangASTContext.TestBuiltinTypeForEncodingAndBitSize (1087 of 1785) PASS: lldb-unit :: Signals/./SignalsTests/UnixSignalsTest.VersionChange (1088 of 1785) PASS: lldb-api :: lang/objc/forward-decl/TestForwardDecl.py (1089 of 1785) PASS: lldb-unit :: Process/gdb-remote/./ProcessGdbRemoteTests/GDBRemoteClientBaseTest.SendPacketAndReceiveResponseWithOutputSupport (1090 of 1785) PASS: lldb-shell :: Settings/TestDisassemblyFormat.test (1091 of 1785) PASS: lldb-unit :: Utility/./UtilityTests/UriParserTest.BracketedHostnamePort (1092 of 1785) PASS: lldb-api :: functionalities/data-formatter/data-formatter-stl/libcxx/string/TestDataFormatterLibcxxString.py (1093 of 1785) PASS: lldb-api :: functionalities/ubsan/user-expression/TestUbsanUserExpression.py (1094 of 1785) PASS: lldb-api :: commands/disassemble/basic/TestDisassembleBreakpoint.py (1095 of 1785) PASS: lldb-api :: functionalities/jitloader_gdb/TestJITLoaderGDB.py (1096 of 1785) PASS: lldb-unit :: SymbolFile/DWARF/./SymbolFileDWARFTests/SymbolFileDWARFTests.TestAbilitiesForDWARF (1097 of 1785) PASS: lldb-shell :: ObjectFile/PECOFF/basic-info-arm.yaml (1098 of 1785) UNSUPPORTED: lldb-api :: api/multiple-debuggers/TestMultipleDebuggers.py (1099 of 1785) PASS: lldb-unit :: Platform/./LLDBPlatformTests/PlatformDarwinTest.TestParseVersionBuildDir (1100 of 1785) PASS: lldb-unit :: Language/Highlighting/./HighlighterTests/HighlighterTest.ClangComments (1101 of 1785) PASS: lldb-unit :: Target/./TargetTests/MemoryRegionInfoTest.Formatv (1102 of 1785) PASS: lldb-unit :: ScriptInterpreter/Python/./ScriptInterpreterPythonTests/PythonDataObjectsTest.TestResetting (1103 of 1785) PASS: lldb-unit :: ObjectFile/ELF/./ObjectFileELFTests/ObjectFileELFTest.GetSymtab_NoSymEntryPointArmAddressClass (1104 of 1785) PASS: lldb-api :: functionalities/tail_call_frames/disambiguate_paths_to_common_sink/TestDisambiguatePathsToCommonSink.py (1105 of 1785) PASS: lldb-unit :: Process/gdb-remote/./ProcessGdbRemoteTests/GDBRemoteCommunicationTest.ReadPacket_checksum (1106 of 1785) PASS: lldb-api :: lang/cpp/llvm-style/TestLLVMStyle.py (1107 of 1785) PASS: lldb-unit :: Utility/./UtilityTests/OptionsWithRawTest.EmptyInput (1108 of 1785) PASS: lldb-unit :: ScriptInterpreter/Python/./ScriptInterpreterPythonTests/PythonDataObjectsTest.TestPythonByteArray (1109 of 1785) PASS: lldb-unit :: Utility/./UtilityTests/UUIDTest.SetFromStringRef (1110 of 1785) PASS: lldb-unit :: Utility/./UtilityTests/BinaryStreamTest.PutULEB128FourBytes (1111 of 1785) PASS: lldb-unit :: ScriptInterpreter/Python/./ScriptInterpreterPythonTests/PythonDataObjectsTest.TestModuleNameResolutionNoDot (1112 of 1785) PASS: lldb-api :: commands/expression/radar_8638051/Test8638051.py (1113 of 1785) PASS: lldb-unit :: Host/./HostTests/FileSystemTest.Exists (1114 of 1785) UNSUPPORTED: lldb-api :: iohandler/completion/TestIOHandlerCompletion.py (1115 of 1785) PASS: lldb-api :: functionalities/breakpoint/breakpoint_locations/TestBreakpointLocations.py (1116 of 1785) PASS: lldb-api :: functionalities/data-formatter/user-format-vs-summary/TestUserFormatVsSummary.py (1117 of 1785) PASS: lldb-unit :: UnwindAssembly/x86/./UnwindAssemblyx86Tests/Testx86AssemblyInspectionEngine.TestSimple64bitFrameFunction (1118 of 1785) PASS: lldb-unit :: Interpreter/./InterpreterTests/CompletionTest.DirCompletionAbsolute (1119 of 1785) PASS: lldb-unit :: Utility/./UtilityTests/ArgsTest.TestArgv (1120 of 1785) UNSUPPORTED: lldb-api :: functionalities/darwin_log/basic/TestDarwinLogBasic.py (1121 of 1785) PASS: lldb-api :: types/TestIntegerTypes.py (1122 of 1785) PASS: lldb-api :: python_api/formatters/TestFormattersSBAPI.py (1123 of 1785) PASS: lldb-api :: functionalities/thread/crash_during_step/TestCrashDuringStep.py (1124 of 1785) PASS: lldb-api :: lang/objc/orderedset/TestOrderedSet.py (1125 of 1785) PASS: lldb-shell :: SymbolFile/DWARF/find-basic-namespace.cpp (1126 of 1785) PASS: lldb-api :: functionalities/inferior-assert/TestInferiorAssert.py (1127 of 1785) PASS: lldb-unit :: Process/minidump/./LLDBMinidumpTests/MinidumpParserTest.GetMemoryRegionInfoLinuxMaps (1128 of 1785) PASS: lldb-unit :: Utility/./UtilityTests/RangeTest.Equal (1129 of 1785) PASS: lldb-api :: commands/expression/inline-namespace/TestInlineNamespace.py (1130 of 1785) PASS: lldb-api :: functionalities/ubsan/basic/TestUbsanBasic.py (1131 of 1785) PASS: lldb-unit :: Language/Highlighting/./HighlighterTests/HighlighterTest.FallbackHighlighter (1132 of 1785) PASS: lldb-api :: lang/cpp/incomplete-types/TestCppIncompleteTypes.py (1133 of 1785) PASS: lldb-api :: commands/gui/invalid-args/TestInvalidArgsGui.py (1134 of 1785) PASS: lldb-api :: commands/command/script_alias/TestCommandScriptAlias.py (1135 of 1785) PASS: lldb-api :: api/command-return-object/TestSBCommandReturnObject.py (1136 of 1785) PASS: lldb-unit :: ScriptInterpreter/Python/./ScriptInterpreterPythonTests/PythonExceptionStateTest.TestAutoRestoreChanged (1137 of 1785) PASS: lldb-api :: functionalities/gdb_remote_client/TestRestartBug.py (1138 of 1785) PASS: lldb-unit :: Utility/./UtilityTests/Flags.Test (1139 of 1785) PASS: lldb-api :: functionalities/data-formatter/nssetsynth/TestNSSetSynthetic.py (1140 of 1785) PASS: lldb-unit :: Utility/./UtilityTests/ArgsTest.TestSingleArgWithQuotedSpace (1141 of 1785) PASS: lldb-api :: functionalities/data-formatter/data-formatter-stl/libcxx/initializerlist/TestInitializerList.py (1142 of 1785) PASS: lldb-api :: python_api/objc_type/TestObjCType.py (1143 of 1785) PASS: lldb-unit :: Utility/./UtilityTests/ProcessInfoTest.Constructor (1144 of 1785) PASS: lldb-unit :: Utility/./UtilityTests/ScalarTest.APIntConstructor (1145 of 1785) PASS: lldb-unit :: ScriptInterpreter/Python/./ScriptInterpreterPythonTests/PythonDataObjectsTest.TestTypeNameResolutionNoDot (1146 of 1785) PASS: lldb-unit :: UnwindAssembly/x86/./UnwindAssemblyx86Tests/Testx86AssemblyInspectionEngine.Test64bitFramelessSmallStackFrame (1147 of 1785) PASS: lldb-unit :: Utility/./UtilityTests/UriParserTest.SchemeHostSeparator4 (1148 of 1785) PASS: lldb-unit :: tools/lldb-server/tests/./LLDBServerTests/TestBase.LaunchModePreservesEnvironment (1149 of 1785) PASS: lldb-api :: commands/expression/persist_objc_pointeetype/TestPersistObjCPointeeType.py (1150 of 1785) PASS: lldb-api :: lang/cpp/extern_c/TestExternCSymbols.py (1151 of 1785) PASS: lldb-shell :: ObjectFile/ELF/section-types-edgecases.yaml (1152 of 1785) PASS: lldb-unit :: Utility/./UtilityTests/StreamTest.PutNHex8 (1153 of 1785) PASS: lldb-unit :: Host/./HostTests/Host.WaitStatusFormat (1154 of 1785) PASS: lldb-unit :: Utility/./UtilityTests/StringLexerTest.GetUnlexed (1155 of 1785) PASS: lldb-api :: commands/command/history/TestCommandHistory.py (1156 of 1785) PASS: lldb-unit :: Host/./HostTests/MainLoopTest.UnmonitoredSignal (1157 of 1785) UNSUPPORTED: lldb-shell :: SymbolFile/PDB/vbases.test (1158 of 1785) PASS: lldb-unit :: Editline/./EditlineTests/EditlineTestFixture.EditlineReceivesMultiLineText (1159 of 1785) PASS: lldb-api :: sanity/TestModuleCacheSanity.py (1160 of 1785) PASS: lldb-api :: lang/cpp/template-function/TestTemplateFunctions.py (1161 of 1785) PASS: lldb-api :: lang/c/unions/TestUnionMembers.py (1162 of 1785) PASS: lldb-api :: functionalities/tail_call_frames/thread_step_out_message/TestArtificialFrameStepOutMessage.py (1163 of 1785) PASS: lldb-unit :: Utility/./UtilityTests/StringExtractorTest.GetHexBytes_Partial (1164 of 1785) PASS: lldb-unit :: Utility/./UtilityTests/TimerTest.CategoryTimes (1165 of 1785) PASS: lldb-shell :: SymbolFile/NativePDB/ast-types.cpp (1166 of 1785) PASS: lldb-unit :: Process/gdb-remote/./ProcessGdbRemoteTests/GDBRemoteCommunicationClientTest.SendStartTracePacket (1167 of 1785) PASS: lldb-unit :: Utility/./UtilityTests/StringListTest.JoinThree (1168 of 1785) PASS: lldb-unit :: Utility/./UtilityTests/FileSpecTest.EqualDotsPosix (1169 of 1785) PASS: lldb-api :: lang/objcxx/hide-runtime-values/TestObjCXXHideRuntimeValues.py (1170 of 1785) PASS: lldb-unit :: Interpreter/./InterpreterTests/CompletionTest.DirCompletionUsername (1171 of 1785) PASS: lldb-api :: functionalities/data-formatter/data-formatter-objc/TestDataFormatterObjCNSURL.py (1172 of 1785) PASS: lldb-api :: commands/expression/import-std-module/shared_ptr-dbg-info-content/TestSharedPtrDbgInfoContent.py (1173 of 1785) PASS: lldb-api :: lang/cpp/namespace_definitions/TestNamespaceDefinitions.py (1174 of 1785) PASS: lldb-api :: functionalities/dead-strip/TestDeadStrip.py (1175 of 1785) PASS: lldb-unit :: Utility/./UtilityTests/RangeTest.ContainsEndInclusiveInvalid (1176 of 1785) PASS: lldb-api :: commands/process/attach-resume/TestAttachResume.py (1177 of 1785) PASS: lldb-api :: functionalities/fat_archives/TestFatArchives.py (1178 of 1785) PASS: lldb-api :: commands/expression/call-throws/TestCallThatThrows.py (1179 of 1785) PASS: lldb-shell :: Unwind/eh-frame-dwarf-unwind.test (1180 of 1785) PASS: lldb-unit :: Utility/./UtilityTests/ProcessInstanceInfo.Dump (1181 of 1785) PASS: lldb-api :: functionalities/conditional_break/TestConditionalBreak.py (1182 of 1785) PASS: lldb-unit :: Utility/./UtilityTests/ConstStringTest.CompareConstString (1183 of 1785) PASS: lldb-unit :: Symbol/./SymbolTests/TestClangASTContext.TemplateArguments (1184 of 1785) PASS: lldb-unit :: Utility/./UtilityTests/StreamTeeTest.SetStreamAtIndexOutOfBounds (1185 of 1785) PASS: lldb-unit :: Utility/./UtilityTests/ArchSpecTest.MergeFromMachOUnknown (1186 of 1785) PASS: lldb-shell :: SymbolFile/DWARF/dir-separator-no-comp-dir-relative-name.s (1187 of 1785) PASS: lldb-api :: functionalities/data-formatter/data-formatter-named-summaries/TestDataFormatterNamedSummaries.py (1188 of 1785) PASS: lldb-shell :: ObjectFile/ELF/duplicate-section.yaml (1189 of 1785) UNSUPPORTED: lldb-api :: functionalities/data-formatter/data-formatter-stl/libstdcpp/smart_ptr/TestDataFormatterStdSmartPtr.py (1190 of 1785) PASS: lldb-api :: lang/mixed/TestMixedLanguages.py (1191 of 1785) UNSUPPORTED: lldb-api :: arm/breakpoint-thumb-codesection/TestBreakpointThumbCodesection.py (1192 of 1785) UNSUPPORTED: lldb-api :: tools/lldb-server/TestGdbRemoteAuxvSupport.py (1193 of 1785) PASS: lldb-unit :: Utility/./UtilityTests/LogChannelEnabledTest.LogVerboseThread (1194 of 1785) PASS: lldb-unit :: Utility/./UtilityTests/ArgsTest.TestQuotedUnknownEscape (1195 of 1785) PASS: lldb-unit :: Utility/./UtilityTests/OptionsWithRawTest.EmptyArgsOnlySuffix (1196 of 1785) PASS: lldb-shell :: Commands/CommandScriptImmediateOutput/CommandScriptImmediateOutputConsole.test (1197 of 1785) UNSUPPORTED: lldb-api :: functionalities/data-formatter/data-formatter-stl/libstdcpp/map/TestDataFormatterStdMap.py (1198 of 1785) PASS: lldb-unit :: SymbolFile/NativePDB/./SymbolFileNativePDBTests/PDBFPOProgramToDWARFExpressionTests.InvalidOpBinary (1199 of 1785) PASS: lldb-shell :: SymbolFile/DWARF/array-sizes.s (1200 of 1785) PASS: lldb-unit :: Utility/./UtilityTests/DataExtractorTest.GetCStrAtNullOffset (1201 of 1785) PASS: lldb-api :: api/multithreaded/TestMultithreaded.py (1202 of 1785) PASS: lldb-unit :: Utility/./UtilityTests/StringListTest.ShiftMove (1203 of 1785) PASS: lldb-api :: functionalities/asan/TestReportData.py (1204 of 1785) UNSUPPORTED: lldb-api :: lang/objc/bitfield_ivars/TestBitfieldIvars.py (1205 of 1785) PASS: lldb-shell :: ObjectFile/ELF/PT_TLS-overlap-PT_LOAD.yaml (1206 of 1785) PASS: lldb-api :: lang/objc/blocks/TestObjCIvarsInBlocks.py (1207 of 1785) PASS: lldb-api :: functionalities/tsan/thread_numbers/TestTsanThreadNumbers.py (1208 of 1785) PASS: lldb-unit :: Utility/./UtilityTests/RangeTest.LessThanInvalid (1209 of 1785) PASS: lldb-shell :: SymbolFile/Breakpad/line-table.test (1210 of 1785) PASS: lldb-api :: functionalities/breakpoint/inlined_breakpoints/TestInlinedBreakpoints.py (1211 of 1785) PASS: lldb-unit :: Expression/./ExpressionTests/DiagnosticManagerTest.GetStringNoDiags (1212 of 1785) PASS: lldb-shell :: Driver/TestConvenienceVariables.test (1213 of 1785) PASS: lldb-api :: functionalities/postmortem/minidump-new/TestMiniDumpUUID.py (1214 of 1785) PASS: lldb-unit :: Utility/./UtilityTests/VMRange.ContainsRange (1215 of 1785) PASS: lldb-unit :: ScriptInterpreter/Python/./ScriptInterpreterPythonTests/PythonExceptionStateTest.TestExceptionStateChecking (1216 of 1785) PASS: lldb-unit :: Host/./HostTests/FileSystemTest.GetPermissions (1217 of 1785) UNSUPPORTED: lldb-shell :: Register/x86-64-xmm16-read.test (1218 of 1785) PASS: lldb-api :: lang/cpp/global_operators/TestCppGlobalOperators.py (1219 of 1785) PASS: lldb-api :: functionalities/inferior-crashing/TestInferiorCrashingStep.py (1220 of 1785) PASS: lldb-api :: functionalities/breakpoint/consecutive_breakpoints/TestConsecutiveBreakpoints.py (1221 of 1785) PASS: lldb-unit :: Utility/./UtilityTests/OptionsWithRawTest.EmptySuffixSingleWhitespace (1222 of 1785) PASS: lldb-shell :: SymbolFile/NativePDB/s_constant.cpp (1223 of 1785) PASS: lldb-api :: functionalities/postmortem/minidump/TestMiniDump.py (1224 of 1785) PASS: lldb-unit :: Process/gdb-remote/./ProcessGdbRemoteTests/GDBRemoteCommunicationServerTest.SendErrorResponse_ErrorNumber (1225 of 1785) PASS: lldb-unit :: ScriptInterpreter/Python/./ScriptInterpreterPythonTests/PythonDataObjectsTest.TestBorrowedReferences (1226 of 1785) PASS: lldb-unit :: Utility/./UtilityTests/AnsiTerminal.WhiteSpace (1227 of 1785) PASS: lldb-unit :: Expression/./ExpressionTests/CppModuleConfigurationTest.LibCppV2 (1228 of 1785) PASS: lldb-unit :: ScriptInterpreter/Python/./ScriptInterpreterPythonTests/PythonDataObjectsTest.TestPythonFile (1229 of 1785) PASS: lldb-unit :: Utility/./UtilityTests/ScalarTest.SetValueFromCString (1230 of 1785) PASS: lldb-api :: commands/expression/anonymous-struct/TestCallUserAnonTypedef.py (1231 of 1785) PASS: lldb-unit :: Utility/./UtilityTests/ArgsTest.TestMultipleArgs (1232 of 1785) PASS: lldb-unit :: Signals/./SignalsTests/UnixSignalsTest.Iteration (1233 of 1785) PASS: lldb-unit :: Host/./HostTests/TaskPoolTest.TaskMap (1234 of 1785) PASS: lldb-api :: functionalities/thread/concurrent_events/TestConcurrentWatchpointWithDelayWatchpointThreads.py (1235 of 1785) PASS: lldb-shell :: SymbolFile/Breakpad/line-table-discontinuous-file-ids.test (1236 of 1785) PASS: lldb-unit :: Expression/./ExpressionTests/ClangHostTest.MacOSX (1237 of 1785) PASS: lldb-unit :: Expression/./ExpressionTests/CppModuleConfigurationTest.MissingLibCpp (1238 of 1785) PASS: lldb-api :: commands/log/basic/TestLogging.py (1239 of 1785) PASS: lldb-unit :: Utility/./UtilityTests/VASprintfTest.NoBufferResize (1240 of 1785) PASS: lldb-api :: macosx/find-dsym/bundle-with-dot-in-filename/TestBundleWithDotInFilename.py (1241 of 1785) PASS: lldb-api :: commands/expression/fixits/TestFixIts.py (1242 of 1785) PASS: lldb-api :: commands/expression/import-std-module/weak_ptr/TestWeakPtr.py (1243 of 1785) PASS: lldb-unit :: Utility/./UtilityTests/StringExtractorTest.InitEmpty (1244 of 1785) PASS: lldb-unit :: Utility/./UtilityTests/SerializationRountripTest.SerializeDeserializeCString (1245 of 1785) PASS: lldb-unit :: Utility/./UtilityTests/FileSpecTest.GuessPathStyle (1246 of 1785) PASS: lldb-api :: commands/expression/calculator_mode/TestCalculatorMode.py (1247 of 1785) UNSUPPORTED: lldb-api :: commands/register/register/intel_xtended_registers/TestMPXRegisters.py (1248 of 1785) PASS: lldb-shell :: SymbolFile/DWARF/find-variable-file.cpp (1249 of 1785) PASS: lldb-api :: python_api/process/read-mem-cstring/TestReadMemCString.py (1250 of 1785) PASS: lldb-api :: lang/cpp/wchar_t/TestCxxWCharT.py (1251 of 1785) PASS: lldb-api :: lang/objc/foundation/TestSymbolTable.py (1252 of 1785) PASS: lldb-api :: commands/expression/import-std-module/weak_ptr-dbg-info-content/TestDbgInfoContentWeakPtr.py (1253 of 1785) PASS: lldb-shell :: SymbolFile/DWARF/find-basic-type.cpp (1254 of 1785) PASS: lldb-unit :: Utility/./UtilityTests/ScalarTest.Division (1255 of 1785) PASS: lldb-api :: macosx/indirect_symbol/TestIndirectSymbols.py (1256 of 1785) PASS: lldb-unit :: Utility/./UtilityTests/StreamTest.QuotedCString (1257 of 1785) PASS: lldb-api :: commands/apropos/with-process/TestAproposWithProcess.py (1258 of 1785) PASS: lldb-unit :: ObjectFile/ELF/./ObjectFileELFTests/ObjectFileELFTest.GetSymtab_NoSymEntryPointArmThumbAddressClass (1259 of 1785) PASS: lldb-api :: functionalities/thread/concurrent_events/TestConcurrentTwoBreakpointsOneWatchpoint.py (1260 of 1785) PASS: lldb-unit :: SymbolFile/NativePDB/./SymbolFileNativePDBTests/PDBFPOProgramToDWARFExpressionTests.MultipleIndependentAssignments (1261 of 1785) PASS: lldb-unit :: Utility/./UtilityTests/DataExtractorTest.GetMaxU64 (1262 of 1785) PASS: lldb-api :: functionalities/completion/TestCompletion.py (1263 of 1785) PASS: lldb-unit :: Utility/./UtilityTests/StreamTest.PutStringAsRawHex8 (1264 of 1785) PASS: lldb-api :: lang/cpp/auto/TestCPPAuto.py (1265 of 1785) UNSUPPORTED: lldb-shell :: SymbolFile/PDB/function-nested-block.test (1266 of 1785) PASS: lldb-unit :: Utility/./UtilityTests/UriParserTest.BracketedHostname (1267 of 1785) PASS: lldb-api :: lang/objc/foundation/TestFoundationDisassembly.py (1268 of 1785) PASS: lldb-unit :: Utility/./UtilityTests/StreamTest.ShiftOperatorPtr (1269 of 1785) PASS: lldb-unit :: Utility/./UtilityTests/StringExtractorTest.GetHexBytes_OddPair2 (1270 of 1785) PASS: lldb-api :: tools/lldb-server/TestGdbRemoteExpeditedRegisters.py (1271 of 1785) PASS: lldb-shell :: ExecControl/StopHook/stop-hook.test (1272 of 1785) PASS: lldb-unit :: Utility/./UtilityTests/BinaryStreamTest.PutSLEB128NineBytes (1273 of 1785) PASS: lldb-api :: python_api/interpreter/TestRunCommandInterpreterAPI.py (1274 of 1785) PASS: lldb-api :: functionalities/inferior-crashing/recursive-inferior/TestRecursiveInferior.py (1275 of 1785) PASS: lldb-unit :: Utility/./UtilityTests/BinaryStreamTest.PutULEB128Zero (1276 of 1785) PASS: lldb-unit :: Utility/./UtilityTests/ArgsTest.ReplaceArgumentAtIndexShort (1277 of 1785) PASS: lldb-api :: functionalities/tail_call_frames/disambiguate_tail_call_seq/TestDisambiguateTailCallSeq.py (1278 of 1785) PASS: lldb-unit :: Utility/./UtilityTests/StreamTest.ShiftOperatorInts (1279 of 1785) PASS: lldb-shell :: ObjectFile/PECOFF/dep-modules.yaml (1280 of 1785) PASS: lldb-api :: commands/help/TestHelp.py (1281 of 1785) PASS: lldb-unit :: Utility/./UtilityTests/StringListTest.GetMaxStringLengthIncreasingSize (1282 of 1785) PASS: lldb-unit :: Utility/./UtilityTests/FileSpecTest.EqualDotsPosixRoot (1283 of 1785) PASS: lldb-unit :: UnwindAssembly/x86/./UnwindAssemblyx86Tests/Testx86AssemblyInspectionEngine.TestAddESP (1284 of 1785) PASS: lldb-api :: lang/c/step-target/TestStepTarget.py (1285 of 1785) PASS: lldb-shell :: SymbolFile/DWARF/debug_aranges-empty-section.s (1286 of 1785) PASS: lldb-api :: functionalities/thread/concurrent_events/TestConcurrentManyCrash.py (1287 of 1785) UNSUPPORTED: lldb-shell :: SymbolFile/NativePDB/typedefs.cpp (1288 of 1785) PASS: lldb-api :: functionalities/paths/TestPaths.py (1289 of 1785) PASS: lldb-api :: functionalities/target_var/TestTargetVar.py (1290 of 1785) PASS: lldb-unit :: Host/./HostTests/SocketTest.UDPConnect (1291 of 1785) PASS: lldb-unit :: Language/CPlusPlus/./LanguageCPlusPlusTests/CPlusPlusLanguage.ExtractContextAndIdentifier (1292 of 1785) PASS: lldb-unit :: Core/./LLDBCoreTests/StreamCallbackTest.Callback (1293 of 1785) PASS: lldb-unit :: Language/CPlusPlus/./LanguageCPlusPlusTests/CPlusPlusLanguage.CPlusPlusNameParser (1294 of 1785) PASS: lldb-unit :: Utility/./UtilityTests/StringLexerTest.PutBack (1295 of 1785) PASS: lldb-api :: lang/c/set_values/TestSetValues.py (1296 of 1785) PASS: lldb-api :: functionalities/tsan/thread_leak/TestTsanThreadLeak.py (1297 of 1785) PASS: lldb-unit :: Utility/./UtilityTests/StringExtractorTest.GetHexBytesAvail_OddPair2 (1298 of 1785) PASS: lldb-api :: commands/expression/two-files/TestObjCTypeQueryFromOtherCompileUnit.py (1299 of 1785) PASS: lldb-unit :: Utility/./UtilityTests/StringListTest.LongestCommonPrefixNoPrefix (1300 of 1785) PASS: lldb-unit :: Host/./HostTests/ConnectionFileDescriptorTest.TCPGetURIv4 (1301 of 1785) PASS: lldb-unit :: Host/./HostTests/FileSystemTest.Resolve (1302 of 1785) PASS: lldb-unit :: Utility/./UtilityTests/AnsiTerminal.Unknown (1303 of 1785) PASS: lldb-api :: functionalities/data-formatter/setvaluefromcstring/TestSetValueFromCString.py (1304 of 1785) PASS: lldb-unit :: Process/gdb-remote/./ProcessGdbRemoteTests/GDBRemoteClientBaseTest.InterruptNoResponse (1305 of 1785) PASS: lldb-api :: commands/expression/persistent_types/TestNestedPersistentTypes.py (1306 of 1785) PASS: lldb-api :: lang/c/const_variables/TestConstVariables.py (1307 of 1785) PASS: lldb-shell :: SymbolFile/DWARF/gnu-style-compression.cpp (1308 of 1785) PASS: lldb-unit :: Utility/./UtilityTests/IndexToObjectTest.ObjectForIndex (1309 of 1785) PASS: lldb-unit :: Language/Highlighting/./HighlighterTests/HighlighterTest.ClangCursorPosInOtherToken (1310 of 1785) PASS: lldb-unit :: Utility/./UtilityTests/LogChannelEnabledTest.LogGetLogThread (1311 of 1785) PASS: lldb-unit :: Utility/./UtilityTests/Flags.AllClear (1312 of 1785) PASS: lldb-api :: commands/target/stop-hooks/TestStopHooks.py (1313 of 1785) PASS: lldb-shell :: ObjectFile/ELF/minidebuginfo-corrupt-xz.yaml (1314 of 1785) PASS: lldb-unit :: Utility/./UtilityTests/TimerTest.CategoryTimesNested (1315 of 1785) PASS: lldb-unit :: Process/minidump/./LLDBMinidumpTests/MinidumpParserTest.GetMemoryRegionInfo (1316 of 1785) PASS: lldb-api :: lang/c/shared_lib/TestSharedLib.py (1317 of 1785) PASS: lldb-api :: lang/cpp/bool/TestCPPBool.py (1318 of 1785) PASS: lldb-api :: commands/frame/select/TestFrameSelect.py (1319 of 1785) PASS: lldb-unit :: Utility/./UtilityTests/OptionsWithRawTest.QuotedSuffix (1320 of 1785) PASS: lldb-unit :: Utility/./UtilityTests/DataExtractorTest.GetBitfield (1321 of 1785) PASS: lldb-api :: functionalities/breakpoint/auto_continue/TestBreakpointAutoContinue.py (1322 of 1785) PASS: lldb-shell :: ObjectFile/Breakpad/sections-trailing-func.test (1323 of 1785) PASS: lldb-shell :: Settings/TestSettingsWrite.test (1324 of 1785) PASS: lldb-api :: functionalities/data-formatter/data-formatter-cpp/TestDataFormatterCpp.py (1325 of 1785) PASS: lldb-unit :: Expression/./ExpressionTests/DiagnosticManagerTest.PutStringMultiple (1326 of 1785) PASS: lldb-api :: functionalities/gdb_remote_client/TestStopPCs.py (1327 of 1785) PASS: lldb-unit :: ScriptInterpreter/Python/./ScriptInterpreterPythonTests/PythonExceptionStateTest.TestManualRestoreSemantics (1328 of 1785) PASS: lldb-api :: lang/objc/single-entry-dictionary/TestObjCSingleEntryDictionary.py (1329 of 1785) PASS: lldb-api :: functionalities/breakpoint/breakpoint_options/TestBreakpointOptions.py (1330 of 1785) PASS: lldb-api :: commands/expression/rdar44436068/Test128BitsInteger.py (1331 of 1785) PASS: lldb-api :: macosx/thread-names/TestInterruptThreadNames.py (1332 of 1785) PASS: lldb-api :: commands/expression/namespace_local_var_same_name_obj_c/TestNamespaceLocalVarSameNameObjC.py (1333 of 1785) PASS: lldb-api :: types/TestFloatTypes.py (1334 of 1785) PASS: lldb-unit :: Process/minidump/./LLDBMinidumpTests/MinidumpParserTest.GetMiscInfoWindows (1335 of 1785) PASS: lldb-unit :: Utility/./UtilityTests/StructuredDataTest.ParseJSONFromFile (1336 of 1785) PASS: lldb-api :: commands/expression/import-std-module/deque-basic/TestBasicDeque.py (1337 of 1785) PASS: lldb-shell :: SymbolFile/NativePDB/nested-types.cpp (1338 of 1785) PASS: lldb-shell :: Settings/TestFrameFormatColor.test (1339 of 1785) PASS: lldb-api :: python_api/rdar-12481949/Test-rdar-12481949.py (1340 of 1785) PASS: lldb-api :: lang/c/local_types/TestUseClosestType.py (1341 of 1785) PASS: lldb-shell :: SymbolFile/DWARF/debug-types-basic.test (1342 of 1785) PASS: lldb-api :: functionalities/unwind/sigtramp/TestSigtrampUnwind.py (1343 of 1785) PASS: lldb-api :: python_api/default-constructor/TestDefaultConstructorForAPIObjects.py (1344 of 1785) PASS: lldb-unit :: Utility/./UtilityTests/RangeTest.Constructor (1345 of 1785) PASS: lldb-api :: lang/cpp/accelerator-table/TestCPPAccelerator.py (1346 of 1785) PASS: lldb-unit :: Utility/./UtilityTests/LogTest.Register (1347 of 1785) PASS: lldb-unit :: Utility/./UtilityTests/FileSpecTest.IsRelative (1348 of 1785) PASS: lldb-unit :: Language/Highlighting/./HighlighterTests/HighlighterTest.DefaultHighlighter (1349 of 1785) PASS: lldb-shell :: Driver/TestRepl.test (1350 of 1785) PASS: lldb-api :: lang/cpp/gmodules/TestWithModuleDebugging.py (1351 of 1785) PASS: lldb-api :: functionalities/float-display/TestFloatDisplay.py (1352 of 1785) PASS: lldb-api :: lang/objc/objc-new-syntax/TestObjCNewSyntaxArray.py (1353 of 1785) PASS: lldb-unit :: Utility/./UtilityTests/CompletionRequest.TryCompleteCurrentArgGood (1354 of 1785) PASS: lldb-api :: lang/c/global_variables/TestGlobalVariables.py (1355 of 1785) PASS: lldb-api :: python_api/value/TestValueAPI.py (1356 of 1785) PASS: lldb-api :: functionalities/breakpoint/source_regexp/TestSourceRegexBreakpoints.py (1357 of 1785) PASS: lldb-api :: types/TestRecursiveTypes.py (1358 of 1785) PASS: lldb-api :: functionalities/non-overlapping-index-variable-i/TestIndexVariable.py (1359 of 1785) PASS: lldb-api :: functionalities/tsan/cpp_global_location/TestTsanCPPGlobalLocation.py (1360 of 1785) PASS: lldb-api :: lang/cpp/limit-debug-info/TestWithLimitDebugInfo.py (1361 of 1785) PASS: lldb-unit :: Utility/./UtilityTests/AnsiTerminal.Empty (1362 of 1785) PASS: lldb-unit :: UnwindAssembly/x86/./UnwindAssemblyx86Tests/Testx86AssemblyInspectionEngine.TestPushEBP (1363 of 1785) PASS: lldb-api :: lang/objc/objc-ivar-protocols/TestIvarProtocols.py (1364 of 1785) PASS: lldb-api :: commands/watchpoints/hello_watchpoint/TestMyFirstWatchpoint.py (1365 of 1785) UNSUPPORTED: lldb-api :: functionalities/darwin_log/filter/exact_match/message/TestDarwinLogFilterMatchMessage.py (1366 of 1785) PASS: lldb-shell :: Reproducer/Modules/TestModuleCXX.test (1367 of 1785) PASS: lldb-api :: functionalities/data-formatter/data-formatter-disabling/TestDataFormatterDisabling.py (1368 of 1785) PASS: lldb-api :: lang/objc/hidden-ivars/TestHiddenIvars.py (1369 of 1785) PASS: lldb-unit :: Language/Highlighting/./HighlighterTests/HighlighterTest.Keywords (1370 of 1785) PASS: lldb-shell :: ObjectFile/ELF/basic-info.yaml (1371 of 1785) PASS: lldb-api :: functionalities/data-formatter/stringprinter/TestStringPrinter.py (1372 of 1785) PASS: lldb-unit :: Utility/./UtilityTests/StringListTest.ForRange (1373 of 1785) PASS: lldb-shell :: Minidump/dump-all.test (1374 of 1785) PASS: lldb-shell :: Reproducer/TestSynchronous.test (1375 of 1785) PASS: lldb-unit :: Interpreter/./InterpreterTests/OptionArgParserTest.toBoolean (1376 of 1785) PASS: lldb-api :: lang/c/struct_types/TestStructTypes.py (1377 of 1785) UNSUPPORTED: lldb-api :: functionalities/thread/multi_break/TestMultipleBreakpoints.py (1378 of 1785) PASS: lldb-api :: python_api/hello_world/TestHelloWorld.py (1379 of 1785) PASS: lldb-api :: functionalities/data-formatter/data-formatter-stl/libcxx/unordered/TestDataFormatterUnordered.py (1380 of 1785) PASS: lldb-unit :: Language/Highlighting/./HighlighterTests/HighlighterTest.ClangBraces (1381 of 1785) PASS: lldb-unit :: Symbol/./SymbolTests/PostfixExpression.ParseFPOProgram (1382 of 1785) PASS: lldb-api :: python_api/file_handle/TestFileHandle.py (1383 of 1785) PASS: lldb-api :: functionalities/target-new-solib-notifications/TestModuleLoadedNotifys.py (1384 of 1785) PASS: lldb-api :: functionalities/modern-type-lookup/basic-objc/TestBasicObjcModernTypeLookup.py (1385 of 1785) PASS: lldb-api :: functionalities/step_scripted/TestStepScripted.py (1386 of 1785) PASS: lldb-api :: functionalities/breakpoint/address_breakpoints/TestBadAddressBreakpoints.py (1387 of 1785) PASS: lldb-shell :: SymbolFile/DWARF/find-method.cpp (1388 of 1785) PASS: lldb-api :: lang/c/bitfields/TestBitfields.py (1389 of 1785) PASS: lldb-api :: api/listeners/TestListener.py (1390 of 1785) PASS: lldb-unit :: Utility/./UtilityTests/RecordReplayTest.InstrumentedBarRef (1391 of 1785) PASS: lldb-api :: commands/expression/import_builtin_fileid/TestImportBuiltinFileID.py (1392 of 1785) PASS: lldb-unit :: ScriptInterpreter/Python/./ScriptInterpreterPythonTests/PythonDataObjectsTest.TestPythonInteger (1393 of 1785) PASS: lldb-unit :: Utility/./UtilityTests/AnsiTerminal.AtEnd (1394 of 1785) PASS: lldb-unit :: Utility/./UtilityTests/StreamTest.PutHex64ByteOrderLittle (1395 of 1785) PASS: lldb-unit :: Host/./HostTests/FileSystemTest.MakeAbsolute (1396 of 1785) PASS: lldb-shell :: SymbolFile/DWARF/dwarf5-index-is-used.cpp (1397 of 1785) PASS: lldb-unit :: Utility/./UtilityTests/AnsiTerminal.AtStart (1398 of 1785) PASS: lldb-api :: python_api/lldbutil/TestSwigVersion.py (1399 of 1785) PASS: lldb-api :: commands/process/launch/TestProcessLaunch.py (1400 of 1785) PASS: lldb-unit :: Utility/./UtilityTests/ArgsTest.TestAppendArg (1401 of 1785) PASS: lldb-shell :: Reproducer/TestRelativePath.test (1402 of 1785) PASS: lldb-unit :: Utility/./UtilityTests/StringExtractorTest.GetU64BigEndian (1403 of 1785) PASS: lldb-shell :: ObjectFile/MachO/symtab.yaml (1404 of 1785) PASS: lldb-api :: functionalities/data-formatter/dump_dynamic/TestDumpDynamic.py (1405 of 1785) PASS: lldb-unit :: Host/./HostTests/FileSystemTest.FileAndDirectoryComponents (1406 of 1785) UNSUPPORTED: lldb-shell :: Register/x86-64-gp-write.test (1407 of 1785) UNSUPPORTED: lldb-shell :: SymbolFile/target-symbols-add-unwind.test (1408 of 1785) PASS: lldb-unit :: Host/./HostTests/MainLoopTest.TerminatesImmediately (1409 of 1785) PASS: lldb-unit :: SymbolFile/NativePDB/./SymbolFileNativePDBTests/PDBFPOProgramToDWARFExpressionTests.MultipleDependentAssignments (1410 of 1785) PASS: lldb-unit :: Utility/./UtilityTests/StreamTeeTest.Constructor2Streams (1411 of 1785) PASS: lldb-shell :: ObjectFile/PECOFF/basic-info.yaml (1412 of 1785) PASS: lldb-unit :: UnwindAssembly/x86/./UnwindAssemblyx86Tests/Testx86AssemblyInspectionEngine.TestPushRBPWithREX (1413 of 1785) PASS: lldb-shell :: ObjectFile/PECOFF/subsections.yaml (1414 of 1785) PASS: lldb-api :: functionalities/recursion/TestValueObjectRecursion.py (1415 of 1785) PASS: lldb-unit :: UnwindAssembly/x86/./UnwindAssemblyx86Tests/Testx86AssemblyInspectionEngine.TestPushEDX (1416 of 1785) PASS: lldb-unit :: Utility/./UtilityTests/BinaryStreamTest.PutULEB128NineBytes (1417 of 1785) PASS: lldb-api :: lang/cpp/namespace/TestNamespace.py (1418 of 1785) PASS: lldb-unit :: Utility/./UtilityTests/RangeTest.SizeTypes (1419 of 1785) PASS: lldb-unit :: Utility/./UtilityTests/OptionsWithRawTest.EmptySuffix (1420 of 1785) PASS: lldb-unit :: Utility/./UtilityTests/TimeoutTest.Construction (1421 of 1785) PASS: lldb-api :: functionalities/data-formatter/summary-string-onfail/Test-rdar-9974002.py (1422 of 1785) PASS: lldb-unit :: Utility/./UtilityTests/ListenerTest.GetEventImmediate (1423 of 1785) PASS: lldb-unit :: Utility/./UtilityTests/DataExtractorTest.GetMaxS64 (1424 of 1785) PASS: lldb-api :: commands/frame/diagnose/local-variable/TestLocalVariable.py (1425 of 1785) PASS: lldb-api :: python_api/class_members/TestSBTypeClassMembers.py (1426 of 1785) PASS: lldb-unit :: UnwindAssembly/x86/./UnwindAssemblyx86Tests/Testx86AssemblyInspectionEngine.TestPopEDI (1427 of 1785) PASS: lldb-unit :: Utility/./UtilityTests/UriParserTest.Empty (1428 of 1785) PASS: lldb-unit :: Language/Highlighting/./HighlighterTests/HighlighterTest.ClangCursorPosAfterOtherToken (1429 of 1785) PASS: lldb-api :: sample_test/TestSampleTest.py (1430 of 1785) PASS: lldb-shell :: Reproducer/TestFileRepro.test (1431 of 1785) PASS: lldb-unit :: Utility/./UtilityTests/StringListTest.GetMaxStringLengthMixed (1432 of 1785) PASS: lldb-unit :: Utility/./UtilityTests/StringExtractorTest.GetHexBytesAvail_FullString (1433 of 1785) PASS: lldb-api :: functionalities/thread/concurrent_events/TestConcurrentTwoBreakpointThreads.py (1434 of 1785) PASS: lldb-unit :: Expression/./ExpressionTests/DiagnosticManagerTest.HasFixits (1435 of 1785) PASS: lldb-api :: commands/expression/weak_symbols/TestWeakSymbols.py (1436 of 1785) PASS: lldb-api :: python_api/watchpoint/TestSetWatchpoint.py (1437 of 1785) PASS: lldb-unit :: UnwindAssembly/x86/./UnwindAssemblyx86Tests/Testx86AssemblyInspectionEngine.TestSubRSP (1438 of 1785) PASS: lldb-unit :: Process/gdb-remote/./ProcessGdbRemoteTests/GDBRemoteCommunicationServerTest.SendErrorResponse_ErrorList (1439 of 1785) PASS: lldb-unit :: Utility/./UtilityTests/BinaryStreamTest.PutSLEB128One (1440 of 1785) PASS: lldb-shell :: SymbolFile/DWARF/debug-names-compressed.cpp (1441 of 1785) PASS: lldb-shell :: SymbolFile/NativePDB/bitfields.cpp (1442 of 1785) UNSUPPORTED: lldb-api :: commands/watchpoints/hello_watchlocation/TestWatchLocation.py (1443 of 1785) PASS: lldb-unit :: Utility/./UtilityTests/StringListTest.GetMaxStringLengthEmpty (1444 of 1785) PASS: lldb-shell :: Commands/command-source.test (1445 of 1785) PASS: lldb-api :: functionalities/thread/concurrent_events/TestConcurrentDelaySignalBreak.py (1446 of 1785) PASS: lldb-api :: functionalities/load_unload/TestLoadUnload.py (1447 of 1785) PASS: lldb-unit :: Process/minidump/./LLDBMinidumpTests/MinidumpParserTest.GetFilteredModuleList (1448 of 1785) PASS: lldb-api :: lang/objc/ptr_refs/TestPtrRefsObjC.py (1449 of 1785) PASS: lldb-unit :: Utility/./UtilityTests/RangeTest.DefaultConstructor (1450 of 1785) PASS: lldb-unit :: Utility/./UtilityTests/VMRange.CollectionContains (1451 of 1785) PASS: lldb-unit :: Interpreter/./InterpreterTests/OptionArgParserTest.toScriptLanguage (1452 of 1785) PASS: lldb-api :: lang/cpp/unique-types/TestUniqueTypes.py (1453 of 1785) UNSUPPORTED: lldb-api :: functionalities/longjmp/TestLongjmp.py (1454 of 1785) PASS: lldb-unit :: Process/minidump/./LLDBMinidumpTests/MinidumpParserTest.MinidumpDuplicateModuleMinAddress (1455 of 1785) UNSUPPORTED: lldb-api :: tools/lldb-vscode/launch/TestVSCode_launch.py (1456 of 1785) PASS: lldb-api :: commands/expression/top-level/TestTopLevelExprs.py (1457 of 1785) PASS: lldb-api :: lang/cpp/namespace/TestNamespaceLookup.py (1458 of 1785) PASS: lldb-unit :: Utility/./UtilityTests/StringExtractorTest.GetHexBytesAvail (1459 of 1785) PASS: lldb-shell :: Settings/TestDisableColor.test (1460 of 1785) PASS: lldb-unit :: Utility/./UtilityTests/UriParserTest.TypicalPortPath (1461 of 1785) PASS: lldb-unit :: SymbolFile/NativePDB/./SymbolFileNativePDBTests/PDBFPOProgramToDWARFExpressionTests.DependencyChain (1462 of 1785) PASS: lldb-api :: functionalities/data-formatter/data-formatter-stl/libcxx/map/TestDataFormatterLibccMap.py (1463 of 1785) PASS: lldb-api :: lang/cpp/member-and-local-vars-with-same-name/TestMembersAndLocalsWithSameName.py (1464 of 1785) PASS: lldb-unit :: Utility/./UtilityTests/VMRange.Ordering (1465 of 1785) PASS: lldb-unit :: Utility/./UtilityTests/ArchSpecTest.Compatibility (1466 of 1785) UNSUPPORTED: lldb-api :: functionalities/signal/handle-segv/TestHandleSegv.py (1467 of 1785) PASS: lldb-unit :: Utility/./UtilityTests/NameMatchesTest.EndsWith (1468 of 1785) PASS: lldb-api :: commands/watchpoints/watchpoint_commands/command/TestWatchpointCommandLLDB.py (1469 of 1785) PASS: lldb-api :: functionalities/thread/backtrace_limit/TestBacktraceLimit.py (1470 of 1785) PASS: lldb-api :: commands/expression/namespace_local_var_same_name_cpp_and_c/TestNamespaceLocalVarSameNameCppAndC.py (1471 of 1785) PASS: lldb-unit :: Expression/./ExpressionTests/CppModuleConfigurationTest.Linux (1472 of 1785) PASS: lldb-unit :: Utility/./UtilityTests/RangeTest.ContainsEndInclusive (1473 of 1785) PASS: lldb-unit :: Utility/./UtilityTests/OptionsWithRawTest.ArgsButNoLeadingDash (1474 of 1785) PASS: lldb-unit :: Target/./TargetTests/PathMappingListTest.AbsoluteTests (1475 of 1785) PASS: lldb-unit :: Language/Highlighting/./HighlighterTests/HighlighterTest.HighlighterSelectionType (1476 of 1785) PASS: lldb-unit :: Utility/./UtilityTests/StringExtractorTest.GetHexU8_Underflow_NoEof (1477 of 1785) PASS: lldb-unit :: ScriptInterpreter/Python/./ScriptInterpreterPythonTests/PythonExceptionStateTest.TestAcquisitionSemantics (1478 of 1785) PASS: lldb-unit :: Utility/./UtilityTests/StringExtractorTest.GetHexBytes (1479 of 1785) PASS: lldb-api :: python_api/module_section/TestModuleAndSection.py (1480 of 1785) PASS: lldb-api :: functionalities/data-formatter/data-formatter-stl/libcxx/set/TestDataFormatterLibcxxSet.py (1481 of 1785) PASS: lldb-unit :: Utility/./UtilityTests/StatusTest.Formatv (1482 of 1785) UNSUPPORTED: lldb-api :: functionalities/darwin_log/filter/regex/activity/TestDarwinLogFilterRegexActivity.py (1483 of 1785) PASS: lldb-unit :: Utility/./UtilityTests/RegularExpression.Empty (1484 of 1785) PASS: lldb-api :: lang/objc/objc-static-method-stripped/TestObjCStaticMethodStripped.py (1485 of 1785) PASS: lldb-unit :: Utility/./UtilityTests/FileSpecTest.FormatFileSpec (1486 of 1785) PASS: lldb-api :: lang/cpp/virtual-overload/TestVirtualOverload.py (1487 of 1785) PASS: lldb-api :: functionalities/breakpoint/comp_dir_symlink/TestCompDirSymLink.py (1488 of 1785) PASS: lldb-unit :: Language/Highlighting/./HighlighterTests/HighlighterTest.DefaultHighlighterWithCursorOutOfBounds (1489 of 1785) PASS: lldb-unit :: Utility/./UtilityTests/BinaryStreamTest.PutSLEB128FourBytes (1490 of 1785) PASS: lldb-api :: commands/process/attach/attach_denied/TestAttachDenied.py (1491 of 1785) PASS: lldb-shell :: Commands/CommandScriptImmediateOutput/CommandScriptImmediateOutputFile.test (1492 of 1785) PASS: lldb-unit :: Utility/./UtilityTests/NameMatchesTest.Equals (1493 of 1785) PASS: lldb-shell :: ObjectFile/ELF/PT_LOAD.yaml (1494 of 1785) PASS: lldb-unit :: Utility/./UtilityTests/StringLexerTest.NextIfList (1495 of 1785) PASS: lldb-unit :: Host/./HostTests/SocketAddressTest.Set (1496 of 1785) PASS: lldb-unit :: Utility/./UtilityTests/StringListTest.LongestCommonPrefixDuplicateElement (1497 of 1785) PASS: lldb-api :: commands/expression/po_verbosity/TestPoVerbosity.py (1498 of 1785) PASS: lldb-unit :: Host/./HostTests/File.GetWaitableHandleFileno (1499 of 1785) PASS: lldb-unit :: Host/./HostTests/FileSystemTest.EnumerateDirectory (1500 of 1785) PASS: lldb-shell :: ObjectFile/ELF/netbsd-core-amd64.test (1501 of 1785) PASS: lldb-unit :: Process/minidump/./LLDBMinidumpTests/MinidumpParserTest.GetThreadContext_x86_64 (1502 of 1785) PASS: lldb-api :: functionalities/tsan/multiple/TestTsanMultiple.py (1503 of 1785) PASS: lldb-unit :: Utility/./UtilityTests/Flags.Clear (1504 of 1785) PASS: lldb-unit :: Utility/./UtilityTests/StringLexerTest.NextIf (1505 of 1785) PASS: lldb-unit :: ScriptInterpreter/Python/./ScriptInterpreterPythonTests/PythonExceptionStateTest.TestDiscardSemantics (1506 of 1785) PASS: lldb-api :: functionalities/gdb_remote_client/TestPlatformClient.py (1507 of 1785) PASS: lldb-unit :: Utility/./UtilityTests/VMRange.Comparison (1508 of 1785) PASS: lldb-api :: lang/c/enum_types/TestEnumTypes.py (1509 of 1785) PASS: lldb-api :: tools/lldb-server/TestGdbRemoteHostInfo.py (1510 of 1785) PASS: lldb-unit :: ObjectFile/PECOFF/./ObjectFilePECOFFTests/PECallFrameInfoTest.Chained_eh (1511 of 1785) PASS: lldb-unit :: Utility/./UtilityTests/LogTest.LLDB_LOG_nullptr (1512 of 1785) PASS: lldb-unit :: Host/./HostTests/FileSystemTest.Readable (1513 of 1785) PASS: lldb-unit :: Utility/./UtilityTests/OptionsWithRawTest.WhitespaceSuffix (1514 of 1785) UNSUPPORTED: lldb-api :: benchmarks/expression/TestExpressionCmd.py (1515 of 1785) UNSUPPORTED: lldb-api :: functionalities/thread/break_after_join/TestBreakAfterJoin.py (1516 of 1785) PASS: lldb-unit :: Editline/./EditlineTests/EditlineTestFixture.EditlineReceivesSingleLineText (1517 of 1785) PASS: lldb-shell :: ObjectFile/MachO/subsections.yaml (1518 of 1785) PASS: lldb-api :: python_api/value/linked_list/TestValueAPILinkedList.py (1519 of 1785) PASS: lldb-unit :: UnwindAssembly/x86/./UnwindAssemblyx86Tests/Testx86AssemblyInspectionEngine.TestPushESI (1520 of 1785) PASS: lldb-shell :: SymbolFile/Breakpad/line-table-missing-file.test (1521 of 1785) PASS: lldb-shell :: SymbolFile/DWARF/debug-line-basic.s (1522 of 1785) PASS: lldb-unit :: Utility/./UtilityTests/StringListTest.Clear (1523 of 1785) PASS: lldb-api :: lang/objc/self/TestObjCSelf.py (1524 of 1785) PASS: lldb-unit :: Expression/./ExpressionTests/DiagnosticManagerTest.FixedExpression (1525 of 1785) PASS: lldb-api :: commands/expression/import-std-module/conflicts/TestStdModuleWithConflicts.py (1526 of 1785) PASS: lldb-shell :: Quit/TestQuitExitCodeTooManyArgs.test (1527 of 1785) PASS: lldb-api :: lang/objc/objc-baseclass-sbtype/TestObjCBaseClassSBType.py (1528 of 1785) PASS: lldb-unit :: Utility/./UtilityTests/BinaryStreamTest.PutULEB128EightBytes (1529 of 1785) PASS: lldb-unit :: Utility/./UtilityTests/DeserializerTest.HasData (1530 of 1785) PASS: lldb-api :: commands/target/create-deps/TestTargetCreateDeps.py (1531 of 1785) PASS: lldb-api :: functionalities/modern-type-lookup/objc-modules/TestObjModulesModernTypeLookup.py (1532 of 1785) PASS: lldb-unit :: Utility/./UtilityTests/RangeTest.ContainsRangeStartingFromZero (1533 of 1785) PASS: lldb-shell :: Breakpoint/debug_rnglistx_rlex.test (1534 of 1785) PASS: lldb-api :: functionalities/tail_call_frames/ambiguous_tail_call_seq2/TestAmbiguousTailCallSeq2.py (1535 of 1785) PASS: lldb-api :: functionalities/deleted-executable/TestDeletedExecutable.py (1536 of 1785) PASS: lldb-api :: commands/frame/var/TestFrameVar.py (1537 of 1785) PASS: lldb-api :: lang/cpp/dynamic-value/TestDynamicValue.py (1538 of 1785) PASS: lldb-api :: lang/objc/objc-foundation-dictionary-empty/TestNSDictionary0.py (1539 of 1785) PASS: lldb-unit :: Utility/./UtilityTests/TimerTest.CategoryTimesStats (1540 of 1785) PASS: lldb-unit :: Utility/./UtilityTests/StreamTest.PutHex64ByteOrderBig (1541 of 1785) PASS: lldb-unit :: Utility/./UtilityTests/StringListTest.GetSize (1542 of 1785) PASS: lldb-shell :: Driver/TestFile.test (1543 of 1785) PASS: lldb-api :: commands/frame/recognizer/TestFrameRecognizer.py (1544 of 1785) PASS: lldb-shell :: ObjectFile/ELF/short-build-id.yaml (1545 of 1785) PASS: lldb-unit :: Utility/./UtilityTests/StringExtractorTest.GetHexBytesAvail_Partial (1546 of 1785) PASS: lldb-api :: lang/objc/objc-stepping/TestObjCStepping.py (1547 of 1785) PASS: lldb-unit :: Process/gdb-remote/./ProcessGdbRemoteTests/GDBRemoteClientBaseTest.SendContinueDelegateInterface (1548 of 1785) PASS: lldb-api :: lang/cpp/stl/TestSTL.py (1549 of 1785) PASS: lldb-unit :: Process/gdb-remote/./ProcessGdbRemoteTests/GDBRemoteCommunicationClientTest.SendGetTraceConfigPacket (1550 of 1785) PASS: lldb-api :: lang/c/stepping/TestStepAndBreakpoints.py (1551 of 1785) PASS: lldb-unit :: Utility/./UtilityTests/BinaryStreamTest.PutULEB128MaxValue (1552 of 1785) UNSUPPORTED: lldb-api :: functionalities/breakpoint/hardware_breakpoints/hardware_breakpoint_on_multiple_threads/TestHWBreakMultiThread.py (1553 of 1785) PASS: lldb-unit :: Symbol/./SymbolTests/Type.CompilerContextPattern (1554 of 1785) PASS: lldb-shell :: SymbolFile/DWARF/split-dwarf-multiple-cu.ll (1555 of 1785) PASS: lldb-api :: commands/expression/import-std-module/unique_ptr-dbg-info-content/TestUniquePtrDbgInfoContent.py (1556 of 1785) PASS: lldb-shell :: Settings/TestSettingsSet.test (1557 of 1785) PASS: lldb-unit :: Utility/./UtilityTests/StringListTest.InsertStringAtIndexMove (1558 of 1785) PASS: lldb-api :: functionalities/rerun/TestRerun.py (1559 of 1785) PASS: lldb-unit :: ScriptInterpreter/Python/./ScriptInterpreterPythonTests/PythonDataObjectsTest.TestPythonStringToStructuredString (1560 of 1785) PASS: lldb-unit :: Utility/./UtilityTests/StringExtractorTest.GetHexU8_InvalidHex_NoEof (1561 of 1785) PASS: lldb-api :: functionalities/gdb_remote_client/TestGDBRemoteClient.py (1562 of 1785) UNSUPPORTED: lldb-shell :: Register/aarch64-fp-read.test (1563 of 1785) PASS: lldb-api :: macosx/order/TestOrderFile.py (1564 of 1785) PASS: lldb-unit :: Utility/./UtilityTests/StringExtractorTest.GetHexBytes_Underflow (1565 of 1785) PASS: lldb-api :: lang/objc/print-obj/TestPrintObj.py (1566 of 1785) UNSUPPORTED: lldb-api :: linux/sepdebugsymlink/TestTargetSymbolsSepDebugSymlink.py (1567 of 1785) PASS: lldb-unit :: Utility/./UtilityTests/FileSpecTest.EqualDotsWindows (1568 of 1785) PASS: lldb-api :: driver/batch_mode/TestBatchMode.py (1569 of 1785) PASS: lldb-unit :: UnwindAssembly/x86/./UnwindAssemblyx86Tests/Testx86AssemblyInspectionEngine.TestReturnDetect (1570 of 1785) PASS: lldb-api :: functionalities/postmortem/elf-core/thread_crash/TestLinuxCoreThreads.py (1571 of 1785) PASS: lldb-unit :: Utility/./UtilityTests/StreamTest.PutHex16ByteOrderLittle (1572 of 1785) PASS: lldb-unit :: Utility/./UtilityTests/OptionsWithRawTest.MultiWordSuffix (1573 of 1785) PASS: lldb-api :: functionalities/thread/num_threads/TestNumThreads.py (1574 of 1785) PASS: lldb-shell :: SymbolFile/DWARF/debug-types-signature-loop.s (1575 of 1785) PASS: lldb-api :: commands/expression/pr35310/TestExprsBug35310.py (1576 of 1785) PASS: lldb-api :: commands/expression/persistent_variables/TestPersistentVariables.py (1577 of 1785) PASS: lldb-api :: commands/expression/ignore-artificial-constructors/TestIgnoreArtificialConstructors.py (1578 of 1785) PASS: lldb-unit :: Utility/./UtilityTests/ProcessInstanceInfo.DumpTable_invalidUID (1579 of 1785) PASS: lldb-unit :: Utility/./UtilityTests/AnsiTerminal.Basic (1580 of 1785) PASS: lldb-unit :: Utility/./UtilityTests/CompletionRequest.DuplicateFilteringWithComments (1581 of 1785) PASS: lldb-unit :: SymbolFile/NativePDB/./SymbolFileNativePDBTests/PDBFPOProgramToDWARFExpressionTests.UnknownOp (1582 of 1785) PASS: lldb-api :: commands/watchpoints/watchpoint_size/TestWatchpointSizes.py (1583 of 1785) PASS: lldb-unit :: Utility/./UtilityTests/StreamTest.ShiftOperatorUInts (1584 of 1785) PASS: lldb-unit :: Expression/./ExpressionTests/DiagnosticManagerTest.AppendMessageAttachToLastDiag (1585 of 1785) PASS: lldb-unit :: UnwindAssembly/x86/./UnwindAssemblyx86Tests/Testx86AssemblyInspectionEngine.TestSpillRegToStackViaMOVx86_64 (1586 of 1785) PASS: lldb-unit :: Expression/./ExpressionTests/ClangHostTest.ComputeClangResourceDirectory (1587 of 1785) PASS: lldb-api :: tools/lldb-server/TestGdbRemoteSingleStep.py (1588 of 1785) PASS: lldb-api :: functionalities/postmortem/wow64_minidump/TestWow64MiniDump.py (1589 of 1785) UNSUPPORTED: lldb-shell :: SymbolFile/PDB/compilands.test (1590 of 1785) PASS: lldb-api :: tools/lldb-server/inferior-crash/TestGdbRemoteSegFault.py (1591 of 1785) PASS: lldb-api :: python_api/findvalue_duplist/TestSBFrameFindValue.py (1592 of 1785) PASS: lldb-unit :: Utility/./UtilityTests/UriParserTest.BadPort (1593 of 1785) PASS: lldb-api :: functionalities/thread/backtrace_all/TestBacktraceAll.py (1594 of 1785) PASS: lldb-api :: lang/objc/modules-incomplete/TestIncompleteModules.py (1595 of 1785) PASS: lldb-shell :: ObjectFile/MachO/lc_build_version_notools.yaml (1596 of 1785) PASS: lldb-api :: lang/objc/foundation/TestObjectDescriptionAPI.py (1597 of 1785) PASS: lldb-api :: lang/cpp/char8_t/TestCxxChar8_t.py (1598 of 1785) PASS: lldb-api :: macosx/universal/TestUniversal.py (1599 of 1785) PASS: lldb-api :: functionalities/gdb_remote_client/TestNoWatchpointSupportInfo.py (1600 of 1785) PASS: lldb-unit :: Utility/./UtilityTests/DataExtractorTest.GetCStrUnterminated (1601 of 1785) PASS: lldb-api :: functionalities/abbreviation/TestCommonShortSpellings.py (1602 of 1785) PASS: lldb-api :: lang/c/conflicting-symbol/TestConflictingSymbol.py (1603 of 1785) PASS: lldb-api :: tools/lldb-server/TestGdbRemoteAttach.py (1604 of 1785) UNSUPPORTED: lldb-shell :: SymbolFile/PDB/udt-layout.test (1605 of 1785) PASS: lldb-api :: functionalities/thread/concurrent_events/TestConcurrentTwoBreakpointsOneSignal.py (1606 of 1785) PASS: lldb-shell :: Quit/TestQuitExitCodeHexA.test (1607 of 1785) PASS: lldb-api :: commands/expression/xvalue/TestXValuePrinting.py (1608 of 1785) PASS: lldb-api :: lang/cpp/symbols/TestSymbols.py (1609 of 1785) UNSUPPORTED: lldb-api :: lang/cpp/static_members/TestCPPStaticMembers.py (1610 of 1785) PASS: lldb-unit :: Utility/./UtilityTests/RecordReplayTest.InstrumentedFoo (1611 of 1785) PASS: lldb-unit :: Utility/./UtilityTests/GeneratorTest.Create (1612 of 1785) PASS: lldb-api :: functionalities/plugins/python_os_plugin/TestPythonOSPlugin.py (1613 of 1785) PASS: lldb-unit :: Utility/./UtilityTests/StreamTeeTest.Constructor1Stream (1614 of 1785) UNSUPPORTED: lldb-api :: functionalities/thread/state/TestThreadStates.py (1615 of 1785) UNSUPPORTED: lldb-api :: lang/cpp/function-template-parameter-pack/TestFunctionTemplateParameterPack.py (1616 of 1785) PASS: lldb-api :: functionalities/data-formatter/data-formatter-globals/TestDataFormatterGlobals.py (1617 of 1785) PASS: lldb-api :: commands/process/attach/TestProcessAttach.py (1618 of 1785) PASS: lldb-api :: functionalities/gdb_remote_client/TestArmRegisterDefinition.py (1619 of 1785) PASS: lldb-unit :: Utility/./UtilityTests/StringListTest.InsertStringAtIndexStdString (1620 of 1785) PASS: lldb-api :: python_api/lldbutil/process/TestPrintStackTraces.py (1621 of 1785) PASS: lldb-unit :: Utility/./UtilityTests/ArchSpecTest.MergeFrom (1622 of 1785) UNSUPPORTED: lldb-api :: tools/lldb-vscode/breakpoint/TestVSCode_setExceptionBreakpoints.py (1623 of 1785) PASS: lldb-api :: functionalities/data-formatter/data-formatter-categories/TestDataFormatterCategories.py (1624 of 1785) PASS: lldb-api :: commands/expression/no-deadlock/TestExprDoesntBlock.py (1625 of 1785) PASS: lldb-unit :: Utility/./UtilityTests/StreamTest.PutHex8 (1626 of 1785) PASS: lldb-unit :: Utility/./UtilityTests/SerializationRountripTest.SerializeDeserializePodPointers (1627 of 1785) PASS: lldb-api :: commands/expression/unwind_expression/TestUnwindExpression.py (1628 of 1785) PASS: lldb-unit :: UnwindAssembly/x86/./UnwindAssemblyx86Tests/Testx86AssemblyInspectionEngine.TestPopR12 (1629 of 1785) PASS: lldb-api :: commands/watchpoints/watchpoint_events/TestWatchpointEvents.py (1630 of 1785) PASS: lldb-api :: functionalities/breakpoint/breakpoint_conditions/TestBreakpointConditions.py (1631 of 1785) PASS: lldb-api :: functionalities/breakpoint/address_breakpoints/TestAddressBreakpoints.py (1632 of 1785) PASS: lldb-api :: functionalities/postmortem/mach-core/TestMachCore.py (1633 of 1785) PASS: lldb-shell :: Watchpoint/SetErrorCases.test (1634 of 1785) PASS: lldb-api :: commands/expression/import-std-module/shared_ptr/TestSharedPtr.py (1635 of 1785) PASS: lldb-api :: functionalities/inline-stepping/TestInlineStepping.py (1636 of 1785) PASS: lldb-unit :: Utility/./UtilityTests/StringListTest.RemoveBlankLines (1637 of 1785) PASS: lldb-api :: commands/command/nested_alias/TestNestedAlias.py (1638 of 1785) PASS: lldb-unit :: Utility/./UtilityTests/ArgsTest.TestOverwriteArgs (1639 of 1785) PASS: lldb-api :: functionalities/data-formatter/data-formatter-objc/TestDataFormatterObjCNSBundle.py (1640 of 1785) PASS: lldb-unit :: Symbol/./SymbolTests/DWARFCallFrameInfoTest.Basic_eh (1641 of 1785) PASS: lldb-unit :: UnwindAssembly/x86/./UnwindAssemblyx86Tests/Testx86AssemblyInspectionEngine.TestPushR12 (1642 of 1785) PASS: lldb-shell :: Breakpoint/implicit_const_form_support.test (1643 of 1785) PASS: lldb-shell :: Unwind/trap_frame_sym_ctx.test (1644 of 1785) PASS: lldb-unit :: UnwindAssembly/x86/./UnwindAssemblyx86Tests/Testx86AssemblyInspectionEngine.Test64bitFramelessBigStackFrame (1645 of 1785) PASS: lldb-unit :: Utility/./UtilityTests/AnsiTerminal.Incomplete (1646 of 1785) PASS: lldb-api :: lang/cpp/nsimport/TestCppNsImport.py (1647 of 1785) PASS: lldb-unit :: Language/Highlighting/./HighlighterTests/HighlighterTest.ClangCursorOutOfBounds (1648 of 1785) PASS: lldb-unit :: Signals/./SignalsTests/UnixSignalsTest.GetInfo (1649 of 1785) PASS: lldb-api :: source-manager/TestSourceManager.py (1650 of 1785) PASS: lldb-api :: commands/watchpoints/multiple_hits/TestMultipleHits.py (1651 of 1785) PASS: lldb-api :: tools/lldb-server/commandline/TestStubReverseConnect.py (1652 of 1785) PASS: lldb-shell :: Breakpoint/debug_addrx.test (1653 of 1785) UNSUPPORTED: lldb-api :: python_api/disassemble-raw-data/TestDisassemble_VST1_64.py (1654 of 1785) PASS: lldb-api :: functionalities/thread/concurrent_events/TestConcurrentManyBreakpoints.py (1655 of 1785) PASS: lldb-unit :: Utility/./UtilityTests/StateTest.Formatv (1656 of 1785) PASS: lldb-unit :: Symbol/./SymbolTests/TestClangASTContext.TestRecordHasFields (1657 of 1785) PASS: lldb-shell :: SymbolFile/DWARF/debug-types-line-tables.s (1658 of 1785) PASS: lldb-api :: lang/cpp/unicode-literals/TestUnicodeLiterals.py (1659 of 1785) PASS: lldb-unit :: Utility/./UtilityTests/StreamTest.PutHex32ByteOrderBig (1660 of 1785) PASS: lldb-api :: lang/objc/objc-new-syntax/TestObjCNewSyntaxLiteral.py (1661 of 1785) PASS: lldb-unit :: Host/./HostTests/SocketTest.DecodeHostAndPort (1662 of 1785) PASS: lldb-api :: functionalities/thread/concurrent_events/TestConcurrentCrashWithSignal.py (1663 of 1785) PASS: lldb-unit :: ObjectFile/Breakpad/./ObjectFileBreakpadTests/Record.classify (1664 of 1785) PASS: lldb-api :: macosx/nslog/TestDarwinNSLogOutput.py (1665 of 1785) PASS: lldb-api :: functionalities/value_md5_crash/TestValueMD5Crash.py (1666 of 1785) PASS: lldb-unit :: Process/minidump/./LLDBMinidumpTests/MinidumpParserTest.GetThreadsAndGetThreadContext (1667 of 1785) PASS: lldb-api :: commands/process/launch-with-shellexpand/TestLaunchWithShellExpand.py (1668 of 1785) PASS: lldb-shell :: Minidump/breakpad-symbols.test (1669 of 1785) UNSUPPORTED: lldb-shell :: Register/x86-gp-write.test (1670 of 1785) PASS: lldb-api :: commands/apropos/basic/TestApropos.py (1671 of 1785) PASS: lldb-shell :: SymbolFile/DWARF/debug_rnglists.s (1672 of 1785) PASS: lldb-api :: functionalities/thread/concurrent_events/TestConcurrentCrashWithBreak.py (1673 of 1785) PASS: lldb-api :: commands/expression/import-std-module/list-basic/TestBasicList.py (1674 of 1785) PASS: lldb-unit :: Utility/./UtilityTests/StringListTest.PopBack (1675 of 1785) PASS: lldb-unit :: UnwindAssembly/x86/./UnwindAssemblyx86Tests/Testx86AssemblyInspectionEngine.TestPushECX (1676 of 1785) PASS: lldb-shell :: BuildScript/compiler-full-path.test (1677 of 1785) PASS: lldb-unit :: UnwindAssembly/x86/./UnwindAssemblyx86Tests/Testx86AssemblyInspectionEngine.TestAddRSP (1678 of 1785) UNSUPPORTED: lldb-api :: benchmarks/startup/TestStartupDelays.py (1679 of 1785) PASS: lldb-api :: lang/c/blocks/TestBlocks.py (1680 of 1785) PASS: lldb-unit :: Core/./LLDBCoreTests/RichManglingContextTest.FromCxxMethodName (1681 of 1785) PASS: lldb-unit :: Process/gdb-remote/./ProcessGdbRemoteTests/GDBRemoteCommunicationClientTest.GetModulesInfo_UUID20 (1682 of 1785) PASS: lldb-api :: lang/objc/foundation/TestConstStrings.py (1683 of 1785) PASS: lldb-unit :: Utility/./UtilityTests/VMRange.Reset (1684 of 1785) PASS: lldb-api :: functionalities/ptr_refs/TestPtrRefs.py (1685 of 1785) PASS: lldb-api :: api/log/TestAPILog.py (1686 of 1785) PASS: lldb-unit :: Utility/./UtilityTests/StringListTest.JoinSingle (1687 of 1785) PASS: lldb-unit :: Utility/./UtilityTests/CompletionRequest.TryCompleteCurrentArgBad (1688 of 1785) PASS: lldb-unit :: Utility/./UtilityTests/BinaryStreamTest.PutSLEB128SevenBytes (1689 of 1785) UNSUPPORTED: lldb-api :: functionalities/thread/thread_specific_break_plus_condition/TestThreadSpecificBpPlusCondition.py (1690 of 1785) PASS: lldb-shell :: Breakpoint/debug_rnglist_offset_pair.test (1691 of 1785) PASS: lldb-unit :: Utility/./UtilityTests/StringExtractorTest.GetU32BigEndian (1692 of 1785) UNSUPPORTED: lldb-shell :: ExecControl/StopHook/stop-hook-threads.test (1693 of 1785) PASS: lldb-unit :: Utility/./UtilityTests/ReproducerTest.SetReplay (1694 of 1785) PASS: lldb-unit :: Language/Highlighting/./HighlighterTests/HighlighterTest.ClangPPDirectives (1695 of 1785) PASS: lldb-api :: lang/c/vla/TestVLA.py (1696 of 1785) PASS: lldb-unit :: Utility/./UtilityTests/ConstStringTest.format_provider (1697 of 1785) PASS: lldb-shell :: SymbolFile/DWARF/childless-compile-unit.s (1698 of 1785) PASS: lldb-unit :: Target/./TargetTests/ModuleCacheTest.GetAndPutUuidExists (1699 of 1785) PASS: lldb-unit :: Utility/./UtilityTests/UriParserTest.MinimalPortPath (1700 of 1785) UNSUPPORTED: lldb-api :: commands/gui/basic/TestGuiBasic.py (1701 of 1785) PASS: lldb-api :: lang/objc/objc-ivar-stripped/TestObjCIvarStripped.py (1702 of 1785) UNSUPPORTED: lldb-shell :: ObjectFile/ELF/minidebuginfo-no-lzma.yaml (1703 of 1785) PASS: lldb-unit :: Utility/./UtilityTests/StructuredDataTest.StringDump (1704 of 1785) PASS: lldb-unit :: Host/./HostTests/SocketTest.DomainListenConnectAccept (1705 of 1785) XFAIL: lldb-shell :: SymbolFile/DWARF/find-type-in-function.cpp (1706 of 1785) PASS: lldb-api :: functionalities/thread/concurrent_events/TestConcurrentTwoWatchpointsOneDelayBreakpoint.py (1707 of 1785) PASS: lldb-unit :: Utility/./UtilityTests/AnsiTerminal.Twice (1708 of 1785) PASS: lldb-unit :: Utility/./UtilityTests/StringExtractorTest.GetHexU8_Exact (1709 of 1785) PASS: lldb-api :: functionalities/gdb_remote_client/TestNestedRegDefinitions.py (1710 of 1785) PASS: lldb-unit :: ScriptInterpreter/Python/./ScriptInterpreterPythonTests/PythonDataObjectsTest.TestDictionaryResolutionWithDot (1711 of 1785) PASS: lldb-unit :: Utility/./UtilityTests/Flags.AnySet (1712 of 1785) PASS: lldb-shell :: Reproducer/Functionalities/TestStepping.test (1713 of 1785) PASS: lldb-api :: commands/expression/context-object-objc/TestContextObjectObjc.py (1714 of 1785) PASS: lldb-api :: lang/objc/objc-dyn-sbtype/TestObjCDynamicSBType.py (1715 of 1785) PASS: lldb-api :: python_api/watchpoint/TestWatchpointIter.py (1716 of 1785) UNSUPPORTED: lldb-shell :: SymbolFile/PDB/function-level-linking.test (1717 of 1785) PASS: lldb-unit :: Host/./HostTests/MainLoopTest.DetectsEOF (1718 of 1785) PASS: lldb-api :: commands/expression/context-object/TestContextObject.py (1719 of 1785) PASS: lldb-unit :: Utility/./UtilityTests/OptionsWithRawTest.WhitespaceInput (1720 of 1785) PASS: lldb-api :: tools/lldb-server/TestGdbRemote_vCont.py (1721 of 1785) PASS: lldb-unit :: debugserver/./debugserverTests/RNBSocket.LoopBackListenIPv6 (1722 of 1785) PASS: lldb-api :: commands/frame/diagnose/bad-reference/TestBadReference.py (1723 of 1785) PASS: lldb-api :: commands/expression/import-std-module/deque-dbg-info-content/TestDbgInfoContentDeque.py (1724 of 1785) PASS: lldb-api :: functionalities/thread/concurrent_events/TestConcurrentSignalWatch.py (1725 of 1785) PASS: lldb-api :: functionalities/gdb_remote_client/TestTargetXMLArch.py (1726 of 1785) PASS: lldb-unit :: Utility/./UtilityTests/StreamTeeTest.CopyConstructor (1727 of 1785) PASS: lldb-unit :: Utility/./UtilityTests/FileSpecTest.CopyByAppendingPathComponent (1728 of 1785) UNSUPPORTED: lldb-shell :: Register/x86-64-zmm-read.test (1729 of 1785) PASS: lldb-unit :: Utility/./UtilityTests/UriParserTest.BracketedHostnameWithColon (1730 of 1785) PASS: lldb-api :: commands/expression/formatters/TestFormatters.py (1731 of 1785) PASS: lldb-shell :: Register/x86-64-ymm-read.test (1732 of 1785) PASS: lldb-unit :: Process/gdb-remote/./ProcessGdbRemoteTests/GDBRemoteCommunicationClientTest.SendSignalsToIgnore (1733 of 1785) PASS: lldb-unit :: debugserver/./debugserverTests/RNBSocket.AnyListen (1734 of 1785) PASS: lldb-api :: functionalities/thread/concurrent_events/TestConcurrentCrashWithWatchpointBreakpointSignal.py (1735 of 1785) UNSUPPORTED: lldb-api :: functionalities/darwin_log/filter/exact_match/activity/TestDarwinLogFilterMatchActivity.py (1736 of 1785) PASS: lldb-api :: functionalities/breakpoint/breakpoint_language/TestBreakpointLanguage.py (1737 of 1785) PASS: lldb-unit :: Utility/./UtilityTests/StringExtractorTest.GetNameColonValueContainsColon (1738 of 1785) PASS: lldb-api :: python_api/process/io/TestProcessIO.py (1739 of 1785) PASS: lldb-api :: lang/objc/rdar-11355592/TestRdar11355592.py (1740 of 1785) PASS: lldb-unit :: SymbolFile/DWARF/./SymbolFileDWARFTests/SymbolFileDWARFTests.TestAbbrevOutOfOrder (1741 of 1785) PASS: lldb-api :: lang/objc/objc++/TestObjCXX.py (1742 of 1785) PASS: lldb-unit :: Process/minidump/./LLDBMinidumpTests/MinidumpParserTest.GetPidWindows (1743 of 1785) UNSUPPORTED: lldb-api :: functionalities/breakpoint/breakpoint_in_delayslot/TestAvoidBreakpointInDelaySlot.py (1744 of 1785) PASS: lldb-unit :: Utility/./UtilityTests/StringExtractorTest.GetHexBytes_FullString (1745 of 1785) PASS: lldb-unit :: ObjectFile/Breakpad/./ObjectFileBreakpadTests/ModuleRecord.parse (1746 of 1785) PASS: lldb-api :: lang/cpp/call-function/TestCallCPPFunction.py (1747 of 1785) PASS: lldb-unit :: SymbolFile/NativePDB/./SymbolFileNativePDBTests/PDBFPOProgramToDWARFExpressionTests.InvalidOpUnary (1748 of 1785) PASS: lldb-unit :: Utility/./UtilityTests/VMRange.SetEndAddress (1749 of 1785) PASS: lldb-api :: lang/cpp/modules-import/TestCXXModulesImport.py (1750 of 1785) PASS: lldb-api :: terminal/TestSTTYBeforeAndAfter.py (1751 of 1785) PASS: lldb-api :: python_api/value/change_values/TestChangeValueAPI.py (1752 of 1785) PASS: lldb-api :: lang/c/find_struct_type/TestFindStructTypes.py (1753 of 1785) PASS: lldb-api :: functionalities/data-formatter/nsdictionarysynth/TestNSDictionarySynthetic.py (1754 of 1785) PASS: lldb-api :: functionalities/data-formatter/data-formatter-stl/libcxx/list/TestDataFormatterLibcxxList.py (1755 of 1785) PASS: lldb-unit :: Signals/./SignalsTests/UnixSignalsTest.GetFilteredSignals (1756 of 1785) PASS: lldb-unit :: Utility/./UtilityTests/ArgsTest.BareSingleQuote (1757 of 1785) PASS: lldb-shell :: Breakpoint/debug_rnglist_rlestartend.test (1758 of 1785) PASS: lldb-api :: functionalities/data-formatter/data-formatter-objc/TestDataFormatterObjCNSError.py (1759 of 1785) PASS: lldb-unit :: Process/gdb-remote/./ProcessGdbRemoteTests/GDBRemoteClientBaseTest.SendContinueAndInterrupt2PacketBug (1760 of 1785) PASS: lldb-unit :: Interpreter/./InterpreterTests/OptionArgParserTest.toChar (1761 of 1785) PASS: lldb-unit :: Utility/./UtilityTests/StringListTest.Join (1762 of 1785) PASS: lldb-api :: tools/lldb-server/TestGdbRemoteRegisterState.py (1763 of 1785) PASS: lldb-unit :: Utility/./UtilityTests/UriParserTest.PortOverflow (1764 of 1785) PASS: lldb-unit :: UnwindAssembly/x86/./UnwindAssemblyx86Tests/Testx86AssemblyInspectionEngine.TestPushEBX (1765 of 1785) PASS: lldb-unit :: Symbol/./SymbolTests/LineEntryTest.GetSameLineContiguousAddressRangeOneInline (1766 of 1785) PASS: lldb-unit :: Utility/./UtilityTests/StreamTeeTest.Assignment (1767 of 1785) PASS: lldb-unit :: SymbolFile/NativePDB/./SymbolFileNativePDBTests/PDBFPOProgramToDWARFExpressionTests.InvalidAssignmentSingle (1768 of 1785) PASS: lldb-unit :: Utility/./UtilityTests/BinaryStreamTest.PutULEB128TwoBytes (1769 of 1785) PASS: lldb-shell :: SymbolFile/NativePDB/function-types-classes.cpp (1770 of 1785) PASS: lldb-api :: python_api/disassemble-raw-data/TestDisassembleRawData.py (1771 of 1785) PASS: lldb-api :: macosx/lc-note/kern-ver-str/TestKernVerStrLCNOTE.py (1772 of 1785) PASS: lldb-api :: commands/platform/process/TestProcessList.py (1773 of 1785) PASS: lldb-api :: functionalities/thread/concurrent_events/TestConcurrentTwoWatchpointsOneSignal.py (1774 of 1785) PASS: lldb-api :: functionalities/signal/TestSendSignal.py (1775 of 1785) PASS: lldb-api :: lang/objcxx/objcxx-ivar-vector/TestIvarVector.py (1776 of 1785) PASS: lldb-api :: functionalities/breakpoint/breakpoint_ids/TestBreakpointIDs.py (1777 of 1785) PASS: lldb-api :: functionalities/data-formatter/data-formatter-stl/libcxx/optional/TestDataFormatterLibcxxOptional.py (1778 of 1785) PASS: lldb-api :: commands/expression/call-function/TestCallStopAndContinue.py (1779 of 1785) PASS: lldb-api :: functionalities/mtc/simple/TestMTCSimple.py (1780 of 1785) PASS: lldb-api :: lang/objc/real-definition/TestRealDefinition.py (1781 of 1785) PASS: lldb-api :: lang/objc/foundation/TestRuntimeTypes.py (1782 of 1785) PASS: lldb-api :: commands/expression/import-std-module/vector-dbg-info-content/TestDbgInfoContentVector.py (1783 of 1785) PASS: lldb-api :: lang/objc/exceptions/TestObjCExceptions.py (1784 of 1785) PASS: lldb-api :: types/TestIntegerTypesExpr.py (1785 of 1785) Testing Time: 1748.06s ******************** Failing Tests (2): lldb-api :: tools/lldb-server/commandline/TestStubSetSID.py lldb-shell :: Reproducer/Functionalities/TestImageList.test

Hide Details

Hide Details

Slowest Tests: -------------------------------------------------------------------------- 111.12s: lldb-api :: commands/target/basic/TestTargetCommand.py 112.95s: lldb-api :: lang/objc/foundation/TestObjCMethodsString.py 114.72s: lldb-api :: commands/expression/import-std-module/stack/TestStack.py 120.38s: lldb-api :: lang/c/anonymous/TestAnonymous.py 124.29s: lldb-api :: api/check_public_api_headers/TestPublicAPIHeaders.py 138.22s: lldb-api :: lang/objc/objc-new-syntax/TestObjCNewSyntaxDictionary.py 141.14s: lldb-api :: lang/objc/objc-new-syntax/TestObjCNewSyntaxArray.py 143.69s: lldb-api :: functionalities/recursion/TestValueObjectRecursion.py 161.89s: lldb-api :: functionalities/return-value/TestReturnValue.py 174.30s: lldb-api :: functionalities/load_unload/TestLoadUnload.py 187.43s: lldb-api :: lang/objc/objc-new-syntax/TestObjCNewSyntaxLiteral.py 191.73s: lldb-api :: lang/cpp/namespace/TestNamespaceLookup.py 192.31s: lldb-api :: lang/cpp/enum_types/TestCPP11EnumTypes.py 197.41s: lldb-api :: lang/objc/foundation/TestObjCMethods.py 198.79s: lldb-api :: tools/lldb-server/TestLldbGdbServer.py 219.53s: lldb-api :: api/multithreaded/TestMultithreaded.py 227.30s: lldb-api :: types/TestIntegerTypesExpr.py 228.02s: lldb-api :: lang/objc/hidden-ivars/TestHiddenIvars.py 376.80s: lldb-api :: types/TestIntegerTypes.py 690.54s: lldb-api :: lang/objc/foundation/TestFoundationDisassembly.py

Hide Details

Tests Times: -------------------------------------------------------------------------- [ Range ] :: [ Percentage ] :: [ Count ] -------------------------------------------------------------------------- [ 0s, 50s) :: [************************************* ] :: [1670/1785] [ 50s,100s) :: [** ] :: [ 92/1785] [100s,150s) :: [ ] :: [ 11/1785] [150s,200s) :: [ ] :: [ 5/1785] [200s,250s) :: [ ] :: [ 5/1785] [250s,300s) :: [ ] :: [ 0/1785] [300s,350s) :: [ ] :: [ 0/1785] [350s,400s) :: [ ] :: [ 1/1785] [400s,450s) :: [ ] :: [ 0/1785] [450s,500s) :: [ ] :: [ 0/1785] [500s,550s) :: [ ] :: [ 0/1785] [550s,600s) :: [ ] :: [ 0/1785] [600s,650s) :: [ ] :: [ 0/1785] [650s,700s) :: [ ] :: [ 1/1785] Expected Passes : 1635 Expected Failures : 6 Unsupported Tests : 142 Unexpected Failures: 2 FAILED: tools/lldb/test/CMakeFiles/check-lldb-lit cd /Users/buildslave/jenkins/workspace/lldb-cmake-sanitized/lldb-build/tools/lldb/test && /usr/bin/python /Users/buildslave/jenkins/workspace/lldb-cmake-sanitized/lldb-build/./bin/llvm-lit -v --time-tests --shuffle --xunit-xml-output=/Users/buildslave/jenkins/workspace/lldb-cmake-sanitized/test/results.xml -v --timeout 1200 /Users/buildslave/jenkins/workspace/lldb-cmake-sanitized/lldb-build/tools/lldb/test ninja: build stopped: subcommand failed. Command failed Command: ['/usr/bin/env', 'TERM=vt100', '/usr/local/bin/ninja', '-v', 'check-lldb'] [Pipeline] } [Pipeline] // timeout [Pipeline] } [Pipeline] // stage [Pipeline] stage [Pipeline] { (Declarative: Post Actions) [Pipeline] scanForIssues No credentials specified [Clang (LLVM based)] Sleeping for 5 seconds due to JENKINS-32191... [Clang (LLVM based)] Parsing console log (workspace: '/Users/buildslave/jenkins/workspace/lldb-cmake-sanitized') [Pipeline] junit Recording test results [Pipeline] } [Pipeline] // stage [Pipeline] } [Pipeline] // withEnv [Pipeline] } [Pipeline] // node [Pipeline] End of Pipeline [BFA] Scanning build for known causes... [BFA] Found failure cause(s): [BFA] Ninja target failed from category Compile [BFA] Regression test failed from category Test [BFA] Done. 1s ERROR: script returned exit code 1 Finished: FAILURE