FailedConsole Output

Skipping 3,882 KB.. Full Log
lugin.process.gdb-remote.packet-timeout 60
output: 

Hide Details

runCmd: settings set symbols.clang-modules-cache-path "/Users/buildslave/jenkins/workspace/lldb-cmake-sanitized/lldb-build/tools/lldb/lldb-test-build.noindex/module-cache-lldb/lldb-api" output:

Hide Details

runCmd: settings set use-color false output:

Hide Details

UNSUPPORTED: LLDB (/Users/buildslave/jenkins/workspace/lldb-cmake-sanitized/host-compiler/bin/clang-10-x86_64) :: test_software_breakpoint_set_and_remove_work_llgs (TestLldbGdbServer.LldbGdbServerTestCase) (llgs tests) runCmd: settings set symbols.enable-external-lookup false output:

Hide Details

runCmd: settings set plugin.process.gdb-remote.packet-timeout 60 output:

Hide Details

runCmd: settings set symbols.clang-modules-cache-path "/Users/buildslave/jenkins/workspace/lldb-cmake-sanitized/lldb-build/tools/lldb/lldb-test-build.noindex/module-cache-lldb/lldb-api" output:

Hide Details

runCmd: settings set use-color false output:

Hide Details

Adding tearDown hook: def shutdown_named_pipe(): # Close the pipe. try: named_pipe.close() except: print("failed to close named pipe") None

Hide Details

# Delete the pipe. try: os.remove(named_pipe_path) except: print("failed to delete named pipe: {}".format(named_pipe_path)) None

Hide Details

# Delete the temp directory. try: os.rmdir(temp_dir) except: print( "failed to delete temp dir: {}, directory contents: '{}'".format( temp_dir, os.listdir(temp_dir))) None

Hide Details

Hide Details

Adding tearDown hook: def cleanupSubprocesses(self): # Ensure any subprocesses are cleaned up for p in self.subprocesses: p.terminate() del p del self.subprocesses[:] # Ensure any forked processes are cleaned up for pid in self.forkedProcessPids: if os.path.exists("/proc/" + str(pid)): os.kill(pid, signal.SIGTERM)

Hide Details

Hide Details

Adding tearDown hook: def shutdown_debug_monitor(): try: server.terminate() except: logger.warning( "failed to terminate server for debug monitor: {}; ignoring".format( sys.exc_info()[0]))

Hide Details

Hide Details

Adding tearDown hook: def shutdown_socket(): if sock: try: # send the kill packet so lldb-server shuts down gracefully sock.sendall(GdbRemoteTestCaseBase._GDBREMOTE_KILL_PACKET) except: logger.warning( "failed to send kill packet to debug monitor: {}; ignoring".format( sys.exc_info()[0]))

Hide Details

try: sock.close() except: logger.warning( "failed to close socket to debug monitor: {}; ignoring".format( sys.exc_info()[0]))

Hide Details

Hide Details

Executing tearDown hook: def shutdown_socket(): if sock: try: # send the kill packet so lldb-server shuts down gracefully sock.sendall(GdbRemoteTestCaseBase._GDBREMOTE_KILL_PACKET) except: logger.warning( "failed to send kill packet to debug monitor: {}; ignoring".format( sys.exc_info()[0]))

Hide Details

try: sock.close() except: logger.warning( "failed to close socket to debug monitor: {}; ignoring".format( sys.exc_info()[0]))

Hide Details

Hide Details

Executing tearDown hook: def shutdown_debug_monitor(): try: server.terminate() except: logger.warning( "failed to terminate server for debug monitor: {}; ignoring".format( sys.exc_info()[0]))

Hide Details

Hide Details

Executing tearDown hook: def cleanupSubprocesses(self): # Ensure any subprocesses are cleaned up for p in self.subprocesses: p.terminate() del p del self.subprocesses[:] # Ensure any forked processes are cleaned up for pid in self.forkedProcessPids: if os.path.exists("/proc/" + str(pid)): os.kill(pid, signal.SIGTERM)

Hide Details

Hide Details

Executing tearDown hook: def shutdown_named_pipe(): # Close the pipe. try: named_pipe.close() except: print("failed to close named pipe") None

Hide Details

# Delete the pipe. try: os.remove(named_pipe_path) except: print("failed to delete named pipe: {}".format(named_pipe_path)) None

Hide Details

# Delete the temp directory. try: os.rmdir(temp_dir) except: print( "failed to delete temp dir: {}, directory contents: '{}'".format( temp_dir, os.listdir(temp_dir))) None

Hide Details

Hide Details

PASS: LLDB (/Users/buildslave/jenkins/workspace/lldb-cmake-sanitized/host-compiler/bin/clang-10-x86_64) :: test_start_no_ack_mode_debugserver (TestLldbGdbServer.LldbGdbServerTestCase) runCmd: settings set symbols.enable-external-lookup false output:

Hide Details

runCmd: settings set plugin.process.gdb-remote.packet-timeout 60 output:

Hide Details

runCmd: settings set symbols.clang-modules-cache-path "/Users/buildslave/jenkins/workspace/lldb-cmake-sanitized/lldb-build/tools/lldb/lldb-test-build.noindex/module-cache-lldb/lldb-api" output:

Hide Details

runCmd: settings set use-color false output:

Hide Details

UNSUPPORTED: LLDB (/Users/buildslave/jenkins/workspace/lldb-cmake-sanitized/host-compiler/bin/clang-10-x86_64) :: test_start_no_ack_mode_llgs (TestLldbGdbServer.LldbGdbServerTestCase) (llgs tests) runCmd: settings set symbols.enable-external-lookup false output:

Hide Details

runCmd: settings set plugin.process.gdb-remote.packet-timeout 60 output:

Hide Details

runCmd: settings set symbols.clang-modules-cache-path "/Users/buildslave/jenkins/workspace/lldb-cmake-sanitized/lldb-build/tools/lldb/lldb-test-build.noindex/module-cache-lldb/lldb-api" output:

Hide Details

runCmd: settings set use-color false output:

Hide Details

Adding tearDown hook: def shutdown_named_pipe(): # Close the pipe. try: named_pipe.close() except: print("failed to close named pipe") None

Hide Details

# Delete the pipe. try: os.remove(named_pipe_path) except: print("failed to delete named pipe: {}".format(named_pipe_path)) None

Hide Details

# Delete the temp directory. try: os.rmdir(temp_dir) except: print( "failed to delete temp dir: {}, directory contents: '{}'".format( temp_dir, os.listdir(temp_dir))) None

Hide Details

Hide Details

Adding tearDown hook: def cleanupSubprocesses(self): # Ensure any subprocesses are cleaned up for p in self.subprocesses: p.terminate() del p del self.subprocesses[:] # Ensure any forked processes are cleaned up for pid in self.forkedProcessPids: if os.path.exists("/proc/" + str(pid)): os.kill(pid, signal.SIGTERM)

Hide Details

Hide Details

Adding tearDown hook: def shutdown_debug_monitor(): try: server.terminate() except: logger.warning( "failed to terminate server for debug monitor: {}; ignoring".format( sys.exc_info()[0]))

Hide Details

Hide Details

Adding tearDown hook: def shutdown_socket(): if sock: try: # send the kill packet so lldb-server shuts down gracefully sock.sendall(GdbRemoteTestCaseBase._GDBREMOTE_KILL_PACKET) except: logger.warning( "failed to send kill packet to debug monitor: {}; ignoring".format( sys.exc_info()[0]))

Hide Details

try: sock.close() except: logger.warning( "failed to close socket to debug monitor: {}; ignoring".format( sys.exc_info()[0]))

Hide Details

Hide Details

Executing tearDown hook: def shutdown_socket(): if sock: try: # send the kill packet so lldb-server shuts down gracefully sock.sendall(GdbRemoteTestCaseBase._GDBREMOTE_KILL_PACKET) except: logger.warning( "failed to send kill packet to debug monitor: {}; ignoring".format( sys.exc_info()[0]))

Hide Details

try: sock.close() except: logger.warning( "failed to close socket to debug monitor: {}; ignoring".format( sys.exc_info()[0]))

Hide Details

Hide Details

Executing tearDown hook: def shutdown_debug_monitor(): try: server.terminate() except: logger.warning( "failed to terminate server for debug monitor: {}; ignoring".format( sys.exc_info()[0]))

Hide Details

Hide Details

Executing tearDown hook: def cleanupSubprocesses(self): # Ensure any subprocesses are cleaned up for p in self.subprocesses: p.terminate() del p del self.subprocesses[:] # Ensure any forked processes are cleaned up for pid in self.forkedProcessPids: if os.path.exists("/proc/" + str(pid)): os.kill(pid, signal.SIGTERM)

Hide Details

Hide Details

Executing tearDown hook: def shutdown_named_pipe(): # Close the pipe. try: named_pipe.close() except: print("failed to close named pipe") None

Hide Details

# Delete the pipe. try: os.remove(named_pipe_path) except: print("failed to delete named pipe: {}".format(named_pipe_path)) None

Hide Details

# Delete the temp directory. try: os.rmdir(temp_dir) except: print( "failed to delete temp dir: {}, directory contents: '{}'".format( temp_dir, os.listdir(temp_dir))) None

Hide Details

Hide Details

PASS: LLDB (/Users/buildslave/jenkins/workspace/lldb-cmake-sanitized/host-compiler/bin/clang-10-x86_64) :: test_thread_suffix_supported_debugserver (TestLldbGdbServer.LldbGdbServerTestCase) runCmd: settings set symbols.enable-external-lookup false output:

Hide Details

runCmd: settings set plugin.process.gdb-remote.packet-timeout 60 output:

Hide Details

runCmd: settings set symbols.clang-modules-cache-path "/Users/buildslave/jenkins/workspace/lldb-cmake-sanitized/lldb-build/tools/lldb/lldb-test-build.noindex/module-cache-lldb/lldb-api" output:

Hide Details

runCmd: settings set use-color false output:

Hide Details

UNSUPPORTED: LLDB (/Users/buildslave/jenkins/workspace/lldb-cmake-sanitized/host-compiler/bin/clang-10-x86_64) :: test_thread_suffix_supported_llgs (TestLldbGdbServer.LldbGdbServerTestCase) (llgs tests) runCmd: settings set symbols.enable-external-lookup false output:

Hide Details

runCmd: settings set plugin.process.gdb-remote.packet-timeout 60 output:

Hide Details

runCmd: settings set symbols.clang-modules-cache-path "/Users/buildslave/jenkins/workspace/lldb-cmake-sanitized/lldb-build/tools/lldb/lldb-test-build.noindex/module-cache-lldb/lldb-api" output:

Hide Details

runCmd: settings set use-color false output:

Hide Details

Adding tearDown hook: def shutdown_named_pipe(): # Close the pipe. try: named_pipe.close() except: print("failed to close named pipe") None

Hide Details

# Delete the pipe. try: os.remove(named_pipe_path) except: print("failed to delete named pipe: {}".format(named_pipe_path)) None

Hide Details

# Delete the temp directory. try: os.rmdir(temp_dir) except: print( "failed to delete temp dir: {}, directory contents: '{}'".format( temp_dir, os.listdir(temp_dir))) None

Hide Details

Hide Details

Adding tearDown hook: def cleanupSubprocesses(self): # Ensure any subprocesses are cleaned up for p in self.subprocesses: p.terminate() del p del self.subprocesses[:] # Ensure any forked processes are cleaned up for pid in self.forkedProcessPids: if os.path.exists("/proc/" + str(pid)): os.kill(pid, signal.SIGTERM)

Hide Details

Hide Details

Adding tearDown hook: def shutdown_debug_monitor(): try: server.terminate() except: logger.warning( "failed to terminate server for debug monitor: {}; ignoring".format( sys.exc_info()[0]))

Hide Details

Hide Details

Adding tearDown hook: def shutdown_socket(): if sock: try: # send the kill packet so lldb-server shuts down gracefully sock.sendall(GdbRemoteTestCaseBase._GDBREMOTE_KILL_PACKET) except: logger.warning( "failed to send kill packet to debug monitor: {}; ignoring".format( sys.exc_info()[0]))

Hide Details

try: sock.close() except: logger.warning( "failed to close socket to debug monitor: {}; ignoring".format( sys.exc_info()[0]))

Hide Details

Hide Details

Executing tearDown hook: def shutdown_socket(): if sock: try: # send the kill packet so lldb-server shuts down gracefully sock.sendall(GdbRemoteTestCaseBase._GDBREMOTE_KILL_PACKET) except: logger.warning( "failed to send kill packet to debug monitor: {}; ignoring".format( sys.exc_info()[0]))

Hide Details

try: sock.close() except: logger.warning( "failed to close socket to debug monitor: {}; ignoring".format( sys.exc_info()[0]))

Hide Details

Hide Details

Executing tearDown hook: def shutdown_debug_monitor(): try: server.terminate() except: logger.warning( "failed to terminate server for debug monitor: {}; ignoring".format( sys.exc_info()[0]))

Hide Details

Hide Details

Executing tearDown hook: def cleanupSubprocesses(self): # Ensure any subprocesses are cleaned up for p in self.subprocesses: p.terminate() del p del self.subprocesses[:] # Ensure any forked processes are cleaned up for pid in self.forkedProcessPids: if os.path.exists("/proc/" + str(pid)): os.kill(pid, signal.SIGTERM)

Hide Details

Hide Details

Executing tearDown hook: def shutdown_named_pipe(): # Close the pipe. try: named_pipe.close() except: print("failed to close named pipe") None

Hide Details

# Delete the pipe. try: os.remove(named_pipe_path) except: print("failed to delete named pipe: {}".format(named_pipe_path)) None

Hide Details

# Delete the temp directory. try: os.rmdir(temp_dir) except: print( "failed to delete temp dir: {}, directory contents: '{}'".format( temp_dir, os.listdir(temp_dir))) None

Hide Details

Hide Details

PASS: LLDB (/Users/buildslave/jenkins/workspace/lldb-cmake-sanitized/host-compiler/bin/clang-10-x86_64) :: test_written_M_content_reads_back_correctly_debugserver (TestLldbGdbServer.LldbGdbServerTestCase) runCmd: settings set symbols.enable-external-lookup false output:

Hide Details

runCmd: settings set plugin.process.gdb-remote.packet-timeout 60 output:

Hide Details

runCmd: settings set symbols.clang-modules-cache-path "/Users/buildslave/jenkins/workspace/lldb-cmake-sanitized/lldb-build/tools/lldb/lldb-test-build.noindex/module-cache-lldb/lldb-api" output:

Hide Details

runCmd: settings set use-color false output:

Hide Details

UNSUPPORTED: LLDB (/Users/buildslave/jenkins/workspace/lldb-cmake-sanitized/host-compiler/bin/clang-10-x86_64) :: test_written_M_content_reads_back_correctly_llgs (TestLldbGdbServer.LldbGdbServerTestCase) (llgs tests) Restore dir to: /Users/buildslave/jenkins/workspace/lldb-cmake-sanitized/lldb-build/tools/lldb/test ====================================================================== FAIL: test_qThreadInfo_contains_thread_attach_debugserver (TestLldbGdbServer.LldbGdbServerTestCase) ---------------------------------------------------------------------- Traceback (most recent call last): File "/Users/buildslave/jenkins/workspace/lldb-cmake-sanitized/llvm-project/lldb/packages/Python/lldbsuite/test/decorators.py", line 141, in wrapper func(*args, **kwargs) File "/Users/buildslave/jenkins/workspace/lldb-cmake-sanitized/llvm-project/lldb/packages/Python/lldbsuite/test/tools/lldb-server/TestLldbGdbServer.py", line 481, in test_qThreadInfo_contains_thread_attach_debugserver self.qThreadInfo_contains_thread() File "/Users/buildslave/jenkins/workspace/lldb-cmake-sanitized/llvm-project/lldb/packages/Python/lldbsuite/test/tools/lldb-server/TestLldbGdbServer.py", line 446, in qThreadInfo_contains_thread procs = self.prep_debug_monitor_and_inferior() File "/Users/buildslave/jenkins/workspace/lldb-cmake-sanitized/llvm-project/lldb/packages/Python/lldbsuite/test/tools/lldb-server/gdbremote_testcase.py", line 583, in prep_debug_monitor_and_inferior server = self.connect_to_debug_monitor(attach_pid=attach_pid) File "/Users/buildslave/jenkins/workspace/lldb-cmake-sanitized/llvm-project/lldb/packages/Python/lldbsuite/test/tools/lldb-server/gdbremote_testcase.py", line 417, in connect_to_debug_monitor server = self.launch_debug_monitor(attach_pid=attach_pid) File "/Users/buildslave/jenkins/workspace/lldb-cmake-sanitized/llvm-project/lldb/packages/Python/lldbsuite/test/tools/lldb-server/gdbremote_testcase.py", line 410, in launch_debug_monitor self.port = self.get_stub_port_from_named_socket(self._READ_TIMEOUT) File "/Users/buildslave/jenkins/workspace/lldb-cmake-sanitized/llvm-project/lldb/packages/Python/lldbsuite/test/tools/lldb-server/gdbremote_testcase.py", line 216, in get_stub_port_from_named_socket "write side of pipe has not written anything - stub isn't writing to pipe.") AssertionError: 0 == 0 : write side of pipe has not written anything - stub isn't writing to pipe. Config=x86_64-/Users/buildslave/jenkins/workspace/lldb-cmake-sanitized/host-compiler/bin/clang-10 ---------------------------------------------------------------------- Ran 65 tests in 272.469s

Hide Details

RESULT: FAILED (29 passes, 1 failures, 0 errors, 34 skipped, 1 expected failures, 0 unexpected successes)

Hide Details

******************** PASS: lldb-shell :: ObjectFile/ELF/PT_LOAD-empty.yaml (447 of 1785) PASS: lldb-unit :: Utility/./UtilityTests/StringListTest.LongestCommonPrefixDuplicateElement (448 of 1785) PASS: lldb-shell :: Settings/TestEchoCommands.test (449 of 1785) PASS: lldb-shell :: Commands/command-regex-delete.test (450 of 1785) PASS: lldb-unit :: Host/./HostTests/TaskPoolTest.AddTask (451 of 1785) PASS: lldb-api :: functionalities/data-formatter/data-formatter-stl/libcxx/list/TestDataFormatterLibcxxList.py (452 of 1785) PASS: lldb-api :: commands/frame/diagnose/bad-reference/TestBadReference.py (453 of 1785) PASS: lldb-api :: commands/frame/diagnose/virtual-method-call/TestDiagnoseDereferenceVirtualMethodCall.py (454 of 1785) PASS: lldb-api :: lang/c/local_variables/TestLocalVariables.py (455 of 1785) PASS: lldb-api :: lang/c/unions/TestUnionMembers.py (456 of 1785) PASS: lldb-api :: functionalities/data-formatter/data-formatter-synthtype/TestDataFormatterSynthType.py (457 of 1785) PASS: lldb-shell :: ObjectFile/PECOFF/dep-modules.yaml (458 of 1785) PASS: lldb-unit :: Utility/./UtilityTests/ArgsTest.TestSingleArgWithQuotedSpace (459 of 1785) PASS: lldb-api :: commands/frame/diagnose/dereference-argument/TestDiagnoseDereferenceArgument.py (460 of 1785) PASS: lldb-api :: types/TestDoubleTypesExpr.py (461 of 1785) PASS: lldb-api :: functionalities/thread/concurrent_events/TestConcurrentWatchBreak.py (462 of 1785) PASS: lldb-unit :: Utility/./UtilityTests/AnsiTerminal.Twice (463 of 1785) PASS: lldb-api :: python_api/function_symbol/TestSymbolAPI.py (464 of 1785) PASS: lldb-api :: lang/c/array_types/TestArrayTypes.py (465 of 1785) PASS: lldb-api :: commands/expression/weak_symbols/TestWeakSymbols.py (466 of 1785) PASS: lldb-unit :: ScriptInterpreter/Python/./ScriptInterpreterPythonTests/PythonDataObjectsTest.TestPythonBoolean (467 of 1785) PASS: lldb-shell :: SymbolFile/Breakpad/unwind-via-stack-cfi.test (468 of 1785) PASS: lldb-api :: functionalities/thread/concurrent_events/TestConcurrentSignalWatch.py (469 of 1785) PASS: lldb-api :: functionalities/return-value/TestReturnValue.py (470 of 1785) PASS: lldb-unit :: Expression/./ExpressionTests/CppModuleConfigurationTest.Sysroot (471 of 1785) PASS: lldb-unit :: Symbol/./SymbolTests/TestClangASTContext.TestBuiltinTypeForEncodingAndBitSize (472 of 1785) PASS: lldb-api :: python_api/interpreter/TestRunCommandInterpreterAPI.py (473 of 1785) XFAIL: lldb-shell :: Unwind/prefer-debug-over-eh-frame.test (474 of 1785) PASS: lldb-api :: commands/expression/pr35310/TestExprsBug35310.py (475 of 1785) PASS: lldb-api :: functionalities/fat_archives/TestFatArchives.py (476 of 1785) PASS: lldb-api :: commands/expression/namespace_local_var_same_name_obj_c/TestNamespaceLocalVarSameNameObjC.py (477 of 1785) PASS: lldb-api :: functionalities/data-formatter/data-formatter-stl/libcxx/map/TestDataFormatterLibccMap.py (478 of 1785) PASS: lldb-shell :: SymbolFile/DWARF/dir-separator-posix.s (479 of 1785) PASS: lldb-api :: lang/cpp/global_operators/TestCppGlobalOperators.py (480 of 1785) PASS: lldb-unit :: Utility/./UtilityTests/LogChannelEnabledTest.log_options (481 of 1785) PASS: lldb-api :: lang/objc/objc++/TestObjCXX.py (482 of 1785) PASS: lldb-api :: functionalities/show_location/TestShowLocationDwarf5.py (483 of 1785) PASS: lldb-unit :: Utility/./UtilityTests/CompletionRequest.ShiftArguments (484 of 1785) PASS: lldb-api :: functionalities/load_using_paths/TestLoadUsingPaths.py (485 of 1785) PASS: lldb-api :: tools/lldb-server/TestGdbRemoteProcessInfo.py (486 of 1785) PASS: lldb-api :: functionalities/breakpoint/breakpoint_command/TestBreakpointCommand.py (487 of 1785) PASS: lldb-api :: lang/objc/objc-optimized/TestObjcOptimized.py (488 of 1785) PASS: lldb-unit :: Utility/./UtilityTests/SerializationRountripTest.SerializeDeserializePod (489 of 1785) PASS: lldb-unit :: Utility/./UtilityTests/StreamTeeTest.AppendStream (490 of 1785) UNSUPPORTED: lldb-shell :: Register/x86-64-xmm16-read.test (491 of 1785) PASS: lldb-unit :: Utility/./UtilityTests/StreamTest.PutCStringWithStringRef (492 of 1785) PASS: lldb-api :: lang/objc/forward-decl/TestForwardDecl.py (493 of 1785) PASS: lldb-unit :: Utility/./UtilityTests/AnsiTerminal.Basic (494 of 1785) PASS: lldb-shell :: SymbolFile/DWARF/deterministic-build.cpp (495 of 1785) PASS: lldb-api :: python_api/exprpath_synthetic/TestExprPathSynthetic.py (496 of 1785) PASS: lldb-unit :: Utility/./UtilityTests/RangeTest.Copy (497 of 1785) PASS: lldb-unit :: Process/minidump/./LLDBMinidumpTests/MinidumpParserTest.GetPid (498 of 1785) UNSUPPORTED: lldb-api :: arm/breakpoint-thumb-codesection/TestBreakpointThumbCodesection.py (499 of 1785) PASS: lldb-api :: functionalities/data-formatter/language_category_updates/TestDataFormatterLanguageCategoryUpdates.py (500 of 1785) UNSUPPORTED: lldb-shell :: SymbolFile/PDB/func-symbols.test (501 of 1785) PASS: lldb-shell :: BuildScript/compiler-full-path.test (502 of 1785) UNSUPPORTED: lldb-api :: tools/lldb-vscode/launch/TestVSCode_launch.py (503 of 1785) UNSUPPORTED: lldb-api :: functionalities/darwin_log/source/debug/TestDarwinLogSourceDebug.py (504 of 1785) PASS: lldb-api :: lang/objc/objc-struct-return/TestObjCStructReturn.py (505 of 1785) PASS: lldb-unit :: Utility/./UtilityTests/ScalarTest.SetValueFromCString (506 of 1785) UNSUPPORTED: lldb-shell :: SymbolFile/DWARF/debug-types-expressions.test (507 of 1785) PASS: lldb-api :: lang/cpp/inlines/TestInlines.py (508 of 1785) PASS: lldb-shell :: Watchpoint/SetErrorCases.test (509 of 1785) UNSUPPORTED: lldb-shell :: SymbolFile/PDB/pointers.test (510 of 1785) PASS: lldb-unit :: Utility/./UtilityTests/DataExtractorTest.GetMaxU64 (511 of 1785) PASS: lldb-unit :: ScriptInterpreter/Python/./ScriptInterpreterPythonTests/PythonDataObjectsTest.TestPythonInteger (512 of 1785) PASS: lldb-api :: lang/cpp/extern_c/TestExternCSymbols.py (513 of 1785) PASS: lldb-shell :: SymbolFile/DWARF/split-dwarf-multiple-cu.ll (514 of 1785) PASS: lldb-unit :: Core/./LLDBCoreTests/StreamCallbackTest.Callback (515 of 1785) PASS: lldb-unit :: Utility/./UtilityTests/RangeTest.NotEqualInvalid (516 of 1785) PASS: lldb-api :: python_api/thread/TestThreadAPI.py (517 of 1785) PASS: lldb-api :: functionalities/signal/TestSendSignal.py (518 of 1785) PASS: lldb-unit :: UnwindAssembly/x86/./UnwindAssemblyx86Tests/Testx86AssemblyInspectionEngine.Testi386IgnoredRegisters (519 of 1785) PASS: lldb-unit :: Utility/./UtilityTests/CompletionRequest.TestCompletionOwnership (520 of 1785) PASS: lldb-api :: python_api/breakpoint/TestBreakpointAPI.py (521 of 1785) PASS: lldb-api :: functionalities/thread/thread_specific_break/TestThreadSpecificBreakpoint.py (522 of 1785) PASS: lldb-unit :: UnwindAssembly/x86/./UnwindAssemblyx86Tests/Testx86AssemblyInspectionEngine.TestPushEBX (523 of 1785) PASS: lldb-shell :: Breakpoint/implicit_const_form_support.test (524 of 1785) PASS: lldb-unit :: Host/./HostTests/MainLoopTest.Signal (525 of 1785) PASS: lldb-api :: lang/cpp/thread_local/TestThreadLocal.py (526 of 1785) UNSUPPORTED: lldb-api :: commands/expression/completion-crash2/TestCompletionCrash2.py (527 of 1785) PASS: lldb-unit :: UnwindAssembly/x86/./UnwindAssemblyx86Tests/Testx86AssemblyInspectionEngine.TestPopRBX (528 of 1785) PASS: lldb-api :: functionalities/abbreviation/TestCommonShortSpellings.py (529 of 1785) PASS: lldb-api :: lang/cpp/breakpoint_in_member_func_w_non_primitive_params/TestBreakpointInMemberFuncWNonPrimitiveParams.py (530 of 1785) PASS: lldb-unit :: Process/minidump/./LLDBMinidumpTests/RegisterContextMinidump.ConvertMinidumpContext_x86_32 (531 of 1785) PASS: lldb-shell :: SymbolFile/NativePDB/ast-methods.cpp (532 of 1785) PASS: lldb-api :: commands/command/source/TestCommandSource.py (533 of 1785) PASS: lldb-api :: functionalities/thread/concurrent_events/TestConcurrentBreakpointOneDelayBreakpointThreads.py (534 of 1785) PASS: lldb-api :: python_api/sbvalue_const_addrof/TestSBValueConstAddrOf.py (535 of 1785) PASS: lldb-api :: python_api/value/linked_list/TestValueAPILinkedList.py (536 of 1785) PASS: lldb-unit :: Utility/./UtilityTests/FileSpecTest.CopyByAppendingPathComponent (537 of 1785) PASS: lldb-unit :: Utility/./UtilityTests/Flags.GetBitSize (538 of 1785) PASS: lldb-unit :: UnwindAssembly/x86/./UnwindAssemblyx86Tests/Testx86AssemblyInspectionEngine.TestDisassemblyJunkBytes (539 of 1785) PASS: lldb-api :: tools/lldb-server/register-reading/TestGdbRemoteGPacket.py (540 of 1785) PASS: lldb-unit :: Expression/./ExpressionTests/DWARFExpression.DW_OP_convert (541 of 1785) PASS: lldb-api :: lang/c/register_variables/TestRegisterVariables.py (542 of 1785) PASS: lldb-unit :: Utility/./UtilityTests/StreamTeeTest.Write (543 of 1785) PASS: lldb-unit :: Utility/./UtilityTests/StreamTest.PutULEB128 (544 of 1785) UNSUPPORTED: lldb-api :: functionalities/exec/TestExec.py (545 of 1785) PASS: lldb-shell :: Reproducer/Functionalities/TestDataFormatter.test (546 of 1785) PASS: lldb-unit :: Utility/./UtilityTests/BinaryStreamTest.PutSLEB128NineBytes (547 of 1785) UNSUPPORTED: lldb-api :: commands/watchpoints/variable_out_of_scope/TestWatchedVarHitWhenInScope.py (548 of 1785) PASS: lldb-api :: commands/expression/two-files/TestObjCTypeQueryFromOtherCompileUnit.py (549 of 1785) PASS: lldb-unit :: Host/./HostTests/NativeProcessProtocolTest.ReadMemoryWithoutTrap (550 of 1785) PASS: lldb-shell :: Breakpoint/jitbp_elf.test (551 of 1785) PASS: lldb-api :: functionalities/breakpoint/breakpoint_command/TestRegexpBreakCommand.py (552 of 1785) PASS: lldb-unit :: ScriptInterpreter/Python/./ScriptInterpreterPythonTests/PythonDataObjectsTest.TestPythonStringToStr (553 of 1785) PASS: lldb-unit :: Utility/./UtilityTests/EnvironmentTest.EnvpConversion (554 of 1785) PASS: lldb-unit :: Utility/./UtilityTests/FileSpecTest.PrependPathComponent (555 of 1785) PASS: lldb-unit :: SymbolFile/NativePDB/./SymbolFileNativePDBTests/PDBFPOProgramToDWARFExpressionTests.UnresolvedRegisterReference (556 of 1785) PASS: lldb-api :: functionalities/data-formatter/data-formatter-stl/libcxx/list/loop/TestDataFormatterLibcxxListLoop.py (557 of 1785) PASS: lldb-api :: lang/c/enum_types/TestEnumTypes.py (558 of 1785) PASS: lldb-unit :: Utility/./UtilityTests/BinaryStreamTest.PutULEB128OneByte (559 of 1785) UNSUPPORTED: lldb-api :: macosx/macabi/TestMacABImacOSFramework.py (560 of 1785) PASS: lldb-shell :: SymbolFile/NativePDB/break-by-line.cpp (561 of 1785) PASS: lldb-api :: lang/cpp/static_methods/TestCPPStaticMethods.py (562 of 1785) UNSUPPORTED: lldb-api :: functionalities/data-formatter/data-formatter-stl/libstdcpp/unique_ptr/TestDataFormatterStdUniquePtr.py (563 of 1785) PASS: lldb-unit :: UnwindAssembly/x86/./UnwindAssemblyx86Tests/Testx86AssemblyInspectionEngine.Test32BitOnlyInstruction (564 of 1785) PASS: lldb-api :: commands/expression/xvalue/TestXValuePrinting.py (565 of 1785) PASS: lldb-shell :: SymbolFile/DWARF/dir-separator-no-comp-dir.s (566 of 1785) PASS: lldb-unit :: Utility/./UtilityTests/RecordReplayTest.InstrumentedFoo (567 of 1785) PASS: lldb-shell :: SymbolFile/NativePDB/globals-fundamental.cpp (568 of 1785) PASS: lldb-api :: functionalities/data-formatter/data-formatter-globals/TestDataFormatterGlobals.py (569 of 1785) PASS: lldb-unit :: Expression/./ExpressionTests/CppModuleConfigurationTest.UnknownLibCppFile (570 of 1785) PASS: lldb-unit :: Utility/./UtilityTests/StreamTeeTest.SetStreamAtIndexOverwrite (571 of 1785) PASS: lldb-api :: lang/objcxx/class-name-clash/TestNameClash.py (572 of 1785) PASS: lldb-unit :: Utility/./UtilityTests/SerializationRountripTest.SerializeDeserializeObjectReference (573 of 1785) PASS: lldb-unit :: Host/./HostTests/FileActionTest.Open (574 of 1785) XFAIL: lldb-shell :: Register/x86-mm-xmm-read.test (575 of 1785) PASS: lldb-unit :: Utility/./UtilityTests/StringListTest.InsertStringAtIndexOutOfBounds (576 of 1785) PASS: lldb-unit :: Host/./HostTests/MainLoopTest.ReadObject (577 of 1785) PASS: lldb-unit :: Utility/./UtilityTests/StringExtractorTest.GetHexU8_Underflow_NoEof (578 of 1785) PASS: lldb-unit :: Symbol/./SymbolTests/PostfixExpression.ToDWARF (579 of 1785) PASS: lldb-shell :: Settings/TestSettingsSet.test (580 of 1785) PASS: lldb-api :: commands/frame/diagnose/dereference-function-return/TestDiagnoseDereferenceFunctionReturn.py (581 of 1785) PASS: lldb-unit :: Utility/./UtilityTests/DataExtractorTest.PeekData (582 of 1785) PASS: lldb-unit :: debugserver/./debugserverTests/RNBSocket.LoopBackListenIPv4 (583 of 1785) PASS: lldb-unit :: Utility/./UtilityTests/StringExtractorTest.GetHexU8_Underflow2_NoEof (584 of 1785) PASS: lldb-api :: functionalities/breakpoint/breakpoint_names/TestBreakpointNames.py (585 of 1785) PASS: lldb-unit :: Utility/./UtilityTests/ArgsTest.TestInsertArg (586 of 1785) PASS: lldb-api :: functionalities/breakpoint/breakpoint_command/TestBreakpointCommandsFromPython.py (587 of 1785) PASS: lldb-api :: functionalities/data-formatter/data-formatter-stl/libcxx/variant/TestDataFormatterLibcxxVariant.py (588 of 1785) PASS: lldb-api :: functionalities/gdb_remote_client/TestThreadSelectionBug.py (589 of 1785) PASS: lldb-api :: lang/cpp/chained-calls/TestCppChainedCalls.py (590 of 1785) PASS: lldb-shell :: ObjectFile/PECOFF/basic-info-arm64.yaml (591 of 1785) PASS: lldb-api :: functionalities/data-formatter/data-formatter-cpp/TestDataFormatterCpp.py (592 of 1785) PASS: lldb-unit :: Language/Highlighting/./HighlighterTests/HighlighterTest.DefaultHighlighter (593 of 1785) PASS: lldb-api :: functionalities/data-formatter/data-formatter-objc/TestDataFormatterObjCCF.py (594 of 1785) PASS: lldb-api :: functionalities/breakpoint/step_over_breakpoint/TestStepOverBreakpoint.py (595 of 1785) PASS: lldb-unit :: Expression/./ExpressionTests/DiagnosticManagerTest.AppendMessageSubsequentDiags (596 of 1785) PASS: lldb-api :: functionalities/plugins/python_os_plugin/TestPythonOSPlugin.py (597 of 1785) UNSUPPORTED: lldb-api :: functionalities/darwin_log/filter/regex/activity/TestDarwinLogFilterRegexActivity.py (598 of 1785) PASS: lldb-api :: commands/watchpoints/multiple_threads/TestWatchpointMultipleThreads.py (599 of 1785) PASS: lldb-api :: functionalities/data-formatter/user-format-vs-summary/TestUserFormatVsSummary.py (600 of 1785) PASS: lldb-shell :: Expr/TestTypeOfDeclTypeExpr.test (601 of 1785) PASS: lldb-unit :: Utility/./UtilityTests/StringListTest.InsertStringAtIndexStart (602 of 1785) PASS: lldb-unit :: Process/minidump/./LLDBMinidumpTests/MinidumpParserTest.GetThreadContext_x86_32 (603 of 1785) PASS: lldb-unit :: Utility/./UtilityTests/OptionsWithRawTest.LeadingSpaceArgs (604 of 1785) PASS: lldb-api :: python_api/value/TestValueAPI.py (605 of 1785) PASS: lldb-unit :: Process/gdb-remote/./ProcessGdbRemoteTests/GDBRemoteClientBaseTest.SendContinueAndInterrupt2PacketBug (606 of 1785) PASS: lldb-api :: lang/cpp/operator-overload/TestOperatorOverload.py (607 of 1785) PASS: lldb-unit :: Utility/./UtilityTests/ScalarTest.Division (608 of 1785) PASS: lldb-shell :: Commands/CommandScriptImmediateOutput/CommandScriptImmediateOutputConsole.test (609 of 1785) PASS: lldb-shell :: SymbolFile/DWARF/gnu-style-compression.cpp (610 of 1785) PASS: lldb-unit :: Utility/./UtilityTests/ScalarTest.GetValue (611 of 1785) PASS: lldb-unit :: Utility/./UtilityTests/StringExtractorTest.GetU32LittleEndian (612 of 1785) PASS: lldb-unit :: Utility/./UtilityTests/StringExtractorTest.GetHexBytes_Partial (613 of 1785) PASS: lldb-api :: functionalities/data-formatter/data-formatter-objc/TestDataFormatterObjCPlain.py (614 of 1785) PASS: lldb-api :: functionalities/data-formatter/stringprinter/TestStringPrinter.py (615 of 1785) PASS: lldb-api :: functionalities/tail_call_frames/disambiguate_tail_call_seq/TestDisambiguateTailCallSeq.py (616 of 1785) UNSUPPORTED: lldb-shell :: Register/x86-64-ymm16-write.test (617 of 1785) PASS: lldb-unit :: UnwindAssembly/x86/./UnwindAssemblyx86Tests/Testx86AssemblyInspectionEngine.TestAddESP (618 of 1785) PASS: lldb-api :: commands/expression/formatters/TestFormatters.py (619 of 1785) PASS: lldb-api :: python_api/watchpoint/TestWatchpointIgnoreCount.py (620 of 1785) PASS: lldb-api :: lang/objc/modules-auto-import/TestModulesAutoImport.py (621 of 1785) PASS: lldb-unit :: Utility/./UtilityTests/RangeTest.ContainsRangeStartingFromZero (622 of 1785) PASS: lldb-unit :: Utility/./UtilityTests/RangeTest.Constructor (623 of 1785) PASS: lldb-api :: python_api/watchpoint/condition/TestWatchpointConditionAPI.py (624 of 1785) PASS: lldb-api :: functionalities/data-formatter/data-formatter-objc/TestDataFormatterObjCKVO.py (625 of 1785) PASS: lldb-unit :: Utility/./UtilityTests/StringExtractorTest.DecodeHexU8_Underflow2 (626 of 1785) UNSUPPORTED: lldb-api :: functionalities/process_save_core/TestProcessSaveCore.py (627 of 1785) PASS: lldb-unit :: Utility/./UtilityTests/OptionsWithRawTest.EmptySuffix (628 of 1785) PASS: lldb-api :: commands/process/launch-with-shellexpand/TestLaunchWithShellExpand.py (629 of 1785) PASS: lldb-unit :: Utility/./UtilityTests/StreamTest.PutRawBytesToBigEndian (630 of 1785) PASS: lldb-api :: commands/expression/import_builtin_fileid/TestImportBuiltinFileID.py (631 of 1785) PASS: lldb-unit :: Utility/./UtilityTests/UriParserTest.Empty (632 of 1785) PASS: lldb-unit :: Language/Highlighting/./HighlighterTests/HighlighterTest.DefaultHighlighterWithCursorOutOfBounds (633 of 1785) PASS: lldb-api :: lang/cpp/limit-debug-info/TestWithLimitDebugInfo.py (634 of 1785) PASS: lldb-unit :: ScriptInterpreter/Python/./ScriptInterpreterPythonTests/PythonDataObjectsTest.TestPythonListToStructuredList (635 of 1785) PASS: lldb-api :: macosx/version_zero/TestGetVersionZeroVersion.py (636 of 1785) PASS: lldb-shell :: Commands/CommandScriptImmediateOutput/CommandScriptImmediateOutputFile.test (637 of 1785) PASS: lldb-api :: functionalities/postmortem/elf-core/TestLinuxCore.py (638 of 1785) PASS: lldb-unit :: UnwindAssembly/x86/./UnwindAssemblyx86Tests/Testx86AssemblyInspectionEngine.TestReturnDetect (639 of 1785) PASS: lldb-shell :: SymbolFile/NativePDB/function-types-classes.cpp (640 of 1785) PASS: lldb-api :: functionalities/data-formatter/type_summary_list_arg/TestTypeSummaryListArg.py (641 of 1785) PASS: lldb-shell :: Commands/command-source.test (642 of 1785) UNSUPPORTED: lldb-api :: functionalities/thread/multi_break/TestMultipleBreakpoints.py (643 of 1785) PASS: lldb-api :: lang/objc/objc-dyn-sbtype/TestObjCDynamicSBType.py (644 of 1785) PASS: lldb-api :: commands/expression/class_template_specialization_empty_pack/TestClassTemplateSpecializationParametersHandling.py (645 of 1785) UNSUPPORTED: lldb-api :: functionalities/darwin_log/basic/TestDarwinLogBasic.py (646 of 1785) PASS: lldb-api :: functionalities/data-formatter/parray/TestPrintArray.py (647 of 1785) PASS: lldb-shell :: Breakpoint/debug_rnglist_basic.test (648 of 1785) UNSUPPORTED: lldb-api :: python_api/disassemble-raw-data/TestDisassemble_VST1_64.py (649 of 1785) PASS: lldb-api :: python_api/watchpoint/TestSetWatchpoint.py (650 of 1785) PASS: lldb-api :: functionalities/thread/concurrent_events/TestConcurrentSignalNWatchNBreak.py (651 of 1785) PASS: lldb-unit :: Utility/./UtilityTests/StreamTest.ChangingByteOrder (652 of 1785) PASS: lldb-api :: functionalities/data-formatter/data-formatter-stl/libcxx/string/TestDataFormatterLibcxxString.py (653 of 1785) PASS: lldb-api :: lang/cpp/lambdas/TestLambdas.py (654 of 1785) PASS: lldb-api :: lang/cpp/class_types/TestClassTypes.py (655 of 1785) PASS: lldb-unit :: Host/./HostTests/SocketAddressTest.GetAddressInfo (656 of 1785) PASS: lldb-unit :: Utility/./UtilityTests/TimerTest.CategoryTimesStats (657 of 1785) PASS: lldb-shell :: ObjectFile/ELF/section-permissions.yaml (658 of 1785) PASS: lldb-api :: functionalities/thread/concurrent_events/TestConcurrentManyBreakpoints.py (659 of 1785) PASS: lldb-unit :: Language/Highlighting/./HighlighterTests/HighlighterTest.ClangCursorPosAfterOtherToken (660 of 1785) PASS: lldb-shell :: SymbolFile/NativePDB/disassembly.cpp (661 of 1785) PASS: lldb-unit :: Language/CPlusPlus/./LanguageCPlusPlusTests/CPlusPlusLanguage.CPlusPlusNameParser (662 of 1785) PASS: lldb-shell :: Settings/TestFrameFormatColor.test (663 of 1785) PASS: lldb-unit :: Target/./TargetTests/ModuleCacheTest.GetAndPutStrangeHostname (664 of 1785) PASS: lldb-shell :: ObjectFile/ELF/duplicate-section.yaml (665 of 1785) PASS: lldb-api :: commands/expression/top-level/TestTopLevelExprs.py (666 of 1785) PASS: lldb-unit :: Process/gdb-remote/./ProcessGdbRemoteTests/GDBRemoteCommunicationClientTest.SyncThreadState (667 of 1785) PASS: lldb-shell :: Driver/TestCommands.test (668 of 1785) UNSUPPORTED: lldb-shell :: SymbolFile/PDB/class-layout.test (669 of 1785) PASS: lldb-unit :: Utility/./UtilityTests/FileSpecTest.IsRelative (670 of 1785) PASS: lldb-api :: functionalities/data-formatter/synthupdate/TestSyntheticFilterRecompute.py (671 of 1785) PASS: lldb-api :: commands/expression/import-std-module/shared_ptr/TestSharedPtr.py (672 of 1785) PASS: lldb-api :: functionalities/inferior-assert/TestInferiorAssert.py (673 of 1785) PASS: lldb-unit :: Utility/./UtilityTests/ConstStringTest.format_provider (674 of 1785) PASS: lldb-unit :: Utility/./UtilityTests/StreamTest.PutPtr (675 of 1785) PASS: lldb-unit :: Process/minidump/./LLDBMinidumpTests/MinidumpParserTest.GetMemoryRegionInfo (676 of 1785) UNSUPPORTED: lldb-api :: functionalities/darwin_log/format/TestDarwinLogMessageFormat.py (677 of 1785) PASS: lldb-unit :: Utility/./UtilityTests/UriParserTest.BracketedHostnameWithColon (678 of 1785) PASS: lldb-unit :: Expression/./ExpressionTests/DiagnosticManagerTest.PutString (679 of 1785) PASS: lldb-unit :: Utility/./UtilityTests/StringListTest.ShiftCString (680 of 1785) PASS: lldb-unit :: UnwindAssembly/x86/./UnwindAssemblyx86Tests/Testx86AssemblyInspectionEngine.TestPopR12 (681 of 1785) PASS: lldb-unit :: Symbol/./SymbolTests/TestClangASTContext.TemplateArguments (682 of 1785) PASS: lldb-unit :: ScriptInterpreter/Python/./ScriptInterpreterPythonTests/PythonDataObjectsTest.TestInstanceNameResolutionNoDot (683 of 1785) XFAIL: lldb-shell :: Register/x86-64-write.test (684 of 1785) PASS: lldb-unit :: debugserver/./debugserverTests/RNBSocket.AnyListen (685 of 1785) PASS: lldb-api :: commands/expression/persistent_variables/TestPersistentVariables.py (686 of 1785) PASS: lldb-unit :: Utility/./UtilityTests/OptionsWithRawTest.TerminatedQuote (687 of 1785) PASS: lldb-api :: commands/expression/test/TestExprs2.py (688 of 1785) PASS: lldb-unit :: Utility/./UtilityTests/ArgsTest.GetArgumentArrayRef (689 of 1785) PASS: lldb-api :: commands/process/attach/TestProcessAttach.py (690 of 1785) PASS: lldb-unit :: Utility/./UtilityTests/LogTest.Register (691 of 1785) PASS: lldb-api :: commands/apropos/basic/TestApropos.py (692 of 1785) UNSUPPORTED: lldb-shell :: Breakpoint/case-insensitive.test (693 of 1785) PASS: lldb-api :: functionalities/thread/concurrent_events/TestConcurrentNWatchNBreak.py (694 of 1785) PASS: lldb-api :: commands/watchpoints/watchpoint_size/TestWatchpointSizes.py (695 of 1785) PASS: lldb-unit :: Utility/./UtilityTests/StringLexerTest.AdvanceIf (696 of 1785) PASS: lldb-unit :: Utility/./UtilityTests/Flags.AnySet (697 of 1785) UNSUPPORTED: lldb-shell :: Process/Windows/exception_access_violation.cpp (698 of 1785) PASS: lldb-unit :: Utility/./UtilityTests/RecordReplayTest.InstrumentedBarPtr (699 of 1785) PASS: lldb-unit :: Utility/./UtilityTests/StringListTest.PopBack (700 of 1785) PASS: lldb-unit :: Utility/./UtilityTests/BinaryStreamTest.PutULEB128FiveBytes (701 of 1785) PASS: lldb-shell :: ObjectFile/Breakpad/uuid-matching-mac.test (702 of 1785) PASS: lldb-unit :: Utility/./UtilityTests/LogChannelEnabledTest.LogThread (703 of 1785) PASS: lldb-unit :: Utility/./UtilityTests/StreamTest.PutHex16ByteOrderBig (704 of 1785) UNSUPPORTED: lldb-api :: benchmarks/turnaround/TestCompileRunToBreakpointTurnaround.py (705 of 1785) PASS: lldb-unit :: Utility/./UtilityTests/RangeTest.Clear (706 of 1785) PASS: lldb-api :: commands/watchpoints/watchpoint_on_vectors/TestValueOfVectorVariable.py (707 of 1785) PASS: lldb-unit :: Utility/./UtilityTests/StringExtractorTest.GetHexBytesAvail_OddPair2 (708 of 1785) UNSUPPORTED: lldb-api :: tools/lldb-server/libraries-svr4/TestGdbRemoteLibrariesSvr4Support.py (709 of 1785) PASS: lldb-unit :: Utility/./UtilityTests/StringLexerTest.Peek (710 of 1785) UNSUPPORTED: lldb-api :: benchmarks/libcxxlist/TestBenchmarkLibcxxList.py (711 of 1785) PASS: lldb-unit :: Utility/./UtilityTests/CompletionRequest.TryCompleteCurrentArgMode (712 of 1785) PASS: lldb-unit :: Utility/./UtilityTests/StringExtractorTest.GetU64BigEndian (713 of 1785) UNSUPPORTED: lldb-api :: tools/lldb-server/thread-name/TestGdbRemoteThreadName.py (714 of 1785) PASS: lldb-unit :: Utility/./UtilityTests/StringExtractorTest.DecodeHexU8_Extra (715 of 1785) PASS: lldb-shell :: SymbolFile/NativePDB/tag-types.cpp (716 of 1785) UNSUPPORTED: lldb-api :: commands/expression/completion-crash1/TestCompletionCrash1.py (717 of 1785) PASS: lldb-unit :: Utility/./UtilityTests/StreamTest.ShiftOperatorInts (718 of 1785) UNSUPPORTED: lldb-api :: tools/lldb-server/signal-filtering/TestGdbRemote_QPassSignals.py (719 of 1785) PASS: lldb-unit :: Process/gdb-remote/./ProcessGdbRemoteTests/GDBRemoteClientBaseTest.SendContinueAndAsyncPacket (720 of 1785) PASS: lldb-unit :: Utility/./UtilityTests/StringListTest.GetSize (721 of 1785) PASS: lldb-unit :: Utility/./UtilityTests/BinaryStreamTest.PutSLEB128ThreeBytes (722 of 1785) PASS: lldb-api :: python_api/rdar-12481949/Test-rdar-12481949.py (723 of 1785) PASS: lldb-api :: functionalities/postmortem/netbsd-core/TestNetBSDCore.py (724 of 1785) PASS: lldb-unit :: Utility/./UtilityTests/StreamTeeTest.CopyConstructor (725 of 1785) PASS: lldb-api :: commands/expression/dollar-in-variable/TestDollarInVariable.py (726 of 1785) PASS: lldb-shell :: ObjectFile/ELF/build-id-case.yaml (727 of 1785) UNSUPPORTED: lldb-api :: functionalities/darwin_log/filter/exact_match/activity/TestDarwinLogFilterMatchActivity.py (728 of 1785) PASS: lldb-shell :: SymbolFile/DWARF/debug_aranges-empty-section.s (729 of 1785) PASS: lldb-api :: functionalities/tsan/multiple/TestTsanMultiple.py (730 of 1785) PASS: lldb-unit :: Utility/./UtilityTests/StringExtractorTest.GetHexBytesAvail_Underflow (731 of 1785) PASS: lldb-unit :: Utility/./UtilityTests/ListenerTest.GetEventImmediate (732 of 1785) PASS: lldb-api :: lang/objc/objc-super/TestObjCSuper.py (733 of 1785) PASS: lldb-unit :: Utility/./UtilityTests/VMRange.CollectionContains (734 of 1785) PASS: lldb-unit :: Utility/./UtilityTests/SerializationRountripTest.SerializeDeserializeObjectPointer (735 of 1785) PASS: lldb-unit :: SymbolFile/DWARF/./SymbolFileDWARFTests/SymbolFileDWARFTests.TestAbilitiesForDWARF (736 of 1785) PASS: lldb-unit :: UnwindAssembly/x86/./UnwindAssemblyx86Tests/Testx86AssemblyInspectionEngine.Test32bitFramelessSmallStackFrame (737 of 1785) PASS: lldb-shell :: SymbolFile/DWARF/find-variable-file.cpp (738 of 1785) PASS: lldb-unit :: Editline/./EditlineTests/EditlineTestFixture.EditlineReceivesMultiLineText (739 of 1785) PASS: lldb-unit :: UnwindAssembly/x86/./UnwindAssemblyx86Tests/Testx86AssemblyInspectionEngine.TestPopRBP (740 of 1785) PASS: lldb-unit :: Utility/./UtilityTests/ScalarTest.ExtractBitfield (741 of 1785) PASS: lldb-unit :: Utility/./UtilityTests/ConstStringTest.CompareConstString (742 of 1785) PASS: lldb-api :: functionalities/completion/TestCompletion.py (743 of 1785) PASS: lldb-unit :: Utility/./UtilityTests/ArchSpecTest.OperatorBool (744 of 1785) PASS: lldb-api :: commands/expression/ir-interpreter-phi-nodes/TestIRInterpreterPHINodes.py (745 of 1785) PASS: lldb-api :: commands/add-dsym/uuid/TestAddDsymCommand.py (746 of 1785) UNSUPPORTED: lldb-shell :: ExecControl/StopHook/stop-hook-threads.test (747 of 1785) PASS: lldb-unit :: Utility/./UtilityTests/RangeTest.SlideZero (748 of 1785) PASS: lldb-api :: functionalities/thread/step_until/TestStepUntil.py (749 of 1785) UNSUPPORTED: lldb-shell :: Register/x86-gp-write.test (750 of 1785) PASS: lldb-shell :: Python/crashlog.test (751 of 1785) PASS: lldb-api :: functionalities/data-formatter/setvaluefromcstring/TestSetValueFromCString.py (752 of 1785) PASS: lldb-unit :: ScriptInterpreter/Python/./ScriptInterpreterPythonTests/PythonExceptionStateTest.TestAcquisitionSemantics (753 of 1785) PASS: lldb-api :: commands/expression/completion-in-lambda-and-unnnamed-class/TestCompletionInLambdaAndUnnamedClass.py (754 of 1785) PASS: lldb-unit :: Utility/./UtilityTests/StringListTest.LongestCommonPrefixSingleElement (755 of 1785) PASS: lldb-api :: lang/cpp/rvalue-references/TestRvalueReferences.py (756 of 1785) PASS: lldb-api :: lang/objc/objc-ivar-stripped/TestObjCIvarStripped.py (757 of 1785) PASS: lldb-api :: functionalities/modern-type-lookup/basic-objc/TestBasicObjcModernTypeLookup.py (758 of 1785) PASS: lldb-api :: lang/cpp/enum_types/TestCPP11EnumTypes.py (759 of 1785) PASS: lldb-api :: functionalities/data-formatter/data-formatter-stl/libcxx/initializerlist/TestInitializerList.py (760 of 1785) PASS: lldb-api :: tools/lldb-server/TestGdbRemoteRegisterState.py (761 of 1785) PASS: lldb-unit :: Host/./HostTests/ConnectionFileDescriptorTest.TCPGetURIv4 (762 of 1785) PASS: lldb-api :: commands/expression/ignore-artificial-constructors/TestIgnoreArtificialConstructors.py (763 of 1785) PASS: lldb-api :: functionalities/memory-region/TestMemoryRegion.py (764 of 1785) PASS: lldb-api :: tools/lldb-server/TestGdbRemote_vCont.py (765 of 1785) PASS: lldb-api :: macosx/find-dsym/bundle-with-dot-in-filename/TestBundleWithDotInFilename.py (766 of 1785) PASS: lldb-shell :: SymbolFile/DWARF/dir-separator-no-comp-dir-relative-name.s (767 of 1785) PASS: lldb-unit :: ScriptInterpreter/Python/./ScriptInterpreterPythonTests/PythonExceptionStateTest.TestAutoRestoreSemantics (768 of 1785) PASS: lldb-unit :: UnwindAssembly/x86/./UnwindAssemblyx86Tests/Testx86AssemblyInspectionEngine.TestPushEAX (769 of 1785) PASS: lldb-shell :: ObjectFile/PECOFF/uuid.yaml (770 of 1785) PASS: lldb-unit :: Expression/./ExpressionTests/DWARFExpression.DW_OP_pick (771 of 1785) PASS: lldb-unit :: Utility/./UtilityTests/StringListTest.SplitIntoLinesSingleTrailingCR (772 of 1785) PASS: lldb-unit :: Utility/./UtilityTests/VMRange.ContainsAddr (773 of 1785) PASS: lldb-unit :: Language/Highlighting/./HighlighterTests/HighlighterTest.FallbackHighlighter (774 of 1785) PASS: lldb-shell :: SymbolFile/DWARF/debug-types-line-tables.s (775 of 1785) PASS: lldb-api :: lang/cpp/wchar_t/TestCxxWCharT.py (776 of 1785) PASS: lldb-unit :: Utility/./UtilityTests/StreamTest.PutHex64ByteOrderBig (777 of 1785) PASS: lldb-api :: types/TestFloatTypes.py (778 of 1785) PASS: lldb-unit :: SymbolFile/NativePDB/./SymbolFileNativePDBTests/PDBFPOProgramToDWARFExpressionTests.UnresolvedCyclicRegisterAssignmentReference (779 of 1785) PASS: lldb-api :: api/multiple-targets/TestMultipleTargets.py (780 of 1785) PASS: lldb-api :: functionalities/data-formatter/data-formatter-stl/libcxx/iterator/TestDataFormatterLibccIterator.py (781 of 1785) PASS: lldb-unit :: Host/./HostTests/SocketTest.DomainListenConnectAccept (782 of 1785) PASS: lldb-unit :: Core/./LLDBCoreTests/UniqueCStringMap.NoDefaultConstructor (783 of 1785) PASS: lldb-api :: functionalities/backticks/TestBackticksWithoutATarget.py (784 of 1785) UNSUPPORTED: lldb-api :: tools/lldb-server/TestGdbRemoteModuleInfo.py (785 of 1785) PASS: lldb-api :: functionalities/data-formatter/data-formatter-categories/TestDataFormatterCategories.py (786 of 1785) PASS: lldb-api :: lang/c/vla/TestVLA.py (787 of 1785) PASS: lldb-unit :: UnwindAssembly/x86/./UnwindAssemblyx86Tests/Testx86AssemblyInspectionEngine.TestPushR15 (788 of 1785) PASS: lldb-unit :: Utility/./UtilityTests/ArchSpecTest.TestParseMachCPUDashSubtypeTripleSimple (789 of 1785) PASS: lldb-api :: functionalities/plugins/command_plugin/TestPluginCommands.py (790 of 1785) PASS: lldb-unit :: Utility/./UtilityTests/FileSpecTest.AppendPathComponent (791 of 1785) PASS: lldb-api :: lang/c/bitfields/TestBitfields.py (792 of 1785) PASS: lldb-unit :: Utility/./UtilityTests/SerializationRountripTest.SerializeDeserializePodReferences (793 of 1785) PASS: lldb-shell :: Minidump/Windows/find-module.test (794 of 1785) PASS: lldb-api :: types/TestDoubleTypes.py (795 of 1785) PASS: lldb-unit :: ObjectFile/ELF/./ObjectFileELFTests/ObjectFileELFTest.SectionsResolveConsistently (796 of 1785) PASS: lldb-api :: lang/objc/objc-stepping/TestObjCStepping.py (797 of 1785) PASS: lldb-api :: lang/cpp/dynamic-value-same-basename/TestDynamicValueSameBase.py (798 of 1785) PASS: lldb-unit :: Symbol/./SymbolTests/TestClangASTContext.TestUnifyAccessSpecifiers (799 of 1785) PASS: lldb-api :: functionalities/value_md5_crash/TestValueMD5Crash.py (800 of 1785) UNSUPPORTED: lldb-api :: benchmarks/expression/TestRepeatedExprs.py (801 of 1785) PASS: lldb-api :: functionalities/data-formatter/type_summary_list_script/TestTypeSummaryListScript.py (802 of 1785) PASS: lldb-api :: lang/objc/objc-static-method/TestObjCStaticMethod.py (803 of 1785) PASS: lldb-api :: commands/frame/language/TestGuessLanguage.py (804 of 1785) PASS: lldb-shell :: Breakpoint/debug_rnglist_rlestartend.test (805 of 1785) PASS: lldb-api :: functionalities/data-formatter/data-formatter-stl/libcxx/vbool/TestDataFormatterLibcxxVBool.py (806 of 1785) PASS: lldb-shell :: Quit/TestQuitExitCodeTooManyArgs.test (807 of 1785) PASS: lldb-unit :: UnwindAssembly/x86/./UnwindAssemblyx86Tests/Testx86AssemblyInspectionEngine.TestPushExtended (808 of 1785) PASS: lldb-unit :: ScriptInterpreter/Python/./ScriptInterpreterPythonTests/PythonDataObjectsTest.TestPythonTupleSize (809 of 1785) PASS: lldb-api :: functionalities/data-formatter/data-formatter-synthval/TestDataFormatterSynthVal.py (810 of 1785) PASS: lldb-api :: commands/platform/basic/TestPlatformPython.py (811 of 1785) PASS: lldb-api :: python_api/lldbutil/iter/TestRegistersIterator.py (812 of 1785) PASS: lldb-shell :: Reproducer/Modules/TestModuleCXX.test (813 of 1785) PASS: lldb-shell :: ObjectFile/Breakpad/sections-trailing-func.test (814 of 1785) PASS: lldb-api :: lang/c/find_struct_type/TestFindStructTypes.py (815 of 1785) PASS: lldb-unit :: Utility/./UtilityTests/UriParserTest.BadPort (816 of 1785) PASS: lldb-unit :: Host/./HostTests/Host.WaitStatusFormat (817 of 1785) PASS: lldb-unit :: Process/minidump/./LLDBMinidumpTests/MinidumpParserTest.GetThreadContext_x86_64 (818 of 1785) PASS: lldb-api :: commands/expression/call-function/TestCallUserDefinedFunction.py (819 of 1785) PASS: lldb-unit :: Utility/./UtilityTests/StreamTeeTest.Constructor1Stream (820 of 1785) PASS: lldb-unit :: Host/./HostTests/SocketTest.TCPGetAddress (821 of 1785) PASS: lldb-api :: functionalities/abbreviation/TestAbbreviations.py (822 of 1785) PASS: lldb-unit :: SymbolFile/NativePDB/./SymbolFileNativePDBTests/PDBFPOProgramToDWARFExpressionTests.DependencyChain (823 of 1785) PASS: lldb-unit :: UnwindAssembly/x86/./UnwindAssemblyx86Tests/Testx86AssemblyInspectionEngine.TestPushRBPWithREX (824 of 1785) PASS: lldb-shell :: SymbolFile/DWARF/find-inline-method.s (825 of 1785) PASS: lldb-api :: commands/version/TestVersion.py (826 of 1785) PASS: lldb-api :: lang/c/const_variables/TestConstVariables.py (827 of 1785) UNSUPPORTED: lldb-api :: functionalities/tty/TestTerminal.py (828 of 1785) PASS: lldb-unit :: Utility/./UtilityTests/LogChannelTest.EnableOptions (829 of 1785) PASS: lldb-unit :: ObjectFile/ELF/./ObjectFileELFTests/ObjectFileELFTest.GetModuleSpecifications_EarlySectionHeaders (830 of 1785) PASS: lldb-api :: lang/c/local_types/TestUseClosestType.py (831 of 1785) PASS: lldb-api :: functionalities/thread/concurrent_events/TestConcurrentDelayedCrashWithBreakpointWatchpoint.py (832 of 1785) PASS: lldb-api :: lang/cpp/trivial_abi/TestTrivialABI.py (833 of 1785) PASS: lldb-shell :: ObjectFile/MachO/symtab.yaml (834 of 1785) PASS: lldb-unit :: Expression/./ExpressionTests/DiagnosticManagerTest.AppendMessageNoDiag (835 of 1785) PASS: lldb-unit :: Utility/./UtilityTests/RangeTest.ContainsAddrInvalid (836 of 1785) PASS: lldb-unit :: Utility/./UtilityTests/NameMatchesTest.Equals (837 of 1785) PASS: lldb-api :: functionalities/thread/num_threads/TestNumThreads.py (838 of 1785) PASS: lldb-unit :: Expression/./ExpressionTests/DiagnosticManagerTest.GetStringMultipleDiags (839 of 1785) PASS: lldb-api :: commands/platform/process/TestProcessList.py (840 of 1785) PASS: lldb-api :: lang/objc/conflicting-definition/TestConflictingDefinition.py (841 of 1785) PASS: lldb-shell :: SymbolFile/NativePDB/function-types-calling-conv.cpp (842 of 1785) PASS: lldb-api :: functionalities/gdb_remote_client/TestGDBRemoteClient.py (843 of 1785) UNSUPPORTED: lldb-api :: lang/cpp/static_members/TestCPPStaticMembers.py (844 of 1785) PASS: lldb-api :: python_api/signals/TestSignalsAPI.py (845 of 1785) PASS: lldb-unit :: Process/gdb-remote/./ProcessGdbRemoteTests/GDBRemoteCommunicationServerTest.SendErrorResponse_StringError (846 of 1785) PASS: lldb-api :: functionalities/breakpoint/debugbreak/TestDebugBreak.py (847 of 1785) PASS: lldb-unit :: Utility/./UtilityTests/VMRange.ContainsRange (848 of 1785) PASS: lldb-unit :: Utility/./UtilityTests/DataExtractorTest.GetMaxS64 (849 of 1785) PASS: lldb-shell :: Reproducer/TestRelativePath.test (850 of 1785) PASS: lldb-api :: functionalities/deleted-executable/TestDeletedExecutable.py (851 of 1785) PASS: lldb-unit :: Language/Highlighting/./HighlighterTests/HighlighterTest.ClangScalarLiterals (852 of 1785) PASS: lldb-unit :: Utility/./UtilityTests/StreamTest.PutHex8 (853 of 1785) PASS: lldb-api :: functionalities/data-formatter/ostypeformatting/TestFormattersOsType.py (854 of 1785) PASS: lldb-unit :: Utility/./UtilityTests/UserIDResolver.GetUserName (855 of 1785) PASS: lldb-unit :: Process/gdb-remote/./ProcessGdbRemoteTests/GDBRemoteCommunicationClientTest.GetModulesInfo (856 of 1785) PASS: lldb-api :: python_api/sbtype_typeclass/TestSBTypeTypeClass.py (857 of 1785) PASS: lldb-api :: commands/frame/var-scope/TestFrameVariableScope.py (858 of 1785) PASS: lldb-api :: commands/expression/import-std-module/weak_ptr-dbg-info-content/TestDbgInfoContentWeakPtr.py (859 of 1785) PASS: lldb-shell :: SymbolFile/DWARF/compilercontext.ll (860 of 1785) PASS: lldb-unit :: Utility/./UtilityTests/StringListTest.DefaultConstructor (861 of 1785) UNSUPPORTED: lldb-api :: functionalities/data-formatter/data-formatter-stl/libstdcpp/vector/TestDataFormatterStdVector.py (862 of 1785) PASS: lldb-api :: tools/lldb-server/commandline/TestStubSetSID.py (863 of 1785) PASS: lldb-api :: functionalities/inline-stepping/TestInlineStepping.py (864 of 1785) PASS: lldb-unit :: ScriptInterpreter/Python/./ScriptInterpreterPythonTests/PythonDataObjectsTest.TestPythonDictionaryValueEquality (865 of 1785) PASS: lldb-shell :: Minidump/breakpad-symbols.test (866 of 1785) PASS: lldb-unit :: Utility/./UtilityTests/RegularExpression.Invalid (867 of 1785) PASS: lldb-unit :: Process/minidump/./LLDBMinidumpTests/MinidumpParserTest.GetPidWow64 (868 of 1785) PASS: lldb-api :: functionalities/data-formatter/compactvectors/TestCompactVectors.py (869 of 1785) PASS: lldb-api :: lang/c/global_variables/TestGlobalVariables.py (870 of 1785) PASS: lldb-unit :: Utility/./UtilityTests/OptionsWithRawTest.SingleWhitespaceInput (871 of 1785) PASS: lldb-api :: functionalities/breakpoint/cpp_exception/TestCPPExceptionBreakpoint.py (872 of 1785) PASS: lldb-shell :: Settings/TestSettingsWrite.test (873 of 1785) UNSUPPORTED: lldb-api :: benchmarks/startup/TestStartupDelays.py (874 of 1785) PASS: lldb-api :: tools/lldb-server/TestGdbRemoteExpeditedRegisters.py (875 of 1785) PASS: lldb-api :: commands/expression/call-function/TestCallStopAndContinue.py (876 of 1785) PASS: lldb-api :: lang/cpp/char8_t/TestCxxChar8_t.py (877 of 1785) PASS: lldb-unit :: Utility/./UtilityTests/BinaryStreamTest.PutSLEB128MaxValue (878 of 1785) PASS: lldb-shell :: ObjectFile/ELF/many-sections.s (879 of 1785) PASS: lldb-shell :: Settings/TestModuleCacheSanity.test (880 of 1785) PASS: lldb-unit :: Utility/./UtilityTests/OptionsWithRawTest.QuotedSuffix (881 of 1785) PASS: lldb-unit :: Utility/./UtilityTests/StringExtractorTest.GetHexU8_InvalidHex_NoEof (882 of 1785) PASS: lldb-unit :: Utility/./UtilityTests/ConstStringTest.UpdateMangledCounterpart (883 of 1785) PASS: lldb-unit :: Utility/./UtilityTests/StreamTest.PutBytesAsRawHex8ToMixedEndian (884 of 1785) PASS: lldb-unit :: Utility/./UtilityTests/ScalarTest.Scalar_512 (885 of 1785) PASS: lldb-api :: functionalities/data-formatter/format-propagation/TestFormatPropagation.py (886 of 1785) PASS: lldb-api :: functionalities/target_var/TestTargetVar.py (887 of 1785) PASS: lldb-api :: lang/objc/modules-cache/TestClangModulesCache.py (888 of 1785) PASS: lldb-api :: tools/lldb-server/TestGdbRemoteThreadsInStopReply.py (889 of 1785) PASS: lldb-unit :: ScriptInterpreter/Python/./ScriptInterpreterPythonTests/PythonDataObjectsTest.TestPythonTupleToStructuredList (890 of 1785) PASS: lldb-unit :: UnwindAssembly/x86/./UnwindAssemblyx86Tests/Testx86AssemblyInspectionEngine.TestPopEDI (891 of 1785) PASS: lldb-shell :: ObjectFile/Breakpad/breakpad-identification.test (892 of 1785) PASS: lldb-api :: functionalities/breakpoint/global_constructor/TestBreakpointInGlobalConstructor.py (893 of 1785) PASS: lldb-api :: commands/expression/import-std-module/shared_ptr-dbg-info-content/TestSharedPtrDbgInfoContent.py (894 of 1785) PASS: lldb-api :: functionalities/data-formatter/summary-string-onfail/Test-rdar-9974002.py (895 of 1785) PASS: lldb-api :: commands/expression/unwind_expression/TestUnwindExpression.py (896 of 1785) PASS: lldb-unit :: Utility/./UtilityTests/StringListTest.CopyListEmpty (897 of 1785) PASS: lldb-unit :: Core/./LLDBCoreTests/RichManglingContextTest.Basic (898 of 1785) PASS: lldb-api :: commands/settings/TestSettings.py (899 of 1785) PASS: lldb-api :: lang/objc/foundation/TestObjCMethods2.py (900 of 1785) PASS: lldb-api :: functionalities/postmortem/wow64_minidump/TestWow64MiniDump.py (901 of 1785) PASS: lldb-unit :: Target/./TargetTests/ModuleCacheTest.GetAndPutUuidExists (902 of 1785) PASS: lldb-unit :: Utility/./UtilityTests/StringListTest.GetMaxStringLengthDecreasingSize (903 of 1785) PASS: lldb-unit :: Utility/./UtilityTests/StreamTest.PutHex16ByteOrderLittle (904 of 1785) PASS: lldb-api :: commands/watchpoints/watchpoint_set_command/TestWatchLocationWithWatchSet.py (905 of 1785) PASS: lldb-shell :: SymbolFile/NativePDB/source-list.cpp (906 of 1785) PASS: lldb-api :: functionalities/breakpoint/breakpoint_options/TestBreakpointOptions.py (907 of 1785) PASS: lldb-shell :: SymbolFile/DWARF/find-function-regex.cpp (908 of 1785) PASS: lldb-unit :: Symbol/./SymbolTests/PostfixExpression.ParseOneExpression (909 of 1785) PASS: lldb-api :: functionalities/thread/concurrent_events/TestConcurrentDelayedCrashWithBreakpointSignal.py (910 of 1785) PASS: lldb-api :: functionalities/inferior-crashing/recursive-inferior/TestRecursiveInferiorStep.py (911 of 1785) PASS: lldb-unit :: Utility/./UtilityTests/StringExtractorTest.GetNameColonValueNoSemicolon (912 of 1785) PASS: lldb-api :: commands/platform/basic/TestPlatformCommand.py (913 of 1785) PASS: lldb-api :: commands/expression/char/TestExprsChar.py (914 of 1785) PASS: lldb-api :: commands/expression/ir-interpreter/TestIRInterpreter.py (915 of 1785) PASS: lldb-shell :: Quit/TestQuitExitCodeHexA.test (916 of 1785) PASS: lldb-api :: functionalities/thread/backtrace_all/TestBacktraceAll.py (917 of 1785) PASS: lldb-api :: api/log/TestAPILog.py (918 of 1785) PASS: lldb-api :: python_api/section/TestSectionAPI.py (919 of 1785) PASS: lldb-unit :: Utility/./UtilityTests/ArgsTest.TestMultipleArgs (920 of 1785) PASS: lldb-api :: functionalities/memory/find/TestMemoryFind.py (921 of 1785) PASS: lldb-unit :: Utility/./UtilityTests/TimerTest.CategoryTimesNested (922 of 1785) PASS: lldb-unit :: Expression/./ExpressionTests/CppModuleConfigurationTest.Xcode (923 of 1785) PASS: lldb-api :: functionalities/breakpoint/breakpoint_set_restart/TestBreakpointSetRestart.py (924 of 1785) PASS: lldb-api :: functionalities/data-formatter/data-formatter-enum-format/TestDataFormatterEnumFormat.py (925 of 1785) UNSUPPORTED: lldb-api :: functionalities/darwin_log/source/info/TestDarwinLogSourceInfo.py (926 of 1785) PASS: lldb-unit :: Utility/./UtilityTests/StreamTeeTest.GetStreamAtIndexOutOfBounds (927 of 1785) PASS: lldb-api :: commands/expression/context-object-objc/TestContextObjectObjc.py (928 of 1785) PASS: lldb-api :: commands/watchpoints/step_over_watchpoint/TestStepOverWatchpoint.py (929 of 1785) UNSUPPORTED: lldb-api :: functionalities/data-formatter/data-formatter-stl/libstdcpp/vbool/TestDataFormatterStdVBool.py (930 of 1785) PASS: lldb-unit :: Utility/./UtilityTests/OptionsWithRawTest.EmptyArgsOnlySuffix (931 of 1785) PASS: lldb-api :: python_api/frame/inlines/TestInlinedFrame.py (932 of 1785) PASS: lldb-api :: commands/disassemble/basic/TestDisassembleBreakpoint.py (933 of 1785) PASS: lldb-unit :: Core/./LLDBCoreTests/MangledTest.NameIndexes_FindFunctionSymbols (934 of 1785) PASS: lldb-unit :: Utility/./UtilityTests/StringListTest.CopyListSingle (935 of 1785) PASS: lldb-unit :: Utility/./UtilityTests/ArgsTest.AppendArguments (936 of 1785) PASS: lldb-unit :: Core/./LLDBCoreTests/RichManglingContextTest.SwitchProvider (937 of 1785) PASS: lldb-unit :: Process/gdb-remote/./ProcessGdbRemoteTests/GDBRemoteCommunicationClientTest.SaveRestoreRegistersNoSuffix (938 of 1785) PASS: lldb-api :: functionalities/thread/exit_during_step/TestExitDuringStep.py (939 of 1785) PASS: lldb-unit :: Utility/./UtilityTests/StreamTeeTest.GetStreamAtIndexOutOfBoundsEmpty (940 of 1785) PASS: lldb-api :: commands/frame/diagnose/dereference-this/TestDiagnoseDereferenceThis.py (941 of 1785) PASS: lldb-unit :: UnwindAssembly/x86/./UnwindAssemblyx86Tests/Testx86AssemblyInspectionEngine.TestStackRealignMSVC_i386 (942 of 1785) PASS: lldb-api :: commands/expression/import-std-module/empty-module/TestEmptyStdModule.py (943 of 1785) PASS: lldb-unit :: Utility/./UtilityTests/FileSpecTest.FileAndDirectoryComponents (944 of 1785) PASS: lldb-unit :: Utility/./UtilityTests/ScalarTest.GetBytes (945 of 1785) PASS: lldb-unit :: Target/./TargetTests/PathMappingListTest.RemapRoot (946 of 1785) PASS: lldb-unit :: Utility/./UtilityTests/NameMatchesTest.StartsWith (947 of 1785) PASS: lldb-api :: tools/lldb-server/TestGdbRemoteAttach.py (948 of 1785) PASS: lldb-api :: lang/cpp/class-template-parameter-pack/TestClassTemplateParameterPack.py (949 of 1785) PASS: lldb-unit :: Utility/./UtilityTests/NameMatchesTest.RegularExpression (950 of 1785) PASS: lldb-unit :: Expression/./ExpressionTests/DiagnosticManagerTest.GetStringSeverityLabels (951 of 1785) PASS: lldb-api :: lang/objc/modules/TestObjCModules.py (952 of 1785) PASS: lldb-unit :: Host/./HostTests/SocketTest.TCPGetConnectURI (953 of 1785) PASS: lldb-api :: commands/expression/import-std-module/unique_ptr/TestUniquePtr.py (954 of 1785) PASS: lldb-unit :: Utility/./UtilityTests/ArgsTest.TestOverwriteArgs (955 of 1785) PASS: lldb-api :: lang/objc/foundation/TestConstStrings.py (956 of 1785) PASS: lldb-api :: functionalities/data-formatter/data-formatter-objc/TestDataFormatterObjCNSError.py (957 of 1785) PASS: lldb-shell :: Reproducer/TestWorkingDir.test (958 of 1785) PASS: lldb-shell :: SymbolFile/Breakpad/line-table.test (959 of 1785) PASS: lldb-shell :: ObjectFile/ELF/aarch64-relocations.yaml (960 of 1785) PASS: lldb-shell :: SymbolFile/DWARF/find-basic-type.cpp (961 of 1785) PASS: lldb-unit :: Utility/./UtilityTests/ListenerTest.GetEventWait (962 of 1785) PASS: lldb-api :: functionalities/data-formatter/data-formatter-skip-summary/TestDataFormatterSkipSummary.py (963 of 1785) PASS: lldb-unit :: Process/gdb-remote/./ProcessGdbRemoteTests/GDBRemoteClientBaseTest.InterruptNoResponse (964 of 1785) PASS: lldb-api :: commands/expression/import-std-module/queue/TestQueue.py (965 of 1785) PASS: lldb-api :: functionalities/breakpoint/consecutive_breakpoints/TestConsecutiveBreakpoints.py (966 of 1785) PASS: lldb-unit :: Utility/./UtilityTests/AnsiTerminal.Empty (967 of 1785) PASS: lldb-unit :: Utility/./UtilityTests/ArgsTest.TestQuotedTrailingBackslash (968 of 1785) PASS: lldb-api :: lang/cpp/exceptions/TestCPPExceptionBreakpoints.py (969 of 1785) PASS: lldb-unit :: Utility/./UtilityTests/StreamTest.PutHex32ByteOrderLittle (970 of 1785) PASS: lldb-unit :: Host/./HostTests/SocketAddressTest.Set (971 of 1785) PASS: lldb-unit :: Utility/./UtilityTests/RangeDataVector.FindEntryThatContains (972 of 1785) PASS: lldb-unit :: SymbolFile/NativePDB/./SymbolFileNativePDBTests/PDBFPOProgramToDWARFExpressionTests.InvalidAssignmentMultiple (973 of 1785) PASS: lldb-shell :: Breakpoint/debug_addrx.test (974 of 1785) PASS: lldb-unit :: ScriptInterpreter/Python/./ScriptInterpreterPythonTests/PythonDataObjectsTest.TestPythonString (975 of 1785) PASS: lldb-unit :: Process/minidump/./LLDBMinidumpTests/MinidumpParserTest.GetMemoryRegionInfoFromMemoryList (976 of 1785) PASS: lldb-unit :: Utility/./UtilityTests/ArchSpecTest.MergeFrom (977 of 1785) UNSUPPORTED: lldb-api :: benchmarks/stepping/TestSteppingSpeed.py (978 of 1785) PASS: lldb-unit :: Expression/./ExpressionTests/DiagnosticManagerTest.PutStringMultiple (979 of 1785) PASS: lldb-unit :: ScriptInterpreter/Python/./ScriptInterpreterPythonTests/PythonExceptionStateTest.TestDiscardSemantics (980 of 1785) PASS: lldb-api :: functionalities/gdb_remote_client/TestNestedRegDefinitions.py (981 of 1785) PASS: lldb-unit :: tools/lldb-server/tests/./LLDBServerTests/StandardStartupTest.TestStopReplyContainsThreadPcs (982 of 1785) PASS: lldb-unit :: Utility/./UtilityTests/AnsiTerminal.Incomplete (983 of 1785) PASS: lldb-api :: commands/gui/invalid-args/TestInvalidArgsGui.py (984 of 1785) PASS: lldb-unit :: Process/gdb-remote/./ProcessGdbRemoteTests/GDBRemoteCommunicationClientTest.GetMemoryRegionInfo (985 of 1785) PASS: lldb-unit :: Expression/./ExpressionTests/ClangHostTest.MacOSX (986 of 1785) PASS: lldb-unit :: Utility/./UtilityTests/ReproducerTest.SetCapture (987 of 1785) PASS: lldb-unit :: Utility/./UtilityTests/StringListTest.AppendList (988 of 1785) PASS: lldb-shell :: Settings/TestDisableColor.test (989 of 1785) PASS: lldb-api :: api/check_public_api_headers/TestPublicAPIHeaders.py (990 of 1785) PASS: lldb-api :: functionalities/thread/concurrent_events/TestConcurrentSignalBreak.py (991 of 1785) PASS: lldb-unit :: Utility/./UtilityTests/UriParserTest.MinimalPort (992 of 1785) PASS: lldb-shell :: ObjectFile/Breakpad/sections.test (993 of 1785) PASS: lldb-shell :: ObjectFile/ELF/section-types.yaml (994 of 1785) PASS: lldb-shell :: ObjectFile/MachO/lc_build_version_notools.yaml (995 of 1785) PASS: lldb-unit :: Utility/./UtilityTests/BinaryStreamTest.PutULEB128TwoBytes (996 of 1785) PASS: lldb-unit :: Utility/./UtilityTests/CompletionRequest.FakeLastArg (997 of 1785) PASS: lldb-shell :: Commands/command-script-import.test (998 of 1785) PASS: lldb-unit :: ObjectFile/ELF/./ObjectFileELFTests/ObjectFileELFTest.GetSymtab_NoSymEntryPointArmAddressClass (999 of 1785) PASS: lldb-api :: commands/expression/import-std-module/forward_list-dbg-info-content/TestDbgInfoContentForwardList.py (1000 of 1785) PASS: lldb-api :: lang/cpp/dynamic-value/TestCppValueCast.py (1001 of 1785) PASS: lldb-unit :: Host/./HostTests/FileSystemTest.Exists (1002 of 1785) PASS: lldb-api :: terminal/TestSTTYBeforeAndAfter.py (1003 of 1785) PASS: lldb-unit :: Utility/./UtilityTests/StreamTest.PutMaxHex64ByteOrderBig (1004 of 1785) PASS: lldb-api :: functionalities/breakpoint/breakpoint_ignore_count/TestBreakpointIgnoreCount.py (1005 of 1785) PASS: lldb-unit :: Utility/./UtilityTests/ArgsTest.StringListConstructor (1006 of 1785) PASS: lldb-unit :: UnwindAssembly/x86/./UnwindAssemblyx86Tests/Testx86AssemblyInspectionEngine.TestStackRealign8BitDisp_i386 (1007 of 1785) PASS: lldb-unit :: Utility/./UtilityTests/ConstStringTest.MangledCounterpart (1008 of 1785) PASS: lldb-unit :: Utility/./UtilityTests/StreamTest.PutBytesAsRawHex8ToBigEndian (1009 of 1785) PASS: lldb-shell :: Register/x86-64-gp-read.test (1010 of 1785) PASS: lldb-unit :: Utility/./UtilityTests/ScalarTest.Promotion (1011 of 1785) PASS: lldb-unit :: UnwindAssembly/x86/./UnwindAssemblyx86Tests/Testx86AssemblyInspectionEngine.TestPushR14 (1012 of 1785) PASS: lldb-unit :: Utility/./UtilityTests/ArchSpecTest.MergeFromMachOUnknown (1013 of 1785) PASS: lldb-api :: lang/cpp/std-function-step-into-callable/TestStdFunctionStepIntoCallable.py (1014 of 1785) PASS: lldb-unit :: Utility/./UtilityTests/CompletionRequest.DuplicateFiltering (1015 of 1785) PASS: lldb-api :: lang/objc/orderedset/TestOrderedSet.py (1016 of 1785) PASS: lldb-shell :: Breakpoint/split-dwarf5-debug-stroffsets.test (1017 of 1785) PASS: lldb-api :: commands/watchpoints/hello_watchpoint/TestMyFirstWatchpoint.py (1018 of 1785) PASS: lldb-api :: commands/expression/context-object/TestContextObject.py (1019 of 1785) PASS: lldb-unit :: Utility/./UtilityTests/StreamTest.PutBytesAsRawHex8ToLittleEndian (1020 of 1785) PASS: lldb-api :: lang/c/function_types/TestFunctionTypes.py (1021 of 1785) PASS: lldb-shell :: ObjectFile/PECOFF/export-dllfunc.yaml (1022 of 1785) PASS: lldb-unit :: Utility/./UtilityTests/StringExtractorTest.GetHexBytesAvail_OddPair (1023 of 1785) PASS: lldb-api :: functionalities/gdb_remote_client/TestTargetXMLArch.py (1024 of 1785) UNSUPPORTED: lldb-api :: commands/expression/call-restarts/TestCallThatRestarts.py (1025 of 1785) PASS: lldb-unit :: Process/gdb-remote/./ProcessGdbRemoteTests/GDBRemoteCommunicationClientTest.GetMemoryRegionInfoInvalidResponse (1026 of 1785) PASS: lldb-api :: functionalities/recursion/TestValueObjectRecursion.py (1027 of 1785) PASS: lldb-unit :: Utility/./UtilityTests/CompletionRequest.DuplicateFilteringWithComments (1028 of 1785) UNSUPPORTED: lldb-api :: functionalities/darwin_log/filter/regex/message/TestDarwinLogFilterRegexMessage.py (1029 of 1785) PASS: lldb-api :: lang/objc/foundation/TestObjectDescriptionAPI.py (1030 of 1785) PASS: lldb-unit :: Utility/./UtilityTests/ArgsTest.GetQuotedCommandString (1031 of 1785) PASS: lldb-unit :: Utility/./UtilityTests/RecordReplayTest.InstrumentedBar (1032 of 1785) PASS: lldb-api :: functionalities/data-formatter/data-formatter-stl/libcxx/tuple/TestDataFormatterLibcxxTuple.py (1033 of 1785) PASS: lldb-api :: commands/apropos/with-process/TestAproposWithProcess.py (1034 of 1785) PASS: lldb-unit :: Utility/./UtilityTests/EnvironmentTest.EnvpConstruction (1035 of 1785) PASS: lldb-api :: lang/cpp/unsigned_types/TestUnsignedTypes.py (1036 of 1785) PASS: lldb-unit :: Utility/./UtilityTests/RecordReplayTest.InstrumentedBarRef (1037 of 1785) PASS: lldb-unit :: ScriptInterpreter/Python/./ScriptInterpreterPythonTests/PythonDataObjectsTest.TestDictionaryResolutionWithDot (1038 of 1785) PASS: lldb-unit :: Host/./HostTests/SocketTest.TCPListen0GetPort (1039 of 1785) PASS: lldb-shell :: Quit/TestQuitExitCode0.test (1040 of 1785) PASS: lldb-api :: commands/watchpoints/watchpoint_commands/condition/TestWatchpointConditionCmd.py (1041 of 1785) PASS: lldb-shell :: SymbolFile/DWARF/apple-index-is-used.cpp (1042 of 1785) PASS: lldb-unit :: Process/gdb-remote/./ProcessGdbRemoteTests/GDBRemoteCommunicationClientTest.TestPacketSpeedJSON (1043 of 1785) UNSUPPORTED: lldb-api :: api/multiple-debuggers/TestMultipleDebuggers.py (1044 of 1785) PASS: lldb-api :: functionalities/tsan/thread_numbers/TestTsanThreadNumbers.py (1045 of 1785) PASS: lldb-unit :: Utility/./UtilityTests/ArgsTest.TestSingleArg (1046 of 1785) PASS: lldb-api :: functionalities/tail_call_frames/disambiguate_paths_to_common_sink/TestDisambiguatePathsToCommonSink.py (1047 of 1785) PASS: lldb-shell :: Driver/TestRepl.test (1048 of 1785) PASS: lldb-unit :: Utility/./UtilityTests/UriParserTest.SchemeHostSeparator (1049 of 1785) PASS: lldb-unit :: Utility/./UtilityTests/OptionsWithRawTest.WhitespaceInput (1050 of 1785) PASS: lldb-api :: functionalities/thread/concurrent_events/TestConcurrentTwoWatchpointThreads.py (1051 of 1785) PASS: lldb-unit :: Utility/./UtilityTests/AnsiTerminal.AtEnd (1052 of 1785) PASS: lldb-unit :: Expression/./ExpressionTests/CppModuleConfigurationTest.IgnoreLibStdCpp (1053 of 1785) PASS: lldb-shell :: ObjectFile/ELF/PT_LOAD-overlap-PT_INTERP.yaml (1054 of 1785) PASS: lldb-shell :: ObjectFile/ELF/PT_TLS-overlap-PT_LOAD.yaml (1055 of 1785) PASS: lldb-shell :: Register/x86-64-ymm-read.test (1056 of 1785) PASS: lldb-api :: tools/lldb-server/TestGdbRemoteExitCode.py (1057 of 1785) PASS: lldb-unit :: ObjectFile/PECOFF/./ObjectFilePECOFFTests/PECallFrameInfoTest.Frame_reg_eh (1058 of 1785) PASS: lldb-api :: lang/objc/objc-ivar-protocols/TestIvarProtocols.py (1059 of 1785) PASS: lldb-api :: commands/expression/po_verbosity/TestPoVerbosity.py (1060 of 1785) PASS: lldb-unit :: Host/./HostTests/TaskPoolTest.RunTasks (1061 of 1785) PASS: lldb-api :: sanity/TestModuleCacheSanity.py (1062 of 1785) UNSUPPORTED: lldb-api :: functionalities/darwin_log/filter/exact_match/subsystem/TestDarwinLogFilterMatchSubsystem.py (1063 of 1785) PASS: lldb-api :: functionalities/thread/concurrent_events/TestConcurrentTwoBreakpointsOneDelaySignal.py (1064 of 1785) PASS: lldb-shell :: SymbolFile/Breakpad/unwind-via-raSearch.test (1065 of 1785) PASS: lldb-api :: functionalities/data-formatter/typedef_array/TestTypedefArray.py (1066 of 1785) PASS: lldb-unit :: Interpreter/./InterpreterTests/CompletionTest.DirCompletionUsername (1067 of 1785) PASS: lldb-unit :: Process/gdb-remote/./ProcessGdbRemoteTests/GDBRemoteCommunicationClientTest.SendGetMetaDataPacket (1068 of 1785) PASS: lldb-api :: functionalities/rerun/TestRerun.py (1069 of 1785) PASS: lldb-api :: api/listeners/TestListener.py (1070 of 1785) UNSUPPORTED: lldb-api :: functionalities/data-formatter/data-formatter-stl/libstdcpp/smart_ptr/TestDataFormatterStdSmartPtr.py (1071 of 1785) PASS: lldb-unit :: ObjectFile/Breakpad/./ObjectFileBreakpadTests/ModuleRecord.parse (1072 of 1785) PASS: lldb-unit :: Utility/./UtilityTests/NameMatchesTest.Contains (1073 of 1785) PASS: lldb-unit :: Utility/./UtilityTests/ScalarTest.ComparisonFloat (1074 of 1785) PASS: lldb-api :: functionalities/thread/backtrace_limit/TestBacktraceLimit.py (1075 of 1785) PASS: lldb-api :: commands/expression/options/TestExprOptions.py (1076 of 1785) PASS: lldb-unit :: Utility/./UtilityTests/StreamTeeTest.DefaultConstructor (1077 of 1785) PASS: lldb-shell :: SymbolFile/NativePDB/globals-bss.cpp (1078 of 1785) PASS: lldb-unit :: Utility/./UtilityTests/StreamTest.PutCharWhitespace (1079 of 1785) PASS: lldb-shell :: Reproducer/Functionalities/TestImageList.test (1080 of 1785) PASS: lldb-api :: commands/expression/calculator_mode/TestCalculatorMode.py (1081 of 1785) PASS: lldb-unit :: Utility/./UtilityTests/StringExtractorTest.DecodeHexU8_InvalidHex (1082 of 1785) PASS: lldb-unit :: Host/./HostTests/FileSystemTest.Readable (1083 of 1785) PASS: lldb-unit :: ScriptInterpreter/Python/./ScriptInterpreterPythonTests/PythonDataObjectsTest.TestPythonCallableCheck (1084 of 1785) PASS: lldb-api :: functionalities/gdb_remote_client/TestRestartBug.py (1085 of 1785) UNSUPPORTED: lldb-shell :: SymbolFile/PDB/ast-restore.test (1086 of 1785) PASS: lldb-api :: functionalities/param_entry_vals/basic_entry_values_x86_64/TestBasicEntryValuesX86_64.py (1087 of 1785) PASS: lldb-api :: python_api/sbvalue_persist/TestSBValuePersist.py (1088 of 1785) UNSUPPORTED: lldb-shell :: ObjectFile/ELF/minidebuginfo-set-and-hit-breakpoint.test (1089 of 1785) PASS: lldb-unit :: Process/gdb-remote/./ProcessGdbRemoteTests/GDBRemoteCommunicationClientTest.SendStopTracePacket (1090 of 1785) PASS: lldb-api :: lang/objc/modules-inline-functions/TestModulesInlineFunctions.py (1091 of 1785) PASS: lldb-shell :: SymbolFile/Breakpad/line-table-missing-file.test (1092 of 1785) PASS: lldb-unit :: Utility/./UtilityTests/StreamTest.ShiftOperatorChars (1093 of 1785) PASS: lldb-unit :: Utility/./UtilityTests/BinaryStreamTest.PutSLEB128SevenBytes (1094 of 1785) PASS: lldb-shell :: ObjectFile/ELF/gnu-debuglink.yaml (1095 of 1785) PASS: lldb-unit :: Language/Highlighting/./HighlighterTests/HighlighterTest.ClangCursorPosEndOfLine (1096 of 1785) PASS: lldb-api :: functionalities/thread/concurrent_events/TestConcurrentTwoBreakpointsOneSignal.py (1097 of 1785) PASS: lldb-unit :: UnwindAssembly/x86/./UnwindAssemblyx86Tests/Testx86AssemblyInspectionEngine.TestPushEBP (1098 of 1785) PASS: lldb-api :: python_api/interpreter/TestCommandInterpreterAPI.py (1099 of 1785) PASS: lldb-api :: commands/expression/call-overridden-method/TestCallOverriddenMethod.py (1100 of 1785) UNSUPPORTED: lldb-shell :: SymbolFile/PDB/function-level-linking.test (1101 of 1785) PASS: lldb-unit :: Utility/./UtilityTests/Predicate.WaitForValueEqualTo (1102 of 1785) PASS: lldb-api :: lang/objc/objc-new-syntax/TestObjCNewSyntaxDictionary.py (1103 of 1785) PASS: lldb-api :: functionalities/asan/TestReportData.py (1104 of 1785) PASS: lldb-unit :: SymbolFile/NativePDB/./SymbolFileNativePDBTests/PDBFPOProgramToDWARFExpressionTests.InvalidOpUnary (1105 of 1785) UNSUPPORTED: lldb-api :: functionalities/darwin_log/filter/exact_match/message/TestDarwinLogFilterMatchMessage.py (1106 of 1785) PASS: lldb-api :: functionalities/breakpoint/cpp/TestCPPBreakpointLocations.py (1107 of 1785) PASS: lldb-unit :: ScriptInterpreter/Python/./ScriptInterpreterPythonTests/PythonDataObjectsTest.TestPythonTupleInitializerList (1108 of 1785) UNSUPPORTED: lldb-shell :: Register/x86-gp-read.test (1109 of 1785) PASS: lldb-unit :: ScriptInterpreter/Python/./ScriptInterpreterPythonTests/PythonDataObjectsTest.TestPythonTupleValues (1110 of 1785) PASS: lldb-unit :: Symbol/./SymbolTests/LineEntryTest.GetSameLineContiguousAddressRangeOneInline (1111 of 1785) PASS: lldb-unit :: Process/minidump/./LLDBMinidumpTests/MinidumpParserTest.GetFilteredModuleList (1112 of 1785) PASS: lldb-shell :: Host/TestCustomShell.test (1113 of 1785) PASS: lldb-unit :: Utility/./UtilityTests/StreamTest.PutNHex8 (1114 of 1785) PASS: lldb-api :: linux/builtin_trap/TestBuiltinTrap.py (1115 of 1785) PASS: lldb-unit :: Process/minidump/./LLDBMinidumpTests/MinidumpParserTest.GetMiscInfo_no_stream (1116 of 1785) PASS: lldb-unit :: Utility/./UtilityTests/SerializationRountripTest.SerializeDeserializeCString (1117 of 1785) PASS: lldb-api :: functionalities/archives/TestBSDArchives.py (1118 of 1785) PASS: lldb-shell :: ObjectFile/PECOFF/basic-info-arm.yaml (1119 of 1785) PASS: lldb-shell :: SymbolFile/DWARF/array-sizes.s (1120 of 1785) PASS: lldb-api :: functionalities/breakpoint/source_regexp/TestSourceRegexBreakpoints.py (1121 of 1785) PASS: lldb-api :: functionalities/paths/TestPaths.py (1122 of 1785) PASS: lldb-api :: lang/objc/objc-class-method/TestObjCClassMethod.py (1123 of 1785) PASS: lldb-unit :: Utility/./UtilityTests/StringListTest.AppendListCStringArray (1124 of 1785) PASS: lldb-unit :: Utility/./UtilityTests/Flags.Reset (1125 of 1785) PASS: lldb-api :: driver/batch_mode/TestBatchMode.py (1126 of 1785) PASS: lldb-unit :: Utility/./UtilityTests/RangeTest.ContainsEndInclusive (1127 of 1785) PASS: lldb-unit :: Process/minidump/./LLDBMinidumpTests/MinidumpParserTest.GetMemory (1128 of 1785) PASS: lldb-unit :: Utility/./UtilityTests/BinaryStreamTest.PutSLEB128One (1129 of 1785) PASS: lldb-unit :: UnwindAssembly/x86/./UnwindAssemblyx86Tests/Testx86AssemblyInspectionEngine.TestPushR13 (1130 of 1785) PASS: lldb-unit :: debugserver/./debugserverTests/RNBSocket.LoopBackConnectIPv6 (1131 of 1785) PASS: lldb-api :: api/command-return-object/TestSBCommandReturnObject.py (1132 of 1785) UNSUPPORTED: lldb-api :: tools/lldb-vscode/attach/TestVSCode_attach.py (1133 of 1785) PASS: lldb-shell :: ObjectFile/ELF/base-address.yaml (1134 of 1785) PASS: lldb-api :: functionalities/data-formatter/hexcaps/TestDataFormatterHexCaps.py (1135 of 1785) PASS: lldb-unit :: SymbolFile/DWARF/./SymbolFileDWARFTests/SymbolFileDWARFTests.TestAbbrevOrder1Start5 (1136 of 1785) PASS: lldb-api :: functionalities/tail_call_frames/thread_step_out_message/TestArtificialFrameStepOutMessage.py (1137 of 1785) PASS: lldb-unit :: Utility/./UtilityTests/ProcessInstanceInfo.Dump (1138 of 1785) PASS: lldb-unit :: Process/minidump/./LLDBMinidumpTests/MinidumpParserTest.GetLinuxProcStatus (1139 of 1785) PASS: lldb-unit :: ObjectFile/Breakpad/./ObjectFileBreakpadTests/LineRecord.parse (1140 of 1785) PASS: lldb-unit :: Utility/./UtilityTests/StringListTest.GetMaxStringLengthIncreasingSize (1141 of 1785) PASS: lldb-unit :: UnwindAssembly/x86/./UnwindAssemblyx86Tests/Testx86AssemblyInspectionEngine.TestSimple64bitFrameFunction (1142 of 1785) PASS: lldb-unit :: Process/minidump/./LLDBMinidumpTests/MinidumpParserTest.GetArchitecture (1143 of 1785) PASS: lldb-api :: api/multithreaded/TestMultithreaded.py (1144 of 1785) PASS: lldb-unit :: SymbolFile/DWARF/./SymbolFileDWARFTests/SymbolFileDWARFTests.TestAbbrevNullAttrValidForm (1145 of 1785) PASS: lldb-api :: python_api/lldbutil/process/TestPrintStackTraces.py (1146 of 1785) PASS: lldb-api :: commands/expression/namespace_local_var_same_name_cpp_and_c/TestNamespaceLocalVarSameNameCppAndC.py (1147 of 1785) UNSUPPORTED: lldb-api :: lang/c/typedef/Testtypedef.py (1148 of 1785) PASS: lldb-unit :: Process/gdb-remote/./ProcessGdbRemoteTests/GDBRemoteClientBaseTest.SendPacketAndReceiveResponseWithOutputSupport (1149 of 1785) PASS: lldb-api :: functionalities/thread/concurrent_events/TestConcurrentTwoWatchpointsOneBreakpoint.py (1150 of 1785) PASS: lldb-api :: functionalities/memory/cache/TestMemoryCache.py (1151 of 1785) PASS: lldb-api :: commands/expression/persist_objc_pointeetype/TestPersistObjCPointeeType.py (1152 of 1785) PASS: lldb-api :: functionalities/thread/concurrent_events/TestConcurrentSignalWatchBreak.py (1153 of 1785) PASS: lldb-api :: functionalities/thread/concurrent_events/TestConcurrentCrashWithWatchpoint.py (1154 of 1785) PASS: lldb-shell :: Reproducer/TestDriverOptions.test (1155 of 1785) PASS: lldb-api :: python_api/sblaunchinfo/TestSBLaunchInfo.py (1156 of 1785) PASS: lldb-unit :: Symbol/./SymbolTests/Type.GetTypeScopeAndBasename (1157 of 1785) PASS: lldb-unit :: Utility/./UtilityTests/BinaryStreamTest.PutULEB128One (1158 of 1785) PASS: lldb-unit :: Utility/./UtilityTests/StringLexerTest.PutBack (1159 of 1785) PASS: lldb-api :: commands/settings/quoting/TestQuoting.py (1160 of 1785) PASS: lldb-api :: commands/reproducer/invalid-args/TestInvalidArgsReproducer.py (1161 of 1785) PASS: lldb-api :: python_api/process/TestProcessAPI.py (1162 of 1785) PASS: lldb-unit :: SymbolFile/NativePDB/./SymbolFileNativePDBTests/PDBFPOProgramToDWARFExpressionTests.MultipleDependentAssignments (1163 of 1785) PASS: lldb-unit :: UnwindAssembly/x86/./UnwindAssemblyx86Tests/Testx86AssemblyInspectionEngine.TestPopEBX (1164 of 1785) PASS: lldb-api :: commands/frame/diagnose/local-variable/TestLocalVariable.py (1165 of 1785) PASS: lldb-unit :: ScriptInterpreter/Python/./ScriptInterpreterPythonTests/PythonDataObjectsTest.TestPythonIntegerToStr (1166 of 1785) PASS: lldb-api :: tools/lldb-server/TestGdbRemoteSingleStep.py (1167 of 1785) PASS: lldb-unit :: Utility/./UtilityTests/ArgsTest.TestArgv (1168 of 1785) PASS: lldb-api :: functionalities/gdb_remote_client/TestStopPCs.py (1169 of 1785) PASS: lldb-shell :: ObjectFile/ELF/short-build-id.yaml (1170 of 1785) PASS: lldb-api :: lang/objc/objc-builtin-types/TestObjCBuiltinTypes.py (1171 of 1785) PASS: lldb-unit :: Utility/./UtilityTests/StreamTest.QuotedCString (1172 of 1785) PASS: lldb-unit :: Utility/./UtilityTests/FileSpecTest.EqualDotsPosixRoot (1173 of 1785) PASS: lldb-unit :: Utility/./UtilityTests/StringExtractorTest.GetHexU8_Underflow2 (1174 of 1785) PASS: lldb-unit :: ScriptInterpreter/Python/./ScriptInterpreterPythonTests/PythonDataObjectsTest.TestPythonByteArray (1175 of 1785) PASS: lldb-unit :: Utility/./UtilityTests/StringListTest.ShiftStdString (1176 of 1785) PASS: lldb-api :: functionalities/data-formatter/pyobjsynthprovider/TestPyObjSynthProvider.py (1177 of 1785) PASS: lldb-api :: functionalities/data-formatter/data-formatter-objc/TestDataFormatterObjCNSDate.py (1178 of 1785) PASS: lldb-unit :: ScriptInterpreter/Python/./ScriptInterpreterPythonTests/PythonDataObjectsTest.TestPythonStringToStructuredString (1179 of 1785) PASS: lldb-unit :: UnwindAssembly/x86/./UnwindAssemblyx86Tests/Testx86AssemblyInspectionEngine.TestSimplei386ugmented (1180 of 1785) PASS: lldb-api :: lang/objc/ptr_refs/TestPtrRefsObjC.py (1181 of 1785) UNSUPPORTED: lldb-api :: functionalities/darwin_log/filter/exact_match/activity-chain/TestDarwinLogFilterMatchActivityChain.py (1182 of 1785) PASS: lldb-unit :: Signals/./SignalsTests/UnixSignalsTest.Iteration (1183 of 1785) PASS: lldb-unit :: Utility/./UtilityTests/StreamTeeTest.SetStreamAtIndexOutOfBounds (1184 of 1785) PASS: lldb-api :: commands/command/delete/TestCommandDelete.py (1185 of 1785) PASS: lldb-shell :: Reproducer/TestReuseDirectory.test (1186 of 1785) PASS: lldb-shell :: SymbolFile/DWARF/dwarf5_locations.s (1187 of 1785) PASS: lldb-unit :: Utility/./UtilityTests/ArgsTest.ReplaceArgumentAtIndexFarOutOfRange (1188 of 1785) UNSUPPORTED: lldb-api :: functionalities/unwind/ehframe/TestEhFrameUnwind.py (1189 of 1785) PASS: lldb-unit :: Signals/./SignalsTests/UnixSignalsTest.VersionChange (1190 of 1785) PASS: lldb-api :: functionalities/data-formatter/nsdictionarysynth/TestNSDictionarySynthetic.py (1191 of 1785) PASS: lldb-unit :: Process/minidump/./LLDBMinidumpTests/MinidumpParserTest.GetThreadsAndGetThreadContext (1192 of 1785) PASS: lldb-unit :: Utility/./UtilityTests/BinaryStreamTest.PutSLEB128SixBytes (1193 of 1785) PASS: lldb-unit :: Utility/./UtilityTests/RangeTest.DoesAdjoinOrIntersect (1194 of 1785) PASS: lldb-api :: commands/expression/inline-namespace/TestInlineNamespace.py (1195 of 1785) UNSUPPORTED: lldb-api :: functionalities/darwin_log/filter/regex/activity-chain/TestDarwinLogFilterRegexActivityChain.py (1196 of 1785) PASS: lldb-api :: lang/cpp/signed_types/TestSignedTypes.py (1197 of 1785) PASS: lldb-api :: functionalities/thread/concurrent_events/TestConcurrentCrashWithSignal.py (1198 of 1785) PASS: lldb-api :: functionalities/dynamic_value_child_count/TestDynamicValueChildCount.py (1199 of 1785) PASS: lldb-unit :: Utility/./UtilityTests/RangeTest.Equal (1200 of 1785) PASS: lldb-api :: functionalities/thread/concurrent_events/TestConcurrentSignalDelayWatch.py (1201 of 1785) PASS: lldb-api :: functionalities/type_lookup/TestTypeLookup.py (1202 of 1785) PASS: lldb-api :: functionalities/thread/concurrent_events/TestConcurrentManyCrash.py (1203 of 1785) PASS: lldb-api :: commands/expression/import-std-module/stack/TestStack.py (1204 of 1785) PASS: lldb-unit :: UnwindAssembly/x86/./UnwindAssemblyx86Tests/Testx86AssemblyInspectionEngine.TestSubESP (1205 of 1785) PASS: lldb-api :: lang/objc/single-entry-dictionary/TestObjCSingleEntryDictionary.py (1206 of 1785) PASS: lldb-api :: functionalities/data-formatter/data-formatter-smart-array/TestDataFormatterSmartArray.py (1207 of 1785) PASS: lldb-shell :: Settings/TestFrameFormatNoColor.test (1208 of 1785) PASS: lldb-unit :: Host/./HostTests/FileSystemTest.FileAndDirectoryComponents (1209 of 1785) PASS: lldb-unit :: Utility/./UtilityTests/BinaryStreamTest.PutSLEB128FiveBytes (1210 of 1785) PASS: lldb-unit :: Utility/./UtilityTests/LogTest.LLDB_LOG_nullptr (1211 of 1785) UNSUPPORTED: lldb-api :: functionalities/breakpoint/hardware_breakpoints/hardware_breakpoint_on_multiple_threads/TestHWBreakMultiThread.py (1212 of 1785) PASS: lldb-api :: commands/process/launch/TestProcessLaunch.py (1213 of 1785) PASS: lldb-api :: commands/log/invalid-args/TestInvalidArgsLog.py (1214 of 1785) PASS: lldb-api :: commands/expression/rdar42038760/TestScalarURem.py (1215 of 1785) PASS: lldb-unit :: Expression/./ExpressionTests/CppModuleConfigurationTest.UnrelatedLibrary (1216 of 1785) PASS: lldb-api :: commands/expression/fixits/TestFixIts.py (1217 of 1785) PASS: lldb-api :: macosx/order/TestOrderFile.py (1218 of 1785) PASS: lldb-unit :: Utility/./UtilityTests/StatusTest.Formatv (1219 of 1785) PASS: lldb-shell :: Quit/TestQuitExitCodeImplicit0.test (1220 of 1785) PASS: lldb-shell :: SymbolFile/DWARF/dwarf5-index-is-used.cpp (1221 of 1785) PASS: lldb-unit :: Process/minidump/./LLDBMinidumpTests/RegisterContextMinidump.CheckRegisterContextMinidump_ARM (1222 of 1785) PASS: lldb-unit :: ObjectFile/Breakpad/./ObjectFileBreakpadTests/InfoRecord.parse (1223 of 1785) PASS: lldb-api :: commands/expression/import-std-module/vector-bool/TestBoolVector.py (1224 of 1785) PASS: lldb-api :: macosx/find-app-in-bundle/TestFindAppInBundle.py (1225 of 1785) PASS: lldb-unit :: SymbolFile/DWARF/./SymbolFileDWARFTests/SymbolFileDWARFTests.TestAbbrevInvalidNULLTag (1226 of 1785) UNSUPPORTED: lldb-shell :: Unwind/eh-frame-small-fde.test (1227 of 1785) PASS: lldb-unit :: Utility/./UtilityTests/UserIDResolver.GetGroupName (1228 of 1785) PASS: lldb-unit :: ObjectFile/Breakpad/./ObjectFileBreakpadTests/StackCFIRecord.parse (1229 of 1785) PASS: lldb-api :: python_api/frame/TestFrames.py (1230 of 1785) PASS: lldb-unit :: Process/gdb-remote/./ProcessGdbRemoteTests/GDBRemoteClientBaseTest.SendContinueAndWait (1231 of 1785) UNSUPPORTED: lldb-api :: functionalities/thread/break_after_join/TestBreakAfterJoin.py (1232 of 1785) PASS: lldb-api :: lang/c/struct_types/TestStructTypes.py (1233 of 1785) PASS: lldb-unit :: Utility/./UtilityTests/StringListTest.InsertStringAtIndexStdString (1234 of 1785) PASS: lldb-unit :: Utility/./UtilityTests/StringListTest.AppendStringMove (1235 of 1785) PASS: lldb-api :: python_api/watchpoint/TestWatchpointIter.py (1236 of 1785) PASS: lldb-unit :: Expression/./ExpressionTests/CppModuleConfigurationTest.LibCppV2 (1237 of 1785) PASS: lldb-unit :: ScriptInterpreter/Python/./ScriptInterpreterPythonTests/PythonDataObjectsTest.TestPythonListManipulation (1238 of 1785) UNSUPPORTED: lldb-api :: android/platform/TestDefaultCacheLineSize.py (1239 of 1785) PASS: lldb-unit :: debugserver/./debugserverTests/RNBSocket.LoopBackConnectIPv4 (1240 of 1785) UNSUPPORTED: lldb-api :: functionalities/data-formatter/data-formatter-stl/libstdcpp/tuple/TestDataFormatterStdTuple.py (1241 of 1785) PASS: lldb-unit :: Utility/./UtilityTests/UUIDTest.RelationalOperators (1242 of 1785) PASS: lldb-shell :: Quit/TestQuitExitCodeNonInt.test (1243 of 1785) PASS: lldb-unit :: UnwindAssembly/x86/./UnwindAssemblyx86Tests/Testx86AssemblyInspectionEngine.TestPushECX (1244 of 1785) UNSUPPORTED: lldb-api :: functionalities/breakpoint/breakpoint_in_delayslot/TestAvoidBreakpointInDelaySlot.py (1245 of 1785) PASS: lldb-unit :: Host/./HostTests/NativeProcessProtocolTest.ReadCStringFromMemory (1246 of 1785) PASS: lldb-api :: lang/objc/foundation/TestObjCMethodsNSError.py (1247 of 1785) PASS: lldb-api :: lang/cpp/stl/TestStdCXXDisassembly.py (1248 of 1785) PASS: lldb-api :: functionalities/breakpoint/require_hw_breakpoints/TestRequireHWBreakpoints.py (1249 of 1785) PASS: lldb-unit :: Host/./HostTests/NativeProcessProtocolTest.ReadCStringFromMemory_CrossPageBoundary (1250 of 1785) PASS: lldb-api :: functionalities/breakpoint/scripted_bkpt/TestScriptedResolver.py (1251 of 1785) PASS: lldb-api :: functionalities/postmortem/minidump-new/TestMiniDumpUUID.py (1252 of 1785) PASS: lldb-api :: functionalities/postmortem/mach-core/TestMachCore.py (1253 of 1785) PASS: lldb-api :: functionalities/postmortem/elf-core/thread_crash/TestLinuxCoreThreads.py (1254 of 1785) PASS: lldb-unit :: Utility/./UtilityTests/StreamTest.PutCharNull (1255 of 1785) PASS: lldb-api :: functionalities/data-formatter/data-formatter-stl/libcxx/set/TestDataFormatterLibcxxSet.py (1256 of 1785) PASS: lldb-shell :: Breakpoint/split-dwarf-5-addrbase.test (1257 of 1785) PASS: lldb-api :: lang/cpp/namespace/TestNamespace.py (1258 of 1785) PASS: lldb-unit :: ScriptInterpreter/Python/./ScriptInterpreterPythonTests/PythonDataObjectsTest.TestPythonListValueEquality (1259 of 1785) PASS: lldb-unit :: tools/lldb-server/tests/./LLDBServerTests/TestBase.LaunchModePreservesEnvironment (1260 of 1785) UNSUPPORTED: lldb-api :: functionalities/thread/create_during_step/TestCreateDuringStep.py (1261 of 1785) PASS: lldb-api :: functionalities/data-formatter/data-formatter-stl/libcxx/queue/TestDataFormatterLibcxxQueue.py (1262 of 1785) PASS: lldb-unit :: Process/gdb-remote/./ProcessGdbRemoteTests/GDBRemoteClientBaseTest.SendContinueAndAsyncSignal (1263 of 1785) PASS: lldb-unit :: SymbolFile/NativePDB/./SymbolFileNativePDBTests/PDBFPOProgramToDWARFExpressionTests.UnresolvedRegisterAssignmentReference (1264 of 1785) PASS: lldb-unit :: Utility/./UtilityTests/DataExtractorTest.GetCStrAtEnd (1265 of 1785) PASS: lldb-shell :: BuildScript/modes.test (1266 of 1785) UNSUPPORTED: lldb-shell :: SymbolFile/PDB/udt-layout.test (1267 of 1785) PASS: lldb-unit :: ScriptInterpreter/Python/./ScriptInterpreterPythonTests/PythonDataObjectsTest.TestBorrowedReferences (1268 of 1785) PASS: lldb-api :: lang/objc/objc-struct-argument/TestObjCStructArgument.py (1269 of 1785) PASS: lldb-api :: lang/cpp/unicode-literals/TestUnicodeLiterals.py (1270 of 1785) PASS: lldb-shell :: SymbolFile/Breakpad/line-table-mixed-path-styles.test (1271 of 1785) PASS: lldb-unit :: Utility/./UtilityTests/RangeTest.ContainsRange (1272 of 1785) PASS: lldb-unit :: Utility/./UtilityTests/RangeDataVector.FindEntryThatContains_Overlap (1273 of 1785) PASS: lldb-unit :: UnwindAssembly/x86/./UnwindAssemblyx86Tests/Testx86AssemblyInspectionEngine.Test64bitFramelessSmallStackFrame (1274 of 1785) PASS: lldb-unit :: Utility/./UtilityTests/SerializationRountripTest.SerializeDeserializePodPointers (1275 of 1785) PASS: lldb-api :: functionalities/data-formatter/data-formatter-synth/TestDataFormatterSynth.py (1276 of 1785) PASS: lldb-unit :: Utility/./UtilityTests/LogChannelEnabledTest.LogGetLogThread (1277 of 1785) PASS: lldb-api :: commands/expression/import-std-module/vector-basic/TestBasicVector.py (1278 of 1785) PASS: lldb-shell :: Quit/TestQuitExitCode30.test (1279 of 1785) PASS: lldb-api :: macosx/queues/TestQueues.py (1280 of 1785) PASS: lldb-api :: functionalities/inferior-crashing/recursive-inferior/TestRecursiveInferior.py (1281 of 1785) PASS: lldb-api :: functionalities/modern-type-lookup/libcxx/TestLibCxxModernTypeLookup.py (1282 of 1785) PASS: lldb-shell :: ObjectFile/ELF/compressed-sections.yaml (1283 of 1785) PASS: lldb-api :: lang/cpp/template/TestTemplateArgs.py (1284 of 1785) UNSUPPORTED: lldb-api :: tools/lldb-server/platform-process-connect/TestPlatformProcessConnect.py (1285 of 1785) PASS: lldb-api :: functionalities/data-formatter/data-formatter-ptr-to-array/TestPtrToArrayFormatting.py (1286 of 1785) PASS: lldb-api :: lang/objc/radar-9691614/TestObjCMethodReturningBOOL.py (1287 of 1785) PASS: lldb-api :: functionalities/modern-type-lookup/objc-modules/TestObjModulesModernTypeLookup.py (1288 of 1785) PASS: lldb-unit :: Utility/./UtilityTests/ArgsTest.ReplaceArgumentAtIndexShort (1289 of 1785) PASS: lldb-shell :: SymbolFile/DWARF/debug-types-address-ranges.s (1290 of 1785) PASS: lldb-unit :: UnwindAssembly/x86/./UnwindAssemblyx86Tests/Testx86AssemblyInspectionEngine.TestPushEDI (1291 of 1785) PASS: lldb-api :: functionalities/breakpoint/breakpoint_hit_count/TestBreakpointHitCount.py (1292 of 1785) PASS: lldb-api :: lang/c/tls_globals/TestTlsGlobals.py (1293 of 1785) PASS: lldb-api :: commands/expression/radar_9673664/TestExprHelpExamples.py (1294 of 1785) PASS: lldb-api :: lang/objc/objc-new-syntax/TestObjCNewSyntaxLiteral.py (1295 of 1785) PASS: lldb-unit :: Process/gdb-remote/./ProcessGdbRemoteTests/GDBRemoteCommunicationClientTest.SendGetTraceConfigPacket (1296 of 1785) PASS: lldb-unit :: UnwindAssembly/x86/./UnwindAssemblyx86Tests/Testx86AssemblyInspectionEngine.TestSpArithx86_64Augmented (1297 of 1785) PASS: lldb-api :: tools/lldb-server/TestAppleSimulatorOSType.py (1298 of 1785) PASS: lldb-api :: functionalities/data-formatter/data-formatter-objc/TestDataFormatterObjCNSContainer.py (1299 of 1785) PASS: lldb-api :: functionalities/breakpoint/address_breakpoints/TestAddressBreakpoints.py (1300 of 1785) PASS: lldb-api :: functionalities/data-formatter/data-formatter-stl/libcxx/multimap/TestDataFormatterLibccMultiMap.py (1301 of 1785) PASS: lldb-unit :: ScriptInterpreter/Python/./ScriptInterpreterPythonTests/PythonDataObjectsTest.TestGlobalNameResolutionWithDot (1302 of 1785) UNSUPPORTED: lldb-shell :: Unwind/unwind-plan-dwarf-dump.test (1303 of 1785) PASS: lldb-api :: lang/objc/exceptions/TestObjCExceptions.py (1304 of 1785) PASS: lldb-unit :: Utility/./UtilityTests/RangeTest.ClearWithStarAddress (1305 of 1785) PASS: lldb-unit :: SymbolFile/DWARF/./SymbolFileDWARFTests/SymbolFileDWARFTests.TestAbbrevOrder1Start1 (1306 of 1785) PASS: lldb-api :: python_api/disassemble-raw-data/TestDisassembleRawData.py (1307 of 1785) PASS: lldb-api :: functionalities/inferior-changed/TestInferiorChanged.py (1308 of 1785) UNSUPPORTED: lldb-api :: tools/lldb-vscode/variables/TestVSCode_variables.py (1309 of 1785) PASS: lldb-api :: functionalities/step-avoids-no-debug/TestStepNoDebug.py (1310 of 1785) PASS: lldb-api :: functionalities/data-formatter/data-formatter-stl/libstdcpp/unique_ptr/invalid/TestDataFormatterInvalidStdUniquePtr.py (1311 of 1785) PASS: lldb-api :: commands/command/invalid-args/TestInvalidArgsCommand.py (1312 of 1785) UNSUPPORTED: lldb-api :: functionalities/darwin_log/filter/exact_match/category/TestDarwinLogFilterMatchCategory.py (1313 of 1785) PASS: lldb-api :: functionalities/data-formatter/data-formatter-stl/libcxx/atomic/TestLibCxxAtomic.py (1314 of 1785) PASS: lldb-unit :: Utility/./UtilityTests/StringExtractorTest.GetHexU8_Extra (1315 of 1785) PASS: lldb-unit :: Host/./HostTests/NativeProcessProtocolTest.SetBreakpointFailWrite (1316 of 1785) PASS: lldb-api :: python_api/sbstructureddata/TestStructuredDataAPI.py (1317 of 1785) PASS: lldb-unit :: Utility/./UtilityTests/FileSpecTest.RemoveLastPathComponent (1318 of 1785) PASS: lldb-api :: functionalities/thread/concurrent_events/TestConcurrentDelaySignalWatch.py (1319 of 1785) PASS: lldb-unit :: Target/./TargetTests/ExecutionContextTest.GetByteOrder (1320 of 1785) PASS: lldb-unit :: Utility/./UtilityTests/BinaryStreamTest.PutSLEB128EightBytes (1321 of 1785) PASS: lldb-api :: functionalities/data-formatter/data-formatter-proper-plurals/TestFormattersOneIsSingular.py (1322 of 1785) PASS: lldb-unit :: ScriptInterpreter/Python/./ScriptInterpreterPythonTests/PythonExceptionStateTest.TestResetSemantics (1323 of 1785) PASS: lldb-api :: commands/watchpoints/watchpoint_events/TestWatchpointEvents.py (1324 of 1785) PASS: lldb-unit :: SymbolFile/NativePDB/./SymbolFileNativePDBTests/PDBFPOProgramToDWARFExpressionTests.SingleAssignmentRegisterRef (1325 of 1785) PASS: lldb-shell :: Unwind/trap_frame_sym_ctx.test (1326 of 1785) PASS: lldb-api :: commands/expression/cast_int_to_anonymous_enum/TestCastIntToAnonymousEnum.py (1327 of 1785) UNSUPPORTED: lldb-shell :: SymbolFile/PDB/function-nested-block.test (1328 of 1785) PASS: lldb-unit :: UnwindAssembly/x86/./UnwindAssemblyx86Tests/Testx86AssemblyInspectionEngine.TestPopR14 (1329 of 1785) PASS: lldb-shell :: SymbolFile/DWARF/find-method-local-struct.cpp (1330 of 1785) PASS: lldb-api :: functionalities/load_unload/TestLoadUnload.py (1331 of 1785) PASS: lldb-api :: python_api/sbdata/TestSBData.py (1332 of 1785) PASS: lldb-unit :: Utility/./UtilityTests/LogChannelTest.Disable (1333 of 1785) PASS: lldb-api :: functionalities/data-formatter/data-formatter-disabling/TestDataFormatterDisabling.py (1334 of 1785) PASS: lldb-api :: commands/expression/persistent_ptr_update/TestPersistentPtrUpdate.py (1335 of 1785) PASS: lldb-shell :: Reproducer/TestSynchronous.test (1336 of 1785) PASS: lldb-unit :: Utility/./UtilityTests/StringListTest.ForRangeEmpty (1337 of 1785) PASS: lldb-shell :: SymbolFile/DWARF/forward-declarations.s (1338 of 1785) PASS: lldb-shell :: SymbolFile/DWARF/split-dwarf-inlining.cpp (1339 of 1785) PASS: lldb-unit :: Utility/./UtilityTests/OptionsWithRawTest.SingleWordSuffix (1340 of 1785) PASS: lldb-api :: commands/statistics/basic/TestStats.py (1341 of 1785) PASS: lldb-unit :: Utility/./UtilityTests/StringLexerTest.GetUnlexed (1342 of 1785) PASS: lldb-api :: functionalities/data-formatter/var-in-aggregate-misuse/TestVarInAggregateMisuse.py (1343 of 1785) PASS: lldb-unit :: Language/Highlighting/./HighlighterTests/HighlighterTest.ClangCursorPosBeforeOtherToken (1344 of 1785) PASS: lldb-unit :: Utility/./UtilityTests/UUIDTest.StringConverion (1345 of 1785) PASS: lldb-unit :: Symbol/./SymbolTests/SymbolsTest.TerminateLocateExecutableSymbolFileForUnknownExecutableAndUnknownSymbolFile (1346 of 1785) PASS: lldb-shell :: SymbolFile/DWARF/debug_ranges.s (1347 of 1785) PASS: lldb-unit :: Utility/./UtilityTests/StreamTeeTest.Assignment (1348 of 1785) PASS: lldb-unit :: Utility/./UtilityTests/ScalarTest.CastOperations (1349 of 1785) PASS: lldb-unit :: Language/CPlusPlus/./LanguageCPlusPlusTests/CPlusPlusLanguage.ExtractContextAndIdentifier (1350 of 1785) PASS: lldb-unit :: Expression/./ExpressionTests/CppModuleConfigurationTest.Linux (1351 of 1785) PASS: lldb-unit :: Utility/./UtilityTests/IndexToObjectTest.ObjectForIndex (1352 of 1785) PASS: lldb-api :: lang/objc/objc-new-syntax/TestObjCNewSyntaxArray.py (1353 of 1785) PASS: lldb-api :: python_api/watchpoint/watchlocation/TestSetWatchlocation.py (1354 of 1785) PASS: lldb-api :: functionalities/data-formatter/varscript_formatting/TestDataFormatterVarScriptFormatting.py (1355 of 1785) PASS: lldb-api :: lang/c/strings/TestCStrings.py (1356 of 1785) PASS: lldb-unit :: Utility/./UtilityTests/StringLexerTest.NextIf (1357 of 1785) PASS: lldb-api :: python_api/symbol-context/TestSymbolContext.py (1358 of 1785) PASS: lldb-shell :: ObjectFile/ELF/basic-info.yaml (1359 of 1785) PASS: lldb-shell :: SymbolFile/sizeless-symbol.test (1360 of 1785) PASS: lldb-api :: lang/objc/objc-checker/TestObjCCheckers.py (1361 of 1785) PASS: lldb-api :: lang/cpp/unique-types/TestUniqueTypes.py (1362 of 1785) PASS: lldb-unit :: Utility/./UtilityTests/StringListTest.JoinNonSpace (1363 of 1785) PASS: lldb-api :: functionalities/ptr_refs/TestPtrRefs.py (1364 of 1785) PASS: lldb-unit :: UnwindAssembly/x86/./UnwindAssemblyx86Tests/Testx86AssemblyInspectionEngine.TestSpillRegToStackViaMOVx86_64 (1365 of 1785) XFAIL: lldb-shell :: SymbolFile/DWARF/find-type-in-function.cpp (1366 of 1785) PASS: lldb-unit :: Utility/./UtilityTests/StringListTest.Clear (1367 of 1785) PASS: lldb-unit :: Utility/./UtilityTests/StringExtractorTest.GetU32BigEndian (1368 of 1785) UNSUPPORTED: lldb-api :: linux/add-symbols/TestTargetSymbolsAddCommand.py (1369 of 1785) PASS: lldb-api :: functionalities/thread/jump/TestThreadJump.py (1370 of 1785) PASS: lldb-api :: functionalities/gdb_remote_client/TestPlatformClient.py (1371 of 1785) PASS: lldb-api :: commands/expression/import-std-module/unique_ptr-dbg-info-content/TestUniquePtrDbgInfoContent.py (1372 of 1785) PASS: lldb-unit :: Expression/./ExpressionTests/CppModuleConfigurationTest.LinuxLocalLibCpp (1373 of 1785) PASS: lldb-unit :: UnwindAssembly/x86/./UnwindAssemblyx86Tests/Testx86AssemblyInspectionEngine.TestAddRSP (1374 of 1785) PASS: lldb-unit :: Host/./HostTests/FileSystemTest.EnumerateDirectory (1375 of 1785) PASS: lldb-api :: macosx/duplicate-archive-members/TestDuplicateMembers.py (1376 of 1785) UNSUPPORTED: lldb-api :: functionalities/signal/handle-segv/TestHandleSegv.py (1377 of 1785) PASS: lldb-api :: lang/c/stepping/TestStepAndBreakpoints.py (1378 of 1785) PASS: lldb-unit :: Utility/./UtilityTests/LogChannelEnabledTest.LogVerboseThread (1379 of 1785) PASS: lldb-api :: python_api/debugger/TestDebuggerAPI.py (1380 of 1785) PASS: lldb-unit :: Symbol/./SymbolTests/TestClangASTContext.TestRemoveFastQualifiers (1381 of 1785) PASS: lldb-unit :: Utility/./UtilityTests/FileSpecTest.EqualSeparator (1382 of 1785) PASS: lldb-unit :: Host/./HostTests/FileSystemTest.MakeAbsolute (1383 of 1785) PASS: lldb-api :: functionalities/tail_call_frames/disambiguate_call_site/TestDisambiguateCallSite.py (1384 of 1785) PASS: lldb-api :: commands/help/TestHelp.py (1385 of 1785) PASS: lldb-api :: macosx/universal/TestUniversal.py (1386 of 1785) PASS: lldb-api :: lang/objc/hidden-ivars/TestHiddenIvars.py (1387 of 1785) UNSUPPORTED: lldb-api :: lang/objc/bitfield_ivars/TestBitfieldIvars.py (1388 of 1785) PASS: lldb-shell :: ObjectFile/ELF/PT_LOAD.yaml (1389 of 1785) PASS: lldb-api :: tools/lldb-server/inferior-crash/TestGdbRemoteAbort.py (1390 of 1785) PASS: lldb-api :: functionalities/thread/concurrent_events/TestConcurrentBreakpointsDelayedBreakpointOneWatchpoint.py (1391 of 1785) PASS: lldb-api :: lang/objc/objc-property/TestObjCProperty.py (1392 of 1785) PASS: lldb-unit :: Process/gdb-remote/./ProcessGdbRemoteTests/GDBRemoteCommunicationClientTest.SendSignalsToIgnore (1393 of 1785) PASS: lldb-shell :: ObjectFile/ELF/PT_LOAD-overlap-section.yaml (1394 of 1785) PASS: lldb-unit :: Expression/./ExpressionTests/CppModuleConfigurationTest.AmbiguousCLib (1395 of 1785) PASS: lldb-unit :: Utility/./UtilityTests/StringExtractorTest.InitEmpty (1396 of 1785) PASS: lldb-api :: functionalities/breakpoint/breakpoint_language/TestBreakpointLanguage.py (1397 of 1785) UNSUPPORTED: lldb-api :: functionalities/thread/state/TestThreadStates.py (1398 of 1785) PASS: lldb-unit :: Expression/./ExpressionTests/DiagnosticManagerTest.GetStringBasic (1399 of 1785) PASS: lldb-unit :: Utility/./UtilityTests/ArgsTest.TestTrailingBackslash (1400 of 1785) PASS: lldb-unit :: Host/./HostTests/MainLoopTest.TerminatesImmediately (1401 of 1785) PASS: lldb-api :: lang/cpp/namespace_conflicts/TestNamespaceConflicts.py (1402 of 1785) PASS: lldb-api :: lang/cpp/dynamic-value/TestDynamicValue.py (1403 of 1785) UNSUPPORTED: lldb-api :: functionalities/data-formatter/data-formatter-stl/libcxx/function/TestLibCxxFunction.py (1404 of 1785) PASS: lldb-shell :: SymbolFile/DWARF/debug-names-compressed.cpp (1405 of 1785) PASS: lldb-unit :: Host/./HostTests/FileSystemTest.OpenErrno (1406 of 1785) PASS: lldb-shell :: Commands/command-regex-unalias.test (1407 of 1785) PASS: lldb-unit :: Host/./HostTests/File.GetStreamFromDescriptor (1408 of 1785) PASS: lldb-api :: functionalities/tsan/cpp_global_location/TestTsanCPPGlobalLocation.py (1409 of 1785) UNSUPPORTED: lldb-api :: commands/watchpoints/hello_watchlocation/TestWatchLocation.py (1410 of 1785) PASS: lldb-unit :: Utility/./UtilityTests/OptionsWithRawTest.MultiWordSuffix (1411 of 1785) PASS: lldb-shell :: Reproducer/TestDump.test (1412 of 1785) PASS: lldb-shell :: SymbolFile/Breakpad/stack-cfi-parsing.test (1413 of 1785) PASS: lldb-unit :: Language/Highlighting/./HighlighterTests/HighlighterTest.ClangCommas (1414 of 1785) PASS: lldb-unit :: Utility/./UtilityTests/OptionsWithRawTest.ArgsButNoDelimiter (1415 of 1785) PASS: lldb-unit :: Process/gdb-remote/./ProcessGdbRemoteTests/GDBRemoteCommunicationTest.ReadPacket_checksum (1416 of 1785) PASS: lldb-api :: functionalities/data-formatter/dump_dynamic/TestDumpDynamic.py (1417 of 1785) PASS: lldb-api :: functionalities/thread/concurrent_events/TestConcurrentCrashWithBreak.py (1418 of 1785) PASS: lldb-shell :: SymbolFile/NativePDB/function-types-builtins.cpp (1419 of 1785) PASS: lldb-api :: commands/command/nested_alias/TestNestedAlias.py (1420 of 1785) PASS: lldb-api :: lang/c/stepping/TestThreadStepping.py (1421 of 1785) PASS: lldb-unit :: Utility/./UtilityTests/UriParserTest.BadPort2 (1422 of 1785) PASS: lldb-api :: functionalities/postmortem/minidump/TestMiniDump.py (1423 of 1785) PASS: lldb-shell :: Driver/TestProcessAttach.test (1424 of 1785) PASS: lldb-unit :: Utility/./UtilityTests/StringListTest.GetMaxStringLengthEmpty (1425 of 1785) PASS: lldb-api :: commands/expression/import-std-module/sysroot/TestStdModuleSysroot.py (1426 of 1785) PASS: lldb-api :: functionalities/tail_call_frames/thread_step_out_or_return/TestSteppingOutWithArtificialFrames.py (1427 of 1785) PASS: lldb-unit :: Host/./HostTests/SocketTest.DecodeHostAndPort (1428 of 1785) PASS: lldb-api :: lang/objc/foundation/TestObjCMethodsNSArray.py (1429 of 1785) PASS: lldb-unit :: Utility/./UtilityTests/Flags.Test (1430 of 1785) PASS: lldb-unit :: Utility/./UtilityTests/ProcessInfoTest.Constructor (1431 of 1785) UNSUPPORTED: lldb-api :: tools/lldb-vscode/breakpoint/TestVSCode_setBreakpoints.py (1432 of 1785) PASS: lldb-unit :: Process/minidump/./LLDBMinidumpTests/MinidumpParserTest.FindMemoryRange (1433 of 1785) PASS: lldb-api :: python_api/file_handle/TestFileHandle.py (1434 of 1785) PASS: lldb-shell :: ObjectFile/ELF/section-overlap.yaml (1435 of 1785) PASS: lldb-unit :: Utility/./UtilityTests/ArgsTest.TestAppendArg (1436 of 1785) PASS: lldb-unit :: UnwindAssembly/x86/./UnwindAssemblyx86Tests/Testx86AssemblyInspectionEngine.Test64bitFramelessBigStackFrame (1437 of 1785) UNSUPPORTED: lldb-shell :: SymbolFile/PDB/type-quals.test (1438 of 1785) PASS: lldb-shell :: ObjectFile/PECOFF/sections-names.yaml (1439 of 1785) UNSUPPORTED: lldb-api :: functionalities/darwin_log/filter/regex/category/TestDarwinLogFilterRegexCategory.py (1440 of 1785) PASS: lldb-unit :: Language/CPlusPlus/./LanguageCPlusPlusTests/CPlusPlusLanguage.FindAlternateFunctionManglings (1441 of 1785) PASS: lldb-unit :: Language/Highlighting/./HighlighterTests/HighlighterTest.ClangPPDirectives (1442 of 1785) PASS: lldb-unit :: Language/Highlighting/./HighlighterTests/HighlighterTest.ClangBraces (1443 of 1785) PASS: lldb-api :: functionalities/wrong_commands/TestWrongCommands.py (1444 of 1785) PASS: lldb-shell :: SymbolFile/DWARF/debug_ranges-missing-section.s (1445 of 1785) PASS: lldb-unit :: SymbolFile/NativePDB/./SymbolFileNativePDBTests/PDBFPOProgramToDWARFExpressionTests.MissingTargetRegister (1446 of 1785) PASS: lldb-api :: lang/cpp/const_this/TestConstThis.py (1447 of 1785) PASS: lldb-api :: types/TestIntegerTypes.py (1448 of 1785) PASS: lldb-api :: commands/expression/radar_8638051/Test8638051.py (1449 of 1785) PASS: lldb-api :: functionalities/thread/concurrent_events/TestConcurrentTwoBreakpointThreads.py (1450 of 1785) PASS: lldb-api :: lang/cpp/template-function/TestTemplateFunctions.py (1451 of 1785) PASS: lldb-api :: commands/expression/persistent_types/TestPersistentTypes.py (1452 of 1785) PASS: lldb-api :: functionalities/multidebugger_commands/TestMultipleDebuggersCommands.py (1453 of 1785) PASS: lldb-api :: functionalities/tsan/basic/TestTsanBasic.py (1454 of 1785) PASS: lldb-unit :: Utility/./UtilityTests/BinaryStreamTest.PutULEB128ThreeBytes (1455 of 1785) PASS: lldb-unit :: Utility/./UtilityTests/VMRange.SetEndAddress (1456 of 1785) PASS: lldb-unit :: Language/Highlighting/./HighlighterTests/HighlighterTest.ClangEmptyInput (1457 of 1785) PASS: lldb-unit :: Utility/./UtilityTests/Flags.IsClear (1458 of 1785) PASS: lldb-unit :: Utility/./UtilityTests/StringExtractorTest.GetNameColonValueContainsColon (1459 of 1785) PASS: lldb-unit :: Language/Highlighting/./HighlighterTests/HighlighterTest.ClangUnterminatedString (1460 of 1785) PASS: lldb-unit :: Signals/./SignalsTests/UnixSignalsTest.GetInfo (1461 of 1785) PASS: lldb-api :: commands/frame/diagnose/inheritance/TestDiagnoseInheritance.py (1462 of 1785) PASS: lldb-shell :: Expr/TestMultilineExpr.test (1463 of 1785) PASS: lldb-unit :: Utility/./UtilityTests/FileSpecTest.GetNormalizedPath (1464 of 1785) PASS: lldb-unit :: Utility/./UtilityTests/RegularExpression.Valid (1465 of 1785) PASS: lldb-unit :: Utility/./UtilityTests/StringExtractorTest.GetHexU8_Exact_NoEof (1466 of 1785) PASS: lldb-unit :: Utility/./UtilityTests/VASprintfTest.EncodingError (1467 of 1785) PASS: lldb-unit :: Utility/./UtilityTests/ArgsTest.ReplaceArgumentAtIndexEqual (1468 of 1785) PASS: lldb-unit :: Utility/./UtilityTests/StringListTest.LongestCommonPrefixNoPrefix (1469 of 1785) PASS: lldb-api :: tools/lldb-server/TestGdbRemoteHostInfo.py (1470 of 1785) PASS: lldb-api :: lang/objc/objc-runtime-ivars/TestRuntimeIvars.py (1471 of 1785) PASS: lldb-shell :: SymbolFile/DWARF/find-variable-dwo.cpp (1472 of 1785) PASS: lldb-unit :: Utility/./UtilityTests/CompletionRequest.Constructor (1473 of 1785) PASS: lldb-api :: commands/expression/completion/TestExprCompletion.py (1474 of 1785) PASS: lldb-shell :: Minidump/dump-all.test (1475 of 1785) PASS: lldb-unit :: Platform/./LLDBPlatformTests/PlatformDarwinTest.TestParseVersionBuildDir (1476 of 1785) PASS: lldb-api :: lang/objc/self/TestObjCSelf.py (1477 of 1785) PASS: lldb-unit :: Utility/./UtilityTests/StringListTest.LongestCommonPrefixEmpty (1478 of 1785) PASS: lldb-api :: lang/objc/rdar-10967107/TestRdar10967107.py (1479 of 1785) PASS: lldb-unit :: Utility/./UtilityTests/StringExtractorTest.GetHexBytes_OddPair (1480 of 1785) PASS: lldb-api :: lang/objc/foundation/TestFoundationDisassembly.py (1481 of 1785) PASS: lldb-unit :: Utility/./UtilityTests/EventTest.DumpEventDataBytes (1482 of 1785) PASS: lldb-unit :: Utility/./UtilityTests/OptionsWithRawTest.UnterminatedQuote (1483 of 1785) PASS: lldb-api :: functionalities/data-formatter/frameformat_smallstruct/TestFrameFormatSmallStruct.py (1484 of 1785) PASS: lldb-api :: functionalities/breakpoint/breakpoint_by_line_and_column/TestBreakpointByLineAndColumn.py (1485 of 1785) PASS: lldb-api :: commands/frame/select/TestFrameSelect.py (1486 of 1785) PASS: lldb-unit :: ScriptInterpreter/Python/./ScriptInterpreterPythonTests/PythonDataObjectsTest.TestTypeNameResolutionNoDot (1487 of 1785) PASS: lldb-api :: commands/expression/import-std-module/list-basic/TestBasicList.py (1488 of 1785) PASS: lldb-unit :: Process/gdb-remote/./ProcessGdbRemoteTests/GDBRemoteCommunicationClientTest.SendStartTracePacket (1489 of 1785) PASS: lldb-unit :: Utility/./UtilityTests/ScalarTest.APIntConstructor (1490 of 1785) PASS: lldb-unit :: ObjectFile/Breakpad/./ObjectFileBreakpadTests/Record.classify (1491 of 1785) UNSUPPORTED: lldb-shell :: SymbolFile/NativePDB/local-variables.cpp (1492 of 1785) UNSUPPORTED: lldb-shell :: SymbolFile/NativePDB/ast-functions-msvc.cpp (1493 of 1785) PASS: lldb-unit :: Process/gdb-remote/./ProcessGdbRemoteTests/GDBRemoteClientBaseTest.SendContinueDelegateStructuredDataReceipt (1494 of 1785) PASS: lldb-unit :: Utility/./UtilityTests/StringExtractorTest.GetU64LittleEndian (1495 of 1785) PASS: lldb-unit :: Utility/./UtilityTests/RangeTest.DoesIntersect (1496 of 1785) PASS: lldb-unit :: Language/Highlighting/./HighlighterTests/HighlighterTest.DefaultHighlighterWithCursor (1497 of 1785) PASS: lldb-unit :: Utility/./UtilityTests/StringExtractorTest.DecodeHexU8_InvalidHex2 (1498 of 1785) PASS: lldb-api :: lang/cpp/diamond/TestDiamond.py (1499 of 1785) PASS: lldb-shell :: ObjectFile/PECOFF/subsections.yaml (1500 of 1785) PASS: lldb-unit :: Utility/./UtilityTests/StreamTest.PutMaxHex64ByteOrderLittle (1501 of 1785) PASS: lldb-unit :: Utility/./UtilityTests/Flags.AnyClear (1502 of 1785) PASS: lldb-unit :: Utility/./UtilityTests/ArgsTest.TestQuotedUnknownEscape (1503 of 1785) PASS: lldb-shell :: SymbolFile/NativePDB/break-by-function.cpp (1504 of 1785) PASS: lldb-unit :: Utility/./UtilityTests/StringListTest.Assignment (1505 of 1785) PASS: lldb-unit :: Host/./HostTests/FileSystemTest.Resolve (1506 of 1785) PASS: lldb-unit :: Symbol/./SymbolTests/TestClangASTContext.TestIsClangType (1507 of 1785) PASS: lldb-api :: functionalities/breakpoint/auto_continue/TestBreakpointAutoContinue.py (1508 of 1785) PASS: lldb-api :: functionalities/data-formatter/data-formatter-stl/libcxx/bitset/TestDataFormatterLibcxxBitset.py (1509 of 1785) PASS: lldb-unit :: Utility/./UtilityTests/StringExtractorTest.GetHexBytes_OddPair2 (1510 of 1785) PASS: lldb-api :: functionalities/mtc/simple/TestMTCSimple.py (1511 of 1785) PASS: lldb-unit :: Language/Highlighting/./HighlighterTests/HighlighterTest.ClangOperators (1512 of 1785) PASS: lldb-api :: functionalities/ubsan/user-expression/TestUbsanUserExpression.py (1513 of 1785) PASS: lldb-api :: python_api/name_lookup/TestNameLookup.py (1514 of 1785) PASS: lldb-api :: functionalities/breakpoint/breakpoint_ids/TestBreakpointIDs.py (1515 of 1785) PASS: lldb-api :: python_api/type/TestTypeList.py (1516 of 1785) PASS: lldb-unit :: Utility/./UtilityTests/StringListTest.LongestCommonPrefix (1517 of 1785) PASS: lldb-unit :: Utility/./UtilityTests/StringExtractorTest.GetHexBytes_Underflow (1518 of 1785) PASS: lldb-api :: arm/emulation/TestEmulations.py (1519 of 1785) PASS: lldb-unit :: Expression/./ExpressionTests/DiagnosticManagerTest.GetStringNoDiags (1520 of 1785) PASS: lldb-api :: functionalities/process_group/TestChangeProcessGroup.py (1521 of 1785) PASS: lldb-unit :: Utility/./UtilityTests/UriParserTest.BracketedHostnamePort (1522 of 1785) PASS: lldb-unit :: ObjectFile/PECOFF/./ObjectFilePECOFFTests/PECallFrameInfoTest.Basic_eh (1523 of 1785) PASS: lldb-api :: commands/expression/import-std-module/deque-basic/TestBasicDeque.py (1524 of 1785) PASS: lldb-shell :: Driver/TestCore.test (1525 of 1785) PASS: lldb-unit :: Utility/./UtilityTests/StringExtractorTest.GetNameColonValueNoColon (1526 of 1785) PASS: lldb-api :: functionalities/thread/exit_during_break/TestExitDuringBreak.py (1527 of 1785) PASS: lldb-unit :: Utility/./UtilityTests/RegularExpression.Match (1528 of 1785) PASS: lldb-unit :: Utility/./UtilityTests/RecordReplayTest.InstrumentedFooSameThis (1529 of 1785) PASS: lldb-api :: commands/expression/test/TestExprs.py (1530 of 1785) PASS: lldb-unit :: Utility/./UtilityTests/Flags.AllSet (1531 of 1785) PASS: lldb-api :: lang/c/conflicting-symbol/TestConflictingSymbol.py (1532 of 1785) PASS: lldb-api :: functionalities/breakpoint/move_nearest/TestMoveNearest.py (1533 of 1785) PASS: lldb-unit :: Utility/./UtilityTests/StringListTest.JoinThree (1534 of 1785) PASS: lldb-api :: functionalities/data-formatter/data-formatter-objc/nsstring/TestDataFormatterNSString.py (1535 of 1785) UNSUPPORTED: lldb-shell :: Register/x86-ymm-read.test (1536 of 1785) UNSUPPORTED: lldb-shell :: SymbolFile/target-symbols-add-unwind.test (1537 of 1785) PASS: lldb-api :: functionalities/breakpoint/comp_dir_symlink/TestCompDirSymLink.py (1538 of 1785) PASS: lldb-api :: commands/expression/persistent_types/TestNestedPersistentTypes.py (1539 of 1785) PASS: lldb-shell :: SymbolFile/DWARF/debug-types-missing-signature.test (1540 of 1785) PASS: lldb-shell :: SymbolFile/DWARF/find-basic-function.cpp (1541 of 1785) PASS: lldb-api :: tools/lldb-server/commandline/TestStubReverseConnect.py (1542 of 1785) PASS: lldb-unit :: Utility/./UtilityTests/StringExtractorTest.GetHexU8_Extra_NoEof (1543 of 1785) PASS: lldb-unit :: Core/./LLDBCoreTests/MangledTest.ResultForValidName (1544 of 1785) PASS: lldb-unit :: Utility/./UtilityTests/DataExtractorTest.GetCStrEmpty (1545 of 1785) PASS: lldb-unit :: Utility/./UtilityTests/BinaryStreamTest.PutULEB128MaxValue (1546 of 1785) PASS: lldb-api :: functionalities/breakpoint/breakpoint_locations/TestBreakpointLocations.py (1547 of 1785) PASS: lldb-shell :: SymbolFile/NativePDB/nested-types.cpp (1548 of 1785) PASS: lldb-unit :: Utility/./UtilityTests/ScalarTest.Equality (1549 of 1785) PASS: lldb-unit :: Utility/./UtilityTests/ScalarTest.Comparison (1550 of 1785) PASS: lldb-shell :: Reproducer/TestFileRepro.test (1551 of 1785) PASS: lldb-api :: lang/cpp/class_static/TestStaticVariables.py (1552 of 1785) PASS: lldb-api :: lang/objc/objc-foundation-dictionary-empty/TestNSDictionary0.py (1553 of 1785) PASS: lldb-unit :: Utility/./UtilityTests/StructuredDataTest.ParseJSONFromFile (1554 of 1785) PASS: lldb-unit :: Symbol/./SymbolTests/TestClangASTContext.TestRecordHasFields (1555 of 1785) PASS: lldb-unit :: ObjectFile/Breakpad/./ObjectFileBreakpadTests/FuncRecord.parse (1556 of 1785) PASS: lldb-api :: functionalities/data-formatter/data-formatter-objc/TestDataFormatterObjCNSURL.py (1557 of 1785) PASS: lldb-unit :: Utility/./UtilityTests/StateTest.Formatv (1558 of 1785) PASS: lldb-unit :: Utility/./UtilityTests/FileSpecTest.EqualDotsWindows (1559 of 1785) PASS: lldb-api :: macosx/function-starts/TestFunctionStarts.py (1560 of 1785) PASS: lldb-api :: lang/cpp/offsetof/TestOffsetofCpp.py (1561 of 1785) PASS: lldb-api :: lang/cpp/accelerator-table/TestCPPAccelerator.py (1562 of 1785) PASS: lldb-api :: functionalities/data-formatter/data-formatter-stl/libcxx/unordered/TestDataFormatterUnordered.py (1563 of 1785) PASS: lldb-unit :: UnwindAssembly/x86/./UnwindAssemblyx86Tests/Testx86AssemblyInspectionEngine.TestStackRealign32BitDisp_x86_64 (1564 of 1785) PASS: lldb-api :: functionalities/inferior-crashing/TestInferiorCrashing.py (1565 of 1785) PASS: lldb-unit :: Utility/./UtilityTests/UriParserTest.PortOverflow (1566 of 1785) PASS: lldb-api :: lang/c/shared_lib_stripped_symbols/TestSharedLibStrippedSymbols.py (1567 of 1785) PASS: lldb-api :: commands/frame/diagnose/array/TestArray.py (1568 of 1785) PASS: lldb-unit :: UnwindAssembly/x86/./UnwindAssemblyx86Tests/Testx86AssemblyInspectionEngine.TestPushRBP (1569 of 1785) PASS: lldb-api :: commands/source/info/TestSourceInfo.py (1570 of 1785) PASS: lldb-unit :: Utility/./UtilityTests/GeneratorTest.Get (1571 of 1785) PASS: lldb-unit :: Utility/./UtilityTests/DataExtractorTest.GetCStr (1572 of 1785) PASS: lldb-unit :: Utility/./UtilityTests/ArchSpecTest.TripleComponentsWereSpecified (1573 of 1785) PASS: lldb-unit :: Utility/./UtilityTests/RangeTest.Slide (1574 of 1785) PASS: lldb-api :: commands/watchpoints/multiple_hits/TestMultipleHits.py (1575 of 1785) PASS: lldb-shell :: SymbolFile/DWARF/find-basic-variable.cpp (1576 of 1785) PASS: lldb-shell :: ObjectFile/ELF/PT_LOAD-overlap.yaml (1577 of 1785) PASS: lldb-unit :: Utility/./UtilityTests/TimeoutTest.Construction (1578 of 1785) PASS: lldb-unit :: Process/gdb-remote/./ProcessGdbRemoteTests/GDBRemoteCommunicationServerTest.SendErrorResponse_ErrorNumber (1579 of 1785) PASS: lldb-api :: commands/expression/import-std-module/vector-dbg-info-content/TestDbgInfoContentVector.py (1580 of 1785) PASS: lldb-api :: commands/log/basic/TestLogging.py (1581 of 1785) PASS: lldb-api :: lang/c/inlines/TestRedefinitionsInInlines.py (1582 of 1785) PASS: lldb-unit :: Process/gdb-remote/./ProcessGdbRemoteTests/GDBRemoteClientBaseTest.SendContinueDelegateInterface (1583 of 1785) PASS: lldb-unit :: Process/gdb-remote/./ProcessGdbRemoteTests/GDBRemoteCommunicationServerTest.SendErrorResponse_ErrorList (1584 of 1785) PASS: lldb-unit :: Process/gdb-remote/./ProcessGdbRemoteTests/GDBRemoteCommunicationClientTest.GetModulesInfo_UUID20 (1585 of 1785) PASS: lldb-shell :: Quit/TestQuitExitCode-30.test (1586 of 1785) PASS: lldb-api :: functionalities/tail_call_frames/inlining_and_tail_calls/TestInliningAndTailCalls.py (1587 of 1785) PASS: lldb-api :: macosx/thread-names/TestInterruptThreadNames.py (1588 of 1785) PASS: lldb-api :: lang/objcxx/cxx-bridged-po/TestObjCXXBridgedPO.py (1589 of 1785) PASS: lldb-api :: commands/expression/import-std-module/deque-dbg-info-content/TestDbgInfoContentDeque.py (1590 of 1785) PASS: lldb-unit :: Utility/./UtilityTests/StatusTest.ErrorConstructor (1591 of 1785) PASS: lldb-unit :: Utility/./UtilityTests/StringListTest.GetMaxStringLengthEqualSize (1592 of 1785) PASS: lldb-api :: lang/objc/objc-ivar-offsets/TestObjCIvarOffsets.py (1593 of 1785) PASS: lldb-api :: python_api/hello_world/TestHelloWorld.py (1594 of 1785) PASS: lldb-unit :: Process/gdb-remote/./ProcessGdbRemoteTests/GDBRemoteCommunicationClientTest.ReadRegister (1595 of 1785) PASS: lldb-api :: functionalities/tail_call_frames/ambiguous_tail_call_seq1/TestAmbiguousTailCallSeq1.py (1596 of 1785) PASS: lldb-unit :: Core/./LLDBCoreTests/RichManglingContextTest.FromCxxMethodName (1597 of 1785) PASS: lldb-api :: macosx/safe-to-func-call/TestSafeFuncCalls.py (1598 of 1785) PASS: lldb-shell :: ObjectFile/ELF/section-types-edgecases.yaml (1599 of 1785) PASS: lldb-unit :: tools/lldb-server/tests/./LLDBServerTests/TestBase.DebugserverEnv (1600 of 1785) UNSUPPORTED: lldb-api :: tools/lldb-vscode/breakpoint/TestVSCode_setExceptionBreakpoints.py (1601 of 1785) UNSUPPORTED: lldb-api :: iohandler/completion/TestIOHandlerCompletion.py (1602 of 1785) UNSUPPORTED: lldb-api :: functionalities/darwin_log/filter/regex/subsystem/TestDarwinLogFilterRegexSubsystem.py (1603 of 1785) PASS: lldb-unit :: Utility/./UtilityTests/StringLexerTest.HasAtLeast (1604 of 1785) PASS: lldb-api :: python_api/process/io/TestProcessIO.py (1605 of 1785) PASS: lldb-shell :: SymbolFile/DWARF/debug-types-dwo-cross-reference.cpp (1606 of 1785) PASS: lldb-api :: commands/frame/var/TestFrameVar.py (1607 of 1785) PASS: lldb-api :: lang/cpp/namespace_definitions/TestNamespaceDefinitions.py (1608 of 1785) PASS: lldb-shell :: SymbolFile/DWARF/find-qualified-variable.cpp (1609 of 1785) PASS: lldb-api :: commands/process/attach/attach_denied/TestAttachDenied.py (1610 of 1785) PASS: lldb-api :: commands/expression/import-std-module/list-dbg-info-content/TestDbgInfoContentList.py (1611 of 1785) PASS: lldb-unit :: Breakpoint/./LLDBBreakpointTests/BreakpointIDTest.StringIsBreakpointName (1612 of 1785) PASS: lldb-api :: functionalities/postmortem/minidump-new/TestMiniDumpNew.py (1613 of 1785) PASS: lldb-unit :: Process/gdb-remote/./ProcessGdbRemoteTests/GDBRemoteCommunicationServerTest.SendErrorResponse_Status (1614 of 1785) PASS: lldb-api :: macosx/find-dsym/deep-bundle/TestDeepBundle.py (1615 of 1785) UNSUPPORTED: lldb-shell :: SymbolFile/PDB/typedefs.test (1616 of 1785) PASS: lldb-unit :: Process/minidump/./LLDBMinidumpTests/MinidumpParserTest.FindMemoryRangeWithFullMemoryMinidump (1617 of 1785) PASS: lldb-unit :: UnwindAssembly/x86/./UnwindAssemblyx86Tests/Testx86AssemblyInspectionEngine.TestSimple32bitFrameFunction (1618 of 1785) PASS: lldb-unit :: Process/minidump/./LLDBMinidumpTests/MinidumpParserTest.GetMemoryRegionInfoFromMemory64List (1619 of 1785) PASS: lldb-api :: commands/command/script/import/rdar-12586188/TestRdar12586188.py (1620 of 1785) UNSUPPORTED: lldb-api :: benchmarks/libcxxmap/TestBenchmarkLibcxxMap.py (1621 of 1785) PASS: lldb-shell :: ObjectFile/ELF/minidebuginfo-corrupt-xz.yaml (1622 of 1785) PASS: lldb-api :: python_api/symbol-context/two-files/TestSymbolContextTwoFiles.py (1623 of 1785) PASS: lldb-unit :: Process/gdb-remote/./ProcessGdbRemoteTests/GDBRemoteClientBaseTest.SendContinueAndLateInterrupt (1624 of 1785) PASS: lldb-shell :: SymbolFile/DWARF/find-basic-namespace.cpp (1625 of 1785) UNSUPPORTED: lldb-api :: functionalities/data-formatter/data-formatter-stl/libstdcpp/iterator/TestDataFormatterStdIterator.py (1626 of 1785) PASS: lldb-api :: functionalities/var_path/TestVarPath.py (1627 of 1785) PASS: lldb-api :: functionalities/breakpoint/serialize/TestBreakpointSerialization.py (1628 of 1785) PASS: lldb-api :: python_api/watchpoint/watchlocation/TestTargetWatchAddress.py (1629 of 1785) UNSUPPORTED: lldb-shell :: SymbolFile/PDB/compilands.test (1630 of 1785) PASS: lldb-unit :: Utility/./UtilityTests/StringListTest.ForRange (1631 of 1785) PASS: lldb-shell :: SymbolFile/DWARF/childless-compile-unit.s (1632 of 1785) PASS: lldb-api :: functionalities/thread/concurrent_events/TestConcurrentDelayWatchBreak.py (1633 of 1785) PASS: lldb-unit :: ScriptInterpreter/Python/./ScriptInterpreterPythonTests/PythonDataObjectsTest.TestObjectAttributes (1634 of 1785) PASS: lldb-unit :: Utility/./UtilityTests/UriParserTest.SchemeHostSeparator2 (1635 of 1785) PASS: lldb-api :: lang/c/step-target/TestStepTarget.py (1636 of 1785) PASS: lldb-api :: commands/expression/argument_passing_restrictions/TestArgumentPassingRestrictions.py (1637 of 1785) PASS: lldb-api :: functionalities/thread/concurrent_events/TestConcurrentDelaySignalBreak.py (1638 of 1785) PASS: lldb-unit :: Target/./TargetTests/PathMappingListTest.AbsoluteTests (1639 of 1785) PASS: lldb-api :: commands/watchpoints/watchpoint_commands/command/TestWatchpointCommandPython.py (1640 of 1785) PASS: lldb-unit :: Utility/./UtilityTests/VMRange.Comparison (1641 of 1785) PASS: lldb-api :: functionalities/thread/create_after_attach/TestCreateAfterAttach.py (1642 of 1785) PASS: lldb-api :: lang/objc/objc-static-method-stripped/TestObjCStaticMethodStripped.py (1643 of 1785) PASS: lldb-unit :: Utility/./UtilityTests/VASprintfTest.NoBufferResize (1644 of 1785) PASS: lldb-shell :: ObjectFile/PECOFF/basic-info.yaml (1645 of 1785) PASS: lldb-api :: functionalities/breakpoint/address_breakpoints/TestBadAddressBreakpoints.py (1646 of 1785) PASS: lldb-unit :: Utility/./UtilityTests/ConstStringTest.NullAndEmptyStates (1647 of 1785) PASS: lldb-unit :: Utility/./UtilityTests/DeserializerTest.HasData (1648 of 1785) PASS: lldb-api :: macosx/lc-note/kern-ver-str/TestKernVerStrLCNOTE.py (1649 of 1785) PASS: lldb-unit :: Host/./HostTests/MainLoopTest.DetectsEOF (1650 of 1785) PASS: lldb-unit :: UnwindAssembly/x86/./UnwindAssemblyx86Tests/Testx86AssemblyInspectionEngine.TestMovRSPtoRBP (1651 of 1785) PASS: lldb-unit :: Core/./LLDBCoreTests/RichManglingContextTest.IPDRealloc (1652 of 1785) PASS: lldb-shell :: Minidump/disassemble-no-module.yaml (1653 of 1785) PASS: lldb-unit :: ScriptInterpreter/Python/./ScriptInterpreterPythonTests/PythonDataObjectsTest.TestPythonDictionaryToStructuredDictionary (1654 of 1785) PASS: lldb-shell :: Settings/TestDisassemblyFormat.test (1655 of 1785) PASS: lldb-api :: macosx/add-dsym/TestAddDsymMidExecutionCommand.py (1656 of 1785) PASS: lldb-unit :: ObjectFile/Breakpad/./ObjectFileBreakpadTests/PublicRecord.parse (1657 of 1785) PASS: lldb-unit :: ObjectFile/ELF/./ObjectFileELFTests/ObjectFileELFTest.GetSymtab_NoSymEntryPointArmThumbAddressClass (1658 of 1785) PASS: lldb-unit :: Utility/./UtilityTests/StatusTest.ErrorConversion (1659 of 1785) PASS: lldb-unit :: ScriptInterpreter/Python/./ScriptInterpreterPythonTests/PythonDataObjectsTest.TestPythonFile (1660 of 1785) PASS: lldb-api :: commands/target/basic/TestTargetCommand.py (1661 of 1785) PASS: lldb-api :: functionalities/thread/step_out/TestThreadStepOut.py (1662 of 1785) PASS: lldb-api :: functionalities/jitloader_gdb/TestJITLoaderGDB.py (1663 of 1785) PASS: lldb-unit :: Utility/./UtilityTests/NameMatchesTest.EndsWith (1664 of 1785) PASS: lldb-shell :: ObjectFile/ELF/netbsd-exec-8.99.30-amd64.yaml (1665 of 1785) PASS: lldb-api :: lang/cpp/call-function/TestCallCPPFunction.py (1666 of 1785) PASS: lldb-unit :: Expression/./ExpressionTests/DiagnosticManagerTest.FixedExpression (1667 of 1785) PASS: lldb-unit :: Utility/./UtilityTests/StreamTest.PutRawBytesToLittleEndian (1668 of 1785) PASS: lldb-api :: functionalities/thread/concurrent_events/TestConcurrentSignalDelayBreak.py (1669 of 1785) PASS: lldb-api :: source-manager/TestSourceManager.py (1670 of 1785) PASS: lldb-api :: functionalities/inferior-crashing/TestInferiorCrashingStep.py (1671 of 1785) PASS: lldb-api :: functionalities/thread/concurrent_events/TestConcurrentTwoBreakpointsOneWatchpoint.py (1672 of 1785) UNSUPPORTED: lldb-api :: commands/expression/multiline-completion/TestMultilineCompletion.py (1673 of 1785) PASS: lldb-api :: commands/expression/import-std-module/basic/TestImportStdModule.py (1674 of 1785) PASS: lldb-unit :: Utility/./UtilityTests/DataExtractorTest.GetBitfield (1675 of 1785) UNSUPPORTED: lldb-shell :: BuildScript/toolchain-msvc.test (1676 of 1785) PASS: lldb-api :: python_api/process/read-mem-cstring/TestReadMemCString.py (1677 of 1785) PASS: lldb-api :: lang/objc/print-obj/TestPrintObj.py (1678 of 1785) UNSUPPORTED: lldb-api :: commands/register/register/intel_xtended_registers/TestMPXRegisters.py (1679 of 1785) PASS: lldb-unit :: UnwindAssembly/x86/./UnwindAssemblyx86Tests/Testx86AssemblyInspectionEngine.TestDisassemblyMidFunctionEpilogues (1680 of 1785) PASS: lldb-unit :: Utility/./UtilityTests/TildeExpressionResolver.ResolveFullPath (1681 of 1785) PASS: lldb-unit :: Utility/./UtilityTests/StreamTest.ShiftOperatorPtr (1682 of 1785) PASS: lldb-unit :: Utility/./UtilityTests/Predicate.WaitForValueNotEqualTo (1683 of 1785) PASS: lldb-api :: commands/expression/save_jit_objects/TestSaveJITObjects.py (1684 of 1785) PASS: lldb-api :: python_api/function_symbol/TestDisasmAPI.py (1685 of 1785) PASS: lldb-api :: functionalities/gdb_remote_client/TestNoWatchpointSupportInfo.py (1686 of 1785) PASS: lldb-api :: functionalities/unwind/noreturn/module-end/TestNoReturnModuleEnd.py (1687 of 1785) PASS: lldb-api :: lang/cpp/auto/TestCPPAuto.py (1688 of 1785) PASS: lldb-api :: commands/expression/vector_of_enums/TestVectorOfEnums.py (1689 of 1785) PASS: lldb-unit :: UnwindAssembly/x86/./UnwindAssemblyx86Tests/Testx86AssemblyInspectionEngine.TestPushEDX (1690 of 1785) UNSUPPORTED: lldb-shell :: ObjectFile/ELF/minidebuginfo-no-lzma.yaml (1691 of 1785) UNSUPPORTED: lldb-api :: benchmarks/frame_variable/TestFrameVariableResponse.py (1692 of 1785) PASS: lldb-api :: functionalities/tail_call_frames/unambiguous_sequence/TestUnambiguousTailCalls.py (1693 of 1785) PASS: lldb-unit :: Language/Highlighting/./HighlighterTests/HighlighterTest.ClangIdentifiers (1694 of 1785) PASS: lldb-shell :: ObjectFile/ELF/PT_LOAD-overlap-PT_TLS.yaml (1695 of 1785) PASS: lldb-api :: functionalities/pre_run_dylibs/TestPreRunDylibs.py (1696 of 1785) PASS: lldb-api :: python_api/module_section/TestModuleAndSection.py (1697 of 1785) PASS: lldb-api :: lang/cpp/member-and-local-vars-with-same-name/TestMembersAndLocalsWithSameName.py (1698 of 1785) UNSUPPORTED: lldb-api :: linux/thread/create_during_instruction_step/TestCreateDuringInstructionStep.py (1699 of 1785) PASS: lldb-unit :: Expression/./ExpressionTests/DiagnosticManagerTest.PutStringSeverities (1700 of 1785) UNSUPPORTED: lldb-api :: functionalities/data-formatter/data-formatter-stl/libstdcpp/map/TestDataFormatterStdMap.py (1701 of 1785) PASS: lldb-unit :: Interpreter/./InterpreterTests/OptionArgParserTest.toChar (1702 of 1785) PASS: lldb-unit :: Utility/./UtilityTests/DataExtractorTest.GetMaxU64_unchecked (1703 of 1785) PASS: lldb-api :: python_api/lldbutil/TestSwigVersion.py (1704 of 1785) PASS: lldb-unit :: Utility/./UtilityTests/StringListTest.ShiftMove (1705 of 1785) PASS: lldb-api :: functionalities/data-formatter/data-formatter-named-summaries/TestDataFormatterNamedSummaries.py (1706 of 1785) PASS: lldb-unit :: Expression/./ExpressionTests/DiagnosticManagerTest.AddDiagnostic (1707 of 1785) UNSUPPORTED: lldb-shell :: Register/x86-64-ymm16-read.test (1708 of 1785) PASS: lldb-unit :: Utility/./UtilityTests/UriParserTest.BracketedHostname (1709 of 1785) PASS: lldb-unit :: Utility/./UtilityTests/StringExtractorTest.GetHexU8_Exact (1710 of 1785) PASS: lldb-api :: lang/objc/foundation/TestObjCMethods.py (1711 of 1785) PASS: lldb-unit :: Host/./HostTests/SocketTest.UDPConnect (1712 of 1785) PASS: lldb-shell :: Driver/TestFile.test (1713 of 1785) PASS: lldb-unit :: Utility/./UtilityTests/StringListTest.JoinSingle (1714 of 1785) PASS: lldb-api :: commands/expression/dont_allow_jit/TestAllowJIT.py (1715 of 1785) UNSUPPORTED: lldb-api :: functionalities/unwind/standard/TestStandardUnwind.py (1716 of 1785) PASS: lldb-unit :: Utility/./UtilityTests/ConstStringTest.FromMidOfBufferStringRef (1717 of 1785) PASS: lldb-api :: functionalities/multiword-commands/TestMultiWordCommands.py (1718 of 1785) PASS: lldb-api :: functionalities/breakpoint/dummy_target_breakpoints/TestBreakpointsWithNoTargets.py (1719 of 1785) PASS: lldb-unit :: Utility/./UtilityTests/StreamTest.PutRawBytesToMixedEndian (1720 of 1785) PASS: lldb-api :: functionalities/non-overlapping-index-variable-i/TestIndexVariable.py (1721 of 1785) UNSUPPORTED: lldb-api :: tools/lldb-vscode/step/TestVSCode_step.py (1722 of 1785) PASS: lldb-api :: functionalities/source-map/TestTargetSourceMap.py (1723 of 1785) PASS: lldb-api :: functionalities/thread/concurrent_events/TestConcurrentWatchBreakDelay.py (1724 of 1785) PASS: lldb-shell :: SymbolFile/DWARF/debug-types-signature-loop.s (1725 of 1785) PASS: lldb-api :: functionalities/float-display/TestFloatDisplay.py (1726 of 1785) PASS: lldb-unit :: Utility/./UtilityTests/UriParserTest.SchemeHostSeparator3 (1727 of 1785) PASS: lldb-unit :: Host/./HostTests/FileSystemTest.GetByteSize (1728 of 1785) PASS: lldb-unit :: Utility/./UtilityTests/StringLexerTest.NextIfList (1729 of 1785) PASS: lldb-api :: functionalities/modern-type-lookup/basic/TestBasicModernTypeLookup.py (1730 of 1785) PASS: lldb-unit :: Utility/./UtilityTests/StringListTest.RemoveBlankLines (1731 of 1785) UNSUPPORTED: lldb-shell :: Register/x86-64-xmm16-write.test (1732 of 1785) PASS: lldb-unit :: Language/Highlighting/./HighlighterTests/HighlighterTest.Colons (1733 of 1785) PASS: lldb-unit :: Utility/./UtilityTests/RangeTest.Union (1734 of 1785) PASS: lldb-unit :: Utility/./UtilityTests/StringListTest.InsertStringAtIndexMove (1735 of 1785) PASS: lldb-api :: functionalities/data-formatter/data-formatter-objc/nsindexpath/TestDataFormatterNSIndexPath.py (1736 of 1785) PASS: lldb-unit :: ScriptInterpreter/Python/./ScriptInterpreterPythonTests/PythonDataObjectsTest.TestPythonDictionaryManipulation (1737 of 1785) PASS: lldb-unit :: SymbolFile/NativePDB/./SymbolFileNativePDBTests/PDBFPOProgramToDWARFExpressionTests.UnsupportedRASearch (1738 of 1785) PASS: lldb-unit :: Utility/./UtilityTests/UriParserTest.Minimal (1739 of 1785) PASS: lldb-unit :: Host/./HostTests/SocketTest.UDPGetConnectURI (1740 of 1785) PASS: lldb-unit :: Utility/./UtilityTests/CompletionRequest.TryCompleteCurrentArgGood (1741 of 1785) PASS: lldb-api :: functionalities/data-formatter/boolreference/TestFormattersBoolRefPtr.py (1742 of 1785) PASS: lldb-api :: lang/objc/foundation/TestObjCMethodsString.py (1743 of 1785) PASS: lldb-unit :: Utility/./UtilityTests/TimerTest.CategoryTimes2 (1744 of 1785) PASS: lldb-unit :: Host/./HostTests/NativeProcessProtocolTest.ReadCStringFromMemory_MaxSize (1745 of 1785) PASS: lldb-unit :: Expression/./ExpressionTests/DiagnosticManagerTest.GetStringMultiline (1746 of 1785) PASS: lldb-api :: lang/cpp/gmodules/TestWithModuleDebugging.py (1747 of 1785) PASS: lldb-api :: lang/mixed/TestMixedLanguages.py (1748 of 1785) PASS: lldb-unit :: Process/minidump/./LLDBMinidumpTests/MinidumpParserTest.GetThreadContext_x86_32_wow64 (1749 of 1785) PASS: lldb-api :: commands/expression/entry-bp/TestExprEntryBP.py (1750 of 1785) PASS: lldb-unit :: Utility/./UtilityTests/StringExtractorTest.GetHexU8_InvalidHex (1751 of 1785) PASS: lldb-unit :: Language/Highlighting/./HighlighterTests/HighlighterTest.ClangCursorPos (1752 of 1785) PASS: lldb-api :: commands/watchpoints/watchpoint_commands/TestWatchpointCommands.py (1753 of 1785) PASS: lldb-unit :: Utility/./UtilityTests/BinaryStreamTest.PutSLEB128Zero (1754 of 1785) PASS: lldb-api :: lang/cpp/gmodules-templates/TestGModules.py (1755 of 1785) PASS: lldb-api :: functionalities/type_completion/TestTypeCompletion.py (1756 of 1785) PASS: lldb-shell :: SymbolFile/DWARF/debug_rnglists.s (1757 of 1785) PASS: lldb-shell :: Commands/command-backtrace.test (1758 of 1785) PASS: lldb-unit :: Utility/./UtilityTests/StreamTeeTest.Constructor2Streams (1759 of 1785) PASS: lldb-api :: commands/expression/call-throws/TestCallThatThrows.py (1760 of 1785) PASS: lldb-unit :: Utility/./UtilityTests/StreamTest.PutSLEB128 (1761 of 1785) PASS: lldb-unit :: Utility/./UtilityTests/LogChannelTest.Enable (1762 of 1785) PASS: lldb-unit :: Language/Highlighting/./HighlighterTests/HighlighterTest.ClangStringLiterals (1763 of 1785) PASS: lldb-api :: lang/cpp/symbols/TestSymbols.py (1764 of 1785) PASS: lldb-unit :: Symbol/./SymbolTests/LineEntryTest.GetSameLineContiguousAddressRangeNestedInline (1765 of 1785) PASS: lldb-unit :: Utility/./UtilityTests/RangeTest.ContainsAddr (1766 of 1785) PASS: lldb-unit :: Utility/./UtilityTests/UriParserTest.SchemeHostSeparator4 (1767 of 1785) PASS: lldb-unit :: Process/gdb-remote/./ProcessGdbRemoteTests/GDBRemoteCommunicationServerTest.SendErrorResponse_UnimplementedError (1768 of 1785) PASS: lldb-unit :: Signals/./SignalsTests/UnixSignalsTest.GetFilteredSignals (1769 of 1785) PASS: lldb-api :: functionalities/tsan/global_location/TestTsanGlobalLocation.py (1770 of 1785) UNSUPPORTED: lldb-api :: commands/watchpoints/multi_watchpoint_slots/TestWatchpointMultipleSlots.py (1771 of 1785) PASS: lldb-api :: functionalities/data-formatter/nssetsynth/TestNSSetSynthetic.py (1772 of 1785) UNSUPPORTED: lldb-api :: functionalities/data-formatter/data-formatter-stl/libstdcpp/list/TestDataFormatterStdList.py (1773 of 1785) PASS: lldb-api :: lang/cpp/llvm-style/TestLLVMStyle.py (1774 of 1785) PASS: lldb-api :: lang/cpp/overloaded-functions/TestOverloadedFunctions.py (1775 of 1785) PASS: lldb-api :: lang/c/unicode/TestUnicodeSymbols.py (1776 of 1785) PASS: lldb-api :: python_api/value/change_values/TestChangeValueAPI.py (1777 of 1785) PASS: lldb-api :: commands/expression/rdar44436068/Test128BitsInteger.py (1778 of 1785) PASS: lldb-api :: functionalities/set-data/TestSetData.py (1779 of 1785) PASS: lldb-api :: lang/cpp/operators/TestCppOperators.py (1780 of 1785) PASS: lldb-api :: lang/objc/real-definition/TestRealDefinition.py (1781 of 1785) PASS: lldb-api :: lang/objc/rdar-11355592/TestRdar11355592.py (1782 of 1785) PASS: lldb-api :: functionalities/breakpoint/breakpoint_conditions/TestBreakpointConditions.py (1783 of 1785) PASS: lldb-api :: lang/cpp/namespace/TestNamespaceLookup.py (1784 of 1785) PASS: lldb-api :: types/TestIntegerTypesExpr.py (1785 of 1785) Testing Time: 1693.09s ******************** Failing Tests (2): lldb-api :: tools/lldb-server/TestLldbGdbServer.py lldb-unit :: Utility/./UtilityTests/TimerTest.CategoryTimes

Hide Details

Hide Details

Slowest Tests: -------------------------------------------------------------------------- 115.63s: lldb-api :: lang/objc/foundation/TestObjCMethodsString.py 116.12s: lldb-api :: api/check_public_api_headers/TestPublicAPIHeaders.py 121.01s: lldb-api :: python_api/target/TestTargetAPI.py 129.52s: lldb-api :: lang/c/anonymous/TestAnonymous.py 129.70s: lldb-api :: lang/objc/objc-new-syntax/TestObjCNewSyntaxArray.py 131.35s: lldb-api :: functionalities/inferior-crashing/TestInferiorCrashingStep.py 131.73s: lldb-api :: lang/objc/objc-new-syntax/TestObjCNewSyntaxDictionary.py 140.10s: lldb-api :: commands/target/basic/TestTargetCommand.py 144.20s: lldb-api :: lang/objc/exceptions/TestObjCExceptions.py 157.93s: lldb-api :: functionalities/recursion/TestValueObjectRecursion.py 173.22s: lldb-api :: lang/objc/objc-new-syntax/TestObjCNewSyntaxLiteral.py 178.64s: lldb-api :: functionalities/return-value/TestReturnValue.py 206.07s: lldb-api :: lang/objc/hidden-ivars/TestHiddenIvars.py 212.23s: lldb-api :: api/multithreaded/TestMultithreaded.py 213.25s: lldb-api :: lang/objc/foundation/TestObjCMethods.py 234.11s: lldb-api :: lang/cpp/enum_types/TestCPP11EnumTypes.py 279.54s: lldb-api :: tools/lldb-server/TestLldbGdbServer.py 318.72s: lldb-api :: types/TestIntegerTypes.py 390.66s: lldb-api :: types/TestIntegerTypesExpr.py 698.51s: lldb-api :: lang/objc/foundation/TestFoundationDisassembly.py

Hide Details

Tests Times: -------------------------------------------------------------------------- [ Range ] :: [ Percentage ] :: [ Count ] -------------------------------------------------------------------------- [ 0s, 50s) :: [************************************* ] :: [1674/1785] [ 50s,100s) :: [* ] :: [ 85/1785] [100s,150s) :: [ ] :: [ 15/1785] [150s,200s) :: [ ] :: [ 3/1785] [200s,250s) :: [ ] :: [ 4/1785] [250s,300s) :: [ ] :: [ 1/1785] [300s,350s) :: [ ] :: [ 1/1785] [350s,400s) :: [ ] :: [ 1/1785] [400s,450s) :: [ ] :: [ 0/1785] [450s,500s) :: [ ] :: [ 0/1785] [500s,550s) :: [ ] :: [ 0/1785] [550s,600s) :: [ ] :: [ 0/1785] [600s,650s) :: [ ] :: [ 0/1785] [650s,700s) :: [ ] :: [ 1/1785] Expected Passes : 1635 Expected Failures : 6 Unsupported Tests : 142 Unexpected Failures: 2 FAILED: tools/lldb/test/CMakeFiles/check-lldb-lit cd /Users/buildslave/jenkins/workspace/lldb-cmake-sanitized/lldb-build/tools/lldb/test && /usr/bin/python /Users/buildslave/jenkins/workspace/lldb-cmake-sanitized/lldb-build/./bin/llvm-lit -v --time-tests --shuffle --xunit-xml-output=/Users/buildslave/jenkins/workspace/lldb-cmake-sanitized/test/results.xml -v --timeout 1200 /Users/buildslave/jenkins/workspace/lldb-cmake-sanitized/lldb-build/tools/lldb/test ninja: build stopped: subcommand failed. Command failed Command: ['/usr/bin/env', 'TERM=vt100', '/usr/local/bin/ninja', '-v', 'check-lldb'] [Pipeline] } [Pipeline] // timeout [Pipeline] } [Pipeline] // stage [Pipeline] stage [Pipeline] { (Declarative: Post Actions) [Pipeline] scanForIssues No credentials specified [Clang (LLVM based)] Sleeping for 5 seconds due to JENKINS-32191... [Clang (LLVM based)] Parsing console log (workspace: '/Users/buildslave/jenkins/workspace/lldb-cmake-sanitized') [Pipeline] junit Recording test results [Pipeline] } [Pipeline] // stage [Pipeline] } [Pipeline] // withEnv [Pipeline] } [Pipeline] // node [Pipeline] End of Pipeline [BFA] Scanning build for known causes... [BFA] Found failure cause(s): [BFA] Ninja target failed from category Compile [BFA] Regression test failed from category Test [BFA] Done. 0s ERROR: script returned exit code 1 Finished: FAILURE