FailedConsole Output

Skipping 109 KB.. Full Log
tized/lldb-build/tools/lldb/lldb-test-build.noindex/module-cache-lldb/lldb-api"
output: 

Hide Details

runCmd: settings set use-color false output:

Hide Details

Adding tearDown hook: def shutdown_named_pipe(): # Close the pipe. try: named_pipe.close() except: print("failed to close named pipe") None

Hide Details

# Delete the pipe. try: os.remove(named_pipe_path) except: print("failed to delete named pipe: {}".format(named_pipe_path)) None

Hide Details

# Delete the temp directory. try: os.rmdir(temp_dir) except: print( "failed to delete temp dir: {}, directory contents: '{}'".format( temp_dir, os.listdir(temp_dir))) None

Hide Details

Hide Details

Adding tearDown hook: def cleanupSubprocesses(self): # Ensure any subprocesses are cleaned up for p in self.subprocesses: p.terminate() del p del self.subprocesses[:] # Ensure any forked processes are cleaned up for pid in self.forkedProcessPids: if os.path.exists("/proc/" + str(pid)): os.kill(pid, signal.SIGTERM)

Hide Details

Hide Details

Adding tearDown hook: def shutdown_debug_monitor(): try: server.terminate() except: logger.warning( "failed to terminate server for debug monitor: {}; ignoring".format( sys.exc_info()[0]))

Hide Details

Hide Details

Adding tearDown hook: def shutdown_socket(): if sock: try: # send the kill packet so lldb-server shuts down gracefully sock.sendall(GdbRemoteTestCaseBase._GDBREMOTE_KILL_PACKET) except: logger.warning( "failed to send kill packet to debug monitor: {}; ignoring".format( sys.exc_info()[0]))

Hide Details

try: sock.close() except: logger.warning( "failed to close socket to debug monitor: {}; ignoring".format( sys.exc_info()[0]))

Hide Details

Hide Details

Executing tearDown hook: def shutdown_socket(): if sock: try: # send the kill packet so lldb-server shuts down gracefully sock.sendall(GdbRemoteTestCaseBase._GDBREMOTE_KILL_PACKET) except: logger.warning( "failed to send kill packet to debug monitor: {}; ignoring".format( sys.exc_info()[0]))

Hide Details

try: sock.close() except: logger.warning( "failed to close socket to debug monitor: {}; ignoring".format( sys.exc_info()[0]))

Hide Details

Hide Details

Executing tearDown hook: def shutdown_debug_monitor(): try: server.terminate() except: logger.warning( "failed to terminate server for debug monitor: {}; ignoring".format( sys.exc_info()[0]))

Hide Details

Hide Details

Executing tearDown hook: def cleanupSubprocesses(self): # Ensure any subprocesses are cleaned up for p in self.subprocesses: p.terminate() del p del self.subprocesses[:] # Ensure any forked processes are cleaned up for pid in self.forkedProcessPids: if os.path.exists("/proc/" + str(pid)): os.kill(pid, signal.SIGTERM)

Hide Details

Hide Details

Executing tearDown hook: def shutdown_named_pipe(): # Close the pipe. try: named_pipe.close() except: print("failed to close named pipe") None

Hide Details

# Delete the pipe. try: os.remove(named_pipe_path) except: print("failed to delete named pipe: {}".format(named_pipe_path)) None

Hide Details

# Delete the temp directory. try: os.rmdir(temp_dir) except: print( "failed to delete temp dir: {}, directory contents: '{}'".format( temp_dir, os.listdir(temp_dir))) None

Hide Details

Hide Details

PASS: LLDB (/Users/buildslave/jenkins/workspace/lldb-cmake-sanitized/host-compiler/bin/clang-10-x86_64) :: test_qProcessInfo_does_not_contain_triple_debugserver_darwin (TestGdbRemoteProcessInfo.TestGdbRemoteProcessInfo) runCmd: settings set symbols.enable-external-lookup false output:

Hide Details

runCmd: settings set plugin.process.gdb-remote.packet-timeout 60 output:

Hide Details

runCmd: settings set symbols.clang-modules-cache-path "/Users/buildslave/jenkins/workspace/lldb-cmake-sanitized/lldb-build/tools/lldb/lldb-test-build.noindex/module-cache-lldb/lldb-api" output:

Hide Details

runCmd: settings set use-color false output:

Hide Details

UNSUPPORTED: LLDB (/Users/buildslave/jenkins/workspace/lldb-cmake-sanitized/host-compiler/bin/clang-10-x86_64) :: test_qProcessInfo_does_not_contain_triple_llgs_darwin (TestGdbRemoteProcessInfo.TestGdbRemoteProcessInfo) (llgs tests) runCmd: settings set symbols.enable-external-lookup false output:

Hide Details

runCmd: settings set plugin.process.gdb-remote.packet-timeout 60 output:

Hide Details

runCmd: settings set symbols.clang-modules-cache-path "/Users/buildslave/jenkins/workspace/lldb-cmake-sanitized/lldb-build/tools/lldb/lldb-test-build.noindex/module-cache-lldb/lldb-api" output:

Hide Details

runCmd: settings set use-color false output:

Hide Details

Adding tearDown hook: def shutdown_named_pipe(): # Close the pipe. try: named_pipe.close() except: print("failed to close named pipe") None

Hide Details

# Delete the pipe. try: os.remove(named_pipe_path) except: print("failed to delete named pipe: {}".format(named_pipe_path)) None

Hide Details

# Delete the temp directory. try: os.rmdir(temp_dir) except: print( "failed to delete temp dir: {}, directory contents: '{}'".format( temp_dir, os.listdir(temp_dir))) None

Hide Details

Hide Details

Adding tearDown hook: def cleanupSubprocesses(self): # Ensure any subprocesses are cleaned up for p in self.subprocesses: p.terminate() del p del self.subprocesses[:] # Ensure any forked processes are cleaned up for pid in self.forkedProcessPids: if os.path.exists("/proc/" + str(pid)): os.kill(pid, signal.SIGTERM)

Hide Details

Hide Details

Adding tearDown hook: def shutdown_debug_monitor(): try: server.terminate() except: logger.warning( "failed to terminate server for debug monitor: {}; ignoring".format( sys.exc_info()[0]))

Hide Details

Hide Details

Adding tearDown hook: def shutdown_socket(): if sock: try: # send the kill packet so lldb-server shuts down gracefully sock.sendall(GdbRemoteTestCaseBase._GDBREMOTE_KILL_PACKET) except: logger.warning( "failed to send kill packet to debug monitor: {}; ignoring".format( sys.exc_info()[0]))

Hide Details

try: sock.close() except: logger.warning( "failed to close socket to debug monitor: {}; ignoring".format( sys.exc_info()[0]))

Hide Details

Hide Details

Executing tearDown hook: def shutdown_socket(): if sock: try: # send the kill packet so lldb-server shuts down gracefully sock.sendall(GdbRemoteTestCaseBase._GDBREMOTE_KILL_PACKET) except: logger.warning( "failed to send kill packet to debug monitor: {}; ignoring".format( sys.exc_info()[0]))

Hide Details

try: sock.close() except: logger.warning( "failed to close socket to debug monitor: {}; ignoring".format( sys.exc_info()[0]))

Hide Details

Hide Details

Executing tearDown hook: def shutdown_debug_monitor(): try: server.terminate() except: logger.warning( "failed to terminate server for debug monitor: {}; ignoring".format( sys.exc_info()[0]))

Hide Details

Hide Details

Executing tearDown hook: def cleanupSubprocesses(self): # Ensure any subprocesses are cleaned up for p in self.subprocesses: p.terminate() del p del self.subprocesses[:] # Ensure any forked processes are cleaned up for pid in self.forkedProcessPids: if os.path.exists("/proc/" + str(pid)): os.kill(pid, signal.SIGTERM)

Hide Details

Hide Details

Executing tearDown hook: def shutdown_named_pipe(): # Close the pipe. try: named_pipe.close() except: print("failed to close named pipe") None

Hide Details

# Delete the pipe. try: os.remove(named_pipe_path) except: print("failed to delete named pipe: {}".format(named_pipe_path)) None

Hide Details

# Delete the temp directory. try: os.rmdir(temp_dir) except: print( "failed to delete temp dir: {}, directory contents: '{}'".format( temp_dir, os.listdir(temp_dir))) None

Hide Details

Hide Details

PASS: LLDB (/Users/buildslave/jenkins/workspace/lldb-cmake-sanitized/host-compiler/bin/clang-10-x86_64) :: test_qProcessInfo_reports_valid_endian_debugserver (TestGdbRemoteProcessInfo.TestGdbRemoteProcessInfo) runCmd: settings set symbols.enable-external-lookup false output:

Hide Details

runCmd: settings set plugin.process.gdb-remote.packet-timeout 60 output:

Hide Details

runCmd: settings set symbols.clang-modules-cache-path "/Users/buildslave/jenkins/workspace/lldb-cmake-sanitized/lldb-build/tools/lldb/lldb-test-build.noindex/module-cache-lldb/lldb-api" output:

Hide Details

runCmd: settings set use-color false output:

Hide Details

UNSUPPORTED: LLDB (/Users/buildslave/jenkins/workspace/lldb-cmake-sanitized/host-compiler/bin/clang-10-x86_64) :: test_qProcessInfo_reports_valid_endian_llgs (TestGdbRemoteProcessInfo.TestGdbRemoteProcessInfo) (llgs tests) runCmd: settings set symbols.enable-external-lookup false output:

Hide Details

runCmd: settings set plugin.process.gdb-remote.packet-timeout 60 output:

Hide Details

runCmd: settings set symbols.clang-modules-cache-path "/Users/buildslave/jenkins/workspace/lldb-cmake-sanitized/lldb-build/tools/lldb/lldb-test-build.noindex/module-cache-lldb/lldb-api" output:

Hide Details

runCmd: settings set use-color false output:

Hide Details

Adding tearDown hook: def shutdown_named_pipe(): # Close the pipe. try: named_pipe.close() except: print("failed to close named pipe") None

Hide Details

# Delete the pipe. try: os.remove(named_pipe_path) except: print("failed to delete named pipe: {}".format(named_pipe_path)) None

Hide Details

# Delete the temp directory. try: os.rmdir(temp_dir) except: print( "failed to delete temp dir: {}, directory contents: '{}'".format( temp_dir, os.listdir(temp_dir))) None

Hide Details

Hide Details

Adding tearDown hook: def cleanupSubprocesses(self): # Ensure any subprocesses are cleaned up for p in self.subprocesses: p.terminate() del p del self.subprocesses[:] # Ensure any forked processes are cleaned up for pid in self.forkedProcessPids: if os.path.exists("/proc/" + str(pid)): os.kill(pid, signal.SIGTERM)

Hide Details

Hide Details

Adding tearDown hook: def shutdown_debug_monitor(): try: server.terminate() except: logger.warning( "failed to terminate server for debug monitor: {}; ignoring".format( sys.exc_info()[0]))

Hide Details

Hide Details

Adding tearDown hook: def shutdown_socket(): if sock: try: # send the kill packet so lldb-server shuts down gracefully sock.sendall(GdbRemoteTestCaseBase._GDBREMOTE_KILL_PACKET) except: logger.warning( "failed to send kill packet to debug monitor: {}; ignoring".format( sys.exc_info()[0]))

Hide Details

try: sock.close() except: logger.warning( "failed to close socket to debug monitor: {}; ignoring".format( sys.exc_info()[0]))

Hide Details

Hide Details

Executing tearDown hook: def shutdown_socket(): if sock: try: # send the kill packet so lldb-server shuts down gracefully sock.sendall(GdbRemoteTestCaseBase._GDBREMOTE_KILL_PACKET) except: logger.warning( "failed to send kill packet to debug monitor: {}; ignoring".format( sys.exc_info()[0]))

Hide Details

try: sock.close() except: logger.warning( "failed to close socket to debug monitor: {}; ignoring".format( sys.exc_info()[0]))

Hide Details

Hide Details

Executing tearDown hook: def shutdown_debug_monitor(): try: server.terminate() except: logger.warning( "failed to terminate server for debug monitor: {}; ignoring".format( sys.exc_info()[0]))

Hide Details

Hide Details

Executing tearDown hook: def cleanupSubprocesses(self): # Ensure any subprocesses are cleaned up for p in self.subprocesses: p.terminate() del p del self.subprocesses[:] # Ensure any forked processes are cleaned up for pid in self.forkedProcessPids: if os.path.exists("/proc/" + str(pid)): os.kill(pid, signal.SIGTERM)

Hide Details

Hide Details

Executing tearDown hook: def shutdown_named_pipe(): # Close the pipe. try: named_pipe.close() except: print("failed to close named pipe") None

Hide Details

# Delete the pipe. try: os.remove(named_pipe_path) except: print("failed to delete named pipe: {}".format(named_pipe_path)) None

Hide Details

# Delete the temp directory. try: os.rmdir(temp_dir) except: print( "failed to delete temp dir: {}, directory contents: '{}'".format( temp_dir, os.listdir(temp_dir))) None

Hide Details

Hide Details

PASS: LLDB (/Users/buildslave/jenkins/workspace/lldb-cmake-sanitized/host-compiler/bin/clang-10-x86_64) :: test_qProcessInfo_returns_running_process_debugserver (TestGdbRemoteProcessInfo.TestGdbRemoteProcessInfo) runCmd: settings set symbols.enable-external-lookup false output:

Hide Details

runCmd: settings set plugin.process.gdb-remote.packet-timeout 60 output:

Hide Details

runCmd: settings set symbols.clang-modules-cache-path "/Users/buildslave/jenkins/workspace/lldb-cmake-sanitized/lldb-build/tools/lldb/lldb-test-build.noindex/module-cache-lldb/lldb-api" output:

Hide Details

runCmd: settings set use-color false output:

Hide Details

UNSUPPORTED: LLDB (/Users/buildslave/jenkins/workspace/lldb-cmake-sanitized/host-compiler/bin/clang-10-x86_64) :: test_qProcessInfo_returns_running_process_llgs (TestGdbRemoteProcessInfo.TestGdbRemoteProcessInfo) (llgs tests) Restore dir to: /Users/buildslave/jenkins/workspace/lldb-cmake-sanitized/lldb-build/tools/lldb/test ====================================================================== FAIL: test_attach_commandline_qProcessInfo_reports_correct_pid_debugserver (TestGdbRemoteProcessInfo.TestGdbRemoteProcessInfo) ---------------------------------------------------------------------- Traceback (most recent call last): File "/Users/buildslave/jenkins/workspace/lldb-cmake-sanitized/llvm-project/lldb/packages/Python/lldbsuite/test/decorators.py", line 141, in wrapper func(*args, **kwargs) File "/Users/buildslave/jenkins/workspace/lldb-cmake-sanitized/llvm-project/lldb/packages/Python/lldbsuite/test/tools/lldb-server/TestGdbRemoteProcessInfo.py", line 76, in test_attach_commandline_qProcessInfo_reports_correct_pid_debugserver self.attach_commandline_qProcessInfo_reports_correct_pid() File "/Users/buildslave/jenkins/workspace/lldb-cmake-sanitized/llvm-project/lldb/packages/Python/lldbsuite/test/tools/lldb-server/TestGdbRemoteProcessInfo.py", line 51, in attach_commandline_qProcessInfo_reports_correct_pid procs = self.prep_debug_monitor_and_inferior() File "/Users/buildslave/jenkins/workspace/lldb-cmake-sanitized/llvm-project/lldb/packages/Python/lldbsuite/test/tools/lldb-server/gdbremote_testcase.py", line 583, in prep_debug_monitor_and_inferior server = self.connect_to_debug_monitor(attach_pid=attach_pid) File "/Users/buildslave/jenkins/workspace/lldb-cmake-sanitized/llvm-project/lldb/packages/Python/lldbsuite/test/tools/lldb-server/gdbremote_testcase.py", line 417, in connect_to_debug_monitor server = self.launch_debug_monitor(attach_pid=attach_pid) File "/Users/buildslave/jenkins/workspace/lldb-cmake-sanitized/llvm-project/lldb/packages/Python/lldbsuite/test/tools/lldb-server/gdbremote_testcase.py", line 410, in launch_debug_monitor self.port = self.get_stub_port_from_named_socket(self._READ_TIMEOUT) File "/Users/buildslave/jenkins/workspace/lldb-cmake-sanitized/llvm-project/lldb/packages/Python/lldbsuite/test/tools/lldb-server/gdbremote_testcase.py", line 216, in get_stub_port_from_named_socket "write side of pipe has not written anything - stub isn't writing to pipe.") AssertionError: 0 == 0 : write side of pipe has not written anything - stub isn't writing to pipe. Config=x86_64-/Users/buildslave/jenkins/workspace/lldb-cmake-sanitized/host-compiler/bin/clang-10 ---------------------------------------------------------------------- Ran 12 tests in 85.035s

Hide Details

RESULT: FAILED (4 passes, 1 failures, 0 errors, 7 skipped, 0 expected failures, 0 unexpected successes)

Hide Details

******************** PASS: lldb-api :: functionalities/data-formatter/data-formatter-named-summaries/TestDataFormatterNamedSummaries.py (547 of 1785) PASS: lldb-unit :: Utility/./UtilityTests/NameMatchesTest.StartsWith (548 of 1785) PASS: lldb-unit :: Utility/./UtilityTests/BinaryStreamTest.PutULEB128TwoBytes (549 of 1785) UNSUPPORTED: lldb-api :: functionalities/exec/TestExec.py (550 of 1785) PASS: lldb-unit :: Expression/./ExpressionTests/DiagnosticManagerTest.FixedExpression (551 of 1785) PASS: lldb-api :: functionalities/process_group/TestChangeProcessGroup.py (552 of 1785) PASS: lldb-unit :: Utility/./UtilityTests/StringListTest.JoinEmpty (553 of 1785) PASS: lldb-unit :: Utility/./UtilityTests/LogChannelTest.EnableOptions (554 of 1785) PASS: lldb-api :: functionalities/memory/read/TestMemoryRead.py (555 of 1785) PASS: lldb-api :: types/TestFloatTypes.py (556 of 1785) PASS: lldb-unit :: Utility/./UtilityTests/StreamTest.ShiftOperatorChars (557 of 1785) PASS: lldb-unit :: Expression/./ExpressionTests/DiagnosticManagerTest.AppendMessageSubsequentDiags (558 of 1785) PASS: lldb-unit :: Language/Highlighting/./HighlighterTests/HighlighterTest.DefaultHighlighter (559 of 1785) PASS: lldb-shell :: Breakpoint/split-dwarf-5-addrbase.test (560 of 1785) PASS: lldb-unit :: Host/./HostTests/MainLoopTest.ReadObject (561 of 1785) PASS: lldb-api :: functionalities/object-file/TestImageListMultiArchitecture.py (562 of 1785) UNSUPPORTED: lldb-shell :: SymbolFile/PDB/vbases.test (563 of 1785) PASS: lldb-api :: functionalities/data-formatter/data-formatter-stl/libcxx/set/TestDataFormatterLibcxxSet.py (564 of 1785) PASS: lldb-api :: lang/objcxx/hide-runtime-values/TestObjCXXHideRuntimeValues.py (565 of 1785) PASS: lldb-api :: lang/c/function_types/TestFunctionTypes.py (566 of 1785) PASS: lldb-api :: python_api/frame/get-variables/TestGetVariables.py (567 of 1785) PASS: lldb-shell :: Reproducer/TestFileRepro.test (568 of 1785) PASS: lldb-api :: functionalities/rerun/TestRerun.py (569 of 1785) PASS: lldb-unit :: Utility/./UtilityTests/StringListTest.ShiftCString (570 of 1785) PASS: lldb-unit :: Utility/./UtilityTests/StatusTest.ErrorConstructor (571 of 1785) PASS: lldb-unit :: Process/gdb-remote/./ProcessGdbRemoteTests/GDBRemoteCommunicationClientTest.WriteRegisterNoSuffix (572 of 1785) PASS: lldb-api :: commands/expression/dont_allow_jit/TestAllowJIT.py (573 of 1785) PASS: lldb-api :: commands/watchpoints/watchpoint_commands/condition/TestWatchpointConditionCmd.py (574 of 1785) PASS: lldb-unit :: Utility/./UtilityTests/DeserializerTest.HasData (575 of 1785) PASS: lldb-api :: commands/expression/char/TestExprsChar.py (576 of 1785) PASS: lldb-api :: lang/cpp/this/TestCPPThis.py (577 of 1785) PASS: lldb-unit :: Process/minidump/./LLDBMinidumpTests/MinidumpParserTest.GetMiscInfoWindows (578 of 1785) PASS: lldb-unit :: Utility/./UtilityTests/AnsiTerminal.KnownPrefix (579 of 1785) PASS: lldb-unit :: Utility/./UtilityTests/ArgsTest.TestSingleArgWithQuotedSpace (580 of 1785) PASS: lldb-unit :: Utility/./UtilityTests/BinaryStreamTest.PutSLEB128TwoBytes (581 of 1785) UNSUPPORTED: lldb-api :: functionalities/darwin_log/filter/exact_match/category/TestDarwinLogFilterMatchCategory.py (582 of 1785) PASS: lldb-api :: commands/watchpoints/watchpoint_set_command/TestWatchLocationWithWatchSet.py (583 of 1785) PASS: lldb-api :: functionalities/dynamic_value_child_count/TestDynamicValueChildCount.py (584 of 1785) PASS: lldb-unit :: UnwindAssembly/x86/./UnwindAssemblyx86Tests/Testx86AssemblyInspectionEngine.Test32bitFramelessSmallStackFrame (585 of 1785) PASS: lldb-api :: functionalities/var_path/TestVarPath.py (586 of 1785) PASS: lldb-unit :: Utility/./UtilityTests/ScalarTest.RightShiftOperator (587 of 1785) UNSUPPORTED: lldb-shell :: SymbolFile/NativePDB/typedefs.cpp (588 of 1785) PASS: lldb-api :: lang/objc/objc-runtime-ivars/TestRuntimeIvars.py (589 of 1785) PASS: lldb-unit :: Host/./HostTests/NativeProcessProtocolTest.SetBreakpointFailVerify (590 of 1785) PASS: lldb-unit :: UnwindAssembly/x86/./UnwindAssemblyx86Tests/Testx86AssemblyInspectionEngine.TestPopR13 (591 of 1785) PASS: lldb-unit :: ScriptInterpreter/Python/./ScriptInterpreterPythonTests/PythonDataObjectsTest.TestPythonTupleValues (592 of 1785) PASS: lldb-unit :: Interpreter/./InterpreterTests/CompletionTest.DirCompletionAbsolute (593 of 1785) PASS: lldb-unit :: Utility/./UtilityTests/OptionsWithRawTest.LeadingSpaceArgs (594 of 1785) PASS: lldb-api :: sample_test/TestSampleInlineTest.py (595 of 1785) PASS: lldb-api :: functionalities/tsan/thread_leak/TestTsanThreadLeak.py (596 of 1785) PASS: lldb-api :: lang/cpp/llvm-style/TestLLVMStyle.py (597 of 1785) PASS: lldb-unit :: UnwindAssembly/x86/./UnwindAssemblyx86Tests/Testx86AssemblyInspectionEngine.TestPush0 (598 of 1785) PASS: lldb-api :: commands/expression/test/TestExprs.py (599 of 1785) UNSUPPORTED: lldb-shell :: SymbolFile/PDB/variables.test (600 of 1785) PASS: lldb-unit :: Host/./HostTests/SocketTest.UDPConnect (601 of 1785) PASS: lldb-unit :: ScriptInterpreter/Python/./ScriptInterpreterPythonTests/PythonExceptionStateTest.TestExceptionStateChecking (602 of 1785) PASS: lldb-api :: macosx/universal/TestUniversal.py (603 of 1785) PASS: lldb-shell :: ObjectFile/PECOFF/sections-names.yaml (604 of 1785) PASS: lldb-unit :: Utility/./UtilityTests/RangeTest.Equal (605 of 1785) PASS: lldb-api :: lang/objc/objc-struct-return/TestObjCStructReturn.py (606 of 1785) PASS: lldb-unit :: Utility/./UtilityTests/UriParserTest.PortOverflow (607 of 1785) PASS: lldb-unit :: Symbol/./SymbolTests/PostfixExpression.ParseFPOProgram (608 of 1785) PASS: lldb-api :: commands/disassemble/basic/TestFrameDisassemble.py (609 of 1785) PASS: lldb-shell :: Watchpoint/SetErrorCases.test (610 of 1785) PASS: lldb-unit :: Utility/./UtilityTests/StreamTest.PutCharNull (611 of 1785) PASS: lldb-api :: functionalities/tsan/global_location/TestTsanGlobalLocation.py (612 of 1785) PASS: lldb-api :: lang/objc/objc-property/TestObjCProperty.py (613 of 1785) PASS: lldb-api :: functionalities/data-formatter/varscript_formatting/TestDataFormatterVarScriptFormatting.py (614 of 1785) PASS: lldb-api :: python_api/lldbutil/frame/TestFrameUtils.py (615 of 1785) PASS: lldb-shell :: ObjectFile/ELF/PT_LOAD-overlap.yaml (616 of 1785) PASS: lldb-api :: functionalities/type_completion/TestTypeCompletion.py (617 of 1785) UNSUPPORTED: lldb-api :: commands/expression/completion-crash2/TestCompletionCrash2.py (618 of 1785) PASS: lldb-unit :: Core/./LLDBCoreTests/RichManglingContextTest.FromCxxMethodName (619 of 1785) PASS: lldb-api :: python_api/lldbutil/process/TestPrintStackTraces.py (620 of 1785) PASS: lldb-api :: commands/watchpoints/step_over_watchpoint/TestStepOverWatchpoint.py (621 of 1785) PASS: lldb-unit :: Symbol/./SymbolTests/LineEntryTest.GetSameLineContiguousAddressRangeNoInlines (622 of 1785) PASS: lldb-api :: lang/c/vla/TestVLA.py (623 of 1785) PASS: lldb-api :: lang/cpp/dynamic-value/TestDynamicValue.py (624 of 1785) XFAIL: lldb-shell :: Register/x86-mm-xmm-read.test (625 of 1785) PASS: lldb-unit :: Utility/./UtilityTests/CompletionRequest.TestCompletionOwnership (626 of 1785) UNSUPPORTED: lldb-api :: functionalities/darwin_log/filter/exact_match/activity/TestDarwinLogFilterMatchActivity.py (627 of 1785) PASS: lldb-api :: functionalities/paths/TestPaths.py (628 of 1785) PASS: lldb-api :: functionalities/data-formatter/stringprinter/TestStringPrinter.py (629 of 1785) PASS: lldb-unit :: Utility/./UtilityTests/OptionsWithRawTest.UnterminatedQuote (630 of 1785) PASS: lldb-api :: commands/target/stop-hooks/TestStopHooks.py (631 of 1785) PASS: lldb-unit :: Host/./HostTests/SocketTest.DomainListenConnectAccept (632 of 1785) PASS: lldb-api :: lang/c/offsetof/TestOffsetof.py (633 of 1785) PASS: lldb-api :: commands/process/launch-with-shellexpand/TestLaunchWithShellExpand.py (634 of 1785) PASS: lldb-unit :: Utility/./UtilityTests/RangeTest.ContainsEndInclusiveInvalid (635 of 1785) PASS: lldb-unit :: UnwindAssembly/x86/./UnwindAssemblyx86Tests/Testx86AssemblyInspectionEngine.TestSimple64bitFrameFunction (636 of 1785) PASS: lldb-unit :: Process/minidump/./LLDBMinidumpTests/MinidumpParserTest.GetFilteredModuleList (637 of 1785) PASS: lldb-api :: commands/frame/diagnose/dereference-this/TestDiagnoseDereferenceThis.py (638 of 1785) PASS: lldb-shell :: ObjectFile/MachO/symtab.yaml (639 of 1785) PASS: lldb-unit :: Utility/./UtilityTests/RecordReplayTest.InstrumentedFooSameThis (640 of 1785) PASS: lldb-api :: commands/expression/import-std-module/shared_ptr-dbg-info-content/TestSharedPtrDbgInfoContent.py (641 of 1785) UNSUPPORTED: lldb-api :: linux/thread/create_during_instruction_step/TestCreateDuringInstructionStep.py (642 of 1785) PASS: lldb-unit :: Utility/./UtilityTests/UriParserTest.SchemeHostSeparator3 (643 of 1785) PASS: lldb-shell :: SymbolFile/Breakpad/unwind-via-raSearch.test (644 of 1785) PASS: lldb-api :: commands/expression/timeout/TestCallWithTimeout.py (645 of 1785) PASS: lldb-api :: functionalities/data-formatter/data-formatter-proper-plurals/TestFormattersOneIsSingular.py (646 of 1785) PASS: lldb-unit :: Utility/./UtilityTests/ScalarTest.GetBytes (647 of 1785) PASS: lldb-unit :: Utility/./UtilityTests/Flags.GetBitSize (648 of 1785) PASS: lldb-api :: functionalities/plugins/command_plugin/TestPluginCommands.py (649 of 1785) PASS: lldb-api :: tools/lldb-server/commandline/TestStubSetSID.py (650 of 1785) PASS: lldb-unit :: Utility/./UtilityTests/StreamTest.PutBytesAsRawHex8ToMixedEndian (651 of 1785) PASS: lldb-unit :: Symbol/./SymbolTests/TestClangASTContext.TestRemoveFastQualifiers (652 of 1785) PASS: lldb-api :: commands/watchpoints/watchpoint_on_vectors/TestValueOfVectorVariable.py (653 of 1785) PASS: lldb-api :: commands/expression/context-object/TestContextObject.py (654 of 1785) PASS: lldb-api :: lang/objc/ptr_refs/TestPtrRefsObjC.py (655 of 1785) PASS: lldb-api :: lang/cpp/char8_t/TestCxxChar8_t.py (656 of 1785) UNSUPPORTED: lldb-api :: functionalities/breakpoint/breakpoint_in_delayslot/TestAvoidBreakpointInDelaySlot.py (657 of 1785) PASS: lldb-shell :: SymbolFile/DWARF/debug-names-compressed.cpp (658 of 1785) PASS: lldb-shell :: Reproducer/Functionalities/TestDataFormatter.test (659 of 1785) PASS: lldb-api :: commands/expression/import-std-module/weak_ptr-dbg-info-content/TestDbgInfoContentWeakPtr.py (660 of 1785) PASS: lldb-api :: functionalities/data-formatter/data-formatter-objc/TestDataFormatterObjCPlain.py (661 of 1785) PASS: lldb-api :: tools/lldb-server/commandline/TestStubReverseConnect.py (662 of 1785) PASS: lldb-shell :: Driver/TestCore.test (663 of 1785) PASS: lldb-unit :: Utility/./UtilityTests/RangeTest.SetRangeBase (664 of 1785) PASS: lldb-api :: functionalities/thread/concurrent_events/TestConcurrentSignalBreak.py (665 of 1785) PASS: lldb-api :: lang/objc/foundation/TestObjectDescriptionAPI.py (666 of 1785) PASS: lldb-api :: lang/c/anonymous/TestAnonymous.py (667 of 1785) PASS: lldb-api :: functionalities/tsan/multiple/TestTsanMultiple.py (668 of 1785) PASS: lldb-unit :: Utility/./UtilityTests/ScalarTest.Division (669 of 1785) PASS: lldb-unit :: SymbolFile/DWARF/./SymbolFileDWARFTests/SymbolFileDWARFTests.TestAbbrevInvalidNULLTag (670 of 1785) PASS: lldb-shell :: SymbolFile/NativePDB/ast-methods.cpp (671 of 1785) PASS: lldb-api :: functionalities/thread/concurrent_events/TestConcurrentTwoBreakpointsOneSignal.py (672 of 1785) UNSUPPORTED: lldb-api :: functionalities/darwin_log/filter/regex/subsystem/TestDarwinLogFilterRegexSubsystem.py (673 of 1785) PASS: lldb-unit :: Language/CPlusPlus/./LanguageCPlusPlusTests/CPlusPlusLanguage.FindAlternateFunctionManglings (674 of 1785) UNSUPPORTED: lldb-shell :: Register/x86-64-ymm16-read.test (675 of 1785) PASS: lldb-api :: functionalities/inferior-crashing/recursive-inferior/TestRecursiveInferiorStep.py (676 of 1785) PASS: lldb-api :: lang/cpp/bool/TestCPPBool.py (677 of 1785) PASS: lldb-unit :: Utility/./UtilityTests/StringListTest.RemoveBlankLines (678 of 1785) PASS: lldb-shell :: SymbolFile/DWARF/dir-separator-windows.s (679 of 1785) PASS: lldb-unit :: ScriptInterpreter/Python/./ScriptInterpreterPythonTests/PythonDataObjectsTest.TestPythonCallableCheck (680 of 1785) PASS: lldb-unit :: Utility/./UtilityTests/UriParserTest.SchemeHostSeparator2 (681 of 1785) PASS: lldb-unit :: ScriptInterpreter/Python/./ScriptInterpreterPythonTests/PythonExceptionStateTest.TestManualRestoreSemantics (682 of 1785) PASS: lldb-shell :: Reproducer/Functionalities/TestStepping.test (683 of 1785) PASS: lldb-unit :: Utility/./UtilityTests/Predicate.WaitForValueNotEqualTo (684 of 1785) UNSUPPORTED: lldb-api :: commands/expression/completion-crash-incomplete-record/TestCompletionCrashIncompleteRecord.py (685 of 1785) PASS: lldb-unit :: Utility/./UtilityTests/ListenerTest.GetEventWait (686 of 1785) UNSUPPORTED: lldb-shell :: ExecControl/StopHook/stop-hook-threads.test (687 of 1785) PASS: lldb-api :: python_api/lldbutil/iter/TestLLDBIterator.py (688 of 1785) PASS: lldb-unit :: Process/gdb-remote/./ProcessGdbRemoteTests/GDBRemoteCommunicationServerTest.SendErrorResponse_Status (689 of 1785) PASS: lldb-unit :: Utility/./UtilityTests/TildeExpressionResolver.ResolveFullPath (690 of 1785) PASS: lldb-unit :: Utility/./UtilityTests/StringListTest.SplitIntoLines (691 of 1785) PASS: lldb-api :: functionalities/data-formatter/refpointer-recursion/TestDataFormatterRefPtrRecursion.py (692 of 1785) PASS: lldb-api :: functionalities/signal/raise/TestRaise.py (693 of 1785) PASS: lldb-shell :: SymbolFile/Breakpad/stack-cfi-parsing.test (694 of 1785) PASS: lldb-api :: lang/cpp/gmodules/TestWithModuleDebugging.py (695 of 1785) PASS: lldb-shell :: Breakpoint/debug_rnglist_offset_pair.test (696 of 1785) PASS: lldb-api :: functionalities/thread/concurrent_events/TestConcurrentDelayedCrashWithBreakpointSignal.py (697 of 1785) PASS: lldb-unit :: Utility/./UtilityTests/StringLexerTest.GetUnlexed (698 of 1785) PASS: lldb-unit :: Language/CPlusPlus/./LanguageCPlusPlusTests/CPlusPlusLanguage.ExtractContextAndIdentifier (699 of 1785) PASS: lldb-unit :: Process/minidump/./LLDBMinidumpTests/MinidumpParserTest.GetThreadContext_x86_64 (700 of 1785) PASS: lldb-api :: commands/expression/radar_8638051/Test8638051.py (701 of 1785) PASS: lldb-unit :: Expression/./ExpressionTests/ClangHostTest.MacOSX (702 of 1785) PASS: lldb-api :: functionalities/tail_call_frames/unambiguous_sequence/TestUnambiguousTailCalls.py (703 of 1785) PASS: lldb-unit :: Utility/./UtilityTests/StateTest.Formatv (704 of 1785) UNSUPPORTED: lldb-shell :: Unwind/unwind-plan-dwarf-dump.test (705 of 1785) PASS: lldb-unit :: Process/gdb-remote/./ProcessGdbRemoteTests/GDBRemoteCommunicationClientTest.SendSignalsToIgnore (706 of 1785) PASS: lldb-unit :: Utility/./UtilityTests/StringLexerTest.PutBack (707 of 1785) PASS: lldb-shell :: Settings/TestFrameFormatNoColor.test (708 of 1785) PASS: lldb-api :: functionalities/thread/create_after_attach/TestCreateAfterAttach.py (709 of 1785) PASS: lldb-api :: functionalities/thread/exit_during_step/TestExitDuringStep.py (710 of 1785) PASS: lldb-unit :: Expression/./ExpressionTests/DiagnosticManagerTest.AppendMessageNoDiag (711 of 1785) PASS: lldb-unit :: Utility/./UtilityTests/StringListTest.LongestCommonPrefix (712 of 1785) PASS: lldb-shell :: ObjectFile/Breakpad/sections.test (713 of 1785) PASS: lldb-api :: functionalities/thread/concurrent_events/TestConcurrentWatchBreak.py (714 of 1785) PASS: lldb-api :: functionalities/inferior-assert/TestInferiorAssert.py (715 of 1785) PASS: lldb-api :: commands/frame/diagnose/inheritance/TestDiagnoseInheritance.py (716 of 1785) PASS: lldb-api :: functionalities/plugins/python_os_plugin/TestPythonOSPlugin.py (717 of 1785) PASS: lldb-unit :: Utility/./UtilityTests/StringExtractorTest.GetHexBytesAvail_Partial (718 of 1785) UNSUPPORTED: lldb-api :: tools/lldb-vscode/breakpoint/TestVSCode_setExceptionBreakpoints.py (719 of 1785) PASS: lldb-shell :: ObjectFile/PECOFF/basic-info-arm64.yaml (720 of 1785) PASS: lldb-unit :: SymbolFile/DWARF/./SymbolFileDWARFTests/SymbolFileDWARFTests.TestAbbrevOrder1Start5 (721 of 1785) PASS: lldb-shell :: ObjectFile/PECOFF/basic-info-arm.yaml (722 of 1785) PASS: lldb-unit :: Core/./LLDBCoreTests/RichManglingContextTest.Basic (723 of 1785) PASS: lldb-shell :: SymbolFile/DWARF/parallel-indexing-stress.s (724 of 1785) PASS: lldb-unit :: ScriptInterpreter/Python/./ScriptInterpreterPythonTests/PythonDataObjectsTest.TestModuleNameResolutionNoDot (725 of 1785) UNSUPPORTED: lldb-shell :: SymbolFile/PDB/ast-restore.test (726 of 1785) PASS: lldb-unit :: Utility/./UtilityTests/BinaryStreamTest.PutSLEB128FourBytes (727 of 1785) PASS: lldb-unit :: UnwindAssembly/x86/./UnwindAssemblyx86Tests/Testx86AssemblyInspectionEngine.TestSimplex86_64Augmented (728 of 1785) PASS: lldb-api :: lang/objc/objc-baseclass-sbtype/TestObjCBaseClassSBType.py (729 of 1785) PASS: lldb-shell :: SymbolFile/DWARF/find-inline-method.s (730 of 1785) PASS: lldb-api :: macosx/duplicate-archive-members/TestDuplicateMembers.py (731 of 1785) PASS: lldb-unit :: Process/gdb-remote/./ProcessGdbRemoteTests/GDBRemoteCommunicationClientTest.SendGetTraceConfigPacket (732 of 1785) PASS: lldb-api :: lang/cpp/lambdas/TestLambdas.py (733 of 1785) PASS: lldb-api :: functionalities/breakpoint/breakpoint_options/TestBreakpointOptions.py (734 of 1785) PASS: lldb-api :: functionalities/data-formatter/language_category_updates/TestDataFormatterLanguageCategoryUpdates.py (735 of 1785) PASS: lldb-api :: commands/expression/import-std-module/weak_ptr/TestWeakPtr.py (736 of 1785) PASS: lldb-shell :: SymbolFile/DWARF/debug_loc.s (737 of 1785) PASS: lldb-api :: commands/expression/persistent_variables/TestPersistentVariables.py (738 of 1785) PASS: lldb-api :: lang/c/struct_types/TestStructTypes.py (739 of 1785) PASS: lldb-api :: commands/process/attach/attach_denied/TestAttachDenied.py (740 of 1785) PASS: lldb-api :: functionalities/target-new-solib-notifications/TestModuleLoadedNotifys.py (741 of 1785) PASS: lldb-api :: functionalities/tsan/cpp_global_location/TestTsanCPPGlobalLocation.py (742 of 1785) PASS: lldb-api :: commands/reproducer/invalid-args/TestInvalidArgsReproducer.py (743 of 1785) PASS: lldb-unit :: Utility/./UtilityTests/OptionsWithRawTest.TerminatedQuote (744 of 1785) PASS: lldb-api :: commands/frame/diagnose/bad-reference/TestBadReference.py (745 of 1785) PASS: lldb-unit :: Utility/./UtilityTests/StringExtractorTest.GetHexBytes (746 of 1785) PASS: lldb-unit :: Utility/./UtilityTests/StringExtractorTest.GetHexU8_Underflow (747 of 1785) PASS: lldb-unit :: Utility/./UtilityTests/GeneratorTest.Get (748 of 1785) PASS: lldb-shell :: SymbolFile/DWARF/debug-line-basic.s (749 of 1785) PASS: lldb-unit :: Utility/./UtilityTests/RecordReplayTest.InstrumentedBar (750 of 1785) PASS: lldb-api :: functionalities/gdb_remote_client/TestWriteMemory.py (751 of 1785) PASS: lldb-shell :: SymbolFile/DWARF/debug_aranges-empty-section.s (752 of 1785) PASS: lldb-shell :: Breakpoint/debug_rnglist_basic.test (753 of 1785) PASS: lldb-api :: python_api/lldbutil/TestSwigVersion.py (754 of 1785) PASS: lldb-unit :: UnwindAssembly/x86/./UnwindAssemblyx86Tests/Testx86AssemblyInspectionEngine.Test64bitFramelessBigStackFrame (755 of 1785) PASS: lldb-shell :: SymbolFile/NativePDB/source-list.cpp (756 of 1785) PASS: lldb-unit :: Utility/./UtilityTests/Flags.Clear (757 of 1785) UNSUPPORTED: lldb-shell :: Register/x86-ymm-write.test (758 of 1785) PASS: lldb-api :: lang/cpp/namespace/TestNamespace.py (759 of 1785) PASS: lldb-unit :: Target/./TargetTests/ExecutionContextTest.GetByteOrder (760 of 1785) PASS: lldb-api :: functionalities/breakpoint/breakpoint_locations/TestBreakpointLocations.py (761 of 1785) PASS: lldb-unit :: Utility/./UtilityTests/VASprintfTest.NoBufferResize (762 of 1785) PASS: lldb-unit :: Utility/./UtilityTests/StringListTest.GetMaxStringLengthEqualSize (763 of 1785) UNSUPPORTED: lldb-api :: tools/lldb-server/signal-filtering/TestGdbRemote_QPassSignals.py (764 of 1785) PASS: lldb-unit :: ScriptInterpreter/Python/./ScriptInterpreterPythonTests/PythonDataObjectsTest.TestPythonDictionaryToStructuredDictionary (765 of 1785) PASS: lldb-api :: commands/expression/namespace_local_var_same_name_obj_c/TestNamespaceLocalVarSameNameObjC.py (766 of 1785) PASS: lldb-api :: python_api/debugger/TestDebuggerAPI.py (767 of 1785) PASS: lldb-shell :: Driver/TestProcessAttach.test (768 of 1785) PASS: lldb-unit :: Utility/./UtilityTests/StringExtractorTest.GetHexU8_InvalidHex (769 of 1785) PASS: lldb-unit :: Utility/./UtilityTests/StreamTest.PutNHex8 (770 of 1785) PASS: lldb-unit :: Utility/./UtilityTests/StringExtractorTest.GetNameColonValueNoColon (771 of 1785) PASS: lldb-shell :: ObjectFile/ELF/PT_LOAD-overlap-PT_TLS.yaml (772 of 1785) PASS: lldb-unit :: Utility/./UtilityTests/ArchSpecTest.MergeFrom (773 of 1785) PASS: lldb-api :: python_api/symbol-context/TestSymbolContext.py (774 of 1785) PASS: lldb-api :: commands/expression/call-throws/TestCallThatThrows.py (775 of 1785) PASS: lldb-unit :: Process/minidump/./LLDBMinidumpTests/MinidumpParserTest.GetLinuxProcStatus_no_stream (776 of 1785) PASS: lldb-unit :: Utility/./UtilityTests/RangeDataVector.FindEntryThatContains (777 of 1785) PASS: lldb-unit :: Utility/./UtilityTests/LogTest.Unregister (778 of 1785) PASS: lldb-api :: functionalities/pre_run_dylibs/TestPreRunDylibs.py (779 of 1785) PASS: lldb-unit :: Utility/./UtilityTests/CompletionRequest.TryCompleteCurrentArgBad (780 of 1785) PASS: lldb-unit :: Utility/./UtilityTests/StreamTest.PutBytesAsRawHex8ToBigEndian (781 of 1785) PASS: lldb-api :: functionalities/thread/concurrent_events/TestConcurrentDelayedCrashWithBreakpointWatchpoint.py (782 of 1785) PASS: lldb-unit :: Process/minidump/./LLDBMinidumpTests/MinidumpParserTest.GetMemoryRegionInfo (783 of 1785) PASS: lldb-unit :: Process/gdb-remote/./ProcessGdbRemoteTests/GDBRemoteCommunicationClientTest.SendGetDataPacket (784 of 1785) PASS: lldb-shell :: SymbolFile/DWARF/array-sizes.s (785 of 1785) PASS: lldb-unit :: Process/gdb-remote/./ProcessGdbRemoteTests/GDBRemoteClientBaseTest.SendContinueAndWait (786 of 1785) PASS: lldb-unit :: Process/minidump/./LLDBMinidumpTests/MinidumpParserTest.GetLinuxProcStatus (787 of 1785) PASS: lldb-api :: functionalities/data-formatter/pyobjsynthprovider/TestPyObjSynthProvider.py (788 of 1785) PASS: lldb-unit :: Utility/./UtilityTests/AnsiTerminal.Incomplete (789 of 1785) UNSUPPORTED: lldb-api :: functionalities/tty/TestTerminal.py (790 of 1785) PASS: lldb-unit :: Utility/./UtilityTests/StringExtractorTest.DecodeHexU8_Exact (791 of 1785) PASS: lldb-api :: commands/statistics/basic/TestStats.py (792 of 1785) PASS: lldb-shell :: BuildScript/modes.test (793 of 1785) PASS: lldb-api :: functionalities/dead-strip/TestDeadStrip.py (794 of 1785) PASS: lldb-unit :: UnwindAssembly/x86/./UnwindAssemblyx86Tests/Testx86AssemblyInspectionEngine.TestPushR13 (795 of 1785) PASS: lldb-api :: lang/c/inlines/TestRedefinitionsInInlines.py (796 of 1785) PASS: lldb-unit :: Utility/./UtilityTests/BinaryStreamTest.PutSLEB128SevenBytes (797 of 1785) PASS: lldb-unit :: Utility/./UtilityTests/ArchSpecTest.Compatibility (798 of 1785) PASS: lldb-api :: functionalities/gdb_remote_client/TestThreadSelectionBug.py (799 of 1785) PASS: lldb-shell :: SymbolFile/DWARF/debug-types-basic.test (800 of 1785) PASS: lldb-unit :: ScriptInterpreter/Python/./ScriptInterpreterPythonTests/PythonDataObjectsTest.TestPythonString (801 of 1785) PASS: lldb-api :: functionalities/thread/concurrent_events/TestConcurrentWatchBreakDelay.py (802 of 1785) PASS: lldb-unit :: UnwindAssembly/x86/./UnwindAssemblyx86Tests/Testx86AssemblyInspectionEngine.TestPopR15 (803 of 1785) PASS: lldb-shell :: ObjectFile/ELF/section-overlap.yaml (804 of 1785) PASS: lldb-unit :: UnwindAssembly/x86/./UnwindAssemblyx86Tests/Testx86AssemblyInspectionEngine.TestPushECX (805 of 1785) UNSUPPORTED: lldb-api :: functionalities/data-formatter/data-formatter-stl/libstdcpp/vector/TestDataFormatterStdVector.py (806 of 1785) PASS: lldb-unit :: Utility/./UtilityTests/StringListTest.SplitIntoLinesSingleTrailingCR (807 of 1785) PASS: lldb-shell :: Reproducer/TestWorkingDir.test (808 of 1785) PASS: lldb-api :: functionalities/thread/concurrent_events/TestConcurrentTwoWatchpointsOneSignal.py (809 of 1785) PASS: lldb-unit :: Expression/./ExpressionTests/CppModuleConfigurationTest.Sysroot (810 of 1785) PASS: lldb-unit :: Utility/./UtilityTests/RangeTest.SlideZero (811 of 1785) PASS: lldb-unit :: Utility/./UtilityTests/FileSpecTest.RemoveLastPathComponent (812 of 1785) PASS: lldb-unit :: Process/gdb-remote/./ProcessGdbRemoteTests/GDBRemoteClientBaseTest.SendContinueDelegateStructuredDataReceipt (813 of 1785) UNSUPPORTED: lldb-api :: benchmarks/expression/TestExpressionCmd.py (814 of 1785) PASS: lldb-api :: functionalities/thread/concurrent_events/TestConcurrentTwoWatchpointThreads.py (815 of 1785) PASS: lldb-unit :: ScriptInterpreter/Python/./ScriptInterpreterPythonTests/PythonDataObjectsTest.TestPythonListManipulation (816 of 1785) PASS: lldb-shell :: SymbolFile/Breakpad/symtab-macho.test (817 of 1785) PASS: lldb-unit :: Editline/./EditlineTests/EditlineTestFixture.EditlineReceivesSingleLineText (818 of 1785) PASS: lldb-api :: lang/objc/hidden-ivars/TestHiddenIvars.py (819 of 1785) PASS: lldb-api :: functionalities/data-formatter/data-formatter-advanced/TestDataFormatterAdv.py (820 of 1785) PASS: lldb-shell :: Quit/TestQuitExitCode-30.test (821 of 1785) PASS: lldb-unit :: Process/gdb-remote/./ProcessGdbRemoteTests/GDBRemoteCommunicationClientTest.WriteRegister (822 of 1785) PASS: lldb-unit :: ScriptInterpreter/Python/./ScriptInterpreterPythonTests/PythonDataObjectsTest.TestPythonDictionaryValueEquality (823 of 1785) PASS: lldb-shell :: ObjectFile/PECOFF/dep-modules.yaml (824 of 1785) PASS: lldb-unit :: Utility/./UtilityTests/TimeoutTest.Format (825 of 1785) PASS: lldb-api :: lang/cpp/virtual/TestVirtual.py (826 of 1785) PASS: lldb-unit :: Host/./HostTests/MainLoopTest.UnmonitoredSignal (827 of 1785) PASS: lldb-unit :: UnwindAssembly/x86/./UnwindAssemblyx86Tests/Testx86AssemblyInspectionEngine.TestPopEBP (828 of 1785) PASS: lldb-api :: functionalities/modern-type-lookup/objc-modules/TestObjModulesModernTypeLookup.py (829 of 1785) PASS: lldb-api :: sanity/TestModuleCacheSanity.py (830 of 1785) PASS: lldb-api :: functionalities/multidebugger_commands/TestMultipleDebuggersCommands.py (831 of 1785) PASS: lldb-shell :: Driver/TestConvenienceVariables.test (832 of 1785) PASS: lldb-api :: functionalities/tail_call_frames/disambiguate_call_site/TestDisambiguateCallSite.py (833 of 1785) PASS: lldb-api :: commands/watchpoints/watchpoint_disable/TestWatchpointDisable.py (834 of 1785) PASS: lldb-api :: functionalities/data-formatter/data-formatter-stl/libcxx/variant/TestDataFormatterLibcxxVariant.py (835 of 1785) PASS: lldb-unit :: Utility/./UtilityTests/StatusTest.Formatv (836 of 1785) PASS: lldb-unit :: Utility/./UtilityTests/ScalarTest.Scalar_512 (837 of 1785) PASS: lldb-unit :: UnwindAssembly/x86/./UnwindAssemblyx86Tests/Testx86AssemblyInspectionEngine.TestSpArithx86_64Augmented (838 of 1785) PASS: lldb-unit :: Utility/./UtilityTests/StatusTest.ErrorConversion (839 of 1785) PASS: lldb-unit :: Expression/./ExpressionTests/CppModuleConfigurationTest.LinuxLocalLibCpp (840 of 1785) PASS: lldb-unit :: Utility/./UtilityTests/NameMatchesTest.Contains (841 of 1785) PASS: lldb-api :: functionalities/data-formatter/data-formatter-synth/TestDataFormatterSynth.py (842 of 1785) PASS: lldb-api :: lang/cpp/const_this/TestConstThis.py (843 of 1785) PASS: lldb-api :: lang/c/global_variables/TestGlobalVariables.py (844 of 1785) PASS: lldb-unit :: Interpreter/./InterpreterTests/OptionArgParserTest.toBoolean (845 of 1785) PASS: lldb-api :: functionalities/data-formatter/data-formatter-stl/libcxx/list/loop/TestDataFormatterLibcxxListLoop.py (846 of 1785) PASS: lldb-api :: functionalities/recursion/TestValueObjectRecursion.py (847 of 1785) PASS: lldb-unit :: Host/./HostTests/FileSystemTest.Exists (848 of 1785) PASS: lldb-api :: functionalities/testid/TestTestId.py (849 of 1785) PASS: lldb-unit :: Host/./HostTests/FileSystemTest.GetPermissions (850 of 1785) PASS: lldb-unit :: UnwindAssembly/x86/./UnwindAssemblyx86Tests/Testx86AssemblyInspectionEngine.TestPopR14 (851 of 1785) PASS: lldb-unit :: Expression/./ExpressionTests/DiagnosticManagerTest.GetStringPreserveOrder (852 of 1785) PASS: lldb-unit :: Utility/./UtilityTests/UUIDTest.RelationalOperators (853 of 1785) PASS: lldb-shell :: SymbolFile/Breakpad/line-table-discontinuous-file-ids.test (854 of 1785) PASS: lldb-unit :: Utility/./UtilityTests/FileSpecTest.EqualDotsWindows (855 of 1785) PASS: lldb-unit :: Utility/./UtilityTests/DataExtractorTest.GetCStrAtNullOffset (856 of 1785) PASS: lldb-api :: lang/cpp/unicode-literals/TestUnicodeLiterals.py (857 of 1785) PASS: lldb-unit :: Utility/./UtilityTests/StringListTest.InsertStringAtIndexStart (858 of 1785) PASS: lldb-unit :: Expression/./ExpressionTests/CppModuleConfigurationTest.IgnoreLibStdCpp (859 of 1785) PASS: lldb-unit :: Language/CPlusPlus/./LanguageCPlusPlusTests/CPlusPlusLanguage.CPlusPlusNameParser (860 of 1785) PASS: lldb-unit :: Language/Highlighting/./HighlighterTests/HighlighterTest.DefaultHighlighterWithCursorOutOfBounds (861 of 1785) PASS: lldb-unit :: Process/gdb-remote/./ProcessGdbRemoteTests/GDBRemoteClientBaseTest.InterruptNoResponse (862 of 1785) PASS: lldb-shell :: Settings/TestSettingsWrite.test (863 of 1785) PASS: lldb-unit :: Utility/./UtilityTests/ScalarTest.ExtractBitfield (864 of 1785) PASS: lldb-api :: functionalities/data-formatter/data-formatter-synthval/TestDataFormatterSynthVal.py (865 of 1785) PASS: lldb-api :: commands/frame/diagnose/array/TestArray.py (866 of 1785) PASS: lldb-api :: lang/objcxx/class-name-clash/TestNameClash.py (867 of 1785) PASS: lldb-api :: lang/cpp/call-function/TestCallCPPFunction.py (868 of 1785) PASS: lldb-unit :: Utility/./UtilityTests/LogChannelEnabledTest.log_options (869 of 1785) UNSUPPORTED: lldb-shell :: SymbolFile/NativePDB/ast-functions-msvc.cpp (870 of 1785) PASS: lldb-api :: functionalities/data-formatter/data-formatter-objc/TestDataFormatterObjCNSData.py (871 of 1785) XFAIL: lldb-shell :: Register/x86-64-ymm-write.test (872 of 1785) PASS: lldb-api :: commands/frame/var/TestFrameVar.py (873 of 1785) PASS: lldb-unit :: Utility/./UtilityTests/OptionsWithRawTest.EmptySuffix (874 of 1785) PASS: lldb-unit :: Utility/./UtilityTests/ConstStringTest.NullAndEmptyStates (875 of 1785) PASS: lldb-unit :: Host/./HostTests/Host.WaitStatusFormat (876 of 1785) PASS: lldb-unit :: Core/./LLDBCoreTests/MangledTest.ResultForValidName (877 of 1785) PASS: lldb-unit :: Utility/./UtilityTests/VASprintfTest.BufferResize (878 of 1785) PASS: lldb-unit :: Utility/./UtilityTests/ArchSpecTest.TripleComponentsWereSpecified (879 of 1785) PASS: lldb-api :: python_api/formatters/TestFormattersSBAPI.py (880 of 1785) PASS: lldb-api :: lang/objcxx/objcxx-ivar-vector/TestIvarVector.py (881 of 1785) PASS: lldb-unit :: Utility/./UtilityTests/RangeTest.EqualInvalid (882 of 1785) PASS: lldb-shell :: SymbolFile/DWARF/debug_ranges.s (883 of 1785) PASS: lldb-api :: functionalities/breakpoint/cpp_exception/TestCPPExceptionBreakpoint.py (884 of 1785) PASS: lldb-unit :: Utility/./UtilityTests/ScalarTest.Comparison (885 of 1785) PASS: lldb-api :: functionalities/archives/TestBSDArchives.py (886 of 1785) PASS: lldb-unit :: Utility/./UtilityTests/RangeTest.Constructor (887 of 1785) PASS: lldb-unit :: Utility/./UtilityTests/GeneratorTest.GetOrCreate (888 of 1785) PASS: lldb-api :: commands/platform/basic/TestPlatformCommand.py (889 of 1785) UNSUPPORTED: lldb-shell :: Register/x86-64-ymm16-write.test (890 of 1785) PASS: lldb-api :: functionalities/data-formatter/data-formatter-disabling/TestDataFormatterDisabling.py (891 of 1785) PASS: lldb-api :: functionalities/step_scripted/TestStepScripted.py (892 of 1785) PASS: lldb-unit :: Utility/./UtilityTests/UriParserTest.MinimalPath (893 of 1785) PASS: lldb-api :: lang/objc/foundation/TestObjCMethods.py (894 of 1785) PASS: lldb-unit :: UnwindAssembly/x86/./UnwindAssemblyx86Tests/Testx86AssemblyInspectionEngine.TestSimplei386ugmented (895 of 1785) PASS: lldb-shell :: Unwind/eh-frame-dwarf-unwind.test (896 of 1785) PASS: lldb-api :: macosx/indirect_symbol/TestIndirectSymbols.py (897 of 1785) PASS: lldb-unit :: Signals/./SignalsTests/UnixSignalsTest.VersionChange (898 of 1785) PASS: lldb-unit :: Process/gdb-remote/./ProcessGdbRemoteTests/GDBRemoteClientBaseTest.SendContinueAndAsyncPacket (899 of 1785) PASS: lldb-api :: commands/expression/po_verbosity/TestPoVerbosity.py (900 of 1785) PASS: lldb-api :: lang/objc/modules-cache/TestClangModulesCache.py (901 of 1785) PASS: lldb-unit :: Utility/./UtilityTests/StringListTest.GetMaxStringLengthEmpty (902 of 1785) PASS: lldb-unit :: Utility/./UtilityTests/NameMatchesTest.Ignore (903 of 1785) PASS: lldb-api :: functionalities/modern-type-lookup/basic/TestBasicModernTypeLookup.py (904 of 1785) PASS: lldb-unit :: ScriptInterpreter/Python/./ScriptInterpreterPythonTests/PythonDataObjectsTest.TestInstanceNameResolutionNoDot (905 of 1785) PASS: lldb-shell :: Driver/TestNoUseColor.test (906 of 1785) PASS: lldb-api :: functionalities/data-formatter/data-formatter-objc/TestDataFormatterObjCNSBundle.py (907 of 1785) PASS: lldb-api :: functionalities/thread/concurrent_events/TestConcurrentManyWatchpoints.py (908 of 1785) PASS: lldb-shell :: SymbolFile/NativePDB/disassembly.cpp (909 of 1785) PASS: lldb-shell :: BuildScript/compiler-full-path.test (910 of 1785) PASS: lldb-unit :: Utility/./UtilityTests/VMRange.IsValid (911 of 1785) PASS: lldb-api :: functionalities/breakpoint/breakpoint_set_restart/TestBreakpointSetRestart.py (912 of 1785) PASS: lldb-api :: python_api/sbvalue_persist/TestSBValuePersist.py (913 of 1785) PASS: lldb-unit :: Utility/./UtilityTests/RegularExpression.Empty (914 of 1785) PASS: lldb-unit :: Host/./HostTests/MainLoopTest.DetectsEOF (915 of 1785) PASS: lldb-unit :: Utility/./UtilityTests/BinaryStreamTest.PutULEB128MaxValue (916 of 1785) PASS: lldb-unit :: Host/./HostTests/HostInfoTest.GetAugmentedArchSpec (917 of 1785) PASS: lldb-unit :: Utility/./UtilityTests/TimerTest.CategoryTimesStats (918 of 1785) PASS: lldb-shell :: Reproducer/TestGDBRemoteRepro.test (919 of 1785) PASS: lldb-unit :: Utility/./UtilityTests/StringListTest.AppendListCStringArray (920 of 1785) PASS: lldb-unit :: Utility/./UtilityTests/RangeTest.NotEqual (921 of 1785) PASS: lldb-api :: functionalities/breakpoint/breakpoint_language/TestBreakpointLanguage.py (922 of 1785) PASS: lldb-unit :: Host/./HostTests/SocketAddressTest.Set (923 of 1785) PASS: lldb-api :: python_api/frame/inlines/TestInlinedFrame.py (924 of 1785) PASS: lldb-api :: python_api/process/read-mem-cstring/TestReadMemCString.py (925 of 1785) PASS: lldb-api :: commands/expression/top-level/TestTopLevelExprs.py (926 of 1785) PASS: lldb-shell :: SymbolFile/DWARF/dir-separator-no-comp-dir.s (927 of 1785) PASS: lldb-shell :: Host/TestCustomShell.test (928 of 1785) PASS: lldb-unit :: Expression/./ExpressionTests/CppModuleConfigurationTest.AmbiguousCLib (929 of 1785) PASS: lldb-api :: functionalities/thread/concurrent_events/TestConcurrentDelaySignalWatch.py (930 of 1785) PASS: lldb-unit :: Utility/./UtilityTests/StringListTest.AppendList (931 of 1785) PASS: lldb-shell :: SymbolFile/NativePDB/function-types-classes.cpp (932 of 1785) PASS: lldb-api :: functionalities/data-formatter/data-formatter-stl/libcxx/unordered/TestDataFormatterUnordered.py (933 of 1785) UNSUPPORTED: lldb-api :: lang/objc/objc-dynamic-value/TestObjCDynamicValue.py (934 of 1785) PASS: lldb-api :: lang/c/modules/TestCModules.py (935 of 1785) PASS: lldb-unit :: SymbolFile/DWARF/./SymbolFileDWARFTests/SymbolFileDWARFTests.TestAbilitiesForDWARF (936 of 1785) PASS: lldb-unit :: Process/minidump/./LLDBMinidumpTests/MinidumpParserTest.GetThreadContext_x86_32 (937 of 1785) PASS: lldb-unit :: SymbolFile/DWARF/./SymbolFileDWARFTests/SymbolFileDWARFTests.TestAbbrevOutOfOrder (938 of 1785) PASS: lldb-unit :: Utility/./UtilityTests/StreamTest.PutRawBytesToMixedEndian (939 of 1785) PASS: lldb-unit :: Utility/./UtilityTests/StringExtractorTest.GetHexBytesAvail_OddPair2 (940 of 1785) PASS: lldb-unit :: Utility/./UtilityTests/StreamTest.PutHex32ByteOrderBig (941 of 1785) PASS: lldb-api :: commands/expression/import-std-module/forward_list-basic/TestBasicForwardList.py (942 of 1785) PASS: lldb-api :: lang/objc/conflicting-definition/TestConflictingDefinition.py (943 of 1785) PASS: lldb-unit :: Utility/./UtilityTests/RangeTest.Clear (944 of 1785) PASS: lldb-unit :: Language/Highlighting/./HighlighterTests/HighlighterTest.ClangBraces (945 of 1785) PASS: lldb-api :: macosx/order/TestOrderFile.py (946 of 1785) PASS: lldb-api :: lang/objc/single-entry-dictionary/TestObjCSingleEntryDictionary.py (947 of 1785) PASS: lldb-api :: functionalities/thread/concurrent_events/TestConcurrentCrashWithBreak.py (948 of 1785) PASS: lldb-unit :: Language/Highlighting/./HighlighterTests/HighlighterTest.ClangEmptyInput (949 of 1785) PASS: lldb-shell :: ObjectFile/MachO/lc_version_min.yaml (950 of 1785) PASS: lldb-shell :: Quit/TestQuitExitCodeImplicit0.test (951 of 1785) PASS: lldb-api :: functionalities/deleted-executable/TestDeletedExecutable.py (952 of 1785) PASS: lldb-shell :: Driver/TestCommands.test (953 of 1785) UNSUPPORTED: lldb-shell :: Expr/TestIRMemoryMapWindows.test (954 of 1785) PASS: lldb-api :: lang/cpp/overloaded-functions/TestOverloadedFunctions.py (955 of 1785) PASS: lldb-unit :: Interpreter/./InterpreterTests/OptionArgParserTest.toChar (956 of 1785) PASS: lldb-unit :: ScriptInterpreter/Python/./ScriptInterpreterPythonTests/PythonDataObjectsTest.TestPythonListValueEquality (957 of 1785) PASS: lldb-unit :: ScriptInterpreter/Python/./ScriptInterpreterPythonTests/PythonDataObjectsTest.TestTypeNameResolutionNoDot (958 of 1785) UNSUPPORTED: lldb-shell :: Register/x86-64-zmm-write.test (959 of 1785) PASS: lldb-shell :: SymbolFile/NativePDB/s_constant.cpp (960 of 1785) PASS: lldb-unit :: Host/./HostTests/ConnectionFileDescriptorTest.TCPGetURIv4 (961 of 1785) PASS: lldb-api :: lang/cpp/global_variables/TestCPPGlobalVariables.py (962 of 1785) PASS: lldb-api :: commands/expression/import-std-module/list-basic/TestBasicList.py (963 of 1785) PASS: lldb-unit :: Utility/./UtilityTests/StringLexerTest.NextIfList (964 of 1785) PASS: lldb-unit :: Utility/./UtilityTests/StreamTest.PutRawBytesToLittleEndian (965 of 1785) PASS: lldb-shell :: Quit/TestQuitExitCode0.test (966 of 1785) PASS: lldb-unit :: Language/Highlighting/./HighlighterTests/HighlighterTest.ClangSquareBrackets (967 of 1785) PASS: lldb-shell :: ObjectFile/ELF/duplicate-section.yaml (968 of 1785) PASS: lldb-api :: macosx/find-app-in-bundle/TestFindAppInBundle.py (969 of 1785) PASS: lldb-unit :: Utility/./UtilityTests/UriParserTest.BracketedHostname (970 of 1785) PASS: lldb-unit :: Interpreter/./InterpreterTests/OptionArgParserTest.toScriptLanguage (971 of 1785) PASS: lldb-api :: commands/expression/import-std-module/shared_ptr/TestSharedPtr.py (972 of 1785) PASS: lldb-api :: commands/expression/persistent_types/TestPersistentTypes.py (973 of 1785) PASS: lldb-api :: functionalities/thread/concurrent_events/TestConcurrentManyBreakpoints.py (974 of 1785) PASS: lldb-api :: functionalities/data-formatter/data-formatter-stl/libcxx/multimap/TestDataFormatterLibccMultiMap.py (975 of 1785) PASS: lldb-api :: lang/cpp/nsimport/TestCppNsImport.py (976 of 1785) PASS: lldb-unit :: Language/Highlighting/./HighlighterTests/HighlighterTest.ClangCursorPosBeforeOtherToken (977 of 1785) PASS: lldb-shell :: ObjectFile/ELF/base-address.yaml (978 of 1785) UNSUPPORTED: lldb-api :: arm/breakpoint-it/TestBreakpointIt.py (979 of 1785) UNSUPPORTED: lldb-api :: functionalities/darwin_log/basic/TestDarwinLogBasic.py (980 of 1785) PASS: lldb-unit :: Utility/./UtilityTests/RecordReplayTest.InstrumentedBarPtr (981 of 1785) UNSUPPORTED: lldb-api :: functionalities/darwin_log/filter/exact_match/activity-chain/TestDarwinLogFilterMatchActivityChain.py (982 of 1785) PASS: lldb-unit :: UnwindAssembly/x86/./UnwindAssemblyx86Tests/Testx86AssemblyInspectionEngine.TestPopESI (983 of 1785) PASS: lldb-unit :: Symbol/./SymbolTests/PostfixExpression.ToDWARF (984 of 1785) PASS: lldb-api :: functionalities/data-formatter/data-formatter-stl/libcxx/optional/TestDataFormatterLibcxxOptional.py (985 of 1785) PASS: lldb-api :: functionalities/float-display/TestFloatDisplay.py (986 of 1785) PASS: lldb-api :: tools/lldb-server/TestGdbRemoteThreadsInStopReply.py (987 of 1785) UNSUPPORTED: lldb-api :: benchmarks/frame_variable/TestFrameVariableResponse.py (988 of 1785) PASS: lldb-unit :: Utility/./UtilityTests/BinaryStreamTest.PutSLEB128One (989 of 1785) PASS: lldb-unit :: Symbol/./SymbolTests/TestClangASTContext.TestUnifyAccessSpecifiers (990 of 1785) PASS: lldb-api :: commands/frame/select/TestFrameSelect.py (991 of 1785) PASS: lldb-unit :: UnwindAssembly/x86/./UnwindAssemblyx86Tests/Testx86AssemblyInspectionEngine.TestSpillRegToStackViaMOVx86_64 (992 of 1785) PASS: lldb-unit :: Utility/./UtilityTests/UriParserTest.BracketedHostnamePort (993 of 1785) PASS: lldb-unit :: Language/Highlighting/./HighlighterTests/HighlighterTest.ClangPPDirectives (994 of 1785) PASS: lldb-unit :: Utility/./UtilityTests/StringListTest.GetMaxStringLengthMixed (995 of 1785) PASS: lldb-unit :: Utility/./UtilityTests/CompletionRequest.DuplicateFilteringWithComments (996 of 1785) PASS: lldb-unit :: Utility/./UtilityTests/SerializationRountripTest.SerializeDeserializePod (997 of 1785) PASS: lldb-unit :: Process/gdb-remote/./ProcessGdbRemoteTests/GDBRemoteClientBaseTest.SendContinueAndInterrupt2PacketBug (998 of 1785) PASS: lldb-unit :: Utility/./UtilityTests/StreamTeeTest.Write (999 of 1785) PASS: lldb-api :: functionalities/stats_api/TestStatisticsAPI.py (1000 of 1785) PASS: lldb-api :: python_api/watchpoint/watchlocation/TestTargetWatchAddress.py (1001 of 1785) PASS: lldb-unit :: Utility/./UtilityTests/UriParserTest.LongPath (1002 of 1785) PASS: lldb-unit :: Utility/./UtilityTests/ProcessInstanceInfo.DumpTable_invalidUID (1003 of 1785) PASS: lldb-api :: lang/cpp/breakpoint-commands/TestCPPBreakpointCommands.py (1004 of 1785) PASS: lldb-api :: commands/disassemble/basic/TestDisassembleBreakpoint.py (1005 of 1785) PASS: lldb-unit :: SymbolFile/NativePDB/./SymbolFileNativePDBTests/PDBFPOProgramToDWARFExpressionTests.UnresolvedCyclicRegisterAssignmentReference (1006 of 1785) PASS: lldb-api :: types/TestFloatTypesExpr.py (1007 of 1785) PASS: lldb-unit :: Utility/./UtilityTests/BinaryStreamTest.PutSLEB128FiveBytes (1008 of 1785) PASS: lldb-api :: tools/lldb-server/TestLldbGdbServer.py (1009 of 1785) PASS: lldb-api :: lang/cpp/incomplete-types/TestCppIncompleteTypes.py (1010 of 1785) PASS: lldb-unit :: SymbolFile/NativePDB/./SymbolFileNativePDBTests/PDBFPOProgramToDWARFExpressionTests.InvalidOpUnary (1011 of 1785) UNSUPPORTED: lldb-shell :: SymbolFile/PDB/udt-layout.test (1012 of 1785) PASS: lldb-api :: functionalities/data-formatter/setvaluefromcstring/TestSetValueFromCString.py (1013 of 1785) PASS: lldb-unit :: Utility/./UtilityTests/StreamTest.PutHex32ByteOrderLittle (1014 of 1785) PASS: lldb-shell :: ObjectFile/Breakpad/uuid-matching-mac.test (1015 of 1785) PASS: lldb-api :: lang/objc/objc-optimized/TestObjcOptimized.py (1016 of 1785) PASS: lldb-unit :: Utility/./UtilityTests/UserIDResolver.GetUserName (1017 of 1785) PASS: lldb-unit :: Symbol/./SymbolTests/LineEntryTest.GetSameLineContiguousAddressRangeNestedInline (1018 of 1785) PASS: lldb-api :: functionalities/ubsan/basic/TestUbsanBasic.py (1019 of 1785) PASS: lldb-unit :: tools/lldb-server/tests/./LLDBServerTests/StandardStartupTest.TestStopReplyContainsThreadPcs (1020 of 1785) PASS: lldb-unit :: Core/./LLDBCoreTests/RichManglingContextTest.SwitchProvider (1021 of 1785) PASS: lldb-shell :: SymbolFile/DWARF/find-function-regex.cpp (1022 of 1785) PASS: lldb-api :: commands/command/script_alias/TestCommandScriptAlias.py (1023 of 1785) PASS: lldb-shell :: Quit/TestQuitExitCode30.test (1024 of 1785) PASS: lldb-unit :: Utility/./UtilityTests/RangeTest.Union (1025 of 1785) PASS: lldb-shell :: Minidump/dump-all.test (1026 of 1785) PASS: lldb-unit :: SymbolFile/NativePDB/./SymbolFileNativePDBTests/PDBFPOProgramToDWARFExpressionTests.InvalidOpBinary (1027 of 1785) PASS: lldb-api :: lang/cpp/dynamic-value-same-basename/TestDynamicValueSameBase.py (1028 of 1785) PASS: lldb-api :: commands/frame/recognizer/TestFrameRecognizer.py (1029 of 1785) PASS: lldb-unit :: ObjectFile/Breakpad/./ObjectFileBreakpadTests/FileRecord.parse (1030 of 1785) PASS: lldb-unit :: Utility/./UtilityTests/RangeTest.NotEqualInvalid (1031 of 1785) PASS: lldb-shell :: Breakpoint/split-dwarf5-debug-stroffsets.test (1032 of 1785) PASS: lldb-api :: commands/expression/import-std-module/conflicts/TestStdModuleWithConflicts.py (1033 of 1785) PASS: lldb-api :: sample_test/TestSampleTest.py (1034 of 1785) PASS: lldb-api :: functionalities/breakpoint/cpp/TestCPPBreakpointLocations.py (1035 of 1785) PASS: lldb-unit :: Process/minidump/./LLDBMinidumpTests/MinidumpParserTest.GetArchitecture (1036 of 1785) PASS: lldb-unit :: Process/minidump/./LLDBMinidumpTests/MinidumpParserTest.GetArchitectureWindows (1037 of 1785) PASS: lldb-api :: functionalities/data-formatter/frameformat_smallstruct/TestFrameFormatSmallStruct.py (1038 of 1785) PASS: lldb-unit :: Utility/./UtilityTests/BinaryStreamTest.PutULEB128NineBytes (1039 of 1785) PASS: lldb-shell :: Reproducer/TestDump.test (1040 of 1785) PASS: lldb-api :: lang/c/blocks/TestBlocks.py (1041 of 1785) PASS: lldb-unit :: Utility/./UtilityTests/StringExtractorTest.GetHexU8_Extra_NoEof (1042 of 1785) PASS: lldb-unit :: Utility/./UtilityTests/RegisterValueTest.GetSet8 (1043 of 1785) PASS: lldb-unit :: ScriptInterpreter/Python/./ScriptInterpreterPythonTests/PythonDataObjectsTest.TestPythonIntegerToStr (1044 of 1785) PASS: lldb-api :: functionalities/step-avoids-no-debug/TestStepNoDebug.py (1045 of 1785) PASS: lldb-unit :: Utility/./UtilityTests/LogChannelTest.List (1046 of 1785) PASS: lldb-api :: functionalities/breakpoint/inlined_breakpoints/TestInlinedBreakpoints.py (1047 of 1785) PASS: lldb-api :: lang/cpp/operators/TestCppOperators.py (1048 of 1785) PASS: lldb-unit :: ScriptInterpreter/Python/./ScriptInterpreterPythonTests/PythonDataObjectsTest.TestGlobalNameResolutionNoDot (1049 of 1785) UNSUPPORTED: lldb-api :: iohandler/completion/TestIOHandlerCompletion.py (1050 of 1785) PASS: lldb-api :: functionalities/breakpoint/source_regexp/TestSourceRegexBreakpoints.py (1051 of 1785) PASS: lldb-unit :: Utility/./UtilityTests/UUIDTest.Validity (1052 of 1785) PASS: lldb-unit :: Utility/./UtilityTests/StringExtractorTest.DecodeHexU8_InvalidHex (1053 of 1785) PASS: lldb-unit :: Utility/./UtilityTests/StreamTeeTest.Flush (1054 of 1785) PASS: lldb-api :: commands/watchpoints/hello_watchpoint/TestMyFirstWatchpoint.py (1055 of 1785) PASS: lldb-api :: lang/cpp/unsigned_types/TestUnsignedTypes.py (1056 of 1785) PASS: lldb-api :: lang/objc/blocks/TestObjCIvarsInBlocks.py (1057 of 1785) PASS: lldb-unit :: Utility/./UtilityTests/StringListTest.JoinSingle (1058 of 1785) PASS: lldb-unit :: Language/Highlighting/./HighlighterTests/HighlighterTest.ClangIdentifiers (1059 of 1785) PASS: lldb-api :: commands/frame/diagnose/complicated-expression/TestComplicatedExpression.py (1060 of 1785) PASS: lldb-unit :: Editline/./EditlineTests/EditlineTestFixture.EditlineReceivesMultiLineText (1061 of 1785) PASS: lldb-unit :: ScriptInterpreter/Python/./ScriptInterpreterPythonTests/PythonDataObjectsTest.TestPythonTupleToStructuredList (1062 of 1785) PASS: lldb-shell :: SymbolFile/Breakpad/line-table-missing-file.test (1063 of 1785) PASS: lldb-unit :: Utility/./UtilityTests/UriParserTest.BracketedHostnameWithColon (1064 of 1785) PASS: lldb-api :: commands/quit/TestQuit.py (1065 of 1785) PASS: lldb-unit :: Utility/./UtilityTests/StringListTest.Clear (1066 of 1785) PASS: lldb-api :: python_api/sbstructureddata/TestStructuredDataAPI.py (1067 of 1785) PASS: lldb-unit :: Utility/./UtilityTests/UUIDTest.SetFromStringRef (1068 of 1785) PASS: lldb-shell :: SymbolFile/DWARF/find-variable-file.cpp (1069 of 1785) PASS: lldb-shell :: SymbolFile/DWARF/gnu-style-compression.cpp (1070 of 1785) PASS: lldb-api :: functionalities/unwind/noreturn/TestNoreturnUnwind.py (1071 of 1785) PASS: lldb-unit :: Utility/./UtilityTests/StreamTest.PutULEB128 (1072 of 1785) PASS: lldb-api :: lang/objc/modules-auto-import/TestModulesAutoImport.py (1073 of 1785) UNSUPPORTED: lldb-api :: functionalities/data-formatter/data-formatter-stl/libcxx/function/TestLibCxxFunction.py (1074 of 1785) PASS: lldb-api :: functionalities/breakpoint/breakpoint_ids/TestBreakpointIDs.py (1075 of 1785) PASS: lldb-api :: functionalities/postmortem/netbsd-core/TestNetBSDCore.py (1076 of 1785) PASS: lldb-shell :: SymbolFile/NativePDB/function-types-calling-conv.cpp (1077 of 1785) PASS: lldb-api :: commands/watchpoints/watchpoint_commands/TestWatchpointCommands.py (1078 of 1785) PASS: lldb-api :: lang/objc/objc-static-method-stripped/TestObjCStaticMethodStripped.py (1079 of 1785) PASS: lldb-unit :: Process/minidump/./LLDBMinidumpTests/MinidumpParserTest.GetPidWow64 (1080 of 1785) PASS: lldb-unit :: Host/./HostTests/ProcessLaunchInfoTest.Constructor (1081 of 1785) PASS: lldb-unit :: Utility/./UtilityTests/OptionsWithRawTest.SingleWhitespaceInput (1082 of 1785) PASS: lldb-api :: functionalities/tsan/basic/TestTsanBasic.py (1083 of 1785) PASS: lldb-unit :: ObjectFile/Breakpad/./ObjectFileBreakpadTests/FuncRecord.parse (1084 of 1785) PASS: lldb-api :: functionalities/postmortem/minidump-new/TestMiniDumpUUID.py (1085 of 1785) PASS: lldb-shell :: SymbolFile/DWARF/find-qualified-variable.cpp (1086 of 1785) PASS: lldb-unit :: Utility/./UtilityTests/StreamTeeTest.CopyConstructor (1087 of 1785) PASS: lldb-unit :: Utility/./UtilityTests/BinaryStreamTest.PutULEB128ThreeBytes (1088 of 1785) PASS: lldb-shell :: Settings/TestStopCommandSourceOnError.test (1089 of 1785) PASS: lldb-api :: lang/c/local_variables/TestLocalVariables.py (1090 of 1785) UNSUPPORTED: lldb-api :: lang/objc/rdar-12408181/TestRdar12408181.py (1091 of 1785) PASS: lldb-unit :: Utility/./UtilityTests/Flags.Reset (1092 of 1785) PASS: lldb-unit :: Utility/./UtilityTests/BinaryStreamTest.PutULEB128FiveBytes (1093 of 1785) PASS: lldb-api :: functionalities/data-formatter/data-formatter-objc/TestDataFormatterObjCNSDate.py (1094 of 1785) PASS: lldb-api :: lang/objc/modules-incomplete/TestIncompleteModules.py (1095 of 1785) PASS: lldb-shell :: SymbolFile/DWARF/apple-index-is-used.cpp (1096 of 1785) PASS: lldb-unit :: Utility/./UtilityTests/StringExtractorTest.DecodeHexU8_InvalidHex2 (1097 of 1785) PASS: lldb-unit :: Expression/./ExpressionTests/CppModuleConfigurationTest.MissingLibCpp (1098 of 1785) PASS: lldb-api :: functionalities/data-formatter/ptr_ref_typedef/TestPtrRef2Typedef.py (1099 of 1785) PASS: lldb-unit :: Utility/./UtilityTests/StringExtractorTest.GetU32BigEndian (1100 of 1785) PASS: lldb-api :: api/listeners/TestListener.py (1101 of 1785) PASS: lldb-api :: lang/cpp/modules-import/TestCXXModulesImport.py (1102 of 1785) PASS: lldb-api :: functionalities/breakpoint/step_over_breakpoint/TestStepOverBreakpoint.py (1103 of 1785) PASS: lldb-unit :: Language/CPlusPlus/./LanguageCPlusPlusTests/CPlusPlusLanguage.MethodNameParsing (1104 of 1785) PASS: lldb-unit :: Expression/./ExpressionTests/DiagnosticManagerTest.AddDiagnostic (1105 of 1785) PASS: lldb-unit :: Utility/./UtilityTests/BinaryStreamTest.PutSLEB128SixBytes (1106 of 1785) PASS: lldb-unit :: Process/gdb-remote/./ProcessGdbRemoteTests/GDBRemoteClientBaseTest.SendContinueAndInterrupt (1107 of 1785) PASS: lldb-unit :: Language/Highlighting/./HighlighterTests/HighlighterTest.ClangComments (1108 of 1785) PASS: lldb-unit :: Host/./HostTests/FileSystemTest.Readable (1109 of 1785) PASS: lldb-api :: lang/objc/foundation/TestConstStrings.py (1110 of 1785) UNSUPPORTED: lldb-api :: functionalities/darwin_log/filter/regex/activity/TestDarwinLogFilterRegexActivity.py (1111 of 1785) PASS: lldb-api :: functionalities/thread/concurrent_events/TestConcurrentTwoBreakpointsOneDelaySignal.py (1112 of 1785) PASS: lldb-unit :: Host/./HostTests/SocketTest.TCPGetAddress (1113 of 1785) PASS: lldb-unit :: Utility/./UtilityTests/StreamTest.PutMaxHex64ByteOrderLittle (1114 of 1785) PASS: lldb-unit :: Host/./HostTests/SocketAddressTest.GetAddressInfo (1115 of 1785) PASS: lldb-api :: types/TestIntegerTypes.py (1116 of 1785) PASS: lldb-unit :: Utility/./UtilityTests/StringExtractorTest.GetHexU8_Underflow2 (1117 of 1785) PASS: lldb-unit :: UnwindAssembly/x86/./UnwindAssemblyx86Tests/Testx86AssemblyInspectionEngine.TestDisassemblyMidFunctionEpilogues (1118 of 1785) PASS: lldb-api :: functionalities/tail_call_frames/thread_step_out_message/TestArtificialFrameStepOutMessage.py (1119 of 1785) PASS: lldb-api :: lang/objc/objc++/TestObjCXX.py (1120 of 1785) PASS: lldb-unit :: Process/gdb-remote/./ProcessGdbRemoteTests/GDBRemoteCommunicationClientTest.GetMemoryRegionInfo (1121 of 1785) PASS: lldb-unit :: Utility/./UtilityTests/OptionsWithRawTest.SingleWordSuffix (1122 of 1785) PASS: lldb-unit :: Utility/./UtilityTests/ArgsTest.TestInsertArg (1123 of 1785) PASS: lldb-api :: functionalities/unwind/noreturn/module-end/TestNoReturnModuleEnd.py (1124 of 1785) PASS: lldb-api :: functionalities/breakpoint/objc/TestObjCBreakpoints.py (1125 of 1785) PASS: lldb-unit :: ScriptInterpreter/Python/./ScriptInterpreterPythonTests/PythonExceptionStateTest.TestAutoRestoreSemantics (1126 of 1785) PASS: lldb-unit :: Utility/./UtilityTests/StringListTest.ForRange (1127 of 1785) PASS: lldb-api :: python_api/exprpath_synthetic/TestExprPathSynthetic.py (1128 of 1785) PASS: lldb-unit :: Utility/./UtilityTests/ArchSpecTest.TestParseMachCPUDashSubtypeTripleSimple (1129 of 1785) PASS: lldb-api :: commands/expression/call-function/TestCallStopAndContinue.py (1130 of 1785) PASS: lldb-unit :: SymbolFile/NativePDB/./SymbolFileNativePDBTests/PDBFPOProgramToDWARFExpressionTests.UnknownOp (1131 of 1785) PASS: lldb-unit :: UnwindAssembly/x86/./UnwindAssemblyx86Tests/Testx86AssemblyInspectionEngine.TestPushImm (1132 of 1785) PASS: lldb-unit :: ScriptInterpreter/Python/./ScriptInterpreterPythonTests/PythonDataObjectsTest.TestPythonByteArray (1133 of 1785) PASS: lldb-unit :: UnwindAssembly/x86/./UnwindAssemblyx86Tests/Testx86AssemblyInspectionEngine.TestStackRealign8BitDisp_i386 (1134 of 1785) PASS: lldb-unit :: Utility/./UtilityTests/DataExtractorTest.GetBitfield (1135 of 1785) PASS: lldb-api :: lang/cpp/enum_types/TestCPP11EnumTypes.py (1136 of 1785) PASS: lldb-unit :: SymbolFile/NativePDB/./SymbolFileNativePDBTests/PDBFPOProgramToDWARFExpressionTests.SingleAssignmentRegisterRef (1137 of 1785) PASS: lldb-unit :: Host/./HostTests/NativeProcessProtocolTest.SetBreakpoint (1138 of 1785) PASS: lldb-api :: macosx/load-kext/TestLoadKext.py (1139 of 1785) PASS: lldb-unit :: ScriptInterpreter/Python/./ScriptInterpreterPythonTests/PythonDataObjectsTest.TestCallable (1140 of 1785) PASS: lldb-api :: functionalities/thread/concurrent_events/TestConcurrentTwoBreakpointThreads.py (1141 of 1785) PASS: lldb-unit :: Utility/./UtilityTests/RangeTest.ClearWithStarAddress (1142 of 1785) PASS: lldb-api :: commands/command/script/TestCommandScript.py (1143 of 1785) PASS: lldb-shell :: Reproducer/Modules/TestModuleCXX.test (1144 of 1785) PASS: lldb-shell :: Breakpoint/single-file-split-dwarf.test (1145 of 1785) PASS: lldb-shell :: BuildScript/script-args.test (1146 of 1785) PASS: lldb-unit :: Utility/./UtilityTests/StreamTest.PutHex8 (1147 of 1785) PASS: lldb-api :: functionalities/thread/concurrent_events/TestConcurrentCrashWithWatchpoint.py (1148 of 1785) PASS: lldb-unit :: UnwindAssembly/x86/./UnwindAssemblyx86Tests/Testx86AssemblyInspectionEngine.Testi386IgnoredRegisters (1149 of 1785) PASS: lldb-api :: lang/c/enum_types/TestEnumTypes.py (1150 of 1785) PASS: lldb-api :: lang/cpp/thread_local/TestThreadLocal.py (1151 of 1785) PASS: lldb-api :: functionalities/data-formatter/var-in-aggregate-misuse/TestVarInAggregateMisuse.py (1152 of 1785) PASS: lldb-unit :: Utility/./UtilityTests/LogTest.Register (1153 of 1785) PASS: lldb-api :: python_api/hello_world/TestHelloWorld.py (1154 of 1785) UNSUPPORTED: lldb-shell :: Breakpoint/case-insensitive.test (1155 of 1785) PASS: lldb-api :: functionalities/completion/TestCompletion.py (1156 of 1785) PASS: lldb-unit :: Utility/./UtilityTests/StreamTest.PutHex64ByteOrderBig (1157 of 1785) PASS: lldb-shell :: SymbolFile/DWARF/compilercontext.ll (1158 of 1785) PASS: lldb-unit :: Utility/./UtilityTests/StringListTest.DefaultConstructor (1159 of 1785) PASS: lldb-api :: lang/objc/objc-foundation-dictionary-empty/TestNSDictionary0.py (1160 of 1785) PASS: lldb-unit :: Utility/./UtilityTests/VMRange.CollectionContains (1161 of 1785) PASS: lldb-unit :: UnwindAssembly/x86/./UnwindAssemblyx86Tests/Testx86AssemblyInspectionEngine.TestPushR15 (1162 of 1785) PASS: lldb-unit :: Utility/./UtilityTests/StreamTest.ShiftOperatorUInts (1163 of 1785) PASS: lldb-unit :: Utility/./UtilityTests/UriParserTest.Empty (1164 of 1785) PASS: lldb-api :: commands/watchpoints/watchpoint_size/TestWatchpointSizes.py (1165 of 1785) PASS: lldb-unit :: Utility/./UtilityTests/UriParserTest.TypicalPortPath (1166 of 1785) PASS: lldb-unit :: Utility/./UtilityTests/StringExtractorTest.GetU64BigEndian (1167 of 1785) PASS: lldb-unit :: Utility/./UtilityTests/ConstStringTest.MangledCounterpart (1168 of 1785) PASS: lldb-api :: functionalities/thread/jump/TestThreadJump.py (1169 of 1785) PASS: lldb-api :: lang/objc/objc-class-method/TestObjCClassMethod.py (1170 of 1785) PASS: lldb-api :: functionalities/breakpoint/breakpoint_ignore_count/TestBreakpointIgnoreCount.py (1171 of 1785) PASS: lldb-api :: functionalities/load_unload/TestLoadUnload.py (1172 of 1785) UNSUPPORTED: lldb-api :: functionalities/thread/create_during_step/TestCreateDuringStep.py (1173 of 1785) PASS: lldb-api :: api/multithreaded/TestMultithreaded.py (1174 of 1785) PASS: lldb-unit :: Utility/./UtilityTests/StreamTeeTest.DefaultConstructor (1175 of 1785) PASS: lldb-api :: lang/cpp/template/TestTemplateArgs.py (1176 of 1785) PASS: lldb-unit :: Language/Highlighting/./HighlighterTests/HighlighterTest.ClangCursorPosEndOfLine (1177 of 1785) PASS: lldb-api :: functionalities/thread/backtrace_all/TestBacktraceAll.py (1178 of 1785) UNSUPPORTED: lldb-shell :: SymbolFile/PDB/calling-conventions.test (1179 of 1785) PASS: lldb-api :: functionalities/gdb_remote_client/TestPlatformClient.py (1180 of 1785) PASS: lldb-api :: commands/expression/call-function/TestCallStdStringFunction.py (1181 of 1785) PASS: lldb-shell :: ObjectFile/ELF/section-permissions.yaml (1182 of 1785) PASS: lldb-unit :: Expression/./ExpressionTests/DiagnosticManagerTest.GetStringNoDiags (1183 of 1785) PASS: lldb-unit :: Host/./HostTests/FileSystemTest.MakeAbsolute (1184 of 1785) PASS: lldb-unit :: Utility/./UtilityTests/StringListTest.LongestCommonPrefixEmpty (1185 of 1785) PASS: lldb-api :: commands/expression/unwind_expression/TestUnwindExpression.py (1186 of 1785) PASS: lldb-unit :: Utility/./UtilityTests/StringListTest.InsertStringAtIndexMove (1187 of 1785) PASS: lldb-api :: commands/expression/completion-in-lambda-and-unnnamed-class/TestCompletionInLambdaAndUnnamedClass.py (1188 of 1785) PASS: lldb-api :: functionalities/thread/concurrent_events/TestConcurrentManyCrash.py (1189 of 1785) PASS: lldb-shell :: ObjectFile/PECOFF/uuid.yaml (1190 of 1785) PASS: lldb-unit :: Host/./HostTests/MainLoopTest.Signal (1191 of 1785) PASS: lldb-api :: python_api/function_symbol/TestDisasmAPI.py (1192 of 1785) PASS: lldb-shell :: SymbolFile/Breakpad/symtab.test (1193 of 1785) UNSUPPORTED: lldb-api :: functionalities/thread/state/TestThreadStates.py (1194 of 1785) PASS: lldb-api :: functionalities/tail_call_frames/disambiguate_tail_call_seq/TestDisambiguateTailCallSeq.py (1195 of 1785) PASS: lldb-api :: functionalities/data-formatter/data-formatter-stl/libcxx/initializerlist/TestInitializerList.py (1196 of 1785) UNSUPPORTED: lldb-api :: commands/expression/macros/TestMacros.py (1197 of 1785) PASS: lldb-api :: python_api/sbvalue_const_addrof/TestSBValueConstAddrOf.py (1198 of 1785) PASS: lldb-api :: functionalities/data-formatter/data-formatter-categories/TestDataFormatterCategories.py (1199 of 1785) UNSUPPORTED: lldb-api :: benchmarks/libcxxmap/TestBenchmarkLibcxxMap.py (1200 of 1785) PASS: lldb-api :: linux/builtin_trap/TestBuiltinTrap.py (1201 of 1785) PASS: lldb-unit :: Utility/./UtilityTests/LogTest.LLDB_LOG_nullptr (1202 of 1785) PASS: lldb-api :: terminal/TestSTTYBeforeAndAfter.py (1203 of 1785) UNSUPPORTED: lldb-api :: functionalities/data-formatter/data-formatter-stl/libstdcpp/unique_ptr/TestDataFormatterStdUniquePtr.py (1204 of 1785) PASS: lldb-api :: macosx/nslog/TestDarwinNSLogOutput.py (1205 of 1785) PASS: lldb-unit :: Utility/./UtilityTests/StringExtractorTest.GetHexBytes_Underflow (1206 of 1785) PASS: lldb-unit :: Core/./LLDBCoreTests/RichManglingContextTest.IPDRealloc (1207 of 1785) PASS: lldb-api :: lang/objc/objc-ivar-offsets/TestObjCIvarOffsets.py (1208 of 1785) PASS: lldb-api :: api/check_public_api_headers/TestPublicAPIHeaders.py (1209 of 1785) PASS: lldb-unit :: Expression/./ExpressionTests/DiagnosticManagerTest.AppendMessageAttachToLastDiag (1210 of 1785) PASS: lldb-unit :: Utility/./UtilityTests/VMRange.ContainsAddr (1211 of 1785) PASS: lldb-shell :: Driver/LocalLLDBInit.test (1212 of 1785) PASS: lldb-unit :: Utility/./UtilityTests/FileSpecTest.CopyByAppendingPathComponent (1213 of 1785) PASS: lldb-api :: lang/cpp/dynamic-value/TestCppValueCast.py (1214 of 1785) PASS: lldb-unit :: Utility/./UtilityTests/StringListTest.ShiftMove (1215 of 1785) PASS: lldb-unit :: Symbol/./SymbolTests/TestClangASTContext.TestIsClangType (1216 of 1785) PASS: lldb-api :: source-manager/TestSourceManager.py (1217 of 1785) PASS: lldb-unit :: SymbolFile/NativePDB/./SymbolFileNativePDBTests/PDBFPOProgramToDWARFExpressionTests.UnresolvedRegisterAssignmentReference (1218 of 1785) PASS: lldb-unit :: Host/./HostTests/NativeProcessProtocolTest.ReadCStringFromMemory_MaxSize (1219 of 1785) FAIL: lldb-api :: tools/lldb-server/TestGdbRemoteAttach.py (1220 of 1785) ******************** TEST 'lldb-api :: tools/lldb-server/TestGdbRemoteAttach.py' FAILED ******************** lldb version 10.0.99 (http://labmaster3.local/git/llvm-project.git revision e6125fc0ec3418d6529b52f15853a06e000d478d) clang revision 9d5ad5e45fe40a24ceb11d6f9b046d8077c90778 llvm revision 9d5ad5e45fe40a24ceb11d6f9b046d8077c90778 LLDB library dir: /Users/buildslave/jenkins/workspace/lldb-cmake-sanitized/lldb-build/bin LLDB import library dir: /Users/buildslave/jenkins/workspace/lldb-cmake-sanitized/lldb-build/bin libstdcxx tests will not be run because: Don't know how to build with libstdcxx on macosx Skipping following debug info categories: ['dwo']

Hide Details

Session logs for test failures/errors/unexpected successes will go into directory '/Users/buildslave/jenkins/workspace/lldb-cmake-sanitized/test/logs' Command invoked: /Users/buildslave/jenkins/workspace/lldb-cmake-sanitized/llvm-project/lldb/test/API/dotest.py --arch=x86_64 -s /Users/buildslave/jenkins/workspace/lldb-cmake-sanitized/lldb-build/lldb-test-traces -S nm -u CXXFLAGS -u CFLAGS --executable /Users/buildslave/jenkins/workspace/lldb-cmake-sanitized/lldb-build/./bin/lldb --dsymutil /Users/buildslave/jenkins/workspace/lldb-cmake-sanitized/lldb-build/./bin/dsymutil --filecheck /Users/buildslave/jenkins/workspace/lldb-cmake-sanitized/lldb-build/./bin/FileCheck -C /Users/buildslave/jenkins/workspace/lldb-cmake-sanitized/host-compiler/bin/clang --codesign-identity lldb_codesign --server /Users/buildslave/jenkins/workspace/lldb-cmake-sanitized/lldb-build/./bin/debugserver --arch x86_64 --build-dir /Users/buildslave/jenkins/workspace/lldb-cmake-sanitized/lldb-build/lldb-test-build.noindex -s=/Users/buildslave/jenkins/workspace/lldb-cmake-sanitized/test/logs -t --env TERM=vt100 --env LLVM_LIBS_DIR=/Users/buildslave/jenkins/workspace/lldb-cmake-sanitized/lldb-build/./lib --build-dir /Users/buildslave/jenkins/workspace/lldb-cmake-sanitized/lldb-build/tools/lldb/lldb-test-build.noindex --lldb-module-cache-dir /Users/buildslave/jenkins/workspace/lldb-cmake-sanitized/lldb-build/tools/lldb/lldb-test-build.noindex/module-cache-lldb/lldb-api --clang-module-cache-dir /Users/buildslave/jenkins/workspace/lldb-cmake-sanitized/lldb-build/tools/lldb/lldb-test-build.noindex/module-cache-clang/lldb-api /Users/buildslave/jenkins/workspace/lldb-cmake-sanitized/llvm-project/lldb/packages/Python/lldbsuite/test/tools/lldb-server -p TestGdbRemoteAttach.py Change dir to: /Users/buildslave/jenkins/workspace/lldb-cmake-sanitized/llvm-project/lldb/packages/Python/lldbsuite/test/tools/lldb-server runCmd: settings set symbols.enable-external-lookup false output:

Hide Details

runCmd: settings set plugin.process.gdb-remote.packet-timeout 60 output:

Hide Details

runCmd: settings set symbols.clang-modules-cache-path "/Users/buildslave/jenkins/workspace/lldb-cmake-sanitized/lldb-build/tools/lldb/lldb-test-build.noindex/module-cache-lldb/lldb-api" output:

Hide Details

runCmd: settings set use-color false output:

Hide Details

Adding tearDown hook: def shutdown_named_pipe(): # Close the pipe. try: named_pipe.close() except: print("failed to close named pipe") None

Hide Details

# Delete the pipe. try: os.remove(named_pipe_path) except: print("failed to delete named pipe: {}".format(named_pipe_path)) None

Hide Details

# Delete the temp directory. try: os.rmdir(temp_dir) except: print( "failed to delete temp dir: {}, directory contents: '{}'".format( temp_dir, os.listdir(temp_dir))) None

Hide Details

Hide Details

Adding tearDown hook: def shutdown_process_for_attach(): try: inferior.terminate() except: logger.warning( "failed to terminate inferior process for attach: {}; ignoring".format( sys.exc_info()[0]))

Hide Details

Hide Details

Adding tearDown hook: def cleanupSubprocesses(self): # Ensure any subprocesses are cleaned up for p in self.subprocesses: p.terminate() del p del self.subprocesses[:] # Ensure any forked processes are cleaned up for pid in self.forkedProcessPids: if os.path.exists("/proc/" + str(pid)): os.kill(pid, signal.SIGTERM)

Hide Details

Hide Details

Adding tearDown hook: def shutdown_debug_monitor(): try: server.terminate() except: logger.warning( "failed to terminate server for debug monitor: {}; ignoring".format( sys.exc_info()[0]))

Hide Details

Hide Details

Adding tearDown hook: def shutdown_socket(): if sock: try: # send the kill packet so lldb-server shuts down gracefully sock.sendall(GdbRemoteTestCaseBase._GDBREMOTE_KILL_PACKET) except: logger.warning( "failed to send kill packet to debug monitor: {}; ignoring".format( sys.exc_info()[0]))

Hide Details

try: sock.close() except: logger.warning( "failed to close socket to debug monitor: {}; ignoring".format( sys.exc_info()[0]))

Hide Details

Hide Details

FAIL: LLDB (/Users/buildslave/jenkins/workspace/lldb-cmake-sanitized/host-compiler/bin/clang-10-x86_64) :: test_attach_with_vAttach_debugserver (TestGdbRemoteAttach.TestGdbRemoteAttach) Executing tearDown hook: def shutdown_socket(): if sock: try: # send the kill packet so lldb-server shuts down gracefully sock.sendall(GdbRemoteTestCaseBase._GDBREMOTE_KILL_PACKET) except: logger.warning( "failed to send kill packet to debug monitor: {}; ignoring".format( sys.exc_info()[0]))

Hide Details

try: sock.close() except: logger.warning( "failed to close socket to debug monitor: {}; ignoring".format( sys.exc_info()[0]))

Hide Details

Hide Details

Executing tearDown hook: def shutdown_debug_monitor(): try: server.terminate() except: logger.warning( "failed to terminate server for debug monitor: {}; ignoring".format( sys.exc_info()[0]))

Hide Details

Hide Details

Executing tearDown hook: def cleanupSubprocesses(self): # Ensure any subprocesses are cleaned up for p in self.subprocesses: p.terminate() del p del self.subprocesses[:] # Ensure any forked processes are cleaned up for pid in self.forkedProcessPids: if os.path.exists("/proc/" + str(pid)): os.kill(pid, signal.SIGTERM)

Hide Details

Hide Details

Executing tearDown hook: def shutdown_process_for_attach(): try: inferior.terminate() except: logger.warning( "failed to terminate inferior process for attach: {}; ignoring".format( sys.exc_info()[0]))

Hide Details

Hide Details

Executing tearDown hook: def shutdown_named_pipe(): # Close the pipe. try: named_pipe.close() except: print("failed to close named pipe") None

Hide Details

# Delete the pipe. try: os.remove(named_pipe_path) except: print("failed to delete named pipe: {}".format(named_pipe_path)) None

Hide Details

# Delete the temp directory. try: os.rmdir(temp_dir) except: print( "failed to delete temp dir: {}, directory contents: '{}'".format( temp_dir, os.listdir(temp_dir))) None

Hide Details

Hide Details

runCmd: settings set symbols.enable-external-lookup false output:

Hide Details

runCmd: settings set plugin.process.gdb-remote.packet-timeout 60 output:

Hide Details

runCmd: settings set symbols.clang-modules-cache-path "/Users/buildslave/jenkins/workspace/lldb-cmake-sanitized/lldb-build/tools/lldb/lldb-test-build.noindex/module-cache-lldb/lldb-api" output:

Hide Details

runCmd: settings set use-color false output:

Hide Details

UNSUPPORTED: LLDB (/Users/buildslave/jenkins/workspace/lldb-cmake-sanitized/host-compiler/bin/clang-10-x86_64) :: test_attach_with_vAttach_llgs (TestGdbRemoteAttach.TestGdbRemoteAttach) (llgs tests) Restore dir to: /Users/buildslave/jenkins/workspace/lldb-cmake-sanitized/lldb-build/tools/lldb/test ====================================================================== FAIL: test_attach_with_vAttach_debugserver (TestGdbRemoteAttach.TestGdbRemoteAttach) ---------------------------------------------------------------------- Traceback (most recent call last): File "/Users/buildslave/jenkins/workspace/lldb-cmake-sanitized/llvm-project/lldb/packages/Python/lldbsuite/test/decorators.py", line 141, in wrapper func(*args, **kwargs) File "/Users/buildslave/jenkins/workspace/lldb-cmake-sanitized/llvm-project/lldb/packages/Python/lldbsuite/test/tools/lldb-server/TestGdbRemoteAttach.py", line 60, in test_attach_with_vAttach_debugserver self.attach_with_vAttach() File "/Users/buildslave/jenkins/workspace/lldb-cmake-sanitized/llvm-project/lldb/packages/Python/lldbsuite/test/tools/lldb-server/TestGdbRemoteAttach.py", line 28, in attach_with_vAttach inferior.pid, True)) AssertionError: False is not True Config=x86_64-/Users/buildslave/jenkins/workspace/lldb-cmake-sanitized/host-compiler/bin/clang-10 ---------------------------------------------------------------------- Ran 2 tests in 10.650s

Hide Details

RESULT: FAILED (0 passes, 1 failures, 0 errors, 1 skipped, 0 expected failures, 0 unexpected successes)

Hide Details

******************** PASS: lldb-api :: commands/source/info/TestSourceInfo.py (1221 of 1785) PASS: lldb-unit :: Utility/./UtilityTests/StringListTest.CopyListEmpty (1222 of 1785) PASS: lldb-shell :: ObjectFile/MachO/lc_build_version.yaml (1223 of 1785) PASS: lldb-unit :: Utility/./UtilityTests/StringLexerTest.HasAtLeast (1224 of 1785) UNSUPPORTED: lldb-shell :: SymbolFile/DWARF/debug-types-expressions.test (1225 of 1785) PASS: lldb-api :: commands/frame/language/TestGuessLanguage.py (1226 of 1785) PASS: lldb-shell :: ObjectFile/Breakpad/discontiguous-sections.test (1227 of 1785) PASS: lldb-api :: functionalities/data-formatter/user-format-vs-summary/TestUserFormatVsSummary.py (1228 of 1785) PASS: lldb-shell :: SymbolFile/DWARF/debug_rnglists.s (1229 of 1785) PASS: lldb-unit :: Expression/./ExpressionTests/DiagnosticManagerTest.GetStringBasic (1230 of 1785) PASS: lldb-unit :: tools/lldb-server/tests/./LLDBServerTests/TestBase.DebugserverEnv (1231 of 1785) PASS: lldb-shell :: SymbolFile/DWARF/split-dwarf-inlining.cpp (1232 of 1785) PASS: lldb-unit :: UnwindAssembly/x86/./UnwindAssemblyx86Tests/Testx86AssemblyInspectionEngine.TestPopRBP (1233 of 1785) PASS: lldb-unit :: Utility/./UtilityTests/StreamTest.PutSLEB128 (1234 of 1785) PASS: lldb-api :: functionalities/breakpoint/consecutive_breakpoints/TestConsecutiveBreakpoints.py (1235 of 1785) PASS: lldb-api :: lang/cpp/class_static/TestStaticVariables.py (1236 of 1785) UNSUPPORTED: lldb-api :: commands/expression/multiline-completion/TestMultilineCompletion.py (1237 of 1785) PASS: lldb-api :: commands/settings/quoting/TestQuoting.py (1238 of 1785) PASS: lldb-api :: functionalities/data-formatter/data-formatter-ptr-to-array/TestPtrToArrayFormatting.py (1239 of 1785) PASS: lldb-unit :: Utility/./UtilityTests/ArgsTest.TestQuotedUnknownEscape (1240 of 1785) PASS: lldb-api :: functionalities/breakpoint/scripted_bkpt/TestScriptedResolver.py (1241 of 1785) PASS: lldb-api :: functionalities/data-formatter/boolreference/TestFormattersBoolRefPtr.py (1242 of 1785) PASS: lldb-api :: functionalities/show_location/TestShowLocationDwarf5.py (1243 of 1785) PASS: lldb-api :: commands/expression/pr35310/TestExprsBug35310.py (1244 of 1785) PASS: lldb-api :: functionalities/data-formatter/data-formatter-objc/TestDataFormatterObjCNSContainer.py (1245 of 1785) PASS: lldb-unit :: Core/./LLDBCoreTests/StreamCallbackTest.Callback (1246 of 1785) PASS: lldb-unit :: Expression/./ExpressionTests/DiagnosticManagerTest.GetStringSeverityLabels (1247 of 1785) PASS: lldb-api :: python_api/rdar-12481949/Test-rdar-12481949.py (1248 of 1785) PASS: lldb-unit :: Expression/./ExpressionTests/CppModuleConfigurationTest.UnrelatedLibrary (1249 of 1785) PASS: lldb-unit :: Utility/./UtilityTests/ConstStringTest.CompareConstString (1250 of 1785) PASS: lldb-unit :: Expression/./ExpressionTests/CppModuleConfigurationTest.Xcode (1251 of 1785) PASS: lldb-shell :: Minidump/disassemble-no-module.yaml (1252 of 1785) PASS: lldb-unit :: Utility/./UtilityTests/StreamTest.PutPtr (1253 of 1785) PASS: lldb-shell :: Reproducer/TestReuseDirectory.test (1254 of 1785) PASS: lldb-unit :: Utility/./UtilityTests/Flags.AnySet (1255 of 1785) PASS: lldb-api :: lang/c/stepping/TestStepAndBreakpoints.py (1256 of 1785) PASS: lldb-shell :: SymbolFile/DWARF/find-basic-function.cpp (1257 of 1785) PASS: lldb-api :: commands/expression/import-std-module/queue/TestQueue.py (1258 of 1785) PASS: lldb-unit :: Utility/./UtilityTests/FileSpecTest.GuessPathStyle (1259 of 1785) PASS: lldb-api :: lang/cpp/namespace_definitions/TestNamespaceDefinitions.py (1260 of 1785) PASS: lldb-api :: commands/command/invalid-args/TestInvalidArgsCommand.py (1261 of 1785) PASS: lldb-api :: functionalities/modern-type-lookup/libcxx/TestLibCxxModernTypeLookup.py (1262 of 1785) PASS: lldb-unit :: Utility/./UtilityTests/ProcessInstanceInfo.Dump (1263 of 1785) PASS: lldb-shell :: ObjectFile/ELF/PT_LOAD-overlap-PT_INTERP.yaml (1264 of 1785) PASS: lldb-api :: functionalities/breakpoint/breakpoint_by_line_and_column/TestBreakpointByLineAndColumn.py (1265 of 1785) PASS: lldb-unit :: Process/minidump/./LLDBMinidumpTests/MinidumpParserTest.GetPidWindows (1266 of 1785) PASS: lldb-api :: python_api/watchpoint/TestWatchpointIter.py (1267 of 1785) PASS: lldb-unit :: Utility/./UtilityTests/StringExtractorTest.GetHexBytes_FullString (1268 of 1785) PASS: lldb-unit :: Utility/./UtilityTests/TimerTest.CategoryTimes2 (1269 of 1785) PASS: lldb-api :: tools/lldb-server/TestGdbRemoteExitCode.py (1270 of 1785) PASS: lldb-api :: python_api/findvalue_duplist/TestSBFrameFindValue.py (1271 of 1785) PASS: lldb-unit :: Process/gdb-remote/./ProcessGdbRemoteTests/GDBRemoteCommunicationClientTest.GetMemoryRegionInfoInvalidResponse (1272 of 1785) PASS: lldb-unit :: Utility/./UtilityTests/OptionsWithRawTest.WhitespaceInput (1273 of 1785) PASS: lldb-unit :: UnwindAssembly/x86/./UnwindAssemblyx86Tests/Testx86AssemblyInspectionEngine.Test32BitOnlyInstruction (1274 of 1785) UNSUPPORTED: lldb-shell :: SymbolFile/PDB/pointers.test (1275 of 1785) PASS: lldb-unit :: Utility/./UtilityTests/StringListTest.JoinMultiCharSeparator (1276 of 1785) PASS: lldb-shell :: Commands/CommandScriptImmediateOutput/CommandScriptImmediateOutputConsole.test (1277 of 1785) PASS: lldb-api :: python_api/interpreter/TestCommandInterpreterAPI.py (1278 of 1785) UNSUPPORTED: lldb-api :: benchmarks/turnaround/TestCompileRunToBreakpointTurnaround.py (1279 of 1785) PASS: lldb-api :: lang/objc/foundation/TestRuntimeTypes.py (1280 of 1785) UNSUPPORTED: lldb-shell :: SymbolFile/PDB/compilands.test (1281 of 1785) PASS: lldb-api :: tools/lldb-server/TestGdbRemote_qThreadStopInfo.py (1282 of 1785) PASS: lldb-unit :: UnwindAssembly/x86/./UnwindAssemblyx86Tests/Testx86AssemblyInspectionEngine.TestPushEBP (1283 of 1785) UNSUPPORTED: lldb-shell :: SymbolFile/PDB/type-quals.test (1284 of 1785) PASS: lldb-shell :: Minidump/breakpad-symbols.test (1285 of 1785) PASS: lldb-api :: tools/lldb-server/TestGdbRemoteSingleStep.py (1286 of 1785) PASS: lldb-shell :: Minidump/Windows/find-module.test (1287 of 1785) PASS: lldb-api :: functionalities/postmortem/mach-core/TestMachCore.py (1288 of 1785) PASS: lldb-unit :: Utility/./UtilityTests/RegularExpression.Valid (1289 of 1785) PASS: lldb-api :: functionalities/data-formatter/typedef_array/TestTypedefArray.py (1290 of 1785) PASS: lldb-api :: functionalities/gdb_remote_client/TestNestedRegDefinitions.py (1291 of 1785) UNSUPPORTED: lldb-api :: commands/gui/basic/TestGuiBasic.py (1292 of 1785) PASS: lldb-unit :: Target/./TargetTests/ExecutionContextTest.GetByteOrderProcess (1293 of 1785) PASS: lldb-api :: tools/lldb-server/inferior-crash/TestGdbRemoteSegFault.py (1294 of 1785) PASS: lldb-unit :: Utility/./UtilityTests/StreamTeeTest.AppendStream (1295 of 1785) PASS: lldb-api :: lang/objc/radar-9691614/TestObjCMethodReturningBOOL.py (1296 of 1785) PASS: lldb-unit :: ObjectFile/Breakpad/./ObjectFileBreakpadTests/InfoRecord.parse (1297 of 1785) PASS: lldb-api :: lang/cpp/std-function-step-into-callable/TestStdFunctionStepIntoCallable.py (1298 of 1785) PASS: lldb-api :: functionalities/breakpoint/breakpoint_names/TestBreakpointNames.py (1299 of 1785) PASS: lldb-unit :: ObjectFile/Breakpad/./ObjectFileBreakpadTests/StackCFIRecord.parse (1300 of 1785) UNSUPPORTED: lldb-shell :: SymbolFile/PDB/expressions.test (1301 of 1785) PASS: lldb-unit :: Utility/./UtilityTests/StringListTest.InsertStringAtIndexStdString (1302 of 1785) UNSUPPORTED: lldb-api :: commands/expression/completion-crash1/TestCompletionCrash1.py (1303 of 1785) UNSUPPORTED: lldb-api :: functionalities/unwind/standard/TestStandardUnwind.py (1304 of 1785) PASS: lldb-unit :: Process/minidump/./LLDBMinidumpTests/MinidumpParserTest.MinidumpDuplicateModuleMinAddress (1305 of 1785) PASS: lldb-unit :: Process/minidump/./LLDBMinidumpTests/MinidumpParserTest.GetPid (1306 of 1785) PASS: lldb-api :: functionalities/data-formatter/data-formatter-stl/libcxx/bitset/TestDataFormatterLibcxxBitset.py (1307 of 1785) PASS: lldb-unit :: Utility/./UtilityTests/AnsiTerminal.Basic (1308 of 1785) PASS: lldb-api :: functionalities/ptr_refs/TestPtrRefs.py (1309 of 1785) PASS: lldb-unit :: Utility/./UtilityTests/LogChannelEnabledTest.LLDB_LOG_ERROR (1310 of 1785) PASS: lldb-shell :: SymbolFile/DWARF/dir-separator-no-comp-dir-relative-name.s (1311 of 1785) PASS: lldb-unit :: SymbolFile/NativePDB/./SymbolFileNativePDBTests/PDBFPOProgramToDWARFExpressionTests.MissingTargetRegister (1312 of 1785) PASS: lldb-shell :: ObjectFile/ELF/section-addresses.yaml (1313 of 1785) PASS: lldb-api :: python_api/function_symbol/TestSymbolAPI.py (1314 of 1785) PASS: lldb-shell :: ObjectFile/ELF/basic-info.yaml (1315 of 1785) PASS: lldb-shell :: Quit/TestQuitExitCodeTooManyArgs.test (1316 of 1785) PASS: lldb-unit :: Host/./HostTests/SocketTest.DomainGetConnectURI (1317 of 1785) PASS: lldb-unit :: Utility/./UtilityTests/FileSpecTest.EqualDotsPosix (1318 of 1785) PASS: lldb-unit :: Target/./TargetTests/ModuleCacheTest.GetAndPutStrangeHostname (1319 of 1785) PASS: lldb-unit :: Utility/./UtilityTests/RangeTest.DoesAdjoinOrIntersect (1320 of 1785) PASS: lldb-api :: tools/lldb-server/TestGdbRemoteRegisterState.py (1321 of 1785) UNSUPPORTED: lldb-api :: python_api/event/TestEvents.py (1322 of 1785) PASS: lldb-unit :: UnwindAssembly/x86/./UnwindAssemblyx86Tests/Testx86AssemblyInspectionEngine.TestAddESP (1323 of 1785) PASS: lldb-unit :: Utility/./UtilityTests/CompletionRequest.DuplicateFiltering (1324 of 1785) PASS: lldb-unit :: debugserver/./debugserverTests/RNBSocket.AnyListen (1325 of 1785) PASS: lldb-api :: functionalities/postmortem/elf-core/gcore/TestGCore.py (1326 of 1785) PASS: lldb-api :: commands/settings/TestSettings.py (1327 of 1785) PASS: lldb-unit :: Symbol/./SymbolTests/Type.CompilerContextPattern (1328 of 1785) UNSUPPORTED: lldb-shell :: SymbolFile/PDB/typedefs.test (1329 of 1785) PASS: lldb-api :: functionalities/set-data/TestSetData.py (1330 of 1785) PASS: lldb-api :: tools/lldb-server/TestGdbRemoteHostInfo.py (1331 of 1785) PASS: lldb-unit :: Process/minidump/./LLDBMinidumpTests/RegisterContextMinidump.ConvertMinidumpContext_x86_32 (1332 of 1785) PASS: lldb-api :: macosx/safe-to-func-call/TestSafeFuncCalls.py (1333 of 1785) PASS: lldb-api :: functionalities/data-formatter/data-formatter-stl/libcxx/multiset/TestDataFormatterLibcxxMultiSet.py (1334 of 1785) PASS: lldb-api :: commands/apropos/basic/TestApropos.py (1335 of 1785) PASS: lldb-shell :: SymbolFile/NativePDB/nested-types.cpp (1336 of 1785) PASS: lldb-api :: python_api/frame/TestFrames.py (1337 of 1785) PASS: lldb-api :: functionalities/thread/concurrent_events/TestConcurrentNWatchNBreak.py (1338 of 1785) PASS: lldb-api :: commands/command/history/TestCommandHistory.py (1339 of 1785) PASS: lldb-api :: functionalities/signal/TestSendSignal.py (1340 of 1785) PASS: lldb-unit :: UnwindAssembly/x86/./UnwindAssemblyx86Tests/Testx86AssemblyInspectionEngine.TestPushEDX (1341 of 1785) PASS: lldb-api :: functionalities/data-formatter/data-formatter-globals/TestDataFormatterGlobals.py (1342 of 1785) UNSUPPORTED: lldb-api :: tools/lldb-server/TestGdbRemoteAuxvSupport.py (1343 of 1785) PASS: lldb-unit :: Utility/./UtilityTests/RangeTest.ContainsEndInclusive (1344 of 1785) PASS: lldb-unit :: Host/./HostTests/NativeProcessProtocolTest.ReadMemoryWithoutTrap (1345 of 1785) PASS: lldb-api :: lang/cpp/inlines/TestInlines.py (1346 of 1785) PASS: lldb-api :: commands/gui/invalid-args/TestInvalidArgsGui.py (1347 of 1785) PASS: lldb-api :: commands/process/attach/TestProcessAttach.py (1348 of 1785) PASS: lldb-unit :: Host/./HostTests/NativeProcessProtocolTest.SetBreakpointFailRead (1349 of 1785) PASS: lldb-api :: functionalities/abbreviation/TestCommonShortSpellings.py (1350 of 1785) UNSUPPORTED: lldb-api :: benchmarks/expression/TestRepeatedExprs.py (1351 of 1785) PASS: lldb-unit :: Utility/./UtilityTests/ArgsTest.ReplaceArgumentAtIndexLonger (1352 of 1785) PASS: lldb-unit :: Utility/./UtilityTests/StringLexerTest.Next (1353 of 1785) PASS: lldb-unit :: Utility/./UtilityTests/BinaryStreamTest.PutULEB128SixBytes (1354 of 1785) PASS: lldb-api :: functionalities/breakpoint/move_nearest/TestMoveNearest.py (1355 of 1785) UNSUPPORTED: lldb-shell :: SymbolFile/PDB/enums-layout.test (1356 of 1785) PASS: lldb-api :: lang/objc/rdar-10967107/TestRdar10967107.py (1357 of 1785) PASS: lldb-unit :: Utility/./UtilityTests/ScalarTest.CastOperations (1358 of 1785) PASS: lldb-unit :: Process/minidump/./LLDBMinidumpTests/MinidumpParserTest.FindMemoryRangeWithFullMemoryMinidump (1359 of 1785) PASS: lldb-shell :: SymbolFile/Breakpad/line-table.test (1360 of 1785) PASS: lldb-unit :: Language/Highlighting/./HighlighterTests/HighlighterTest.HighlighterSelectionPath (1361 of 1785) UNSUPPORTED: lldb-api :: functionalities/darwin_log/filter/regex/activity-chain/TestDarwinLogFilterRegexActivityChain.py (1362 of 1785) PASS: lldb-unit :: ScriptInterpreter/Python/./ScriptInterpreterPythonTests/PythonDataObjectsTest.TestResetting (1363 of 1785) PASS: lldb-unit :: Utility/./UtilityTests/IndexToObjectTest.ObjectForIndex (1364 of 1785) UNSUPPORTED: lldb-api :: functionalities/data-formatter/data-formatter-stl/libstdcpp/iterator/TestDataFormatterStdIterator.py (1365 of 1785) PASS: lldb-unit :: ScriptInterpreter/Python/./ScriptInterpreterPythonTests/PythonDataObjectsTest.TestPythonStringToStructuredString (1366 of 1785) PASS: lldb-unit :: Expression/./ExpressionTests/DiagnosticManagerTest.PutString (1367 of 1785) PASS: lldb-unit :: UnwindAssembly/x86/./UnwindAssemblyx86Tests/Testx86AssemblyInspectionEngine.TestAddRSP (1368 of 1785) PASS: lldb-shell :: Expr/TestMultilineExpr.test (1369 of 1785) PASS: lldb-unit :: Utility/./UtilityTests/StringExtractorTest.InitEmpty (1370 of 1785) PASS: lldb-api :: lang/objc/orderedset/TestOrderedSet.py (1371 of 1785) PASS: lldb-api :: lang/objc/forward-decl/TestForwardDecl.py (1372 of 1785) PASS: lldb-unit :: Utility/./UtilityTests/AnsiTerminal.Empty (1373 of 1785) PASS: lldb-shell :: ObjectFile/Breakpad/sections-trailing-func.test (1374 of 1785) UNSUPPORTED: lldb-api :: tools/lldb-server/TestGdbRemoteModuleInfo.py (1375 of 1785) PASS: lldb-api :: lang/cpp/gmodules-templates/TestGModules.py (1376 of 1785) PASS: lldb-api :: functionalities/thread/step_out/TestThreadStepOut.py (1377 of 1785) UNSUPPORTED: lldb-shell :: SymbolFile/dissassemble-entry-point.s (1378 of 1785) PASS: lldb-unit :: Utility/./UtilityTests/StringListTest.ForRangeEmpty (1379 of 1785) PASS: lldb-unit :: Utility/./UtilityTests/ArgsTest.ReplaceArgumentAtIndexOutOfRange (1380 of 1785) PASS: lldb-api :: commands/command/script/import/rdar-12586188/TestRdar12586188.py (1381 of 1785) PASS: lldb-api :: functionalities/thread/concurrent_events/TestConcurrentBreakpointOneDelayBreakpointThreads.py (1382 of 1785) PASS: lldb-api :: functionalities/data-formatter/synthupdate/TestSyntheticFilterRecompute.py (1383 of 1785) PASS: lldb-api :: commands/expression/import-std-module/stack/TestStack.py (1384 of 1785) PASS: lldb-api :: python_api/watchpoint/condition/TestWatchpointConditionAPI.py (1385 of 1785) PASS: lldb-unit :: Utility/./UtilityTests/ListenerTest.GetEventImmediate (1386 of 1785) PASS: lldb-api :: functionalities/data-formatter/data-formatter-stl/libcxx/queue/TestDataFormatterLibcxxQueue.py (1387 of 1785) PASS: lldb-shell :: Settings/TestEchoCommands.test (1388 of 1785) PASS: lldb-api :: lang/objc/print-obj/TestPrintObj.py (1389 of 1785) PASS: lldb-api :: commands/log/invalid-args/TestInvalidArgsLog.py (1390 of 1785) PASS: lldb-shell :: SymbolFile/sizeless-symbol.test (1391 of 1785) PASS: lldb-shell :: ObjectFile/ELF/PT_LOAD-empty.yaml (1392 of 1785) PASS: lldb-unit :: Utility/./UtilityTests/AnsiTerminal.AtEnd (1393 of 1785) PASS: lldb-unit :: Language/Highlighting/./HighlighterTests/HighlighterTest.Colons (1394 of 1785) PASS: lldb-api :: python_api/class_members/TestSBTypeClassMembers.py (1395 of 1785) PASS: lldb-api :: functionalities/avoids-fd-leak/TestFdLeak.py (1396 of 1785) PASS: lldb-unit :: Symbol/./SymbolTests/DWARFCallFrameInfoTest.Basic_eh (1397 of 1785) PASS: lldb-unit :: Utility/./UtilityTests/DataExtractorTest.GetCStrUnterminated (1398 of 1785) PASS: lldb-unit :: Target/./TargetTests/ExecutionContextTest.GetByteOrderTarget (1399 of 1785) PASS: lldb-unit :: Utility/./UtilityTests/OptionsWithRawTest.MultiWordSuffix (1400 of 1785) PASS: lldb-unit :: Utility/./UtilityTests/UriParserTest.SchemeHostSeparator4 (1401 of 1785) PASS: lldb-shell :: Reproducer/TestSynchronous.test (1402 of 1785) PASS: lldb-api :: functionalities/postmortem/minidump/TestMiniDump.py (1403 of 1785) PASS: lldb-unit :: Breakpoint/./LLDBBreakpointTests/BreakpointIDTest.StringIsBreakpointName (1404 of 1785) PASS: lldb-api :: lang/mixed/TestMixedLanguages.py (1405 of 1785) PASS: lldb-unit :: Utility/./UtilityTests/SerializationRountripTest.SerializeDeserializeCString (1406 of 1785) PASS: lldb-api :: python_api/sblaunchinfo/TestSBLaunchInfo.py (1407 of 1785) PASS: lldb-api :: commands/frame/diagnose/dereference-argument/TestDiagnoseDereferenceArgument.py (1408 of 1785) PASS: lldb-api :: functionalities/data-formatter/data-formatter-synthtype/TestDataFormatterSynthType.py (1409 of 1785) UNSUPPORTED: lldb-api :: commands/watchpoints/variable_out_of_scope/TestWatchedVarHitWhenInScope.py (1410 of 1785) PASS: lldb-api :: lang/cpp/class_types/TestClassTypes.py (1411 of 1785) PASS: lldb-api :: functionalities/inferior-changed/TestInferiorChanged.py (1412 of 1785) PASS: lldb-api :: python_api/signals/TestSignalsAPI.py (1413 of 1785) PASS: lldb-shell :: SymbolFile/DWARF/debug-types-signature-loop.s (1414 of 1785) PASS: lldb-shell :: Process/TestEnvironment.test (1415 of 1785) PASS: lldb-api :: lang/cpp/wchar_t/TestCxxWCharT.py (1416 of 1785) PASS: lldb-unit :: Utility/./UtilityTests/LogChannelEnabledTest.LogGetLogThread (1417 of 1785) PASS: lldb-api :: functionalities/thread/thread_specific_break/TestThreadSpecificBreakpoint.py (1418 of 1785) XFAIL: lldb-shell :: Register/x86-64-write.test (1419 of 1785) PASS: lldb-unit :: Utility/./UtilityTests/Flags.AllSet (1420 of 1785) PASS: lldb-api :: functionalities/data-formatter/data-formatter-python-synth/TestDataFormatterPythonSynth.py (1421 of 1785) PASS: lldb-api :: functionalities/thread/concurrent_events/TestConcurrentTwoWatchpointsOneDelayBreakpoint.py (1422 of 1785) PASS: lldb-unit :: Utility/./UtilityTests/StreamTeeTest.Constructor1Stream (1423 of 1785) PASS: lldb-unit :: Utility/./UtilityTests/StreamTest.PutRawBytesToBigEndian (1424 of 1785) PASS: lldb-api :: functionalities/thread/concurrent_events/TestConcurrentDelayWatchBreak.py (1425 of 1785) PASS: lldb-api :: functionalities/breakpoint/serialize/TestBreakpointSerialization.py (1426 of 1785) PASS: lldb-api :: functionalities/memory-region/TestMemoryRegion.py (1427 of 1785) PASS: lldb-api :: functionalities/data-formatter/compactvectors/TestCompactVectors.py (1428 of 1785) PASS: lldb-shell :: SymbolFile/DWARF/find-variable-dwo.cpp (1429 of 1785) PASS: lldb-shell :: Commands/command-backtrace.test (1430 of 1785) PASS: lldb-api :: python_api/module_section/TestModuleAndSection.py (1431 of 1785) PASS: lldb-unit :: Utility/./UtilityTests/GeneratorTest.Create (1432 of 1785) PASS: lldb-shell :: ObjectFile/MachO/lc_build_version_notools.yaml (1433 of 1785) PASS: lldb-api :: commands/expression/unicode-in-variable/TestUnicodeInVariable.py (1434 of 1785) PASS: lldb-unit :: Host/./HostTests/FileSystemTest.OpenErrno (1435 of 1785) PASS: lldb-unit :: Host/./HostTests/NativeProcessProtocolTest.SetBreakpointFailWrite (1436 of 1785) PASS: lldb-api :: commands/frame/diagnose/virtual-method-call/TestDiagnoseDereferenceVirtualMethodCall.py (1437 of 1785) PASS: lldb-shell :: SymbolFile/DWARF/dwarf5-index-is-used.cpp (1438 of 1785) PASS: lldb-api :: functionalities/data-formatter/data-formatter-cpp/TestDataFormatterCpp.py (1439 of 1785) PASS: lldb-api :: functionalities/postmortem/minidump-new/TestMiniDumpNew.py (1440 of 1785) PASS: lldb-unit :: Utility/./UtilityTests/AnsiTerminal.AtStart (1441 of 1785) PASS: lldb-unit :: ScriptInterpreter/Python/./ScriptInterpreterPythonTests/PythonDataObjectsTest.TestPythonListToStructuredList (1442 of 1785) PASS: lldb-unit :: Utility/./UtilityTests/RegularExpression.Invalid (1443 of 1785) XFAIL: lldb-shell :: Register/x86-mm-xmm-write.test (1444 of 1785) PASS: lldb-api :: functionalities/load_using_paths/TestLoadUsingPaths.py (1445 of 1785) PASS: lldb-shell :: SymbolFile/DWARF/debug-types-dwarf5.s (1446 of 1785) PASS: lldb-shell :: SymbolFile/DWARF/debug-types-line-tables.s (1447 of 1785) PASS: lldb-unit :: Utility/./UtilityTests/StringListTest.GetMaxStringLengthDecreasingSize (1448 of 1785) PASS: lldb-api :: commands/log/basic/TestLogging.py (1449 of 1785) PASS: lldb-api :: functionalities/data-formatter/data-formatter-enum-format/TestDataFormatterEnumFormat.py (1450 of 1785) PASS: lldb-api :: commands/expression/import-std-module/basic/TestImportStdModule.py (1451 of 1785) PASS: lldb-api :: commands/expression/namespace_local_var_same_name_cpp_and_c/TestNamespaceLocalVarSameNameCppAndC.py (1452 of 1785) PASS: lldb-unit :: Utility/./UtilityTests/ConstStringTest.format_provider (1453 of 1785) UNSUPPORTED: lldb-api :: functionalities/data-formatter/data-formatter-stl/libstdcpp/string/TestDataFormatterStdString.py (1454 of 1785) PASS: lldb-unit :: Utility/./UtilityTests/ArgsTest.TestAppendArg (1455 of 1785) PASS: lldb-unit :: ScriptInterpreter/Python/./ScriptInterpreterPythonTests/PythonDataObjectsTest.TestPythonIntegerToStructuredInteger (1456 of 1785) PASS: lldb-unit :: Utility/./UtilityTests/StringExtractorTest.GetHexU8_Underflow_NoEof (1457 of 1785) PASS: lldb-api :: lang/objc/self/TestObjCSelf.py (1458 of 1785) PASS: lldb-unit :: UnwindAssembly/x86/./UnwindAssemblyx86Tests/Testx86AssemblyInspectionEngine.TestPushRBP (1459 of 1785) PASS: lldb-unit :: ObjectFile/PECOFF/./ObjectFilePECOFFTests/PECallFrameInfoTest.Frame_reg_eh (1460 of 1785) PASS: lldb-api :: functionalities/thread/crash_during_step/TestCrashDuringStep.py (1461 of 1785) PASS: lldb-api :: functionalities/data-formatter/dump_dynamic/TestDumpDynamic.py (1462 of 1785) PASS: lldb-shell :: SymbolFile/Breakpad/line-table-edgecases.test (1463 of 1785) PASS: lldb-api :: commands/expression/import-std-module/forward_list-dbg-info-content/TestDbgInfoContentForwardList.py (1464 of 1785) PASS: lldb-api :: commands/expression/save_jit_objects/TestSaveJITObjects.py (1465 of 1785) PASS: lldb-shell :: SymbolFile/NativePDB/break-by-line.cpp (1466 of 1785) PASS: lldb-shell :: Minidump/Windows/Sigsegv/sigsegv.test (1467 of 1785) PASS: lldb-unit :: ScriptInterpreter/Python/./ScriptInterpreterPythonTests/PythonDataObjectsTest.TestPythonInteger (1468 of 1785) PASS: lldb-unit :: ScriptInterpreter/Python/./ScriptInterpreterPythonTests/PythonExceptionStateTest.TestAcquisitionSemantics (1469 of 1785) PASS: lldb-unit :: Utility/./UtilityTests/AnsiTerminal.Unknown (1470 of 1785) PASS: lldb-unit :: ScriptInterpreter/Python/./ScriptInterpreterPythonTests/PythonDataObjectsTest.TestPythonCallableInvoke (1471 of 1785) PASS: lldb-unit :: Utility/./UtilityTests/StringListTest.PopBack (1472 of 1785) PASS: lldb-unit :: Target/./TargetTests/ModuleCacheTest.GetAndPutUuidExists (1473 of 1785) PASS: lldb-api :: lang/cpp/frame-var-anon-unions/TestFrameVariableAnonymousUnions.py (1474 of 1785) PASS: lldb-api :: functionalities/modern-type-lookup/basic-objc/TestBasicObjcModernTypeLookup.py (1475 of 1785) PASS: lldb-unit :: Utility/./UtilityTests/DataExtractorTest.GetCStrEmpty (1476 of 1785) UNSUPPORTED: lldb-shell :: SymbolFile/NativePDB/stack_unwinding01.cpp (1477 of 1785) PASS: lldb-api :: commands/expression/scoped_enums/TestScopedEnumType.py (1478 of 1785) UNSUPPORTED: lldb-shell :: Process/Windows/exception_access_violation.cpp (1479 of 1785) UNSUPPORTED: lldb-shell :: Register/x86-64-xmm16-read.test (1480 of 1785) PASS: lldb-api :: lang/cpp/trivial_abi/TestTrivialABI.py (1481 of 1785) PASS: lldb-shell :: ObjectFile/ELF/gnu-debuglink.yaml (1482 of 1785) PASS: lldb-unit :: Language/Highlighting/./HighlighterTests/HighlighterTest.ClangCursorOutOfBounds (1483 of 1785) PASS: lldb-api :: types/TestRecursiveTypes.py (1484 of 1785) PASS: lldb-shell :: ObjectFile/ELF/PT_LOAD.yaml (1485 of 1785) UNSUPPORTED: lldb-api :: functionalities/data-formatter/data-formatter-stl/libstdcpp/tuple/TestDataFormatterStdTuple.py (1486 of 1785) PASS: lldb-api :: functionalities/data-formatter/synthcapping/TestSyntheticCapping.py (1487 of 1785) PASS: lldb-unit :: ObjectFile/Breakpad/./ObjectFileBreakpadTests/Record.classify (1488 of 1785) PASS: lldb-unit :: Utility/./UtilityTests/VMRange.Ordering (1489 of 1785) PASS: lldb-unit :: Process/minidump/./LLDBMinidumpTests/RegisterContextMinidump.CheckRegisterContextMinidump_ARM (1490 of 1785) PASS: lldb-unit :: Host/./HostTests/FileSystemTest.Resolve (1491 of 1785) PASS: lldb-api :: functionalities/thread/concurrent_events/TestConcurrentTwoWatchpointsOneBreakpoint.py (1492 of 1785) PASS: lldb-unit :: Utility/./UtilityTests/ArgsTest.StringListConstructor (1493 of 1785) PASS: lldb-unit :: Utility/./UtilityTests/Flags.Test (1494 of 1785) PASS: lldb-unit :: Utility/./UtilityTests/DataExtractorTest.GetMaxU64 (1495 of 1785) PASS: lldb-api :: commands/expression/no-deadlock/TestExprDoesntBlock.py (1496 of 1785) UNSUPPORTED: lldb-shell :: Register/x86-gp-read.test (1497 of 1785) PASS: lldb-unit :: Utility/./UtilityTests/ArgsTest.TestSingleArg (1498 of 1785) PASS: lldb-api :: commands/expression/call-function/TestCallUserDefinedFunction.py (1499 of 1785) PASS: lldb-api :: commands/frame/diagnose/local-variable/TestLocalVariable.py (1500 of 1785) PASS: lldb-unit :: Utility/./UtilityTests/FileSpecTest.EqualSeparator (1501 of 1785) PASS: lldb-api :: functionalities/postmortem/wow64_minidump/TestWow64MiniDump.py (1502 of 1785) PASS: lldb-unit :: Utility/./UtilityTests/CompletionRequest.Constructor (1503 of 1785) PASS: lldb-unit :: Process/gdb-remote/./ProcessGdbRemoteTests/GDBRemoteCommunicationClientTest.GetModulesInfo_UUID20 (1504 of 1785) UNSUPPORTED: lldb-shell :: BuildScript/toolchain-msvc.test (1505 of 1785) PASS: lldb-unit :: Utility/./UtilityTests/AnsiTerminal.WhiteSpace (1506 of 1785) PASS: lldb-unit :: ObjectFile/ELF/./ObjectFileELFTests/ObjectFileELFTest.SectionsResolveConsistently (1507 of 1785) PASS: lldb-api :: commands/expression/expr-in-syscall/TestExpressionInSyscall.py (1508 of 1785) UNSUPPORTED: lldb-api :: lang/cpp/printf/TestPrintf.py (1509 of 1785) PASS: lldb-unit :: Host/./HostTests/HostInfoTest.GetHostname (1510 of 1785) PASS: lldb-shell :: SymbolFile/DWARF/forward-declarations.s (1511 of 1785) PASS: lldb-shell :: SymbolFile/DWARF/find-basic-namespace.cpp (1512 of 1785) PASS: lldb-api :: functionalities/thread/thread_exit/TestThreadExit.py (1513 of 1785) PASS: lldb-unit :: debugserver/./debugserverTests/RNBSocket.LoopBackListenIPv6 (1514 of 1785) PASS: lldb-unit :: Expression/./ExpressionTests/CppModuleConfigurationTest.LibCppV2 (1515 of 1785) PASS: lldb-unit :: Utility/./UtilityTests/StringExtractorTest.GetHexU8_Extra (1516 of 1785) PASS: lldb-api :: commands/expression/class_template_specialization_empty_pack/TestClassTemplateSpecializationParametersHandling.py (1517 of 1785) PASS: lldb-api :: python_api/section/TestSectionAPI.py (1518 of 1785) PASS: lldb-shell :: SymbolFile/NativePDB/globals-bss.cpp (1519 of 1785) PASS: lldb-unit :: Utility/./UtilityTests/StreamTeeTest.Constructor2Streams (1520 of 1785) PASS: lldb-api :: functionalities/thread/concurrent_events/TestConcurrentWatchpointWithDelayWatchpointThreads.py (1521 of 1785) PASS: lldb-api :: types/TestDoubleTypesExpr.py (1522 of 1785) PASS: lldb-unit :: UnwindAssembly/x86/./UnwindAssemblyx86Tests/Testx86AssemblyInspectionEngine.TestPushR14 (1523 of 1785) PASS: lldb-api :: functionalities/memory/cache/TestMemoryCache.py (1524 of 1785) PASS: lldb-shell :: SymbolFile/NativePDB/ast-functions.cpp (1525 of 1785) PASS: lldb-unit :: Process/minidump/./LLDBMinidumpTests/MinidumpParserTest.FindMemoryRange (1526 of 1785) PASS: lldb-unit :: Utility/./UtilityTests/SerializationRountripTest.SerializeDeserializePodPointers (1527 of 1785) PASS: lldb-unit :: Expression/./ExpressionTests/DiagnosticManagerTest.GetStringMultiline (1528 of 1785) PASS: lldb-unit :: Utility/./UtilityTests/RegularExpression.Match (1529 of 1785) PASS: lldb-unit :: Process/gdb-remote/./ProcessGdbRemoteTests/GDBRemoteCommunicationClientTest.SaveRestoreRegistersNoSuffix (1530 of 1785) PASS: lldb-api :: commands/apropos/with-process/TestAproposWithProcess.py (1531 of 1785) PASS: lldb-api :: commands/expression/import-std-module/unique_ptr/TestUniquePtr.py (1532 of 1785) PASS: lldb-api :: commands/expression/calculator_mode/TestCalculatorMode.py (1533 of 1785) PASS: lldb-unit :: Utility/./UtilityTests/TimerTest.CategoryTimes (1534 of 1785) UNSUPPORTED: lldb-shell :: Register/x86-zmm-read.test (1535 of 1785) PASS: lldb-api :: functionalities/breakpoint/breakpoint_command/TestBreakpointCommand.py (1536 of 1785) PASS: lldb-api :: functionalities/data-formatter/data-formatter-smart-array/TestDataFormatterSmartArray.py (1537 of 1785) PASS: lldb-api :: functionalities/breakpoint/breakpoint_conditions/TestBreakpointConditions.py (1538 of 1785) PASS: lldb-api :: commands/expression/issue_11588/Test11588.py (1539 of 1785) PASS: lldb-unit :: Language/Highlighting/./HighlighterTests/HighlighterTest.DefaultHighlighterWithCursor (1540 of 1785) PASS: lldb-unit :: Utility/./UtilityTests/ArchSpecTest.TestParseMachCPUDashSubtypeTripleExtra (1541 of 1785) PASS: lldb-shell :: SymbolFile/DWARF/debug_ranges-missing-section.s (1542 of 1785) PASS: lldb-unit :: Platform/./LLDBPlatformTests/PlatformDarwinTest.TestParseVersionBuildDir (1543 of 1785) PASS: lldb-api :: functionalities/thread/step_until/TestStepUntil.py (1544 of 1785) PASS: lldb-unit :: Utility/./UtilityTests/StringExtractorTest.GetHexBytes_OddPair (1545 of 1785) PASS: lldb-unit :: Utility/./UtilityTests/CompletionRequest.ShiftArguments (1546 of 1785) PASS: lldb-unit :: Utility/./UtilityTests/StreamTest.PutCString (1547 of 1785) PASS: lldb-api :: python_api/value/empty_class/TestValueAPIEmptyClass.py (1548 of 1785) UNSUPPORTED: lldb-api :: benchmarks/startup/TestStartupDelays.py (1549 of 1785) PASS: lldb-unit :: Utility/./UtilityTests/RangeTest.ContainsRangeStartingFromZero (1550 of 1785) PASS: lldb-unit :: Utility/./UtilityTests/RangeTest.ContainsAddrInvalid (1551 of 1785) PASS: lldb-unit :: UnwindAssembly/x86/./UnwindAssemblyx86Tests/Testx86AssemblyInspectionEngine.TestPopEDI (1552 of 1785) PASS: lldb-api :: functionalities/gdb_remote_client/TestRecognizeBreakpoint.py (1553 of 1785) PASS: lldb-api :: lang/c/shared_lib/TestSharedLib.py (1554 of 1785) PASS: lldb-unit :: Expression/./ExpressionTests/DiagnosticManagerTest.PutStringSeverities (1555 of 1785) PASS: lldb-unit :: SymbolFile/DWARF/./SymbolFileDWARFTests/SymbolFileDWARFTests.TestAbbrevNullAttrValidForm (1556 of 1785) PASS: lldb-unit :: Utility/./UtilityTests/ArgsTest.TestTrailingBackslash (1557 of 1785) PASS: lldb-api :: functionalities/data-formatter/parray/TestPrintArray.py (1558 of 1785) PASS: lldb-unit :: Symbol/./SymbolTests/DWARFCallFrameInfoTest.Basic_dwarf3 (1559 of 1785) PASS: lldb-api :: arm/emulation/TestEmulations.py (1560 of 1785) PASS: lldb-api :: functionalities/data-formatter/data-formatter-stl/libcxx/map/TestDataFormatterLibccMap.py (1561 of 1785) PASS: lldb-unit :: Utility/./UtilityTests/ProcessInstanceInfoMatch.Name (1562 of 1785) PASS: lldb-unit :: Process/gdb-remote/./ProcessGdbRemoteTests/GDBRemoteCommunicationClientTest.SendStartTracePacket (1563 of 1785) PASS: lldb-unit :: UnwindAssembly/x86/./UnwindAssemblyx86Tests/Testx86AssemblyInspectionEngine.TestPushRBX (1564 of 1785) PASS: lldb-api :: functionalities/asan/TestMemoryHistory.py (1565 of 1785) PASS: lldb-unit :: Utility/./UtilityTests/RecordReplayTest.InstrumentedBarRef (1566 of 1785) PASS: lldb-api :: lang/objc/objc-ivar-protocols/TestIvarProtocols.py (1567 of 1785) PASS: lldb-unit :: Target/./TargetTests/PathMappingListTest.RelativeTests (1568 of 1785) PASS: lldb-unit :: Process/minidump/./LLDBMinidumpTests/MinidumpParserTest.GetMemoryRegionInfoFromMemoryList (1569 of 1785) PASS: lldb-unit :: Utility/./UtilityTests/StringListTest.LongestCommonPrefixSingleElement (1570 of 1785) PASS: lldb-unit :: Utility/./UtilityTests/StringListTest.CopyListSingle (1571 of 1785) PASS: lldb-api :: functionalities/data-formatter/data-formatter-script/TestDataFormatterScript.py (1572 of 1785) PASS: lldb-unit :: Utility/./UtilityTests/UriParserTest.MinimalPortPath (1573 of 1785) PASS: lldb-unit :: ScriptInterpreter/Python/./ScriptInterpreterPythonTests/PythonExceptionStateTest.TestDiscardSemantics (1574 of 1785) PASS: lldb-api :: functionalities/data-formatter/data-formatter-objc/TestDataFormatterObjCExpr.py (1575 of 1785) PASS: lldb-unit :: Utility/./UtilityTests/SerializationRountripTest.SerializeDeserializeObjectReference (1576 of 1785) PASS: lldb-unit :: Utility/./UtilityTests/UUIDTest.StringConverion (1577 of 1785) PASS: lldb-unit :: Symbol/./SymbolTests/TestClangASTContext.TestGetBasicTypeFromName (1578 of 1785) PASS: lldb-unit :: Utility/./UtilityTests/StringExtractorTest.GetHexU8_Exact (1579 of 1785) PASS: lldb-unit :: Language/Highlighting/./HighlighterTests/HighlighterTest.FallbackHighlighter (1580 of 1785) PASS: lldb-api :: functionalities/multiword-commands/TestMultiWordCommands.py (1581 of 1785) PASS: lldb-unit :: Utility/./UtilityTests/StringListTest.Join (1582 of 1785) PASS: lldb-api :: functionalities/data-formatter/data-formatter-objc/TestDataFormatterObjCNSURL.py (1583 of 1785) PASS: lldb-unit :: Utility/./UtilityTests/NameMatchesTest.Equals (1584 of 1785) PASS: lldb-unit :: Utility/./UtilityTests/EventTest.DumpEventDataBytes (1585 of 1785) PASS: lldb-shell :: Driver/TestTarget.test (1586 of 1785) PASS: lldb-unit :: Utility/./UtilityTests/ConstStringTest.FromMidOfBufferStringRef (1587 of 1785) PASS: lldb-unit :: Utility/./UtilityTests/LogChannelTest.Enable (1588 of 1785) PASS: lldb-api :: commands/expression/import-std-module/deque-basic/TestBasicDeque.py (1589 of 1785) PASS: lldb-api :: commands/expression/inline-namespace/TestInlineNamespace.py (1590 of 1785) PASS: lldb-api :: functionalities/gdb_remote_client/TestNoWatchpointSupportInfo.py (1591 of 1785) PASS: lldb-api :: lang/objc/ivar-IMP/TestObjCiVarIMP.py (1592 of 1785) PASS: lldb-unit :: Process/minidump/./LLDBMinidumpTests/MinidumpParserTest.GetThreadContext_x86_32_wow64 (1593 of 1785) PASS: lldb-unit :: ScriptInterpreter/Python/./ScriptInterpreterPythonTests/PythonDataObjectsTest.TestPythonDictionaryManipulation (1594 of 1785) PASS: lldb-api :: functionalities/data-formatter/hexcaps/TestDataFormatterHexCaps.py (1595 of 1785) PASS: lldb-api :: macosx/add-dsym/TestAddDsymMidExecutionCommand.py (1596 of 1785) PASS: lldb-unit :: Process/minidump/./LLDBMinidumpTests/MinidumpParserTest.GetMiscInfo_no_stream (1597 of 1785) PASS: lldb-api :: commands/frame/diagnose/dereference-function-return/TestDiagnoseDereferenceFunctionReturn.py (1598 of 1785) PASS: lldb-unit :: Utility/./UtilityTests/StreamTest.PutBytesAsRawHex8ToLittleEndian (1599 of 1785) PASS: lldb-unit :: Utility/./UtilityTests/ArgsTest.GetArgumentArrayRef (1600 of 1785) PASS: lldb-api :: api/command-return-object/TestSBCommandReturnObject.py (1601 of 1785) PASS: lldb-api :: python_api/target/TestTargetAPI.py (1602 of 1785) PASS: lldb-unit :: ScriptInterpreter/Python/./ScriptInterpreterPythonTests/PythonDataObjectsTest.TestPythonFile (1603 of 1785) PASS: lldb-unit :: Expression/./ExpressionTests/CppModuleConfigurationTest.MissingUsrInclude (1604 of 1785) PASS: lldb-api :: python_api/process/io/TestProcessIO.py (1605 of 1785) PASS: lldb-unit :: Utility/./UtilityTests/DataExtractorTest.GetCStrAtEnd (1606 of 1785) UNSUPPORTED: lldb-api :: linux/add-symbols/TestTargetSymbolsAddCommand.py (1607 of 1785) PASS: lldb-api :: functionalities/asan/TestReportData.py (1608 of 1785) PASS: lldb-api :: python_api/disassemble-raw-data/TestDisassembleRawData.py (1609 of 1785) PASS: lldb-api :: functionalities/breakpoint/global_constructor/TestBreakpointInGlobalConstructor.py (1610 of 1785) PASS: lldb-api :: lang/cpp/virtual-overload/TestVirtualOverload.py (1611 of 1785) PASS: lldb-shell :: ObjectFile/ELF/netbsd-core-amd64.test (1612 of 1785) UNSUPPORTED: lldb-shell :: Register/x86-64-zmm-read.test (1613 of 1785) PASS: lldb-unit :: Utility/./UtilityTests/RangeTest.ContainsAddr (1614 of 1785) PASS: lldb-api :: lang/cpp/operator-overload/TestOperatorOverload.py (1615 of 1785) PASS: lldb-api :: commands/expression/ignore-artificial-constructors/TestIgnoreArtificialConstructors.py (1616 of 1785) PASS: lldb-unit :: Utility/./UtilityTests/StreamTest.PutHex64ByteOrderLittle (1617 of 1785) PASS: lldb-unit :: UnwindAssembly/x86/./UnwindAssemblyx86Tests/Testx86AssemblyInspectionEngine.TestLEAVE (1618 of 1785) UNSUPPORTED: lldb-api :: lang/c/typedef/Testtypedef.py (1619 of 1785) PASS: lldb-shell :: ObjectFile/PECOFF/subsections.yaml (1620 of 1785) PASS: lldb-unit :: Symbol/./SymbolTests/TestClangASTContext.TestConvertAccessTypeToAccessSpecifier (1621 of 1785) PASS: lldb-api :: lang/objc/objc-new-syntax/TestObjCNewSyntaxArray.py (1622 of 1785) PASS: lldb-api :: functionalities/data-formatter/data-formatter-stl/libcxx/tuple/TestDataFormatterLibcxxTuple.py (1623 of 1785) PASS: lldb-api :: functionalities/conditional_break/TestConditionalBreak.py (1624 of 1785) PASS: lldb-api :: commands/expression/import-std-module/no-std-module/TestMissingStdModule.py (1625 of 1785) PASS: lldb-api :: commands/expression/import-std-module/vector-basic/TestBasicVector.py (1626 of 1785) PASS: lldb-api :: lang/cpp/limit-debug-info/TestWithLimitDebugInfo.py (1627 of 1785) PASS: lldb-shell :: SymbolFile/Breakpad/unwind-via-stack-win.test (1628 of 1785) PASS: lldb-shell :: SymbolFile/DWARF/find-method.cpp (1629 of 1785) PASS: lldb-api :: functionalities/return-value/TestReturnValue.py (1630 of 1785) PASS: lldb-unit :: ScriptInterpreter/Python/./ScriptInterpreterPythonTests/PythonExceptionStateTest.TestAutoRestoreChanged (1631 of 1785) PASS: lldb-api :: functionalities/inferior-crashing/TestInferiorCrashingStep.py (1632 of 1785) PASS: lldb-unit :: Utility/./UtilityTests/BinaryStreamTest.PutULEB128SevenBytes (1633 of 1785) PASS: lldb-unit :: Symbol/./SymbolTests/Type.GetTypeScopeAndBasename (1634 of 1785) PASS: lldb-api :: commands/process/launch/TestProcessLaunch.py (1635 of 1785) PASS: lldb-shell :: Commands/command-regex-delete.test (1636 of 1785) PASS: lldb-api :: commands/register/register/register_command/TestRegisters.py (1637 of 1785) PASS: lldb-unit :: Host/./HostTests/TaskPoolTest.RunTasks (1638 of 1785) PASS: lldb-api :: python_api/watchpoint/watchlocation/TestSetWatchlocation.py (1639 of 1785) PASS: lldb-unit :: Interpreter/./InterpreterTests/CompletionTest.FileCompletionAbsolute (1640 of 1785) PASS: lldb-api :: lang/objc/objc-ivar-stripped/TestObjCIvarStripped.py (1641 of 1785) PASS: lldb-api :: commands/expression/ir-interpreter-phi-nodes/TestIRInterpreterPHINodes.py (1642 of 1785) PASS: lldb-api :: lang/cpp/nested-class-other-compilation-unit/TestNestedClassWithParentInAnotherCU.py (1643 of 1785) PASS: lldb-api :: functionalities/data-formatter/data-formatter-skip-summary/TestDataFormatterSkipSummary.py (1644 of 1785) PASS: lldb-api :: functionalities/data-formatter/data-formatter-stl/libcxx/list/TestDataFormatterLibcxxList.py (1645 of 1785) PASS: lldb-shell :: SymbolFile/NativePDB/tag-types.cpp (1646 of 1785) PASS: lldb-unit :: Process/minidump/./LLDBMinidumpTests/MinidumpParserTest.InvalidMinidump (1647 of 1785) UNSUPPORTED: lldb-api :: lang/objc/bitfield_ivars/TestBitfieldIvars.py (1648 of 1785) PASS: lldb-unit :: Utility/./UtilityTests/StreamTest.PutHex16ByteOrderLittle (1649 of 1785) UNSUPPORTED: lldb-api :: commands/register/register/intel_xtended_registers/mpx_bound_violation/TestBoundViolation.py (1650 of 1785) PASS: lldb-api :: commands/watchpoints/watchpoint_events/TestWatchpointEvents.py (1651 of 1785) PASS: lldb-api :: functionalities/gdb_remote_client/TestGDBRemoteLoad.py (1652 of 1785) PASS: lldb-unit :: Utility/./UtilityTests/ScalarTest.Promotion (1653 of 1785) PASS: lldb-api :: lang/c/shared_lib_stripped_symbols/TestSharedLibStrippedSymbols.py (1654 of 1785) PASS: lldb-unit :: Process/gdb-remote/./ProcessGdbRemoteTests/GDBRemoteClientBaseTest.SendPacketAndReceiveResponseWithOutputSupport (1655 of 1785) PASS: lldb-unit :: Utility/./UtilityTests/NameMatchesTest.RegularExpression (1656 of 1785) PASS: lldb-unit :: SymbolFile/NativePDB/./SymbolFileNativePDBTests/PDBFPOProgramToDWARFExpressionTests.DependencyChain (1657 of 1785) PASS: lldb-unit :: Utility/./UtilityTests/LogChannelEnabledTest.LogThread (1658 of 1785) PASS: lldb-api :: commands/expression/fixits/TestFixIts.py (1659 of 1785) PASS: lldb-api :: functionalities/breakpoint/breakpoint_hit_count/TestBreakpointHitCount.py (1660 of 1785) PASS: lldb-api :: functionalities/data-formatter/type_summary_list_arg/TestTypeSummaryListArg.py (1661 of 1785) PASS: lldb-unit :: Utility/./UtilityTests/StringExtractorTest.DecodeHexU8_Underflow (1662 of 1785) PASS: lldb-shell :: Breakpoint/jitbp_elf.test (1663 of 1785) PASS: lldb-unit :: Utility/./UtilityTests/VASprintfTest.EncodingError (1664 of 1785) PASS: lldb-unit :: Process/gdb-remote/./ProcessGdbRemoteTests/GDBRemoteCommunicationServerTest.SendErrorResponse_ErrorList (1665 of 1785) PASS: lldb-api :: lang/objc/objc-dyn-sbtype/TestObjCDynamicSBType.py (1666 of 1785) PASS: lldb-unit :: Utility/./UtilityTests/RecordReplayTest.InstrumentedFoo (1667 of 1785) UNSUPPORTED: lldb-api :: benchmarks/continue/TestBenchmarkContinue.py (1668 of 1785) PASS: lldb-unit :: Utility/./UtilityTests/ArgsTest.ReplaceArgumentAtIndexFarOutOfRange (1669 of 1785) PASS: lldb-unit :: Language/Highlighting/./HighlighterTests/HighlighterTest.Keywords (1670 of 1785) PASS: lldb-unit :: Utility/./UtilityTests/StringListTest.LongestCommonPrefixNoPrefix (1671 of 1785) PASS: lldb-unit :: Utility/./UtilityTests/DataExtractorTest.GetMaxS64 (1672 of 1785) PASS: lldb-api :: lang/objc/global_ptrs/TestGlobalObjects.py (1673 of 1785) PASS: lldb-unit :: Symbol/./SymbolTests/TestClangASTContext.TemplateArguments (1674 of 1785) PASS: lldb-shell :: Settings/TestDisableColor.test (1675 of 1785) UNSUPPORTED: lldb-api :: functionalities/thread/thread_specific_break_plus_condition/TestThreadSpecificBpPlusCondition.py (1676 of 1785) PASS: lldb-unit :: ScriptInterpreter/Python/./ScriptInterpreterPythonTests/PythonDataObjectsTest.TestBorrowedReferences (1677 of 1785) PASS: lldb-unit :: Core/./LLDBCoreTests/MangledTest.EmptyForInvalidName (1678 of 1785) PASS: lldb-unit :: Utility/./UtilityTests/StringListTest.SetSize (1679 of 1785) PASS: lldb-unit :: Utility/./UtilityTests/BinaryStreamTest.PutSLEB128OneByte (1680 of 1785) PASS: lldb-api :: functionalities/gdb_remote_client/TestArmRegisterDefinition.py (1681 of 1785) PASS: lldb-api :: commands/expression/persist_objc_pointeetype/TestPersistObjCPointeeType.py (1682 of 1785) PASS: lldb-api :: commands/expression/test/TestExprs2.py (1683 of 1785) PASS: lldb-unit :: Language/Highlighting/./HighlighterTests/HighlighterTest.ClangCursorPosAfterOtherToken (1684 of 1785) PASS: lldb-api :: functionalities/memory/find/TestMemoryFind.py (1685 of 1785) PASS: lldb-api :: commands/version/TestVersion.py (1686 of 1785) PASS: lldb-api :: functionalities/param_entry_vals/basic_entry_values_x86_64/TestBasicEntryValuesX86_64.py (1687 of 1785) PASS: lldb-shell :: Quit/TestQuitExitCodeHexA.test (1688 of 1785) PASS: lldb-unit :: UnwindAssembly/x86/./UnwindAssemblyx86Tests/Testx86AssemblyInspectionEngine.TestPopEBX (1689 of 1785) PASS: lldb-api :: functionalities/signal/handle-abrt/TestHandleAbort.py (1690 of 1785) PASS: lldb-unit :: Utility/./UtilityTests/ArgsTest.ReplaceArgumentAtIndexEqual (1691 of 1785) PASS: lldb-api :: commands/target/basic/TestTargetCommand.py (1692 of 1785) PASS: lldb-unit :: Host/./HostTests/File.GetWaitableHandleFileno (1693 of 1785) PASS: lldb-unit :: ObjectFile/ELF/./ObjectFileELFTests/ObjectFileELFTest.GetSymtab_NoSymEntryPointArmThumbAddressClass (1694 of 1785) PASS: lldb-api :: functionalities/data-formatter/summary-string-onfail/Test-rdar-9974002.py (1695 of 1785) PASS: lldb-api :: commands/process/attach-resume/TestAttachResume.py (1696 of 1785) PASS: lldb-shell :: BuildScript/toolchain-clang.test (1697 of 1785) PASS: lldb-api :: commands/expression/ir-interpreter/TestIRInterpreter.py (1698 of 1785) PASS: lldb-unit :: Utility/./UtilityTests/NameMatchesTest.EndsWith (1699 of 1785) PASS: lldb-api :: functionalities/data-formatter/ostypeformatting/TestFormattersOsType.py (1700 of 1785) PASS: lldb-api :: python_api/interpreter/TestRunCommandInterpreterAPI.py (1701 of 1785) PASS: lldb-api :: functionalities/data-formatter/type_summary_list_script/TestTypeSummaryListScript.py (1702 of 1785) PASS: lldb-unit :: Utility/./UtilityTests/StringExtractorTest.DecodeHexU8_Extra (1703 of 1785) PASS: lldb-unit :: Expression/./ExpressionTests/DiagnosticManagerTest.GetStringMultipleDiags (1704 of 1785) PASS: lldb-api :: commands/help/TestHelp.py (1705 of 1785) PASS: lldb-api :: commands/expression/weak_symbols/TestWeakSymbols.py (1706 of 1785) PASS: lldb-api :: lang/objc/modules-inline-functions/TestModulesInlineFunctions.py (1707 of 1785) PASS: lldb-api :: lang/c/conflicting-symbol/TestConflictingSymbol.py (1708 of 1785) PASS: lldb-unit :: UnwindAssembly/x86/./UnwindAssemblyx86Tests/Testx86AssemblyInspectionEngine.Test64bitFramelessSmallStackFrame (1709 of 1785) PASS: lldb-unit :: Utility/./UtilityTests/ArgsTest.AppendArguments (1710 of 1785) PASS: lldb-shell :: Reproducer/Functionalities/TestImageList.test (1711 of 1785) PASS: lldb-unit :: SymbolFile/NativePDB/./SymbolFileNativePDBTests/PDBFPOProgramToDWARFExpressionTests.InvalidAssignmentSingle (1712 of 1785) PASS: lldb-unit :: Utility/./UtilityTests/ArgsTest.EscapeLLDBCommandArgument (1713 of 1785) PASS: lldb-api :: functionalities/tail_call_frames/ambiguous_tail_call_seq1/TestAmbiguousTailCallSeq1.py (1714 of 1785) PASS: lldb-api :: python_api/file_handle/TestFileHandle.py (1715 of 1785) PASS: lldb-api :: lang/objc/unicode-string/TestUnicodeString.py (1716 of 1785) PASS: lldb-unit :: Utility/./UtilityTests/BinaryStreamTest.PutSLEB128MaxValue (1717 of 1785) PASS: lldb-api :: functionalities/data-formatter/data-formatter-stl/libcxx/forward_list/TestDataFormatterLibcxxForwardList.py (1718 of 1785) UNSUPPORTED: lldb-api :: tools/lldb-server/libraries-svr4/TestGdbRemoteLibrariesSvr4Support.py (1719 of 1785) PASS: lldb-unit :: Host/./HostTests/FileSystemTest.EnumerateDirectory (1720 of 1785) UNSUPPORTED: lldb-shell :: Register/aarch64-gp-read.test (1721 of 1785) PASS: lldb-api :: functionalities/breakpoint/comp_dir_symlink/TestCompDirSymLink.py (1722 of 1785) PASS: lldb-api :: functionalities/thread/concurrent_events/TestConcurrentSignalDelayWatch.py (1723 of 1785) PASS: lldb-api :: functionalities/wrong_commands/TestWrongCommands.py (1724 of 1785) PASS: lldb-unit :: Utility/./UtilityTests/CompletionRequest.TryCompleteCurrentArgGood (1725 of 1785) PASS: lldb-unit :: Utility/./UtilityTests/TimeoutTest.Construction (1726 of 1785) PASS: lldb-api :: commands/expression/import-std-module/unique_ptr-dbg-info-content/TestUniquePtrDbgInfoContent.py (1727 of 1785) PASS: lldb-shell :: ObjectFile/ELF/aarch64-relocations.yaml (1728 of 1785) PASS: lldb-unit :: Utility/./UtilityTests/FileSpecTest.GetNormalizedPath (1729 of 1785) PASS: lldb-api :: functionalities/tail_call_frames/thread_step_out_or_return/TestSteppingOutWithArtificialFrames.py (1730 of 1785) PASS: lldb-shell :: Expr/TestTypeOfDeclTypeExpr.test (1731 of 1785) UNSUPPORTED: lldb-api :: benchmarks/libcxxlist/TestBenchmarkLibcxxList.py (1732 of 1785) PASS: lldb-unit :: Host/./HostTests/SocketTest.UDPGetConnectURI (1733 of 1785) PASS: lldb-unit :: Utility/./UtilityTests/ProcessInfoTest.Constructor (1734 of 1785) PASS: lldb-unit :: Utility/./UtilityTests/StringListTest.AppendStringStdString (1735 of 1785) UNSUPPORTED: lldb-api :: functionalities/breakpoint/hardware_breakpoints/hardware_breakpoint_on_multiple_threads/TestHWBreakMultiThread.py (1736 of 1785) PASS: lldb-unit :: UnwindAssembly/x86/./UnwindAssemblyx86Tests/Testx86AssemblyInspectionEngine.Test32bitFramelessBigStackFrame (1737 of 1785) PASS: lldb-unit :: Utility/./UtilityTests/RangeTest.Slide (1738 of 1785) UNSUPPORTED: lldb-api :: commands/expression/call-restarts/TestCallThatRestarts.py (1739 of 1785) PASS: lldb-api :: lang/cpp/signed_types/TestSignedTypes.py (1740 of 1785) PASS: lldb-unit :: UnwindAssembly/x86/./UnwindAssemblyx86Tests/Testx86AssemblyInspectionEngine.TestPushExtended (1741 of 1785) UNSUPPORTED: lldb-api :: functionalities/process_save_core/TestProcessSaveCore.py (1742 of 1785) PASS: lldb-unit :: Process/minidump/./LLDBMinidumpTests/MinidumpParserTest.GetMemoryRegionInfoLinuxMaps (1743 of 1785) PASS: lldb-unit :: Utility/./UtilityTests/RangeTest.LessThan (1744 of 1785) PASS: lldb-unit :: SymbolFile/DWARF/./SymbolFileDWARFTests/DWARFASTParserClangTests.EnsureAllDIEsInDeclContextHaveBeenParsedParsesOnlyMatchingEntries (1745 of 1785) PASS: lldb-api :: functionalities/source-map/TestTargetSourceMap.py (1746 of 1785) PASS: lldb-api :: commands/expression/radar_9531204/TestPrintfAfterUp.py (1747 of 1785) PASS: lldb-api :: lang/cpp/template-function/TestTemplateFunctions.py (1748 of 1785) PASS: lldb-unit :: Utility/./UtilityTests/TimerTest.CategoryTimesNested (1749 of 1785) PASS: lldb-unit :: Process/gdb-remote/./ProcessGdbRemoteTests/GDBRemoteCommunicationClientTest.ReadRegister (1750 of 1785) PASS: lldb-unit :: SymbolFile/NativePDB/./SymbolFileNativePDBTests/PDBFPOProgramToDWARFExpressionTests.MultipleIndependentAssignments (1751 of 1785) PASS: lldb-api :: commands/command/source/TestCommandSource.py (1752 of 1785) PASS: lldb-unit :: Utility/./UtilityTests/CompletionRequest.TryCompleteCurrentArgMode (1753 of 1785) PASS: lldb-api :: lang/cpp/diamond/TestDiamond.py (1754 of 1785) PASS: lldb-api :: commands/command/nested_alias/TestNestedAlias.py (1755 of 1785) PASS: lldb-api :: driver/batch_mode/TestBatchMode.py (1756 of 1785) PASS: lldb-unit :: Process/minidump/./LLDBMinidumpTests/MinidumpParserTest.GetThreadsAndGetThreadContext (1757 of 1785) PASS: lldb-api :: commands/command/script/import/TestImport.py (1758 of 1785) PASS: lldb-unit :: UnwindAssembly/x86/./UnwindAssemblyx86Tests/Testx86AssemblyInspectionEngine.TestPushEDI (1759 of 1785) PASS: lldb-shell :: ObjectFile/ELF/short-build-id.yaml (1760 of 1785) PASS: lldb-unit :: ScriptInterpreter/Python/./ScriptInterpreterPythonTests/PythonDataObjectsTest.TestPythonTupleInitializerList (1761 of 1785) PASS: lldb-unit :: Host/./HostTests/FileActionTest.Open (1762 of 1785) PASS: lldb-unit :: Utility/./UtilityTests/StringExtractorTest.GetU64LittleEndian (1763 of 1785) PASS: lldb-shell :: SymbolFile/DWARF/find-basic-type.cpp (1764 of 1785) PASS: lldb-unit :: Process/minidump/./LLDBMinidumpTests/MinidumpParserTest.GetMemoryRegionInfoFromMemory64List (1765 of 1785) PASS: lldb-api :: functionalities/data-formatter/data-formatter-objc/nsstring/TestDataFormatterNSString.py (1766 of 1785) PASS: lldb-unit :: ScriptInterpreter/Python/./ScriptInterpreterPythonTests/PythonExceptionStateTest.TestResetSemantics (1767 of 1785) PASS: lldb-unit :: Utility/./UtilityTests/StringListTest.ShiftStdString (1768 of 1785) PASS: lldb-api :: commands/expression/import-std-module/vector-of-vectors/TestVectorOfVectors.py (1769 of 1785) PASS: lldb-api :: functionalities/data-formatter/vector-types/TestVectorTypesFormatting.py (1770 of 1785) PASS: lldb-api :: functionalities/thread/exit_during_break/TestExitDuringBreak.py (1771 of 1785) PASS: lldb-unit :: Utility/./UtilityTests/LogChannelEnabledTest.LogVerboseThread (1772 of 1785) PASS: lldb-api :: python_api/sbdata/TestSBData.py (1773 of 1785) PASS: lldb-api :: commands/expression/formatters/TestFormatters.py (1774 of 1785) UNSUPPORTED: lldb-api :: functionalities/thread/multi_break/TestMultipleBreakpoints.py (1775 of 1785) PASS: lldb-api :: lang/objc/objc-checker/TestObjCCheckers.py (1776 of 1785) PASS: lldb-api :: lang/objc/real-definition/TestRealDefinition.py (1777 of 1785) PASS: lldb-api :: lang/objc/exceptions/TestObjCExceptions.py (1778 of 1785) PASS: lldb-shell :: Expr/TestIRMemoryMap.test (1779 of 1785) PASS: lldb-api :: functionalities/data-formatter/data-formatter-objc/TestDataFormatterObjCKVO.py (1780 of 1785) PASS: lldb-api :: lang/objc/objc-new-syntax/TestObjCNewSyntaxLiteral.py (1781 of 1785) PASS: lldb-api :: functionalities/data-formatter/nsarraysynth/TestNSArraySynthetic.py (1782 of 1785) PASS: lldb-api :: types/TestIntegerTypesExpr.py (1783 of 1785) PASS: lldb-api :: lang/objc/foundation/TestFoundationDisassembly.py (1784 of 1785) TIMEOUT: lldb-api :: functionalities/inline-stepping/TestInlineStepping.py (1785 of 1785) ******************** TEST 'lldb-api :: functionalities/inline-stepping/TestInlineStepping.py' FAILED ******************** Reached timeout of 1200 seconds ******************** Testing Time: 2543.95s ******************** Failing Tests (3): lldb-api :: tools/lldb-server/register-reading/TestGdbRemoteGPacket.py lldb-api :: tools/lldb-server/TestGdbRemoteProcessInfo.py lldb-api :: tools/lldb-server/TestGdbRemoteAttach.py

Hide Details

******************** Timed Out Tests (1): lldb-api :: functionalities/inline-stepping/TestInlineStepping.py

Hide Details

Hide Details

Slowest Tests: -------------------------------------------------------------------------- 123.38s: lldb-api :: functionalities/inferior-crashing/TestInferiorCrashingStep.py 123.46s: lldb-api :: lang/c/anonymous/TestAnonymous.py 132.71s: lldb-api :: lang/objc/exceptions/TestObjCExceptions.py 133.16s: lldb-api :: api/check_public_api_headers/TestPublicAPIHeaders.py 137.71s: lldb-api :: lang/objc/objc-new-syntax/TestObjCNewSyntaxDictionary.py 143.33s: lldb-api :: lang/objc/objc-new-syntax/TestObjCNewSyntaxArray.py 145.26s: lldb-api :: functionalities/recursion/TestValueObjectRecursion.py 153.92s: lldb-api :: lang/objc/objc-new-syntax/TestObjCNewSyntaxLiteral.py 173.23s: lldb-api :: functionalities/return-value/TestReturnValue.py 188.10s: lldb-api :: functionalities/load_unload/TestLoadUnload.py 189.43s: lldb-api :: lang/cpp/namespace/TestNamespaceLookup.py 201.91s: lldb-api :: tools/lldb-server/TestLldbGdbServer.py 211.30s: lldb-api :: lang/objc/foundation/TestObjCMethods.py 225.34s: lldb-api :: lang/cpp/enum_types/TestCPP11EnumTypes.py 236.64s: lldb-api :: api/multithreaded/TestMultithreaded.py 246.88s: lldb-api :: lang/objc/hidden-ivars/TestHiddenIvars.py 402.09s: lldb-api :: types/TestIntegerTypes.py 410.54s: lldb-api :: lang/objc/foundation/TestFoundationDisassembly.py 419.03s: lldb-api :: types/TestIntegerTypesExpr.py 1200.11s: lldb-api :: functionalities/inline-stepping/TestInlineStepping.py

Hide Details

Tests Times: -------------------------------------------------------------------------- [ Range ] :: [ Percentage ] :: [ Count ] -------------------------------------------------------------------------- [ 0s, 100s) :: [*************************************** ] :: [1754/1785] [ 100s, 200s) :: [ ] :: [ 20/1785] [ 200s, 300s) :: [ ] :: [ 7/1785] [ 300s, 400s) :: [ ] :: [ 0/1785] [ 400s, 500s) :: [ ] :: [ 3/1785] [ 500s, 600s) :: [ ] :: [ 0/1785] [ 600s, 700s) :: [ ] :: [ 0/1785] [ 700s, 800s) :: [ ] :: [ 0/1785] [ 800s, 900s) :: [ ] :: [ 0/1785] [ 900s,1000s) :: [ ] :: [ 0/1785] [1000s,1100s) :: [ ] :: [ 0/1785] [1100s,1200s) :: [ ] :: [ 0/1785] [1200s,1300s) :: [ ] :: [ 1/1785] Expected Passes : 1633 Expected Failures : 6 Unsupported Tests : 142 Unexpected Failures: 3 Individual Timeouts: 1 FAILED: tools/lldb/test/CMakeFiles/check-lldb-lit cd /Users/buildslave/jenkins/workspace/lldb-cmake-sanitized/lldb-build/tools/lldb/test && /usr/bin/python /Users/buildslave/jenkins/workspace/lldb-cmake-sanitized/lldb-build/./bin/llvm-lit -v --time-tests --shuffle --xunit-xml-output=/Users/buildslave/jenkins/workspace/lldb-cmake-sanitized/test/results.xml -v --timeout 1200 /Users/buildslave/jenkins/workspace/lldb-cmake-sanitized/lldb-build/tools/lldb/test ninja: build stopped: subcommand failed. Command failed Command: ['/usr/bin/env', 'TERM=vt100', '/usr/local/bin/ninja', '-v', 'check-lldb'] [Pipeline] } [Pipeline] // timeout [Pipeline] } [Pipeline] // stage [Pipeline] stage [Pipeline] { (Declarative: Post Actions) [Pipeline] scanForIssues No credentials specified [Clang (LLVM based)] Sleeping for 5 seconds due to JENKINS-32191... [Clang (LLVM based)] Parsing console log (workspace: '/Users/buildslave/jenkins/workspace/lldb-cmake-sanitized') [Pipeline] junit Recording test results [Pipeline] } [Pipeline] // stage [Pipeline] } [Pipeline] // withEnv [Pipeline] } [Pipeline] // node [Pipeline] End of Pipeline [BFA] Scanning build for known causes... [BFA] Found failure cause(s): [BFA] Ninja target failed from category Compile [BFA] Regression test failed from category Test [BFA] Done. 0s ERROR: script returned exit code 1 Finished: FAILURE