FailedConsole Output

Skipping 643 KB.. Full Log
        server.terminate()
                except:
                    logger.warning(
                        "failed to terminate server for debug monitor: {}; ignoring".format(
                            sys.exc_info()[0]))

Hide Details

Hide Details

Adding tearDown hook: def shutdown_socket(): if sock: try: # send the kill packet so lldb-server shuts down gracefully sock.sendall(GdbRemoteTestCaseBase._GDBREMOTE_KILL_PACKET) except: logger.warning( "failed to send kill packet to debug monitor: {}; ignoring".format( sys.exc_info()[0]))

Hide Details

try: sock.close() except: logger.warning( "failed to close socket to debug monitor: {}; ignoring".format( sys.exc_info()[0]))

Hide Details

Hide Details

Executing tearDown hook: def shutdown_socket(): if sock: try: # send the kill packet so lldb-server shuts down gracefully sock.sendall(GdbRemoteTestCaseBase._GDBREMOTE_KILL_PACKET) except: logger.warning( "failed to send kill packet to debug monitor: {}; ignoring".format( sys.exc_info()[0]))

Hide Details

try: sock.close() except: logger.warning( "failed to close socket to debug monitor: {}; ignoring".format( sys.exc_info()[0]))

Hide Details

Hide Details

Executing tearDown hook: def shutdown_debug_monitor(): try: server.terminate() except: logger.warning( "failed to terminate server for debug monitor: {}; ignoring".format( sys.exc_info()[0]))

Hide Details

Hide Details

Executing tearDown hook: def cleanupSubprocesses(self): # Ensure any subprocesses are cleaned up for p in self.subprocesses: p.terminate() del p del self.subprocesses[:] # Ensure any forked processes are cleaned up for pid in self.forkedProcessPids: if os.path.exists("/proc/" + str(pid)): os.kill(pid, signal.SIGTERM)

Hide Details

Hide Details

Executing tearDown hook: def shutdown_named_pipe(): # Close the pipe. try: named_pipe.close() except: print("failed to close named pipe") None

Hide Details

# Delete the pipe. try: os.remove(named_pipe_path) except: print("failed to delete named pipe: {}".format(named_pipe_path)) None

Hide Details

# Delete the temp directory. try: os.rmdir(temp_dir) except: print( "failed to delete temp dir: {}, directory contents: '{}'".format( temp_dir, os.listdir(temp_dir))) None

Hide Details

Hide Details

PASS: LLDB (/Users/buildslave/jenkins/workspace/lldb-cmake-sanitized/host-compiler/bin/clang-10-x86_64) :: test_qThreadInfo_contains_thread_launch_debugserver (TestLldbGdbServer.LldbGdbServerTestCase) runCmd: settings set symbols.enable-external-lookup false output:

Hide Details

runCmd: settings set plugin.process.gdb-remote.packet-timeout 60 output:

Hide Details

runCmd: settings set symbols.clang-modules-cache-path "/Users/buildslave/jenkins/workspace/lldb-cmake-sanitized/lldb-build/tools/lldb/lldb-test-build.noindex/module-cache-lldb/lldb-api" output:

Hide Details

runCmd: settings set use-color false output:

Hide Details

UNSUPPORTED: LLDB (/Users/buildslave/jenkins/workspace/lldb-cmake-sanitized/host-compiler/bin/clang-10-x86_64) :: test_qThreadInfo_contains_thread_launch_llgs (TestLldbGdbServer.LldbGdbServerTestCase) (llgs tests) runCmd: settings set symbols.enable-external-lookup false output:

Hide Details

runCmd: settings set plugin.process.gdb-remote.packet-timeout 60 output:

Hide Details

runCmd: settings set symbols.clang-modules-cache-path "/Users/buildslave/jenkins/workspace/lldb-cmake-sanitized/lldb-build/tools/lldb/lldb-test-build.noindex/module-cache-lldb/lldb-api" output:

Hide Details

runCmd: settings set use-color false output:

Hide Details

Adding tearDown hook: def shutdown_named_pipe(): # Close the pipe. try: named_pipe.close() except: print("failed to close named pipe") None

Hide Details

# Delete the pipe. try: os.remove(named_pipe_path) except: print("failed to delete named pipe: {}".format(named_pipe_path)) None

Hide Details

# Delete the temp directory. try: os.rmdir(temp_dir) except: print( "failed to delete temp dir: {}, directory contents: '{}'".format( temp_dir, os.listdir(temp_dir))) None

Hide Details

Hide Details

Adding tearDown hook: def shutdown_process_for_attach(): try: inferior.terminate() except: logger.warning( "failed to terminate inferior process for attach: {}; ignoring".format( sys.exc_info()[0]))

Hide Details

Hide Details

Adding tearDown hook: def cleanupSubprocesses(self): # Ensure any subprocesses are cleaned up for p in self.subprocesses: p.terminate() del p del self.subprocesses[:] # Ensure any forked processes are cleaned up for pid in self.forkedProcessPids: if os.path.exists("/proc/" + str(pid)): os.kill(pid, signal.SIGTERM)

Hide Details

Hide Details

Adding tearDown hook: def shutdown_debug_monitor(): try: server.terminate() except: logger.warning( "failed to terminate server for debug monitor: {}; ignoring".format( sys.exc_info()[0]))

Hide Details

Hide Details

Adding tearDown hook: def shutdown_socket(): if sock: try: # send the kill packet so lldb-server shuts down gracefully sock.sendall(GdbRemoteTestCaseBase._GDBREMOTE_KILL_PACKET) except: logger.warning( "failed to send kill packet to debug monitor: {}; ignoring".format( sys.exc_info()[0]))

Hide Details

try: sock.close() except: logger.warning( "failed to close socket to debug monitor: {}; ignoring".format( sys.exc_info()[0]))

Hide Details

Hide Details

Executing tearDown hook: def shutdown_socket(): if sock: try: # send the kill packet so lldb-server shuts down gracefully sock.sendall(GdbRemoteTestCaseBase._GDBREMOTE_KILL_PACKET) except: logger.warning( "failed to send kill packet to debug monitor: {}; ignoring".format( sys.exc_info()[0]))

Hide Details

try: sock.close() except: logger.warning( "failed to close socket to debug monitor: {}; ignoring".format( sys.exc_info()[0]))

Hide Details

Hide Details

Executing tearDown hook: def shutdown_debug_monitor(): try: server.terminate() except: logger.warning( "failed to terminate server for debug monitor: {}; ignoring".format( sys.exc_info()[0]))

Hide Details

Hide Details

Executing tearDown hook: def cleanupSubprocesses(self): # Ensure any subprocesses are cleaned up for p in self.subprocesses: p.terminate() del p del self.subprocesses[:] # Ensure any forked processes are cleaned up for pid in self.forkedProcessPids: if os.path.exists("/proc/" + str(pid)): os.kill(pid, signal.SIGTERM)

Hide Details

Hide Details

Executing tearDown hook: def shutdown_process_for_attach(): try: inferior.terminate() except: logger.warning( "failed to terminate inferior process for attach: {}; ignoring".format( sys.exc_info()[0]))

Hide Details

Hide Details

Executing tearDown hook: def shutdown_named_pipe(): # Close the pipe. try: named_pipe.close() except: print("failed to close named pipe") None

Hide Details

# Delete the pipe. try: os.remove(named_pipe_path) except: print("failed to delete named pipe: {}".format(named_pipe_path)) None

Hide Details

# Delete the temp directory. try: os.rmdir(temp_dir) except: print( "failed to delete temp dir: {}, directory contents: '{}'".format( temp_dir, os.listdir(temp_dir))) None

Hide Details

Hide Details

PASS: LLDB (/Users/buildslave/jenkins/workspace/lldb-cmake-sanitized/host-compiler/bin/clang-10-x86_64) :: test_qThreadInfo_matches_qC_attach_debugserver (TestLldbGdbServer.LldbGdbServerTestCase) runCmd: settings set symbols.enable-external-lookup false output:

Hide Details

runCmd: settings set plugin.process.gdb-remote.packet-timeout 60 output:

Hide Details

runCmd: settings set symbols.clang-modules-cache-path "/Users/buildslave/jenkins/workspace/lldb-cmake-sanitized/lldb-build/tools/lldb/lldb-test-build.noindex/module-cache-lldb/lldb-api" output:

Hide Details

runCmd: settings set use-color false output:

Hide Details

UNSUPPORTED: LLDB (/Users/buildslave/jenkins/workspace/lldb-cmake-sanitized/host-compiler/bin/clang-10-x86_64) :: test_qThreadInfo_matches_qC_attach_llgs (TestLldbGdbServer.LldbGdbServerTestCase) (llgs tests) runCmd: settings set symbols.enable-external-lookup false output:

Hide Details

runCmd: settings set plugin.process.gdb-remote.packet-timeout 60 output:

Hide Details

runCmd: settings set symbols.clang-modules-cache-path "/Users/buildslave/jenkins/workspace/lldb-cmake-sanitized/lldb-build/tools/lldb/lldb-test-build.noindex/module-cache-lldb/lldb-api" output:

Hide Details

runCmd: settings set use-color false output:

Hide Details

Adding tearDown hook: def shutdown_named_pipe(): # Close the pipe. try: named_pipe.close() except: print("failed to close named pipe") None

Hide Details

# Delete the pipe. try: os.remove(named_pipe_path) except: print("failed to delete named pipe: {}".format(named_pipe_path)) None

Hide Details

# Delete the temp directory. try: os.rmdir(temp_dir) except: print( "failed to delete temp dir: {}, directory contents: '{}'".format( temp_dir, os.listdir(temp_dir))) None

Hide Details

Hide Details

Adding tearDown hook: def cleanupSubprocesses(self): # Ensure any subprocesses are cleaned up for p in self.subprocesses: p.terminate() del p del self.subprocesses[:] # Ensure any forked processes are cleaned up for pid in self.forkedProcessPids: if os.path.exists("/proc/" + str(pid)): os.kill(pid, signal.SIGTERM)

Hide Details

Hide Details

Adding tearDown hook: def shutdown_debug_monitor(): try: server.terminate() except: logger.warning( "failed to terminate server for debug monitor: {}; ignoring".format( sys.exc_info()[0]))

Hide Details

Hide Details

Adding tearDown hook: def shutdown_socket(): if sock: try: # send the kill packet so lldb-server shuts down gracefully sock.sendall(GdbRemoteTestCaseBase._GDBREMOTE_KILL_PACKET) except: logger.warning( "failed to send kill packet to debug monitor: {}; ignoring".format( sys.exc_info()[0]))

Hide Details

try: sock.close() except: logger.warning( "failed to close socket to debug monitor: {}; ignoring".format( sys.exc_info()[0]))

Hide Details

Hide Details

Executing tearDown hook: def shutdown_socket(): if sock: try: # send the kill packet so lldb-server shuts down gracefully sock.sendall(GdbRemoteTestCaseBase._GDBREMOTE_KILL_PACKET) except: logger.warning( "failed to send kill packet to debug monitor: {}; ignoring".format( sys.exc_info()[0]))

Hide Details

try: sock.close() except: logger.warning( "failed to close socket to debug monitor: {}; ignoring".format( sys.exc_info()[0]))

Hide Details

Hide Details

Executing tearDown hook: def shutdown_debug_monitor(): try: server.terminate() except: logger.warning( "failed to terminate server for debug monitor: {}; ignoring".format( sys.exc_info()[0]))

Hide Details

Hide Details

Executing tearDown hook: def cleanupSubprocesses(self): # Ensure any subprocesses are cleaned up for p in self.subprocesses: p.terminate() del p del self.subprocesses[:] # Ensure any forked processes are cleaned up for pid in self.forkedProcessPids: if os.path.exists("/proc/" + str(pid)): os.kill(pid, signal.SIGTERM)

Hide Details

Hide Details

Executing tearDown hook: def shutdown_named_pipe(): # Close the pipe. try: named_pipe.close() except: print("failed to close named pipe") None

Hide Details

# Delete the pipe. try: os.remove(named_pipe_path) except: print("failed to delete named pipe: {}".format(named_pipe_path)) None

Hide Details

# Delete the temp directory. try: os.rmdir(temp_dir) except: print( "failed to delete temp dir: {}, directory contents: '{}'".format( temp_dir, os.listdir(temp_dir))) None

Hide Details

Hide Details

PASS: LLDB (/Users/buildslave/jenkins/workspace/lldb-cmake-sanitized/host-compiler/bin/clang-10-x86_64) :: test_qThreadInfo_matches_qC_launch_debugserver (TestLldbGdbServer.LldbGdbServerTestCase) runCmd: settings set symbols.enable-external-lookup false output:

Hide Details

runCmd: settings set plugin.process.gdb-remote.packet-timeout 60 output:

Hide Details

runCmd: settings set symbols.clang-modules-cache-path "/Users/buildslave/jenkins/workspace/lldb-cmake-sanitized/lldb-build/tools/lldb/lldb-test-build.noindex/module-cache-lldb/lldb-api" output:

Hide Details

runCmd: settings set use-color false output:

Hide Details

UNSUPPORTED: LLDB (/Users/buildslave/jenkins/workspace/lldb-cmake-sanitized/host-compiler/bin/clang-10-x86_64) :: test_qThreadInfo_matches_qC_launch_llgs (TestLldbGdbServer.LldbGdbServerTestCase) (llgs tests) runCmd: settings set symbols.enable-external-lookup false output:

Hide Details

runCmd: settings set plugin.process.gdb-remote.packet-timeout 60 output:

Hide Details

runCmd: settings set symbols.clang-modules-cache-path "/Users/buildslave/jenkins/workspace/lldb-cmake-sanitized/lldb-build/tools/lldb/lldb-test-build.noindex/module-cache-lldb/lldb-api" output:

Hide Details

runCmd: settings set use-color false output:

Hide Details

Adding tearDown hook: def shutdown_named_pipe(): # Close the pipe. try: named_pipe.close() except: print("failed to close named pipe") None

Hide Details

# Delete the pipe. try: os.remove(named_pipe_path) except: print("failed to delete named pipe: {}".format(named_pipe_path)) None

Hide Details

# Delete the temp directory. try: os.rmdir(temp_dir) except: print( "failed to delete temp dir: {}, directory contents: '{}'".format( temp_dir, os.listdir(temp_dir))) None

Hide Details

Hide Details

Adding tearDown hook: def cleanupSubprocesses(self): # Ensure any subprocesses are cleaned up for p in self.subprocesses: p.terminate() del p del self.subprocesses[:] # Ensure any forked processes are cleaned up for pid in self.forkedProcessPids: if os.path.exists("/proc/" + str(pid)): os.kill(pid, signal.SIGTERM)

Hide Details

Hide Details

Adding tearDown hook: def shutdown_debug_monitor(): try: server.terminate() except: logger.warning( "failed to terminate server for debug monitor: {}; ignoring".format( sys.exc_info()[0]))

Hide Details

Hide Details

Adding tearDown hook: def shutdown_socket(): if sock: try: # send the kill packet so lldb-server shuts down gracefully sock.sendall(GdbRemoteTestCaseBase._GDBREMOTE_KILL_PACKET) except: logger.warning( "failed to send kill packet to debug monitor: {}; ignoring".format( sys.exc_info()[0]))

Hide Details

try: sock.close() except: logger.warning( "failed to close socket to debug monitor: {}; ignoring".format( sys.exc_info()[0]))

Hide Details

Hide Details

Executing tearDown hook: def shutdown_socket(): if sock: try: # send the kill packet so lldb-server shuts down gracefully sock.sendall(GdbRemoteTestCaseBase._GDBREMOTE_KILL_PACKET) except: logger.warning( "failed to send kill packet to debug monitor: {}; ignoring".format( sys.exc_info()[0]))

Hide Details

try: sock.close() except: logger.warning( "failed to close socket to debug monitor: {}; ignoring".format( sys.exc_info()[0]))

Hide Details

Hide Details

Executing tearDown hook: def shutdown_debug_monitor(): try: server.terminate() except: logger.warning( "failed to terminate server for debug monitor: {}; ignoring".format( sys.exc_info()[0]))

Hide Details

Hide Details

Executing tearDown hook: def cleanupSubprocesses(self): # Ensure any subprocesses are cleaned up for p in self.subprocesses: p.terminate() del p del self.subprocesses[:] # Ensure any forked processes are cleaned up for pid in self.forkedProcessPids: if os.path.exists("/proc/" + str(pid)): os.kill(pid, signal.SIGTERM)

Hide Details

Hide Details

Executing tearDown hook: def shutdown_named_pipe(): # Close the pipe. try: named_pipe.close() except: print("failed to close named pipe") None

Hide Details

# Delete the pipe. try: os.remove(named_pipe_path) except: print("failed to delete named pipe: {}".format(named_pipe_path)) None

Hide Details

# Delete the temp directory. try: os.rmdir(temp_dir) except: print( "failed to delete temp dir: {}, directory contents: '{}'".format( temp_dir, os.listdir(temp_dir))) None

Hide Details

Hide Details

PASS: LLDB (/Users/buildslave/jenkins/workspace/lldb-cmake-sanitized/host-compiler/bin/clang-10-x86_64) :: test_software_breakpoint_set_and_remove_work_debugserver (TestLldbGdbServer.LldbGdbServerTestCase) runCmd: settings set symbols.enable-external-lookup false output:

Hide Details

runCmd: settings set plugin.process.gdb-remote.packet-timeout 60 output:

Hide Details

runCmd: settings set symbols.clang-modules-cache-path "/Users/buildslave/jenkins/workspace/lldb-cmake-sanitized/lldb-build/tools/lldb/lldb-test-build.noindex/module-cache-lldb/lldb-api" output:

Hide Details

runCmd: settings set use-color false output:

Hide Details

UNSUPPORTED: LLDB (/Users/buildslave/jenkins/workspace/lldb-cmake-sanitized/host-compiler/bin/clang-10-x86_64) :: test_software_breakpoint_set_and_remove_work_llgs (TestLldbGdbServer.LldbGdbServerTestCase) (llgs tests) runCmd: settings set symbols.enable-external-lookup false output:

Hide Details

runCmd: settings set plugin.process.gdb-remote.packet-timeout 60 output:

Hide Details

runCmd: settings set symbols.clang-modules-cache-path "/Users/buildslave/jenkins/workspace/lldb-cmake-sanitized/lldb-build/tools/lldb/lldb-test-build.noindex/module-cache-lldb/lldb-api" output:

Hide Details

runCmd: settings set use-color false output:

Hide Details

Adding tearDown hook: def shutdown_named_pipe(): # Close the pipe. try: named_pipe.close() except: print("failed to close named pipe") None

Hide Details

# Delete the pipe. try: os.remove(named_pipe_path) except: print("failed to delete named pipe: {}".format(named_pipe_path)) None

Hide Details

# Delete the temp directory. try: os.rmdir(temp_dir) except: print( "failed to delete temp dir: {}, directory contents: '{}'".format( temp_dir, os.listdir(temp_dir))) None

Hide Details

Hide Details

Adding tearDown hook: def cleanupSubprocesses(self): # Ensure any subprocesses are cleaned up for p in self.subprocesses: p.terminate() del p del self.subprocesses[:] # Ensure any forked processes are cleaned up for pid in self.forkedProcessPids: if os.path.exists("/proc/" + str(pid)): os.kill(pid, signal.SIGTERM)

Hide Details

Hide Details

Adding tearDown hook: def shutdown_debug_monitor(): try: server.terminate() except: logger.warning( "failed to terminate server for debug monitor: {}; ignoring".format( sys.exc_info()[0]))

Hide Details

Hide Details

Adding tearDown hook: def shutdown_socket(): if sock: try: # send the kill packet so lldb-server shuts down gracefully sock.sendall(GdbRemoteTestCaseBase._GDBREMOTE_KILL_PACKET) except: logger.warning( "failed to send kill packet to debug monitor: {}; ignoring".format( sys.exc_info()[0]))

Hide Details

try: sock.close() except: logger.warning( "failed to close socket to debug monitor: {}; ignoring".format( sys.exc_info()[0]))

Hide Details

Hide Details

Executing tearDown hook: def shutdown_socket(): if sock: try: # send the kill packet so lldb-server shuts down gracefully sock.sendall(GdbRemoteTestCaseBase._GDBREMOTE_KILL_PACKET) except: logger.warning( "failed to send kill packet to debug monitor: {}; ignoring".format( sys.exc_info()[0]))

Hide Details

try: sock.close() except: logger.warning( "failed to close socket to debug monitor: {}; ignoring".format( sys.exc_info()[0]))

Hide Details

Hide Details

Executing tearDown hook: def shutdown_debug_monitor(): try: server.terminate() except: logger.warning( "failed to terminate server for debug monitor: {}; ignoring".format( sys.exc_info()[0]))

Hide Details

Hide Details

Executing tearDown hook: def cleanupSubprocesses(self): # Ensure any subprocesses are cleaned up for p in self.subprocesses: p.terminate() del p del self.subprocesses[:] # Ensure any forked processes are cleaned up for pid in self.forkedProcessPids: if os.path.exists("/proc/" + str(pid)): os.kill(pid, signal.SIGTERM)

Hide Details

Hide Details

Executing tearDown hook: def shutdown_named_pipe(): # Close the pipe. try: named_pipe.close() except: print("failed to close named pipe") None

Hide Details

# Delete the pipe. try: os.remove(named_pipe_path) except: print("failed to delete named pipe: {}".format(named_pipe_path)) None

Hide Details

# Delete the temp directory. try: os.rmdir(temp_dir) except: print( "failed to delete temp dir: {}, directory contents: '{}'".format( temp_dir, os.listdir(temp_dir))) None

Hide Details

Hide Details

PASS: LLDB (/Users/buildslave/jenkins/workspace/lldb-cmake-sanitized/host-compiler/bin/clang-10-x86_64) :: test_start_no_ack_mode_debugserver (TestLldbGdbServer.LldbGdbServerTestCase) runCmd: settings set symbols.enable-external-lookup false output:

Hide Details

runCmd: settings set plugin.process.gdb-remote.packet-timeout 60 output:

Hide Details

runCmd: settings set symbols.clang-modules-cache-path "/Users/buildslave/jenkins/workspace/lldb-cmake-sanitized/lldb-build/tools/lldb/lldb-test-build.noindex/module-cache-lldb/lldb-api" output:

Hide Details

runCmd: settings set use-color false output:

Hide Details

UNSUPPORTED: LLDB (/Users/buildslave/jenkins/workspace/lldb-cmake-sanitized/host-compiler/bin/clang-10-x86_64) :: test_start_no_ack_mode_llgs (TestLldbGdbServer.LldbGdbServerTestCase) (llgs tests) runCmd: settings set symbols.enable-external-lookup false output:

Hide Details

runCmd: settings set plugin.process.gdb-remote.packet-timeout 60 output:

Hide Details

runCmd: settings set symbols.clang-modules-cache-path "/Users/buildslave/jenkins/workspace/lldb-cmake-sanitized/lldb-build/tools/lldb/lldb-test-build.noindex/module-cache-lldb/lldb-api" output:

Hide Details

runCmd: settings set use-color false output:

Hide Details

Adding tearDown hook: def shutdown_named_pipe(): # Close the pipe. try: named_pipe.close() except: print("failed to close named pipe") None

Hide Details

# Delete the pipe. try: os.remove(named_pipe_path) except: print("failed to delete named pipe: {}".format(named_pipe_path)) None

Hide Details

# Delete the temp directory. try: os.rmdir(temp_dir) except: print( "failed to delete temp dir: {}, directory contents: '{}'".format( temp_dir, os.listdir(temp_dir))) None

Hide Details

Hide Details

Adding tearDown hook: def cleanupSubprocesses(self): # Ensure any subprocesses are cleaned up for p in self.subprocesses: p.terminate() del p del self.subprocesses[:] # Ensure any forked processes are cleaned up for pid in self.forkedProcessPids: if os.path.exists("/proc/" + str(pid)): os.kill(pid, signal.SIGTERM)

Hide Details

Hide Details

Adding tearDown hook: def shutdown_debug_monitor(): try: server.terminate() except: logger.warning( "failed to terminate server for debug monitor: {}; ignoring".format( sys.exc_info()[0]))

Hide Details

Hide Details

Adding tearDown hook: def shutdown_socket(): if sock: try: # send the kill packet so lldb-server shuts down gracefully sock.sendall(GdbRemoteTestCaseBase._GDBREMOTE_KILL_PACKET) except: logger.warning( "failed to send kill packet to debug monitor: {}; ignoring".format( sys.exc_info()[0]))

Hide Details

try: sock.close() except: logger.warning( "failed to close socket to debug monitor: {}; ignoring".format( sys.exc_info()[0]))

Hide Details

Hide Details

Executing tearDown hook: def shutdown_socket(): if sock: try: # send the kill packet so lldb-server shuts down gracefully sock.sendall(GdbRemoteTestCaseBase._GDBREMOTE_KILL_PACKET) except: logger.warning( "failed to send kill packet to debug monitor: {}; ignoring".format( sys.exc_info()[0]))

Hide Details

try: sock.close() except: logger.warning( "failed to close socket to debug monitor: {}; ignoring".format( sys.exc_info()[0]))

Hide Details

Hide Details

Executing tearDown hook: def shutdown_debug_monitor(): try: server.terminate() except: logger.warning( "failed to terminate server for debug monitor: {}; ignoring".format( sys.exc_info()[0]))

Hide Details

Hide Details

Executing tearDown hook: def cleanupSubprocesses(self): # Ensure any subprocesses are cleaned up for p in self.subprocesses: p.terminate() del p del self.subprocesses[:] # Ensure any forked processes are cleaned up for pid in self.forkedProcessPids: if os.path.exists("/proc/" + str(pid)): os.kill(pid, signal.SIGTERM)

Hide Details

Hide Details

Executing tearDown hook: def shutdown_named_pipe(): # Close the pipe. try: named_pipe.close() except: print("failed to close named pipe") None

Hide Details

# Delete the pipe. try: os.remove(named_pipe_path) except: print("failed to delete named pipe: {}".format(named_pipe_path)) None

Hide Details

# Delete the temp directory. try: os.rmdir(temp_dir) except: print( "failed to delete temp dir: {}, directory contents: '{}'".format( temp_dir, os.listdir(temp_dir))) None

Hide Details

Hide Details

PASS: LLDB (/Users/buildslave/jenkins/workspace/lldb-cmake-sanitized/host-compiler/bin/clang-10-x86_64) :: test_thread_suffix_supported_debugserver (TestLldbGdbServer.LldbGdbServerTestCase) runCmd: settings set symbols.enable-external-lookup false output:

Hide Details

runCmd: settings set plugin.process.gdb-remote.packet-timeout 60 output:

Hide Details

runCmd: settings set symbols.clang-modules-cache-path "/Users/buildslave/jenkins/workspace/lldb-cmake-sanitized/lldb-build/tools/lldb/lldb-test-build.noindex/module-cache-lldb/lldb-api" output:

Hide Details

runCmd: settings set use-color false output:

Hide Details

UNSUPPORTED: LLDB (/Users/buildslave/jenkins/workspace/lldb-cmake-sanitized/host-compiler/bin/clang-10-x86_64) :: test_thread_suffix_supported_llgs (TestLldbGdbServer.LldbGdbServerTestCase) (llgs tests) runCmd: settings set symbols.enable-external-lookup false output:

Hide Details

runCmd: settings set plugin.process.gdb-remote.packet-timeout 60 output:

Hide Details

runCmd: settings set symbols.clang-modules-cache-path "/Users/buildslave/jenkins/workspace/lldb-cmake-sanitized/lldb-build/tools/lldb/lldb-test-build.noindex/module-cache-lldb/lldb-api" output:

Hide Details

runCmd: settings set use-color false output:

Hide Details

Adding tearDown hook: def shutdown_named_pipe(): # Close the pipe. try: named_pipe.close() except: print("failed to close named pipe") None

Hide Details

# Delete the pipe. try: os.remove(named_pipe_path) except: print("failed to delete named pipe: {}".format(named_pipe_path)) None

Hide Details

# Delete the temp directory. try: os.rmdir(temp_dir) except: print( "failed to delete temp dir: {}, directory contents: '{}'".format( temp_dir, os.listdir(temp_dir))) None

Hide Details

Hide Details

Adding tearDown hook: def cleanupSubprocesses(self): # Ensure any subprocesses are cleaned up for p in self.subprocesses: p.terminate() del p del self.subprocesses[:] # Ensure any forked processes are cleaned up for pid in self.forkedProcessPids: if os.path.exists("/proc/" + str(pid)): os.kill(pid, signal.SIGTERM)

Hide Details

Hide Details

Adding tearDown hook: def shutdown_debug_monitor(): try: server.terminate() except: logger.warning( "failed to terminate server for debug monitor: {}; ignoring".format( sys.exc_info()[0]))

Hide Details

Hide Details

Adding tearDown hook: def shutdown_socket(): if sock: try: # send the kill packet so lldb-server shuts down gracefully sock.sendall(GdbRemoteTestCaseBase._GDBREMOTE_KILL_PACKET) except: logger.warning( "failed to send kill packet to debug monitor: {}; ignoring".format( sys.exc_info()[0]))

Hide Details

try: sock.close() except: logger.warning( "failed to close socket to debug monitor: {}; ignoring".format( sys.exc_info()[0]))

Hide Details

Hide Details

Executing tearDown hook: def shutdown_socket(): if sock: try: # send the kill packet so lldb-server shuts down gracefully sock.sendall(GdbRemoteTestCaseBase._GDBREMOTE_KILL_PACKET) except: logger.warning( "failed to send kill packet to debug monitor: {}; ignoring".format( sys.exc_info()[0]))

Hide Details

try: sock.close() except: logger.warning( "failed to close socket to debug monitor: {}; ignoring".format( sys.exc_info()[0]))

Hide Details

Hide Details

Executing tearDown hook: def shutdown_debug_monitor(): try: server.terminate() except: logger.warning( "failed to terminate server for debug monitor: {}; ignoring".format( sys.exc_info()[0]))

Hide Details

Hide Details

Executing tearDown hook: def cleanupSubprocesses(self): # Ensure any subprocesses are cleaned up for p in self.subprocesses: p.terminate() del p del self.subprocesses[:] # Ensure any forked processes are cleaned up for pid in self.forkedProcessPids: if os.path.exists("/proc/" + str(pid)): os.kill(pid, signal.SIGTERM)

Hide Details

Hide Details

Executing tearDown hook: def shutdown_named_pipe(): # Close the pipe. try: named_pipe.close() except: print("failed to close named pipe") None

Hide Details

# Delete the pipe. try: os.remove(named_pipe_path) except: print("failed to delete named pipe: {}".format(named_pipe_path)) None

Hide Details

# Delete the temp directory. try: os.rmdir(temp_dir) except: print( "failed to delete temp dir: {}, directory contents: '{}'".format( temp_dir, os.listdir(temp_dir))) None

Hide Details

Hide Details

PASS: LLDB (/Users/buildslave/jenkins/workspace/lldb-cmake-sanitized/host-compiler/bin/clang-10-x86_64) :: test_written_M_content_reads_back_correctly_debugserver (TestLldbGdbServer.LldbGdbServerTestCase) runCmd: settings set symbols.enable-external-lookup false output:

Hide Details

runCmd: settings set plugin.process.gdb-remote.packet-timeout 60 output:

Hide Details

runCmd: settings set symbols.clang-modules-cache-path "/Users/buildslave/jenkins/workspace/lldb-cmake-sanitized/lldb-build/tools/lldb/lldb-test-build.noindex/module-cache-lldb/lldb-api" output:

Hide Details

runCmd: settings set use-color false output:

Hide Details

UNSUPPORTED: LLDB (/Users/buildslave/jenkins/workspace/lldb-cmake-sanitized/host-compiler/bin/clang-10-x86_64) :: test_written_M_content_reads_back_correctly_llgs (TestLldbGdbServer.LldbGdbServerTestCase) (llgs tests) Restore dir to: /Users/buildslave/jenkins/workspace/lldb-cmake-sanitized/lldb-build/tools/lldb/test ====================================================================== FAIL: test_qThreadInfo_contains_thread_attach_debugserver (TestLldbGdbServer.LldbGdbServerTestCase) ---------------------------------------------------------------------- Traceback (most recent call last): File "/Users/buildslave/jenkins/workspace/lldb-cmake-sanitized/llvm-project/lldb/packages/Python/lldbsuite/test/decorators.py", line 141, in wrapper func(*args, **kwargs) File "/Users/buildslave/jenkins/workspace/lldb-cmake-sanitized/llvm-project/lldb/packages/Python/lldbsuite/test/tools/lldb-server/TestLldbGdbServer.py", line 481, in test_qThreadInfo_contains_thread_attach_debugserver self.qThreadInfo_contains_thread() File "/Users/buildslave/jenkins/workspace/lldb-cmake-sanitized/llvm-project/lldb/packages/Python/lldbsuite/test/tools/lldb-server/TestLldbGdbServer.py", line 446, in qThreadInfo_contains_thread procs = self.prep_debug_monitor_and_inferior() File "/Users/buildslave/jenkins/workspace/lldb-cmake-sanitized/llvm-project/lldb/packages/Python/lldbsuite/test/tools/lldb-server/gdbremote_testcase.py", line 583, in prep_debug_monitor_and_inferior server = self.connect_to_debug_monitor(attach_pid=attach_pid) File "/Users/buildslave/jenkins/workspace/lldb-cmake-sanitized/llvm-project/lldb/packages/Python/lldbsuite/test/tools/lldb-server/gdbremote_testcase.py", line 417, in connect_to_debug_monitor server = self.launch_debug_monitor(attach_pid=attach_pid) File "/Users/buildslave/jenkins/workspace/lldb-cmake-sanitized/llvm-project/lldb/packages/Python/lldbsuite/test/tools/lldb-server/gdbremote_testcase.py", line 410, in launch_debug_monitor self.port = self.get_stub_port_from_named_socket(self._READ_TIMEOUT) File "/Users/buildslave/jenkins/workspace/lldb-cmake-sanitized/llvm-project/lldb/packages/Python/lldbsuite/test/tools/lldb-server/gdbremote_testcase.py", line 216, in get_stub_port_from_named_socket "write side of pipe has not written anything - stub isn't writing to pipe.") AssertionError: 0 == 0 : write side of pipe has not written anything - stub isn't writing to pipe. Config=x86_64-/Users/buildslave/jenkins/workspace/lldb-cmake-sanitized/host-compiler/bin/clang-10 ---------------------------------------------------------------------- Ran 65 tests in 249.465s

Hide Details

RESULT: FAILED (29 passes, 1 failures, 0 errors, 34 skipped, 1 expected failures, 0 unexpected successes)

Hide Details

******************** PASS: lldb-api :: lang/objc/rdar-11355592/TestRdar11355592.py (664 of 1785) PASS: lldb-api :: functionalities/data-formatter/data-formatter-objc/TestDataFormatterObjNSException.py (665 of 1785) PASS: lldb-unit :: Utility/./UtilityTests/ArchSpecTest.TestSetTriple (666 of 1785) UNSUPPORTED: lldb-shell :: Register/x86-64-gp-write.test (667 of 1785) PASS: lldb-shell :: SymbolFile/DWARF/debug-types-line-tables.s (668 of 1785) PASS: lldb-api :: functionalities/data-formatter/data-formatter-stl/libcxx/set/TestDataFormatterLibcxxSet.py (669 of 1785) PASS: lldb-unit :: ScriptInterpreter/Python/./ScriptInterpreterPythonTests/PythonDataObjectsTest.TestResetting (670 of 1785) PASS: lldb-api :: functionalities/data-formatter/data-formatter-objc/TestDataFormatterObjCExpr.py (671 of 1785) PASS: lldb-api :: macosx/function-starts/TestFunctionStarts.py (672 of 1785) PASS: lldb-api :: functionalities/data-formatter/language_category_updates/TestDataFormatterLanguageCategoryUpdates.py (673 of 1785) PASS: lldb-unit :: UnwindAssembly/x86/./UnwindAssemblyx86Tests/Testx86AssemblyInspectionEngine.TestPushRBP (674 of 1785) PASS: lldb-shell :: SymbolFile/DWARF/deterministic-build.cpp (675 of 1785) PASS: lldb-unit :: Host/./HostTests/NativeProcessProtocolTest.SetBreakpointFailVerify (676 of 1785) PASS: lldb-api :: python_api/function_symbol/TestDisasmAPI.py (677 of 1785) PASS: lldb-api :: commands/frame/select/TestFrameSelect.py (678 of 1785) PASS: lldb-api :: tools/lldb-server/TestGdbRemoteKill.py (679 of 1785) PASS: lldb-api :: functionalities/tail_call_frames/ambiguous_tail_call_seq2/TestAmbiguousTailCallSeq2.py (680 of 1785) PASS: lldb-shell :: SymbolFile/DWARF/debug_ranges.s (681 of 1785) PASS: lldb-api :: commands/watchpoints/step_over_watchpoint/TestStepOverWatchpoint.py (682 of 1785) PASS: lldb-api :: commands/expression/call-overridden-method/TestCallOverriddenMethod.py (683 of 1785) UNSUPPORTED: lldb-shell :: Register/x86-64-ymm16-read.test (684 of 1785) PASS: lldb-unit :: Utility/./UtilityTests/StringListTest.SetSize (685 of 1785) PASS: lldb-api :: lang/objc/orderedset/TestOrderedSet.py (686 of 1785) PASS: lldb-unit :: Utility/./UtilityTests/OptionsWithRawTest.LeadingSpaceArgs (687 of 1785) PASS: lldb-unit :: Language/Highlighting/./HighlighterTests/HighlighterTest.ClangIdentifiers (688 of 1785) PASS: lldb-unit :: Utility/./UtilityTests/StringListTest.CopyListEmpty (689 of 1785) PASS: lldb-unit :: ScriptInterpreter/Python/./ScriptInterpreterPythonTests/PythonDataObjectsTest.TestOwnedReferences (690 of 1785) PASS: lldb-unit :: Utility/./UtilityTests/StringExtractorTest.GetHexU8_Underflow2 (691 of 1785) PASS: lldb-api :: lang/cpp/enum_types/TestCPP11EnumTypes.py (692 of 1785) PASS: lldb-unit :: Utility/./UtilityTests/StringExtractorTest.GetNameColonValueContainsColon (693 of 1785) PASS: lldb-shell :: Quit/TestQuitExitCodeHex0.test (694 of 1785) PASS: lldb-unit :: Host/./HostTests/MainLoopTest.ReadObject (695 of 1785) PASS: lldb-api :: functionalities/conditional_break/TestConditionalBreak.py (696 of 1785) PASS: lldb-api :: functionalities/thread/backtrace_all/TestBacktraceAll.py (697 of 1785) PASS: lldb-api :: functionalities/thread/concurrent_events/TestConcurrentWatchpointWithDelayWatchpointThreads.py (698 of 1785) PASS: lldb-unit :: Utility/./UtilityTests/StructuredDataTest.ParseJSONFromFile (699 of 1785) PASS: lldb-shell :: ObjectFile/ELF/PT_TLS-overlap-PT_LOAD.yaml (700 of 1785) PASS: lldb-api :: python_api/module_section/TestModuleAndSection.py (701 of 1785) PASS: lldb-api :: python_api/watchpoint/TestSetWatchpoint.py (702 of 1785) PASS: lldb-unit :: Expression/./ExpressionTests/CppModuleConfigurationTest.AmbiguousLibCpp (703 of 1785) PASS: lldb-unit :: Utility/./UtilityTests/StreamTest.PutRawBytesToBigEndian (704 of 1785) PASS: lldb-api :: lang/cpp/extern_c/TestExternCSymbols.py (705 of 1785) PASS: lldb-unit :: Utility/./UtilityTests/FileSpecTest.AppendPathComponent (706 of 1785) PASS: lldb-api :: functionalities/thread/concurrent_events/TestConcurrentSignalWatchBreak.py (707 of 1785) PASS: lldb-unit :: Process/minidump/./LLDBMinidumpTests/MinidumpParserTest.GetPidWindows (708 of 1785) UNSUPPORTED: lldb-api :: functionalities/breakpoint/hardware_breakpoints/hardware_breakpoint_on_multiple_threads/TestHWBreakMultiThread.py (709 of 1785) PASS: lldb-unit :: Utility/./UtilityTests/StreamTest.PutCharWhitespace (710 of 1785) PASS: lldb-api :: sample_test/TestSampleTest.py (711 of 1785) PASS: lldb-shell :: ObjectFile/Breakpad/sections-trailing-func.test (712 of 1785) PASS: lldb-unit :: Language/Highlighting/./HighlighterTests/HighlighterTest.Colons (713 of 1785) PASS: lldb-api :: tools/lldb-server/TestGdbRemoteThreadsInStopReply.py (714 of 1785) PASS: lldb-unit :: Utility/./UtilityTests/LogChannelEnabledTest.LogGetLogThread (715 of 1785) PASS: lldb-unit :: Utility/./UtilityTests/CompletionRequest.TryCompleteCurrentArgGood (716 of 1785) PASS: lldb-unit :: Utility/./UtilityTests/ArchSpecTest.Compatibility (717 of 1785) PASS: lldb-api :: macosx/duplicate-archive-members/TestDuplicateMembers.py (718 of 1785) PASS: lldb-unit :: Utility/./UtilityTests/UUIDTest.Validity (719 of 1785) PASS: lldb-api :: commands/expression/import-std-module/unique_ptr-dbg-info-content/TestUniquePtrDbgInfoContent.py (720 of 1785) PASS: lldb-unit :: SymbolFile/DWARF/./SymbolFileDWARFTests/SymbolFileDWARFTests.TestAbbrevInvalidNULLTag (721 of 1785) PASS: lldb-shell :: SymbolFile/Breakpad/symtab.test (722 of 1785) PASS: lldb-api :: functionalities/data-formatter/data-formatter-categories/TestDataFormatterCategories.py (723 of 1785) PASS: lldb-api :: commands/target/stop-hooks/TestStopHooks.py (724 of 1785) XFAIL: lldb-shell :: Register/x86-64-write.test (725 of 1785) PASS: lldb-shell :: Reproducer/TestRelativePath.test (726 of 1785) PASS: lldb-api :: commands/expression/import-std-module/sysroot/TestStdModuleSysroot.py (727 of 1785) PASS: lldb-unit :: Utility/./UtilityTests/StringListTest.ShiftCString (728 of 1785) PASS: lldb-api :: commands/expression/call-function/TestCallStdStringFunction.py (729 of 1785) PASS: lldb-shell :: ObjectFile/ELF/build-id-case.yaml (730 of 1785) PASS: lldb-api :: python_api/function_symbol/TestSymbolAPI.py (731 of 1785) PASS: lldb-unit :: Utility/./UtilityTests/AnsiTerminal.Twice (732 of 1785) PASS: lldb-api :: macosx/find-dsym/deep-bundle/TestDeepBundle.py (733 of 1785) PASS: lldb-unit :: Utility/./UtilityTests/StreamTest.PutULEB128 (734 of 1785) PASS: lldb-api :: commands/expression/two-files/TestObjCTypeQueryFromOtherCompileUnit.py (735 of 1785) PASS: lldb-shell :: Quit/TestQuitExitCode0.test (736 of 1785) PASS: lldb-unit :: Utility/./UtilityTests/NameMatchesTest.Equals (737 of 1785) PASS: lldb-api :: functionalities/postmortem/minidump-new/TestMiniDumpUUID.py (738 of 1785) PASS: lldb-shell :: Minidump/Windows/Sigsegv/sigsegv.test (739 of 1785) PASS: lldb-shell :: Reproducer/Functionalities/TestStepping.test (740 of 1785) PASS: lldb-unit :: Utility/./UtilityTests/StreamTest.ShiftOperatorChars (741 of 1785) PASS: lldb-unit :: Utility/./UtilityTests/StreamTest.PutCharNull (742 of 1785) PASS: lldb-api :: lang/c/bitfields/TestBitfields.py (743 of 1785) PASS: lldb-api :: commands/frame/diagnose/bad-reference/TestBadReference.py (744 of 1785) PASS: lldb-unit :: Host/./HostTests/TaskPoolTest.AddTask (745 of 1785) PASS: lldb-unit :: Utility/./UtilityTests/AnsiTerminal.WhiteSpace (746 of 1785) PASS: lldb-api :: tools/lldb-server/TestGdbRemote_qThreadStopInfo.py (747 of 1785) PASS: lldb-api :: functionalities/tail_call_frames/sbapi_support/TestTailCallFrameSBAPI.py (748 of 1785) PASS: lldb-unit :: Host/./HostTests/FileSystemTest.Readable (749 of 1785) UNSUPPORTED: lldb-api :: functionalities/process_save_core/TestProcessSaveCore.py (750 of 1785) UNSUPPORTED: lldb-api :: commands/watchpoints/multi_watchpoint_slots/TestWatchpointMultipleSlots.py (751 of 1785) PASS: lldb-unit :: Utility/./UtilityTests/BinaryStreamTest.PutULEB128OneByte (752 of 1785) PASS: lldb-api :: commands/watchpoints/watchpoint_size/TestWatchpointSizes.py (753 of 1785) PASS: lldb-unit :: Utility/./UtilityTests/UserIDResolver.GetUserName (754 of 1785) PASS: lldb-api :: lang/objc/objc-class-method/TestObjCClassMethod.py (755 of 1785) UNSUPPORTED: lldb-api :: lang/objc/bitfield_ivars/TestBitfieldIvars.py (756 of 1785) PASS: lldb-api :: lang/c/blocks/TestBlocks.py (757 of 1785) PASS: lldb-api :: tools/lldb-server/TestGdbRemoteExitCode.py (758 of 1785) PASS: lldb-unit :: Host/./HostTests/ConnectionFileDescriptorTest.TCPGetURIv4 (759 of 1785) PASS: lldb-unit :: Utility/./UtilityTests/ArgsTest.ReplaceArgumentAtIndexLonger (760 of 1785) PASS: lldb-api :: functionalities/gdb_remote_client/TestRecognizeBreakpoint.py (761 of 1785) PASS: lldb-unit :: Utility/./UtilityTests/StateTest.Formatv (762 of 1785) PASS: lldb-api :: lang/cpp/gmodules/TestWithModuleDebugging.py (763 of 1785) PASS: lldb-api :: lang/objc/objc-struct-return/TestObjCStructReturn.py (764 of 1785) PASS: lldb-api :: functionalities/thread/concurrent_events/TestConcurrentTwoWatchpointThreads.py (765 of 1785) PASS: lldb-unit :: Expression/./ExpressionTests/CppModuleConfigurationTest.LibCppV2 (766 of 1785) PASS: lldb-api :: commands/expression/char/TestExprsChar.py (767 of 1785) PASS: lldb-api :: functionalities/thread/concurrent_events/TestConcurrentTwoBreakpointsOneDelaySignal.py (768 of 1785) PASS: lldb-api :: functionalities/testid/TestTestId.py (769 of 1785) PASS: lldb-unit :: Utility/./UtilityTests/StringListTest.GetMaxStringLengthIncreasingSize (770 of 1785) PASS: lldb-api :: functionalities/postmortem/wow64_minidump/TestWow64MiniDump.py (771 of 1785) PASS: lldb-unit :: Host/./HostTests/NativeProcessProtocolTest.ReadMemoryWithoutTrap (772 of 1785) PASS: lldb-api :: functionalities/gdb_remote_client/TestGDBRemoteClient.py (773 of 1785) PASS: lldb-unit :: Utility/./UtilityTests/DataExtractorTest.GetMaxS64 (774 of 1785) PASS: lldb-api :: functionalities/data-formatter/data-formatter-stl/libcxx/unordered/TestDataFormatterUnordered.py (775 of 1785) PASS: lldb-unit :: Utility/./UtilityTests/TimeoutTest.Construction (776 of 1785) PASS: lldb-api :: lang/c/unions/TestUnionMembers.py (777 of 1785) PASS: lldb-unit :: Process/minidump/./LLDBMinidumpTests/MinidumpParserTest.GetMemoryRegionInfoFromMemoryList (778 of 1785) PASS: lldb-unit :: Utility/./UtilityTests/BinaryStreamTest.PutSLEB128SevenBytes (779 of 1785) PASS: lldb-unit :: Utility/./UtilityTests/CompletionRequest.Constructor (780 of 1785) PASS: lldb-unit :: Utility/./UtilityTests/StringExtractorTest.GetHexBytesAvail_FullString (781 of 1785) UNSUPPORTED: lldb-shell :: SymbolFile/PDB/udt-layout.test (782 of 1785) PASS: lldb-unit :: Utility/./UtilityTests/UriParserTest.SchemeHostSeparator2 (783 of 1785) PASS: lldb-api :: terminal/TestSTTYBeforeAndAfter.py (784 of 1785) PASS: lldb-api :: python_api/sbvalue_persist/TestSBValuePersist.py (785 of 1785) PASS: lldb-unit :: ScriptInterpreter/Python/./ScriptInterpreterPythonTests/PythonDataObjectsTest.TestPythonStringToStructuredString (786 of 1785) PASS: lldb-unit :: UnwindAssembly/x86/./UnwindAssemblyx86Tests/Testx86AssemblyInspectionEngine.TestPopR13 (787 of 1785) PASS: lldb-api :: tools/lldb-server/commandline/TestStubSetSID.py (788 of 1785) PASS: lldb-unit :: Utility/./UtilityTests/BinaryStreamTest.PutULEB128TwoBytes (789 of 1785) PASS: lldb-unit :: Utility/./UtilityTests/SerializationRountripTest.SerializeDeserializePod (790 of 1785) PASS: lldb-unit :: Utility/./UtilityTests/BinaryStreamTest.PutULEB128NineBytes (791 of 1785) PASS: lldb-api :: functionalities/modern-type-lookup/basic-objc/TestBasicObjcModernTypeLookup.py (792 of 1785) PASS: lldb-api :: python_api/findvalue_duplist/TestSBFrameFindValue.py (793 of 1785) PASS: lldb-unit :: Host/./HostTests/SocketTest.UDPConnect (794 of 1785) PASS: lldb-api :: lang/cpp/signed_types/TestSignedTypes.py (795 of 1785) PASS: lldb-api :: functionalities/inferior-changed/TestInferiorChanged.py (796 of 1785) PASS: lldb-unit :: Utility/./UtilityTests/ArgsTest.BareSingleQuote (797 of 1785) PASS: lldb-unit :: Utility/./UtilityTests/Flags.GetBitSize (798 of 1785) PASS: lldb-shell :: SymbolFile/Breakpad/line-table.test (799 of 1785) PASS: lldb-api :: python_api/value/TestValueAPI.py (800 of 1785) PASS: lldb-api :: lang/objcxx/hide-runtime-values/TestObjCXXHideRuntimeValues.py (801 of 1785) PASS: lldb-api :: commands/expression/import-std-module/queue/TestQueue.py (802 of 1785) PASS: lldb-api :: functionalities/data-formatter/data-formatter-objc/TestDataFormatterObjCNSContainer.py (803 of 1785) PASS: lldb-unit :: Utility/./UtilityTests/RangeTest.LessThanInvalid (804 of 1785) PASS: lldb-unit :: Signals/./SignalsTests/UnixSignalsTest.Iteration (805 of 1785) PASS: lldb-unit :: Utility/./UtilityTests/UriParserTest.Minimal (806 of 1785) UNSUPPORTED: lldb-api :: functionalities/data-formatter/data-formatter-stl/libstdcpp/iterator/TestDataFormatterStdIterator.py (807 of 1785) PASS: lldb-shell :: ObjectFile/PECOFF/uuid.yaml (808 of 1785) PASS: lldb-api :: lang/cpp/thread_local/TestThreadLocal.py (809 of 1785) PASS: lldb-unit :: Utility/./UtilityTests/ArgsTest.TestAppendArg (810 of 1785) PASS: lldb-unit :: Utility/./UtilityTests/StreamTeeTest.Assignment (811 of 1785) PASS: lldb-shell :: SymbolFile/DWARF/debug_ranges_and_rnglists.test (812 of 1785) PASS: lldb-api :: lang/objc/global_ptrs/TestGlobalObjects.py (813 of 1785) PASS: lldb-unit :: Process/minidump/./LLDBMinidumpTests/MinidumpParserTest.GetArchitecture (814 of 1785) PASS: lldb-api :: commands/expression/import-std-module/vector-dbg-info-content/TestDbgInfoContentVector.py (815 of 1785) PASS: lldb-unit :: Utility/./UtilityTests/StringListTest.AppendListCStringArrayEmpty (816 of 1785) PASS: lldb-api :: functionalities/thread/exit_during_break/TestExitDuringBreak.py (817 of 1785) PASS: lldb-unit :: Utility/./UtilityTests/ConstStringTest.CompareStringRef (818 of 1785) PASS: lldb-unit :: Utility/./UtilityTests/RangeDataVector.FindEntryThatContains (819 of 1785) PASS: lldb-unit :: Utility/./UtilityTests/GeneratorTest.Create (820 of 1785) PASS: lldb-api :: linux/builtin_trap/TestBuiltinTrap.py (821 of 1785) UNSUPPORTED: lldb-shell :: SymbolFile/PDB/typedefs.test (822 of 1785) PASS: lldb-api :: lang/objc/objc-dyn-sbtype/TestObjCDynamicSBType.py (823 of 1785) PASS: lldb-api :: functionalities/multidebugger_commands/TestMultipleDebuggersCommands.py (824 of 1785) PASS: lldb-unit :: Utility/./UtilityTests/StringExtractorTest.GetHexBytes_Partial (825 of 1785) PASS: lldb-unit :: UnwindAssembly/x86/./UnwindAssemblyx86Tests/Testx86AssemblyInspectionEngine.TestSimplex86_64Augmented (826 of 1785) PASS: lldb-api :: functionalities/data-formatter/stringprinter/TestStringPrinter.py (827 of 1785) PASS: lldb-unit :: Host/./HostTests/SocketTest.DomainGetConnectURI (828 of 1785) PASS: lldb-api :: functionalities/thread/num_threads/TestNumThreads.py (829 of 1785) UNSUPPORTED: lldb-shell :: SymbolFile/PDB/ast-restore.test (830 of 1785) PASS: lldb-api :: lang/objc/objc-builtin-types/TestObjCBuiltinTypes.py (831 of 1785) PASS: lldb-unit :: UnwindAssembly/x86/./UnwindAssemblyx86Tests/Testx86AssemblyInspectionEngine.TestStackRealignMSVC_i386 (832 of 1785) PASS: lldb-api :: functionalities/data-formatter/data-formatter-stl/libcxx/bitset/TestDataFormatterLibcxxBitset.py (833 of 1785) UNSUPPORTED: lldb-shell :: Register/x86-gp-write.test (834 of 1785) UNSUPPORTED: lldb-shell :: Unwind/eh-frame-small-fde.test (835 of 1785) PASS: lldb-api :: python_api/interpreter/TestCommandInterpreterAPI.py (836 of 1785) PASS: lldb-api :: lang/objc/objc-runtime-ivars/TestRuntimeIvars.py (837 of 1785) PASS: lldb-unit :: Utility/./UtilityTests/RangeTest.ContainsEndInclusive (838 of 1785) PASS: lldb-unit :: UnwindAssembly/x86/./UnwindAssemblyx86Tests/Testx86AssemblyInspectionEngine.TestSpillRegToStackViaMOVi386 (839 of 1785) PASS: lldb-shell :: Driver/TestTarget.test (840 of 1785) PASS: lldb-unit :: Utility/./UtilityTests/StringExtractorTest.GetHexBytesAvail_OddPair2 (841 of 1785) PASS: lldb-unit :: Utility/./UtilityTests/LogTest.Unregister (842 of 1785) PASS: lldb-unit :: Utility/./UtilityTests/BroadcasterTest.EventTypeHasListeners (843 of 1785) PASS: lldb-unit :: Utility/./UtilityTests/VMRange.IsValid (844 of 1785) PASS: lldb-unit :: Utility/./UtilityTests/UUIDTest.RelationalOperators (845 of 1785) PASS: lldb-shell :: Settings/TestModuleCacheSanity.test (846 of 1785) PASS: lldb-unit :: Utility/./UtilityTests/BinaryStreamTest.PutULEB128One (847 of 1785) PASS: lldb-api :: functionalities/data-formatter/data-formatter-stl/libcxx/atomic/TestLibCxxAtomic.py (848 of 1785) PASS: lldb-unit :: Process/minidump/./LLDBMinidumpTests/MinidumpParserTest.GetMemoryRegionInfoFromMemory64List (849 of 1785) PASS: lldb-unit :: Utility/./UtilityTests/StreamTeeTest.GetStreamAtIndexOutOfBoundsEmpty (850 of 1785) PASS: lldb-api :: commands/expression/call-function/TestCallStopAndContinue.py (851 of 1785) PASS: lldb-unit :: UnwindAssembly/x86/./UnwindAssemblyx86Tests/Testx86AssemblyInspectionEngine.TestPushRBX (852 of 1785) PASS: lldb-api :: lang/c/shared_lib_stripped_symbols/TestSharedLibStrippedSymbols.py (853 of 1785) PASS: lldb-unit :: Utility/./UtilityTests/TildeExpressionResolver.ResolveFullPath (854 of 1785) PASS: lldb-unit :: Utility/./UtilityTests/UUIDTest.SetFromStringRef (855 of 1785) PASS: lldb-api :: lang/c/set_values/TestSetValues.py (856 of 1785) PASS: lldb-api :: lang/c/register_variables/TestRegisterVariables.py (857 of 1785) PASS: lldb-shell :: ObjectFile/ELF/PT_LOAD-overlap-PT_INTERP.yaml (858 of 1785) PASS: lldb-unit :: ScriptInterpreter/Python/./ScriptInterpreterPythonTests/PythonDataObjectsTest.TestGlobalNameResolutionNoDot (859 of 1785) PASS: lldb-unit :: UnwindAssembly/x86/./UnwindAssemblyx86Tests/Testx86AssemblyInspectionEngine.TestSimple64bitFrameFunction (860 of 1785) PASS: lldb-api :: macosx/queues/TestQueues.py (861 of 1785) PASS: lldb-unit :: Utility/./UtilityTests/RecordReplayTest.InstrumentedBarPtr (862 of 1785) PASS: lldb-api :: commands/version/TestVersion.py (863 of 1785) PASS: lldb-unit :: UnwindAssembly/x86/./UnwindAssemblyx86Tests/Testx86AssemblyInspectionEngine.TestPopRBP (864 of 1785) PASS: lldb-shell :: Driver/TestFile.test (865 of 1785) PASS: lldb-unit :: Utility/./UtilityTests/ListenerTest.GetEventImmediate (866 of 1785) PASS: lldb-unit :: Target/./TargetTests/ModuleCacheTest.GetAndPutStrangeHostname (867 of 1785) PASS: lldb-api :: functionalities/modern-type-lookup/libcxx/TestLibCxxModernTypeLookup.py (868 of 1785) PASS: lldb-unit :: Host/./HostTests/MainLoopTest.DetectsEOF (869 of 1785) PASS: lldb-shell :: SymbolFile/DWARF/find-variable-dwo.cpp (870 of 1785) PASS: lldb-unit :: tools/lldb-server/tests/./LLDBServerTests/TestBase.LaunchModePreservesEnvironment (871 of 1785) PASS: lldb-unit :: Utility/./UtilityTests/StringExtractorTest.GetHexU8_Exact (872 of 1785) PASS: lldb-api :: functionalities/thread/thread_exit/TestThreadExit.py (873 of 1785) PASS: lldb-api :: functionalities/data-formatter/data-formatter-objc/TestDataFormatterObjCNSDate.py (874 of 1785) PASS: lldb-api :: functionalities/abbreviation/TestCommonShortSpellings.py (875 of 1785) PASS: lldb-unit :: SymbolFile/NativePDB/./SymbolFileNativePDBTests/PDBFPOProgramToDWARFExpressionTests.UnresolvedRegisterAssignmentReference (876 of 1785) PASS: lldb-api :: functionalities/wrong_commands/TestWrongCommands.py (877 of 1785) PASS: lldb-api :: lang/cpp/operator-overload/TestOperatorOverload.py (878 of 1785) PASS: lldb-shell :: Driver/TestSingleQuote.test (879 of 1785) PASS: lldb-unit :: Process/minidump/./LLDBMinidumpTests/MinidumpParserTest.MinidumpModuleOrder (880 of 1785) PASS: lldb-api :: python_api/watchpoint/condition/TestWatchpointConditionAPI.py (881 of 1785) PASS: lldb-api :: functionalities/data-formatter/data-formatter-stl/libcxx/iterator/TestDataFormatterLibccIterator.py (882 of 1785) PASS: lldb-unit :: Utility/./UtilityTests/StreamTest.PutBytesAsRawHex8ToBigEndian (883 of 1785) PASS: lldb-api :: lang/cpp/symbols/TestSymbols.py (884 of 1785) PASS: lldb-unit :: UnwindAssembly/x86/./UnwindAssemblyx86Tests/Testx86AssemblyInspectionEngine.TestSimple32bitFrameFunction (885 of 1785) PASS: lldb-unit :: Utility/./UtilityTests/VASprintfTest.EncodingError (886 of 1785) PASS: lldb-api :: functionalities/data-formatter/data-formatter-objc/TestDataFormatterObjCNSURL.py (887 of 1785) PASS: lldb-unit :: UnwindAssembly/x86/./UnwindAssemblyx86Tests/Testx86AssemblyInspectionEngine.TestPushECX (888 of 1785) PASS: lldb-unit :: UnwindAssembly/x86/./UnwindAssemblyx86Tests/Testx86AssemblyInspectionEngine.TestPopR12 (889 of 1785) PASS: lldb-unit :: Utility/./UtilityTests/StreamTest.PutRawBytesToLittleEndian (890 of 1785) PASS: lldb-unit :: Utility/./UtilityTests/RangeTest.DoesIntersect (891 of 1785) PASS: lldb-api :: functionalities/breakpoint/breakpoint_command/TestRegexpBreakCommand.py (892 of 1785) PASS: lldb-api :: functionalities/process_group/TestChangeProcessGroup.py (893 of 1785) PASS: lldb-unit :: ObjectFile/Breakpad/./ObjectFileBreakpadTests/InfoRecord.parse (894 of 1785) PASS: lldb-unit :: Process/gdb-remote/./ProcessGdbRemoteTests/GDBRemoteCommunicationServerTest.SendErrorResponse_ErrorNumber (895 of 1785) PASS: lldb-unit :: Utility/./UtilityTests/StringListTest.LongestCommonPrefixNoPrefix (896 of 1785) PASS: lldb-api :: api/command-return-object/TestSBCommandReturnObject.py (897 of 1785) PASS: lldb-api :: lang/cpp/function_refs/TestFunctionRefs.py (898 of 1785) PASS: lldb-api :: commands/add-dsym/uuid/TestAddDsymCommand.py (899 of 1785) PASS: lldb-unit :: Utility/./UtilityTests/ScalarTest.Promotion (900 of 1785) PASS: lldb-shell :: Breakpoint/implicit_const_form_support.test (901 of 1785) PASS: lldb-unit :: UnwindAssembly/x86/./UnwindAssemblyx86Tests/Testx86AssemblyInspectionEngine.TestLEAVE (902 of 1785) PASS: lldb-unit :: Utility/./UtilityTests/StringListTest.GetMaxStringLengthEmpty (903 of 1785) PASS: lldb-unit :: Utility/./UtilityTests/StringListTest.GetMaxStringLengthDecreasingSize (904 of 1785) PASS: lldb-shell :: SymbolFile/Breakpad/unwind-via-stack-win.test (905 of 1785) PASS: lldb-api :: commands/expression/context-object-objc/TestContextObjectObjc.py (906 of 1785) PASS: lldb-unit :: debugserver/./debugserverTests/RNBSocket.AnyListen (907 of 1785) PASS: lldb-api :: commands/frame/var/TestFrameVar.py (908 of 1785) UNSUPPORTED: lldb-api :: lang/cpp/printf/TestPrintf.py (909 of 1785) PASS: lldb-api :: lang/c/offsetof/TestOffsetof.py (910 of 1785) PASS: lldb-api :: commands/expression/fixits/TestFixIts.py (911 of 1785) PASS: lldb-api :: commands/process/attach-resume/TestAttachResume.py (912 of 1785) PASS: lldb-shell :: Breakpoint/split-dwarf5-debug-stroffsets.test (913 of 1785) PASS: lldb-unit :: ScriptInterpreter/Python/./ScriptInterpreterPythonTests/PythonExceptionStateTest.TestManualRestoreSemantics (914 of 1785) PASS: lldb-unit :: Utility/./UtilityTests/ArgsTest.ReplaceArgumentAtIndexFarOutOfRange (915 of 1785) PASS: lldb-unit :: Host/./HostTests/NativeProcessProtocolTest.SetBreakpointFailWrite (916 of 1785) PASS: lldb-unit :: Expression/./ExpressionTests/DiagnosticManagerTest.HasFixits (917 of 1785) PASS: lldb-unit :: Utility/./UtilityTests/StreamTest.PutMaxHex64ByteOrderLittle (918 of 1785) PASS: lldb-api :: tools/lldb-server/register-reading/TestGdbRemoteGPacket.py (919 of 1785) PASS: lldb-api :: lang/objc/rdar-10967107/TestRdar10967107.py (920 of 1785) PASS: lldb-unit :: Utility/./UtilityTests/OptionsWithRawTest.UnterminatedQuote (921 of 1785) PASS: lldb-unit :: ScriptInterpreter/Python/./ScriptInterpreterPythonTests/PythonDataObjectsTest.TestPythonDictionaryValueEquality (922 of 1785) PASS: lldb-api :: commands/frame/diagnose/inheritance/TestDiagnoseInheritance.py (923 of 1785) PASS: lldb-unit :: Utility/./UtilityTests/RecordReplayTest.InstrumentedBar (924 of 1785) PASS: lldb-api :: functionalities/data-formatter/vector-types/TestVectorTypesFormatting.py (925 of 1785) PASS: lldb-api :: commands/expression/context-object/TestContextObject.py (926 of 1785) PASS: lldb-shell :: SymbolFile/DWARF/dwarf5-partial-index.cpp (927 of 1785) PASS: lldb-shell :: ObjectFile/ELF/netbsd-core-amd64.test (928 of 1785) PASS: lldb-unit :: Process/minidump/./LLDBMinidumpTests/MinidumpParserTest.MinidumpDuplicateModuleMinAddress (929 of 1785) PASS: lldb-unit :: Utility/./UtilityTests/UriParserTest.Empty (930 of 1785) PASS: lldb-api :: functionalities/thread/concurrent_events/TestConcurrentCrashWithSignal.py (931 of 1785) PASS: lldb-unit :: Utility/./UtilityTests/StringListTest.Clear (932 of 1785) PASS: lldb-api :: functionalities/inferior-crashing/TestInferiorCrashingStep.py (933 of 1785) PASS: lldb-shell :: ObjectFile/ELF/gnu-debuglink.yaml (934 of 1785) PASS: lldb-api :: commands/frame/var-scope/TestFrameVariableScope.py (935 of 1785) PASS: lldb-unit :: Host/./HostTests/HostInfoTest.GetHostname (936 of 1785) PASS: lldb-unit :: UnwindAssembly/x86/./UnwindAssemblyx86Tests/Testx86AssemblyInspectionEngine.Test32BitOnlyInstruction (937 of 1785) PASS: lldb-unit :: ScriptInterpreter/Python/./ScriptInterpreterPythonTests/PythonDataObjectsTest.TestBorrowedReferences (938 of 1785) UNSUPPORTED: lldb-api :: functionalities/data-formatter/data-formatter-stl/libstdcpp/unique_ptr/TestDataFormatterStdUniquePtr.py (939 of 1785) UNSUPPORTED: lldb-api :: functionalities/data-formatter/data-formatter-stl/libstdcpp/map/TestDataFormatterStdMap.py (940 of 1785) PASS: lldb-shell :: BuildScript/compiler-full-path.test (941 of 1785) PASS: lldb-unit :: Host/./HostTests/File.GetStreamFromDescriptor (942 of 1785) PASS: lldb-api :: functionalities/thread/concurrent_events/TestConcurrentManyBreakpoints.py (943 of 1785) PASS: lldb-api :: functionalities/set-data/TestSetData.py (944 of 1785) PASS: lldb-api :: functionalities/breakpoint/auto_continue/TestBreakpointAutoContinue.py (945 of 1785) PASS: lldb-api :: commands/help/TestHelp.py (946 of 1785) PASS: lldb-unit :: UnwindAssembly/x86/./UnwindAssemblyx86Tests/Testx86AssemblyInspectionEngine.TestPushExtended (947 of 1785) PASS: lldb-unit :: Utility/./UtilityTests/DataExtractorTest.GetCStrUnterminated (948 of 1785) UNSUPPORTED: lldb-shell :: Breakpoint/ppc64-localentry.test (949 of 1785) PASS: lldb-shell :: ObjectFile/ELF/short-build-id.yaml (950 of 1785) PASS: lldb-unit :: Host/./HostTests/NativeProcessProtocolTest.ReadCStringFromMemory_MaxSize (951 of 1785) PASS: lldb-unit :: Utility/./UtilityTests/StreamTest.ShiftOperatorUInts (952 of 1785) PASS: lldb-api :: commands/expression/import-std-module/basic/TestImportStdModule.py (953 of 1785) PASS: lldb-unit :: Utility/./UtilityTests/UriParserTest.MinimalPath (954 of 1785) PASS: lldb-shell :: Minidump/Windows/find-module.test (955 of 1785) PASS: lldb-unit :: UnwindAssembly/x86/./UnwindAssemblyx86Tests/Testx86AssemblyInspectionEngine.TestPushR15 (956 of 1785) PASS: lldb-unit :: ScriptInterpreter/Python/./ScriptInterpreterPythonTests/PythonDataObjectsTest.TestCallable (957 of 1785) PASS: lldb-unit :: Utility/./UtilityTests/OptionsWithRawTest.EmptyInput (958 of 1785) PASS: lldb-api :: functionalities/stats_api/TestStatisticsAPI.py (959 of 1785) PASS: lldb-unit :: Utility/./UtilityTests/ConstStringTest.UpdateMangledCounterpart (960 of 1785) PASS: lldb-api :: python_api/disassemble-raw-data/TestDisassembleRawData.py (961 of 1785) PASS: lldb-api :: functionalities/data-formatter/type_summary_list_arg/TestTypeSummaryListArg.py (962 of 1785) PASS: lldb-unit :: Expression/./ExpressionTests/CppModuleConfigurationTest.UnknownLibCppFile (963 of 1785) PASS: lldb-unit :: Process/gdb-remote/./ProcessGdbRemoteTests/GDBRemoteClientBaseTest.SendContinueAndLateInterrupt (964 of 1785) PASS: lldb-api :: lang/cpp/chained-calls/TestCppChainedCalls.py (965 of 1785) PASS: lldb-api :: python_api/value/empty_class/TestValueAPIEmptyClass.py (966 of 1785) PASS: lldb-unit :: Utility/./UtilityTests/BinaryStreamTest.PutSLEB128EightBytes (967 of 1785) PASS: lldb-api :: python_api/symbol-context/two-files/TestSymbolContextTwoFiles.py (968 of 1785) PASS: lldb-unit :: Utility/./UtilityTests/StringListTest.JoinEmpty (969 of 1785) PASS: lldb-api :: commands/expression/unwind_expression/TestUnwindExpression.py (970 of 1785) UNSUPPORTED: lldb-api :: functionalities/thread/thread_specific_break_plus_condition/TestThreadSpecificBpPlusCondition.py (971 of 1785) PASS: lldb-unit :: ScriptInterpreter/Python/./ScriptInterpreterPythonTests/PythonDataObjectsTest.TestPythonListToStructuredList (972 of 1785) PASS: lldb-unit :: SymbolFile/DWARF/./SymbolFileDWARFTests/SymbolFileDWARFTests.TestAbbrevValidAttrNullForm (973 of 1785) PASS: lldb-unit :: Utility/./UtilityTests/StringLexerTest.GetUnlexed (974 of 1785) PASS: lldb-unit :: ScriptInterpreter/Python/./ScriptInterpreterPythonTests/PythonDataObjectsTest.TestPythonIntegerToStructuredInteger (975 of 1785) PASS: lldb-unit :: Utility/./UtilityTests/StreamTest.PutBytesAsRawHex8ToLittleEndian (976 of 1785) PASS: lldb-api :: functionalities/history/TestHistoryRecall.py (977 of 1785) PASS: lldb-unit :: Process/gdb-remote/./ProcessGdbRemoteTests/GDBRemoteCommunicationClientTest.GetModulesInfo (978 of 1785) PASS: lldb-unit :: Host/./HostTests/SocketTest.TCPGetAddress (979 of 1785) PASS: lldb-shell :: ObjectFile/MachO/lc_build_version_notools.yaml (980 of 1785) PASS: lldb-unit :: Utility/./UtilityTests/Flags.Reset (981 of 1785) PASS: lldb-api :: functionalities/thread/backtrace_limit/TestBacktraceLimit.py (982 of 1785) PASS: lldb-api :: functionalities/thread/exit_during_step/TestExitDuringStep.py (983 of 1785) PASS: lldb-unit :: Utility/./UtilityTests/StreamTest.PutHex16ByteOrderLittle (984 of 1785) PASS: lldb-unit :: Utility/./UtilityTests/StringExtractorTest.GetHexU8_Exact_NoEof (985 of 1785) PASS: lldb-api :: commands/platform/basic/TestPlatformCommand.py (986 of 1785) PASS: lldb-api :: functionalities/data-formatter/nssetsynth/TestNSSetSynthetic.py (987 of 1785) PASS: lldb-unit :: Utility/./UtilityTests/CompletionRequest.DuplicateFiltering (988 of 1785) PASS: lldb-unit :: Utility/./UtilityTests/UUIDTest.StringConverion (989 of 1785) PASS: lldb-unit :: Utility/./UtilityTests/ArgsTest.TestUnknownEscape (990 of 1785) PASS: lldb-api :: commands/process/attach/TestProcessAttach.py (991 of 1785) PASS: lldb-api :: functionalities/ptr_refs/TestPtrRefs.py (992 of 1785) PASS: lldb-api :: functionalities/data-formatter/data-formatter-stl/libcxx/map/TestDataFormatterLibccMap.py (993 of 1785) PASS: lldb-api :: lang/cpp/char8_t/TestCxxChar8_t.py (994 of 1785) PASS: lldb-api :: functionalities/memory-region/TestMemoryRegion.py (995 of 1785) PASS: lldb-unit :: Utility/./UtilityTests/BinaryStreamTest.PutSLEB128MaxValue (996 of 1785) PASS: lldb-unit :: ScriptInterpreter/Python/./ScriptInterpreterPythonTests/PythonExceptionStateTest.TestExceptionStateChecking (997 of 1785) PASS: lldb-unit :: ScriptInterpreter/Python/./ScriptInterpreterPythonTests/PythonDataObjectsTest.TestPythonDictionaryToStructuredDictionary (998 of 1785) PASS: lldb-unit :: Process/gdb-remote/./ProcessGdbRemoteTests/GDBRemoteClientBaseTest.SendContinueDelegateStructuredDataReceipt (999 of 1785) PASS: lldb-unit :: UnwindAssembly/x86/./UnwindAssemblyx86Tests/Testx86AssemblyInspectionEngine.TestPopR14 (1000 of 1785) PASS: lldb-unit :: Utility/./UtilityTests/StringListTest.InsertStringAtIndexOutOfBounds (1001 of 1785) PASS: lldb-shell :: ObjectFile/ELF/base-address.yaml (1002 of 1785) UNSUPPORTED: lldb-api :: android/platform/TestDefaultCacheLineSize.py (1003 of 1785) PASS: lldb-unit :: Utility/./UtilityTests/ConstStringTest.format_provider (1004 of 1785) PASS: lldb-api :: lang/cpp/namespace_conflicts/TestNamespaceConflicts.py (1005 of 1785) PASS: lldb-api :: lang/c/inlines/TestRedefinitionsInInlines.py (1006 of 1785) PASS: lldb-shell :: SymbolFile/NativePDB/source-list.cpp (1007 of 1785) PASS: lldb-unit :: Language/Highlighting/./HighlighterTests/HighlighterTest.ClangCursorOutOfBounds (1008 of 1785) UNSUPPORTED: lldb-api :: functionalities/darwin_log/filter/regex/subsystem/TestDarwinLogFilterRegexSubsystem.py (1009 of 1785) PASS: lldb-unit :: Utility/./UtilityTests/RangeTest.NotEqualInvalid (1010 of 1785) PASS: lldb-api :: lang/c/tls_globals/TestTlsGlobals.py (1011 of 1785) PASS: lldb-api :: lang/objc/hidden-ivars/TestHiddenIvars.py (1012 of 1785) PASS: lldb-api :: functionalities/param_entry_vals/basic_entry_values_x86_64/TestBasicEntryValuesX86_64.py (1013 of 1785) PASS: lldb-api :: macosx/lc-note/kern-ver-str/TestKernVerStrLCNOTE.py (1014 of 1785) PASS: lldb-unit :: Utility/./UtilityTests/FileSpecTest.EqualDotsWindows (1015 of 1785) PASS: lldb-api :: functionalities/show_location/TestShowLocationDwarf5.py (1016 of 1785) PASS: lldb-api :: functionalities/data-formatter/data-formatter-stl/libcxx/forward_list/TestDataFormatterLibcxxForwardList.py (1017 of 1785) PASS: lldb-unit :: Utility/./UtilityTests/ArgsTest.TestMultipleArgs (1018 of 1785) PASS: lldb-unit :: Symbol/./SymbolTests/DWARFCallFrameInfoTest.Basic_dwarf3 (1019 of 1785) PASS: lldb-shell :: Register/x86-64-ymm-read.test (1020 of 1785) PASS: lldb-unit :: Utility/./UtilityTests/StreamTest.PutCStringWithStringRef (1021 of 1785) PASS: lldb-unit :: Utility/./UtilityTests/AnsiTerminal.Unknown (1022 of 1785) PASS: lldb-shell :: SymbolFile/Breakpad/line-table-discontinuous-file-ids.test (1023 of 1785) PASS: lldb-shell :: SymbolFile/DWARF/find-method-local-struct.cpp (1024 of 1785) PASS: lldb-unit :: UnwindAssembly/x86/./UnwindAssemblyx86Tests/Testx86AssemblyInspectionEngine.TestPush0 (1025 of 1785) UNSUPPORTED: lldb-api :: commands/register/register/intel_xtended_registers/mpx_bound_violation/TestBoundViolation.py (1026 of 1785) UNSUPPORTED: lldb-shell :: ObjectFile/ELF/minidebuginfo-no-lzma.yaml (1027 of 1785) PASS: lldb-api :: functionalities/ubsan/basic/TestUbsanBasic.py (1028 of 1785) PASS: lldb-api :: functionalities/data-formatter/typedef_array/TestTypedefArray.py (1029 of 1785) PASS: lldb-unit :: UnwindAssembly/x86/./UnwindAssemblyx86Tests/Testx86AssemblyInspectionEngine.TestPopEBX (1030 of 1785) PASS: lldb-unit :: Utility/./UtilityTests/LogChannelTest.List (1031 of 1785) PASS: lldb-api :: commands/frame/diagnose/dereference-argument/TestDiagnoseDereferenceArgument.py (1032 of 1785) PASS: lldb-unit :: Host/./HostTests/HostInfoTest.GetAugmentedArchSpec (1033 of 1785) PASS: lldb-unit :: Utility/./UtilityTests/NameMatchesTest.RegularExpression (1034 of 1785) PASS: lldb-unit :: Utility/./UtilityTests/UriParserTest.LongPath (1035 of 1785) PASS: lldb-unit :: Utility/./UtilityTests/ProcessInstanceInfo.DumpTable_invalidUID (1036 of 1785) PASS: lldb-api :: functionalities/gdb_remote_client/TestNoWatchpointSupportInfo.py (1037 of 1785) PASS: lldb-shell :: Driver/TestConvenienceVariables.test (1038 of 1785) PASS: lldb-shell :: SymbolFile/NativePDB/function-types-classes.cpp (1039 of 1785) PASS: lldb-api :: commands/frame/diagnose/local-variable/TestLocalVariable.py (1040 of 1785) PASS: lldb-unit :: Process/minidump/./LLDBMinidumpTests/MinidumpParserTest.FindMemoryRange (1041 of 1785) PASS: lldb-api :: python_api/breakpoint/TestBreakpointAPI.py (1042 of 1785) PASS: lldb-api :: lang/objc/objc-stepping/TestObjCStepping.py (1043 of 1785) UNSUPPORTED: lldb-api :: tools/lldb-vscode/breakpoint/TestVSCode_setFunctionBreakpoints.py (1044 of 1785) PASS: lldb-api :: macosx/thread-names/TestInterruptThreadNames.py (1045 of 1785) PASS: lldb-unit :: Symbol/./SymbolTests/LineEntryTest.GetSameLineContiguousAddressRangeOneInline (1046 of 1785) PASS: lldb-unit :: Core/./LLDBCoreTests/RichManglingContextTest.FromCxxMethodName (1047 of 1785) PASS: lldb-unit :: SymbolFile/DWARF/./SymbolFileDWARFTests/SymbolFileDWARFTests.TestAbbrevOrder1Start1 (1048 of 1785) PASS: lldb-api :: functionalities/breakpoint/global_constructor/TestBreakpointInGlobalConstructor.py (1049 of 1785) PASS: lldb-shell :: Settings/TestSettingsWrite.test (1050 of 1785) PASS: lldb-unit :: Utility/./UtilityTests/VMRange.ContainsRange (1051 of 1785) UNSUPPORTED: lldb-shell :: SymbolFile/PDB/vbases.test (1052 of 1785) PASS: lldb-api :: functionalities/thread/concurrent_events/TestConcurrentManyCrash.py (1053 of 1785) PASS: lldb-unit :: Utility/./UtilityTests/StringListTest.AppendListCStringArray (1054 of 1785) PASS: lldb-unit :: Host/./HostTests/SocketTest.TCPGetConnectURI (1055 of 1785) PASS: lldb-unit :: Utility/./UtilityTests/ConstStringTest.CompareConstString (1056 of 1785) PASS: lldb-api :: types/TestFloatTypes.py (1057 of 1785) PASS: lldb-shell :: ObjectFile/PECOFF/dep-modules.yaml (1058 of 1785) PASS: lldb-shell :: SymbolFile/NativePDB/global-classes.cpp (1059 of 1785) PASS: lldb-shell :: SymbolFile/NativePDB/break-by-line.cpp (1060 of 1785) PASS: lldb-unit :: Target/./TargetTests/PathMappingListTest.RemapRoot (1061 of 1785) PASS: lldb-shell :: ObjectFile/MachO/symtab.yaml (1062 of 1785) UNSUPPORTED: lldb-api :: functionalities/data-formatter/data-formatter-stl/libstdcpp/tuple/TestDataFormatterStdTuple.py (1063 of 1785) PASS: lldb-shell :: ObjectFile/PECOFF/subsections.yaml (1064 of 1785) PASS: lldb-api :: python_api/type/TestTypeList.py (1065 of 1785) PASS: lldb-unit :: Utility/./UtilityTests/ConstStringTest.NullAndEmptyStates (1066 of 1785) PASS: lldb-api :: functionalities/gdb_remote_client/TestNestedRegDefinitions.py (1067 of 1785) PASS: lldb-unit :: Process/minidump/./LLDBMinidumpTests/MinidumpParserTest.GetMemoryRegionInfoLinuxMaps (1068 of 1785) PASS: lldb-shell :: ObjectFile/ELF/PT_LOAD-overlap-section.yaml (1069 of 1785) PASS: lldb-api :: commands/expression/no-deadlock/TestExprDoesntBlock.py (1070 of 1785) PASS: lldb-unit :: Utility/./UtilityTests/OptionsWithRawTest.EmptySuffix (1071 of 1785) PASS: lldb-unit :: Process/gdb-remote/./ProcessGdbRemoteTests/GDBRemoteCommunicationClientTest.SyncThreadState (1072 of 1785) PASS: lldb-unit :: Expression/./ExpressionTests/CppModuleConfigurationTest.MissingLibCpp (1073 of 1785) PASS: lldb-api :: commands/expression/test/TestExprs2.py (1074 of 1785) PASS: lldb-api :: lang/cpp/trivial_abi/TestTrivialABI.py (1075 of 1785) PASS: lldb-unit :: Utility/./UtilityTests/RegularExpression.Invalid (1076 of 1785) PASS: lldb-unit :: Symbol/./SymbolTests/LineEntryTest.GetSameLineContiguousAddressRangeNoInlines (1077 of 1785) PASS: lldb-api :: lang/objc/conflicting-definition/TestConflictingDefinition.py (1078 of 1785) PASS: lldb-unit :: Utility/./UtilityTests/StreamTest.PutBytesAsRawHex8ToMixedEndian (1079 of 1785) PASS: lldb-api :: functionalities/thread/concurrent_events/TestConcurrentSignalBreak.py (1080 of 1785) PASS: lldb-api :: commands/expression/dollar-in-variable/TestDollarInVariable.py (1081 of 1785) PASS: lldb-api :: lang/c/const_variables/TestConstVariables.py (1082 of 1785) PASS: lldb-shell :: SymbolFile/DWARF/debug-types-address-ranges.s (1083 of 1785) PASS: lldb-api :: functionalities/tail_call_frames/thread_step_out_message/TestArtificialFrameStepOutMessage.py (1084 of 1785) PASS: lldb-api :: functionalities/dynamic_value_child_count/TestDynamicValueChildCount.py (1085 of 1785) PASS: lldb-api :: lang/c/enum_types/TestEnumTypes.py (1086 of 1785) PASS: lldb-unit :: Expression/./ExpressionTests/CppModuleConfigurationTest.AmbiguousCLib (1087 of 1785) PASS: lldb-api :: functionalities/thread/concurrent_events/TestConcurrentNWatchNBreak.py (1088 of 1785) PASS: lldb-unit :: Utility/./UtilityTests/ArgsTest.GetArgumentArrayRef (1089 of 1785) PASS: lldb-api :: types/TestFloatTypesExpr.py (1090 of 1785) PASS: lldb-unit :: Language/Highlighting/./HighlighterTests/HighlighterTest.DefaultHighlighterWithCursorOutOfBounds (1091 of 1785) PASS: lldb-unit :: Interpreter/./InterpreterTests/CompletionTest.DirCompletionUsername (1092 of 1785) PASS: lldb-api :: python_api/value_var_update/TestValueVarUpdate.py (1093 of 1785) PASS: lldb-unit :: Host/./HostTests/FileSystemTest.EnumerateDirectory (1094 of 1785) PASS: lldb-unit :: Utility/./UtilityTests/StreamTest.ShiftOperatorPtr (1095 of 1785) PASS: lldb-api :: functionalities/data-formatter/data-formatter-objc/nsindexpath/TestDataFormatterNSIndexPath.py (1096 of 1785) PASS: lldb-shell :: Reproducer/Functionalities/TestImageList.test (1097 of 1785) PASS: lldb-api :: functionalities/thread/concurrent_events/TestConcurrentCrashWithWatchpointBreakpointSignal.py (1098 of 1785) XFAIL: lldb-shell :: Register/x86-64-ymm-write.test (1099 of 1785) PASS: lldb-unit :: debugserver/./debugserverTests/RNBSocket.LoopBackListenIPv6 (1100 of 1785) PASS: lldb-api :: functionalities/breakpoint/breakpoint_hit_count/TestBreakpointHitCount.py (1101 of 1785) PASS: lldb-api :: lang/c/modules/TestCModules.py (1102 of 1785) PASS: lldb-unit :: Utility/./UtilityTests/DataExtractorTest.GetBitfield (1103 of 1785) UNSUPPORTED: lldb-api :: functionalities/breakpoint/breakpoint_in_delayslot/TestAvoidBreakpointInDelaySlot.py (1104 of 1785) PASS: lldb-api :: api/check_public_api_headers/TestPublicAPIHeaders.py (1105 of 1785) PASS: lldb-unit :: Process/minidump/./LLDBMinidumpTests/MinidumpParserTest.GetLinuxProcStatus_no_stream (1106 of 1785) PASS: lldb-unit :: Interpreter/./InterpreterTests/OptionArgParserTest.toChar (1107 of 1785) PASS: lldb-unit :: Host/./HostTests/MainLoopTest.Signal (1108 of 1785) PASS: lldb-api :: functionalities/thread/concurrent_events/TestConcurrentCrashWithWatchpoint.py (1109 of 1785) PASS: lldb-unit :: ScriptInterpreter/Python/./ScriptInterpreterPythonTests/PythonDataObjectsTest.TestObjectAttributes (1110 of 1785) PASS: lldb-api :: functionalities/gdb_remote_client/TestRestartBug.py (1111 of 1785) PASS: lldb-api :: lang/cpp/namespace/TestNamespace.py (1112 of 1785) PASS: lldb-api :: lang/objc/forward-decl/TestForwardDecl.py (1113 of 1785) PASS: lldb-unit :: UnwindAssembly/x86/./UnwindAssemblyx86Tests/Testx86AssemblyInspectionEngine.Test32bitFramelessSmallStackFrame (1114 of 1785) PASS: lldb-api :: commands/frame/diagnose/virtual-method-call/TestDiagnoseDereferenceVirtualMethodCall.py (1115 of 1785) PASS: lldb-api :: functionalities/gdb_remote_client/TestArmRegisterDefinition.py (1116 of 1785) PASS: lldb-unit :: Process/gdb-remote/./ProcessGdbRemoteTests/GDBRemoteCommunicationClientTest.SendGetMetaDataPacket (1117 of 1785) PASS: lldb-unit :: Utility/./UtilityTests/RangeTest.ContainsRangeStartingFromZero (1118 of 1785) PASS: lldb-unit :: Utility/./UtilityTests/RegularExpression.Valid (1119 of 1785) PASS: lldb-shell :: ObjectFile/ELF/compressed-sections.yaml (1120 of 1785) PASS: lldb-api :: functionalities/data-formatter/refpointer-recursion/TestDataFormatterRefPtrRecursion.py (1121 of 1785) PASS: lldb-unit :: Utility/./UtilityTests/RangeTest.Clear (1122 of 1785) PASS: lldb-api :: functionalities/rerun/TestRerun.py (1123 of 1785) PASS: lldb-api :: commands/expression/dont_allow_jit/TestAllowJIT.py (1124 of 1785) PASS: lldb-unit :: Utility/./UtilityTests/UserIDResolver.GetGroupName (1125 of 1785) PASS: lldb-unit :: Utility/./UtilityTests/RangeTest.Slide (1126 of 1785) PASS: lldb-unit :: Host/./HostTests/FileSystemTest.Exists (1127 of 1785) PASS: lldb-unit :: Language/Highlighting/./HighlighterTests/HighlighterTest.ClangScalarLiterals (1128 of 1785) PASS: lldb-shell :: Driver/TestProcessAttach.test (1129 of 1785) UNSUPPORTED: lldb-api :: functionalities/signal/handle-segv/TestHandleSegv.py (1130 of 1785) PASS: lldb-unit :: Symbol/./SymbolTests/TestClangASTContext.TestGetBasicTypeFromName (1131 of 1785) UNSUPPORTED: lldb-api :: commands/expression/macros/TestMacros.py (1132 of 1785) PASS: lldb-unit :: Utility/./UtilityTests/BinaryStreamTest.PutSLEB128ThreeBytes (1133 of 1785) PASS: lldb-api :: functionalities/data-formatter/ostypeformatting/TestFormattersOsType.py (1134 of 1785) UNSUPPORTED: lldb-api :: lang/objc/rdar-12408181/TestRdar12408181.py (1135 of 1785) PASS: lldb-unit :: Process/gdb-remote/./ProcessGdbRemoteTests/GDBRemoteCommunicationServerTest.SendErrorResponse_ErrorList (1136 of 1785) PASS: lldb-unit :: UnwindAssembly/x86/./UnwindAssemblyx86Tests/Testx86AssemblyInspectionEngine.TestPopEDI (1137 of 1785) PASS: lldb-unit :: ScriptInterpreter/Python/./ScriptInterpreterPythonTests/PythonDataObjectsTest.TestPythonDictionaryManipulation (1138 of 1785) PASS: lldb-unit :: Host/./HostTests/Host.GetEnvironment (1139 of 1785) PASS: lldb-api :: lang/cpp/unicode-literals/TestUnicodeLiterals.py (1140 of 1785) PASS: lldb-api :: commands/expression/formatters/TestFormatters.py (1141 of 1785) PASS: lldb-api :: functionalities/unwind/noreturn/TestNoreturnUnwind.py (1142 of 1785) PASS: lldb-api :: functionalities/tsan/multiple/TestTsanMultiple.py (1143 of 1785) PASS: lldb-unit :: Process/minidump/./LLDBMinidumpTests/MinidumpParserTest.GetMiscInfoWindows (1144 of 1785) PASS: lldb-unit :: ScriptInterpreter/Python/./ScriptInterpreterPythonTests/PythonDataObjectsTest.TestDictionaryResolutionWithDot (1145 of 1785) PASS: lldb-api :: lang/objc/variadic_methods/TestVariadicMethods.py (1146 of 1785) PASS: lldb-unit :: UnwindAssembly/x86/./UnwindAssemblyx86Tests/Testx86AssemblyInspectionEngine.TestSpArithx86_64Augmented (1147 of 1785) PASS: lldb-shell :: SymbolFile/NativePDB/nested-types.cpp (1148 of 1785) PASS: lldb-shell :: Reproducer/Modules/TestModuleCXX.test (1149 of 1785) PASS: lldb-api :: lang/objc/foundation/TestObjCMethods2.py (1150 of 1785) PASS: lldb-unit :: Utility/./UtilityTests/VMRange.SetEndAddress (1151 of 1785) UNSUPPORTED: lldb-api :: tools/lldb-server/TestGdbRemoteModuleInfo.py (1152 of 1785) PASS: lldb-unit :: Expression/./ExpressionTests/DiagnosticManagerTest.AddDiagnostic (1153 of 1785) PASS: lldb-unit :: Utility/./UtilityTests/ArgsTest.GetQuotedCommandString (1154 of 1785) PASS: lldb-api :: functionalities/completion/TestCompletion.py (1155 of 1785) PASS: lldb-api :: python_api/watchpoint/TestWatchpointIgnoreCount.py (1156 of 1785) PASS: lldb-api :: functionalities/thread/concurrent_events/TestConcurrentDelaySignalBreak.py (1157 of 1785) UNSUPPORTED: lldb-shell :: ExecControl/StopHook/stop-hook-threads.test (1158 of 1785) PASS: lldb-api :: commands/expression/expr-in-syscall/TestExpressionInSyscall.py (1159 of 1785) PASS: lldb-api :: tools/lldb-server/inferior-crash/TestGdbRemoteAbort.py (1160 of 1785) UNSUPPORTED: lldb-api :: lang/objc/objc-dynamic-value/TestObjCDynamicValue.py (1161 of 1785) PASS: lldb-unit :: Utility/./UtilityTests/StringLexerTest.Next (1162 of 1785) PASS: lldb-api :: lang/objc/ivar-IMP/TestObjCiVarIMP.py (1163 of 1785) PASS: lldb-api :: lang/c/stepping/TestStepAndBreakpoints.py (1164 of 1785) PASS: lldb-unit :: Symbol/./SymbolTests/Type.GetTypeScopeAndBasename (1165 of 1785) UNSUPPORTED: lldb-api :: tools/lldb-vscode/variables/TestVSCode_variables.py (1166 of 1785) PASS: lldb-unit :: Utility/./UtilityTests/VMRange.Clear (1167 of 1785) PASS: lldb-api :: commands/expression/weak_symbols/TestWeakSymbols.py (1168 of 1785) PASS: lldb-unit :: Utility/./UtilityTests/EnvironmentTest.EnvpConstruction (1169 of 1785) UNSUPPORTED: lldb-api :: python_api/event/TestEvents.py (1170 of 1785) PASS: lldb-shell :: SymbolFile/DWARF/debug_loc.s (1171 of 1785) PASS: lldb-api :: functionalities/postmortem/elf-core/gcore/TestGCore.py (1172 of 1785) PASS: lldb-shell :: Settings/TestFrameFormatColor.test (1173 of 1785) PASS: lldb-unit :: Target/./TargetTests/MemoryRegionInfoTest.Formatv (1174 of 1785) PASS: lldb-shell :: SymbolFile/Breakpad/line-table-missing-file.test (1175 of 1785) PASS: lldb-shell :: ObjectFile/ELF/section-permissions.yaml (1176 of 1785) UNSUPPORTED: lldb-api :: functionalities/darwin_log/source/info/TestDarwinLogSourceInfo.py (1177 of 1785) PASS: lldb-api :: commands/process/launch/TestProcessLaunch.py (1178 of 1785) PASS: lldb-unit :: Utility/./UtilityTests/StringExtractorTest.GetHexBytes_FullString (1179 of 1785) PASS: lldb-unit :: ObjectFile/PECOFF/./ObjectFilePECOFFTests/PECallFrameInfoTest.Frame_reg_eh (1180 of 1785) PASS: lldb-api :: commands/register/register/register_command/TestRegisters.py (1181 of 1785) PASS: lldb-api :: functionalities/postmortem/mach-core/TestMachCore.py (1182 of 1785) PASS: lldb-shell :: Minidump/breakpad-symbols.test (1183 of 1785) PASS: lldb-unit :: Utility/./UtilityTests/FileSpecTest.FormatFileSpec (1184 of 1785) PASS: lldb-unit :: Utility/./UtilityTests/OptionsWithRawTest.EmptyArgsOnlySuffix (1185 of 1785) PASS: lldb-unit :: Utility/./UtilityTests/StringListTest.InsertStringAtIndexEnd (1186 of 1785) PASS: lldb-unit :: Expression/./ExpressionTests/DiagnosticManagerTest.GetStringMultiline (1187 of 1785) PASS: lldb-api :: python_api/file_handle/TestFileHandle.py (1188 of 1785) PASS: lldb-unit :: Utility/./UtilityTests/ProcessInstanceInfo.Dump (1189 of 1785) PASS: lldb-api :: commands/watchpoints/watchpoint_commands/condition/TestWatchpointConditionCmd.py (1190 of 1785) PASS: lldb-unit :: Utility/./UtilityTests/RangeTest.SlideZero (1191 of 1785) PASS: lldb-unit :: UnwindAssembly/x86/./UnwindAssemblyx86Tests/Testx86AssemblyInspectionEngine.TestAddESP (1192 of 1785) PASS: lldb-unit :: Process/gdb-remote/./ProcessGdbRemoteTests/GDBRemoteCommunicationServerTest.SendErrorResponse_UnimplementedError (1193 of 1785) PASS: lldb-unit :: Utility/./UtilityTests/VMRange.Comparison (1194 of 1785) PASS: lldb-shell :: SymbolFile/DWARF/dir-separator-posix.s (1195 of 1785) PASS: lldb-shell :: ObjectFile/PECOFF/basic-info.yaml (1196 of 1785) PASS: lldb-unit :: Utility/./UtilityTests/StringExtractorTest.GetHexU8_Extra_NoEof (1197 of 1785) PASS: lldb-unit :: Utility/./UtilityTests/ArgsTest.ReplaceArgumentAtIndexOutOfRange (1198 of 1785) PASS: lldb-unit :: Process/gdb-remote/./ProcessGdbRemoteTests/GDBRemoteClientBaseTest.SendContinueDelegateInterface (1199 of 1785) PASS: lldb-unit :: Utility/./UtilityTests/StringListTest.PopBack (1200 of 1785) PASS: lldb-api :: python_api/section/TestSectionAPI.py (1201 of 1785) PASS: lldb-api :: lang/cpp/virtual/TestVirtual.py (1202 of 1785) PASS: lldb-api :: functionalities/breakpoint/breakpoint_ids/TestBreakpointIDs.py (1203 of 1785) PASS: lldb-api :: lang/cpp/accelerator-table/TestCPPAccelerator.py (1204 of 1785) PASS: lldb-api :: functionalities/tail_call_frames/unambiguous_sequence/TestUnambiguousTailCalls.py (1205 of 1785) PASS: lldb-unit :: Utility/./UtilityTests/OptionsWithRawTest.ArgsButNoDelimiter (1206 of 1785) PASS: lldb-api :: functionalities/modern-type-lookup/basic/TestBasicModernTypeLookup.py (1207 of 1785) PASS: lldb-unit :: Utility/./UtilityTests/StringListTest.SplitIntoLinesEmpty (1208 of 1785) PASS: lldb-shell :: ObjectFile/ELF/many-sections.s (1209 of 1785) PASS: lldb-api :: functionalities/thread/thread_specific_break/TestThreadSpecificBreakpoint.py (1210 of 1785) UNSUPPORTED: lldb-shell :: SymbolFile/NativePDB/local-variables.cpp (1211 of 1785) PASS: lldb-api :: functionalities/tsan/cpp_global_location/TestTsanCPPGlobalLocation.py (1212 of 1785) PASS: lldb-unit :: Utility/./UtilityTests/TimerTest.CategoryTimes (1213 of 1785) PASS: lldb-unit :: Utility/./UtilityTests/Flags.AllClear (1214 of 1785) PASS: lldb-unit :: Process/gdb-remote/./ProcessGdbRemoteTests/GDBRemoteCommunicationClientTest.GetModulesInfo_UUID20 (1215 of 1785) PASS: lldb-unit :: Utility/./UtilityTests/StringExtractorTest.GetHexBytesAvail_Partial (1216 of 1785) PASS: lldb-api :: functionalities/gdb_remote_client/TestGDBRemoteLoad.py (1217 of 1785) UNSUPPORTED: lldb-api :: arm/breakpoint-it/TestBreakpointIt.py (1218 of 1785) PASS: lldb-api :: functionalities/postmortem/netbsd-core/TestNetBSDCore.py (1219 of 1785) UNSUPPORTED: lldb-shell :: Process/Windows/exception_access_violation.cpp (1220 of 1785) PASS: lldb-unit :: Utility/./UtilityTests/CompletionRequest.TryCompleteCurrentArgMode (1221 of 1785) PASS: lldb-api :: python_api/interpreter/TestRunCommandInterpreterAPI.py (1222 of 1785) PASS: lldb-unit :: Expression/./ExpressionTests/DiagnosticManagerTest.GetStringBasic (1223 of 1785) PASS: lldb-api :: functionalities/multiword-commands/TestMultiWordCommands.py (1224 of 1785) PASS: lldb-api :: commands/expression/cast_int_to_anonymous_enum/TestCastIntToAnonymousEnum.py (1225 of 1785) PASS: lldb-unit :: ScriptInterpreter/Python/./ScriptInterpreterPythonTests/PythonDataObjectsTest.TestPythonListManipulation (1226 of 1785) PASS: lldb-api :: commands/target/create-deps/TestTargetCreateDeps.py (1227 of 1785) PASS: lldb-api :: commands/expression/issue_11588/Test11588.py (1228 of 1785) UNSUPPORTED: lldb-api :: functionalities/darwin_log/filter/exact_match/message/TestDarwinLogFilterMatchMessage.py (1229 of 1785) PASS: lldb-api :: functionalities/return-value/TestReturnValue.py (1230 of 1785) PASS: lldb-api :: macosx/indirect_symbol/TestIndirectSymbols.py (1231 of 1785) PASS: lldb-api :: commands/expression/inline-namespace/TestInlineNamespace.py (1232 of 1785) PASS: lldb-unit :: ScriptInterpreter/Python/./ScriptInterpreterPythonTests/PythonDataObjectsTest.TestPythonCallableCheck (1233 of 1785) PASS: lldb-unit :: Utility/./UtilityTests/BinaryStreamTest.PutSLEB128FiveBytes (1234 of 1785) PASS: lldb-unit :: Language/Highlighting/./HighlighterTests/HighlighterTest.ClangCursorPosBeforeOtherToken (1235 of 1785) PASS: lldb-shell :: ObjectFile/ELF/netbsd-exec-8.99.30-amd64.yaml (1236 of 1785) PASS: lldb-api :: lang/cpp/this/TestCPPThis.py (1237 of 1785) PASS: lldb-api :: commands/expression/save_jit_objects/TestSaveJITObjects.py (1238 of 1785) PASS: lldb-unit :: UnwindAssembly/x86/./UnwindAssemblyx86Tests/Testx86AssemblyInspectionEngine.Test64bitFramelessBigStackFrame (1239 of 1785) PASS: lldb-unit :: Utility/./UtilityTests/RangeTest.ClearWithStarAddress (1240 of 1785) PASS: lldb-api :: functionalities/recursion/TestValueObjectRecursion.py (1241 of 1785) PASS: lldb-unit :: Utility/./UtilityTests/BroadcasterTest.BroadcastEvent (1242 of 1785) PASS: lldb-unit :: Language/Highlighting/./HighlighterTests/HighlighterTest.ClangCursorPosAfterOtherToken (1243 of 1785) PASS: lldb-unit :: Symbol/./SymbolTests/DWARFCallFrameInfoTest.Basic_eh (1244 of 1785) PASS: lldb-api :: functionalities/tsan/global_location/TestTsanGlobalLocation.py (1245 of 1785) PASS: lldb-api :: commands/expression/namespace_local_var_same_name_cpp_and_c/TestNamespaceLocalVarSameNameCppAndC.py (1246 of 1785) PASS: lldb-shell :: Breakpoint/jitbp_elf.test (1247 of 1785) PASS: lldb-unit :: Language/Highlighting/./HighlighterTests/HighlighterTest.Keywords (1248 of 1785) UNSUPPORTED: lldb-shell :: SymbolFile/PDB/variables-locations.test (1249 of 1785) PASS: lldb-api :: lang/c/array_types/TestArrayTypes.py (1250 of 1785) PASS: lldb-unit :: UnwindAssembly/x86/./UnwindAssemblyx86Tests/Testx86AssemblyInspectionEngine.TestPushR14 (1251 of 1785) PASS: lldb-unit :: Process/minidump/./LLDBMinidumpTests/MinidumpParserTest.GetPidWow64 (1252 of 1785) PASS: lldb-shell :: Commands/CommandScriptImmediateOutput/CommandScriptImmediateOutputConsole.test (1253 of 1785) PASS: lldb-api :: commands/frame/language/TestGuessLanguage.py (1254 of 1785) PASS: lldb-api :: lang/cpp/namespace/TestNamespaceLookup.py (1255 of 1785) PASS: lldb-api :: api/multithreaded/TestMultithreaded.py (1256 of 1785) PASS: lldb-unit :: Utility/./UtilityTests/StreamTest.PutPtr (1257 of 1785) PASS: lldb-api :: commands/expression/import-std-module/deque-basic/TestBasicDeque.py (1258 of 1785) PASS: lldb-unit :: Utility/./UtilityTests/StringListTest.DefaultConstructor (1259 of 1785) PASS: lldb-api :: commands/command/history/TestCommandHistory.py (1260 of 1785) PASS: lldb-unit :: ScriptInterpreter/Python/./ScriptInterpreterPythonTests/PythonDataObjectsTest.TestPythonByteArray (1261 of 1785) PASS: lldb-shell :: SymbolFile/NativePDB/function-types-calling-conv.cpp (1262 of 1785) PASS: lldb-shell :: SymbolFile/DWARF/find-variable-file.cpp (1263 of 1785) PASS: lldb-unit :: Editline/./EditlineTests/EditlineTestFixture.EditlineReceivesSingleLineText (1264 of 1785) PASS: lldb-unit :: Utility/./UtilityTests/RangeTest.DefaultConstructor (1265 of 1785) PASS: lldb-unit :: UnwindAssembly/x86/./UnwindAssemblyx86Tests/Testx86AssemblyInspectionEngine.TestPushEDI (1266 of 1785) UNSUPPORTED: lldb-shell :: Register/aarch64-gp-read.test (1267 of 1785) PASS: lldb-unit :: ScriptInterpreter/Python/./ScriptInterpreterPythonTests/PythonDataObjectsTest.TestPythonTupleInitializerList2 (1268 of 1785) PASS: lldb-unit :: Core/./LLDBCoreTests/UniqueCStringMap.NoDefaultConstructor (1269 of 1785) PASS: lldb-api :: functionalities/breakpoint/breakpoint_command/TestBreakpointCommandsFromPython.py (1270 of 1785) PASS: lldb-shell :: SymbolFile/DWARF/find-function-regex.cpp (1271 of 1785) PASS: lldb-unit :: Utility/./UtilityTests/AnsiTerminal.KnownPrefix (1272 of 1785) PASS: lldb-api :: functionalities/data-formatter/data-formatter-stl/libcxx/variant/TestDataFormatterLibcxxVariant.py (1273 of 1785) PASS: lldb-unit :: SymbolFile/DWARF/./SymbolFileDWARFTests/SymbolFileDWARFTests.TestAbbrevNullAttrValidForm (1274 of 1785) PASS: lldb-api :: functionalities/breakpoint/address_breakpoints/TestBadAddressBreakpoints.py (1275 of 1785) PASS: lldb-shell :: BuildScript/toolchain-clang.test (1276 of 1785) PASS: lldb-unit :: Utility/./UtilityTests/RangeTest.ContainsAddr (1277 of 1785) PASS: lldb-unit :: Utility/./UtilityTests/ArgsTest.StringListConstructor (1278 of 1785) PASS: lldb-api :: lang/cpp/breakpoint_in_member_func_w_non_primitive_params/TestBreakpointInMemberFuncWNonPrimitiveParams.py (1279 of 1785) PASS: lldb-api :: functionalities/float-display/TestFloatDisplay.py (1280 of 1785) PASS: lldb-api :: python_api/sbtype_typeclass/TestSBTypeTypeClass.py (1281 of 1785) PASS: lldb-unit :: Utility/./UtilityTests/ScalarTest.Comparison (1282 of 1785) PASS: lldb-api :: types/TestIntegerTypes.py (1283 of 1785) PASS: lldb-unit :: Target/./TargetTests/ModuleCacheTest.GetAndPut (1284 of 1785) PASS: lldb-unit :: Process/gdb-remote/./ProcessGdbRemoteTests/GDBRemoteCommunicationClientTest.WriteRegisterNoSuffix (1285 of 1785) PASS: lldb-unit :: Host/./HostTests/FileSystemTest.FileAndDirectoryComponents (1286 of 1785) PASS: lldb-api :: macosx/load-kext/TestLoadKext.py (1287 of 1785) PASS: lldb-api :: functionalities/breakpoint/breakpoint_set_restart/TestBreakpointSetRestart.py (1288 of 1785) PASS: lldb-shell :: Host/TestCustomShell.test (1289 of 1785) UNSUPPORTED: lldb-api :: functionalities/data-formatter/data-formatter-stl/libstdcpp/string/TestDataFormatterStdString.py (1290 of 1785) UNSUPPORTED: lldb-shell :: SymbolFile/NativePDB/stack_unwinding01.cpp (1291 of 1785) PASS: lldb-api :: commands/expression/persistent_ptr_update/TestPersistentPtrUpdate.py (1292 of 1785) PASS: lldb-unit :: Host/./HostTests/File.GetWaitableHandleFileno (1293 of 1785) PASS: lldb-unit :: Process/gdb-remote/./ProcessGdbRemoteTests/GDBRemoteCommunicationClientTest.SaveRestoreRegistersNoSuffix (1294 of 1785) PASS: lldb-api :: lang/objc/objc++/TestObjCXX.py (1295 of 1785) PASS: lldb-unit :: Utility/./UtilityTests/NameMatchesTest.EndsWith (1296 of 1785) PASS: lldb-api :: functionalities/breakpoint/dummy_target_breakpoints/TestBreakpointsWithNoTargets.py (1297 of 1785) PASS: lldb-unit :: ScriptInterpreter/Python/./ScriptInterpreterPythonTests/PythonExceptionStateTest.TestAcquisitionSemantics (1298 of 1785) PASS: lldb-unit :: ScriptInterpreter/Python/./ScriptInterpreterPythonTests/PythonDataObjectsTest.TestPythonTupleInitializerList (1299 of 1785) PASS: lldb-unit :: Utility/./UtilityTests/VASprintfTest.NoBufferResize (1300 of 1785) PASS: lldb-shell :: ObjectFile/ELF/section-addresses.yaml (1301 of 1785) PASS: lldb-unit :: Utility/./UtilityTests/CompletionRequest.TestCompletionOwnership (1302 of 1785) PASS: lldb-unit :: Signals/./SignalsTests/UnixSignalsTest.GetFilteredSignals (1303 of 1785) PASS: lldb-api :: types/TestRecursiveTypes.py (1304 of 1785) PASS: lldb-unit :: Expression/./ExpressionTests/CppModuleConfigurationTest.IgnoreLibStdCpp (1305 of 1785) PASS: lldb-unit :: Utility/./UtilityTests/StreamTeeTest.CopyConstructor (1306 of 1785) PASS: lldb-api :: functionalities/data-formatter/data-formatter-skip-summary/TestDataFormatterSkipSummary.py (1307 of 1785) UNSUPPORTED: lldb-api :: commands/expression/completion-crash2/TestCompletionCrash2.py (1308 of 1785) PASS: lldb-api :: lang/cpp/type_lookup/TestCppTypeLookup.py (1309 of 1785) PASS: lldb-shell :: SymbolFile/DWARF/dwarf5-index-is-used.cpp (1310 of 1785) PASS: lldb-unit :: Expression/./ExpressionTests/DWARFExpression.DW_OP_convert (1311 of 1785) PASS: lldb-shell :: SymbolFile/DWARF/debug-types-basic.test (1312 of 1785) PASS: lldb-unit :: Utility/./UtilityTests/StreamTeeTest.Flush (1313 of 1785) PASS: lldb-shell :: ObjectFile/ELF/section-types.yaml (1314 of 1785) PASS: lldb-api :: functionalities/breakpoint/address_breakpoints/TestAddressBreakpoints.py (1315 of 1785) PASS: lldb-api :: lang/cpp/static_methods/TestCPPStaticMethods.py (1316 of 1785) PASS: lldb-unit :: Utility/./UtilityTests/StreamTest.PutChar (1317 of 1785) PASS: lldb-shell :: Reproducer/Functionalities/TestDataFormatter.test (1318 of 1785) PASS: lldb-unit :: Host/./HostTests/TaskPoolTest.TaskMap (1319 of 1785) PASS: lldb-api :: commands/expression/radar_8638051/Test8638051.py (1320 of 1785) PASS: lldb-unit :: SymbolFile/NativePDB/./SymbolFileNativePDBTests/PDBFPOProgramToDWARFExpressionTests.SingleAssignmentRegisterRef (1321 of 1785) PASS: lldb-api :: functionalities/thread/concurrent_events/TestConcurrentTwoWatchpointsOneSignal.py (1322 of 1785) PASS: lldb-shell :: Register/x86-64-read.test (1323 of 1785) PASS: lldb-api :: lang/cpp/dynamic-value/TestCppValueCast.py (1324 of 1785) PASS: lldb-unit :: UnwindAssembly/x86/./UnwindAssemblyx86Tests/Testx86AssemblyInspectionEngine.TestPushEDX (1325 of 1785) PASS: lldb-api :: lang/objc/objc-new-syntax/TestObjCNewSyntaxDictionary.py (1326 of 1785) PASS: lldb-unit :: Utility/./UtilityTests/StringExtractorTest.GetU64BigEndian (1327 of 1785) PASS: lldb-api :: commands/expression/import-std-module/list-basic/TestBasicList.py (1328 of 1785) PASS: lldb-unit :: Utility/./UtilityTests/StringListTest.ShiftMove (1329 of 1785) PASS: lldb-api :: types/TestDoubleTypesExpr.py (1330 of 1785) PASS: lldb-unit :: Utility/./UtilityTests/ProcessInstanceInfoMatch.Name (1331 of 1785) UNSUPPORTED: lldb-api :: benchmarks/expression/TestExpressionCmd.py (1332 of 1785) PASS: lldb-shell :: SymbolFile/NativePDB/s_constant.cpp (1333 of 1785) PASS: lldb-api :: functionalities/asan/TestMemoryHistory.py (1334 of 1785) PASS: lldb-unit :: Process/gdb-remote/./ProcessGdbRemoteTests/GDBRemoteCommunicationServerTest.SendErrorResponse_StringError (1335 of 1785) UNSUPPORTED: lldb-api :: functionalities/unwind/standard/TestStandardUnwind.py (1336 of 1785) PASS: lldb-api :: python_api/value/change_values/TestChangeValueAPI.py (1337 of 1785) PASS: lldb-unit :: Utility/./UtilityTests/OptionsWithRawTest.WhitespaceInput (1338 of 1785) PASS: lldb-api :: functionalities/thread/concurrent_events/TestConcurrentSignalDelayWatch.py (1339 of 1785) PASS: lldb-api :: functionalities/step_scripted/TestStepScripted.py (1340 of 1785) UNSUPPORTED: lldb-shell :: SymbolFile/PDB/func-symbols.test (1341 of 1785) PASS: lldb-unit :: Utility/./UtilityTests/OptionsWithRawTest.MultiWordSuffix (1342 of 1785) PASS: lldb-api :: commands/settings/quoting/TestQuoting.py (1343 of 1785) PASS: lldb-shell :: SymbolFile/Breakpad/line-table-edgecases.test (1344 of 1785) PASS: lldb-unit :: Language/Highlighting/./HighlighterTests/HighlighterTest.ClangEmptyInput (1345 of 1785) PASS: lldb-shell :: Heap/heap-cstr.test (1346 of 1785) PASS: lldb-api :: lang/cpp/exceptions/TestCPPExceptionBreakpoints.py (1347 of 1785) PASS: lldb-unit :: Interpreter/./InterpreterTests/OptionArgParserTest.toScriptLanguage (1348 of 1785) PASS: lldb-unit :: Language/Highlighting/./HighlighterTests/HighlighterTest.ClangCursorPosInOtherToken (1349 of 1785) PASS: lldb-api :: functionalities/unwind/sigtramp/TestSigtrampUnwind.py (1350 of 1785) PASS: lldb-unit :: Process/minidump/./LLDBMinidumpTests/MinidumpParserTest.GetThreadContext_x86_32 (1351 of 1785) PASS: lldb-shell :: ObjectFile/PECOFF/sections-names.yaml (1352 of 1785) PASS: lldb-api :: python_api/value/linked_list/TestValueAPILinkedList.py (1353 of 1785) PASS: lldb-unit :: ObjectFile/Breakpad/./ObjectFileBreakpadTests/StackWinRecord.parse (1354 of 1785) PASS: lldb-api :: lang/cpp/unique-types/TestUniqueTypes.py (1355 of 1785) PASS: lldb-api :: commands/expression/diagnostics/TestExprDiagnostics.py (1356 of 1785) PASS: lldb-unit :: Utility/./UtilityTests/RangeTest.Equal (1357 of 1785) PASS: lldb-unit :: Utility/./UtilityTests/StringListTest.InsertStringAtIndexStart (1358 of 1785) PASS: lldb-unit :: Process/gdb-remote/./ProcessGdbRemoteTests/GDBRemoteClientBaseTest.SendContinueAndAsyncSignal (1359 of 1785) PASS: lldb-api :: lang/objc/blocks/TestObjCIvarsInBlocks.py (1360 of 1785) PASS: lldb-unit :: Utility/./UtilityTests/StringListTest.JoinThree (1361 of 1785) PASS: lldb-api :: functionalities/mtc/simple/TestMTCSimple.py (1362 of 1785) PASS: lldb-shell :: SymbolFile/DWARF/forward-declarations.s (1363 of 1785) PASS: lldb-unit :: UnwindAssembly/x86/./UnwindAssemblyx86Tests/Testx86AssemblyInspectionEngine.TestPushEBX (1364 of 1785) PASS: lldb-api :: commands/expression/persistent_types/TestNestedPersistentTypes.py (1365 of 1785) PASS: lldb-shell :: SymbolFile/DWARF/find-inline-method.s (1366 of 1785) UNSUPPORTED: lldb-api :: commands/expression/completion-crash-incomplete-record/TestCompletionCrashIncompleteRecord.py (1367 of 1785) PASS: lldb-unit :: ScriptInterpreter/Python/./ScriptInterpreterPythonTests/PythonDataObjectsTest.TestPythonTupleSize (1368 of 1785) PASS: lldb-api :: macosx/universal/TestUniversal.py (1369 of 1785) PASS: lldb-unit :: Utility/./UtilityTests/ArgsTest.TestArgv (1370 of 1785) PASS: lldb-unit :: Utility/./UtilityTests/ArgsTest.TestSingleArgWithQuotedSpace (1371 of 1785) PASS: lldb-unit :: Process/gdb-remote/./ProcessGdbRemoteTests/GDBRemoteCommunicationClientTest.SendStartTracePacket (1372 of 1785) PASS: lldb-api :: lang/cpp/lambdas/TestLambdas.py (1373 of 1785) PASS: lldb-api :: commands/expression/import-std-module/forward_list-basic/TestBasicForwardList.py (1374 of 1785) PASS: lldb-api :: commands/gui/invalid-args/TestInvalidArgsGui.py (1375 of 1785) PASS: lldb-unit :: Utility/./UtilityTests/StringExtractorTest.DecodeHexU8_Extra (1376 of 1785) PASS: lldb-unit :: Utility/./UtilityTests/StringExtractorTest.GetHexU8_Underflow (1377 of 1785) PASS: lldb-shell :: SymbolFile/DWARF/debug-types-missing-signature.test (1378 of 1785) PASS: lldb-api :: lang/cpp/frame-var-anon-unions/TestFrameVariableAnonymousUnions.py (1379 of 1785) PASS: lldb-shell :: Breakpoint/debug_rnglist_basic.test (1380 of 1785) PASS: lldb-unit :: Expression/./ExpressionTests/CppModuleConfigurationTest.UnrelatedLibrary (1381 of 1785) PASS: lldb-api :: functionalities/thread/concurrent_events/TestConcurrentManyWatchpoints.py (1382 of 1785) PASS: lldb-api :: commands/expression/vector_of_enums/TestVectorOfEnums.py (1383 of 1785) PASS: lldb-api :: functionalities/inferior-assert/TestInferiorAssert.py (1384 of 1785) PASS: lldb-api :: commands/disassemble/basic/TestFrameDisassemble.py (1385 of 1785) PASS: lldb-unit :: Utility/./UtilityTests/StreamTest.PutHex32ByteOrderLittle (1386 of 1785) PASS: lldb-unit :: Utility/./UtilityTests/Flags.Clear (1387 of 1785) PASS: lldb-api :: commands/expression/rdar44436068/Test128BitsInteger.py (1388 of 1785) PASS: lldb-api :: python_api/hello_world/TestHelloWorld.py (1389 of 1785) PASS: lldb-api :: api/listeners/TestListener.py (1390 of 1785) PASS: lldb-unit :: Process/minidump/./LLDBMinidumpTests/RegisterContextMinidump.ConvertMinidumpContext_x86_64 (1391 of 1785) PASS: lldb-shell :: ObjectFile/Breakpad/breakpad-identification.test (1392 of 1785) PASS: lldb-unit :: Utility/./UtilityTests/NameMatchesTest.Ignore (1393 of 1785) PASS: lldb-shell :: ObjectFile/ELF/section-overlap.yaml (1394 of 1785) PASS: lldb-api :: lang/cpp/operators/TestCppOperators.py (1395 of 1785) PASS: lldb-unit :: Process/gdb-remote/./ProcessGdbRemoteTests/GDBRemoteCommunicationClientTest.ReadRegister (1396 of 1785) PASS: lldb-unit :: debugserver/./debugserverTests/RNBSocket.LoopBackConnectIPv6 (1397 of 1785) PASS: lldb-api :: lang/objc/print-obj/TestPrintObj.py (1398 of 1785) PASS: lldb-unit :: ObjectFile/Breakpad/./ObjectFileBreakpadTests/Record.classify (1399 of 1785) PASS: lldb-shell :: BuildScript/script-args.test (1400 of 1785) PASS: lldb-api :: functionalities/tail_call_frames/inlining_and_tail_calls/TestInliningAndTailCalls.py (1401 of 1785) PASS: lldb-unit :: Utility/./UtilityTests/StringExtractorTest.DecodeHexU8_InvalidHex (1402 of 1785) PASS: lldb-shell :: Commands/command-source.test (1403 of 1785) PASS: lldb-api :: functionalities/postmortem/minidump-new/TestMiniDumpNew.py (1404 of 1785) UNSUPPORTED: lldb-shell :: SymbolFile/target-symbols-add-unwind.test (1405 of 1785) PASS: lldb-api :: commands/frame/diagnose/array/TestArray.py (1406 of 1785) UNSUPPORTED: lldb-api :: benchmarks/continue/TestBenchmarkContinue.py (1407 of 1785) PASS: lldb-unit :: Process/gdb-remote/./ProcessGdbRemoteTests/GDBRemoteCommunicationClientTest.GetMemoryRegionInfoInvalidResponse (1408 of 1785) PASS: lldb-unit :: Utility/./UtilityTests/RangeTest.LessThan (1409 of 1785) PASS: lldb-api :: functionalities/thread/concurrent_events/TestConcurrentWatchBreakDelay.py (1410 of 1785) PASS: lldb-api :: lang/objc/radar-9691614/TestObjCMethodReturningBOOL.py (1411 of 1785) PASS: lldb-api :: functionalities/data-formatter/data-formatter-proper-plurals/TestFormattersOneIsSingular.py (1412 of 1785) PASS: lldb-unit :: Utility/./UtilityTests/VMRange.Ordering (1413 of 1785) PASS: lldb-unit :: Utility/./UtilityTests/UriParserTest.BracketedHostnamePort (1414 of 1785) PASS: lldb-unit :: Utility/./UtilityTests/UriParserTest.BadPort2 (1415 of 1785) PASS: lldb-unit :: Host/./HostTests/SocketAddressTest.GetAddressInfo (1416 of 1785) PASS: lldb-shell :: SymbolFile/DWARF/split-dwarf-multiple-cu.ll (1417 of 1785) PASS: lldb-api :: functionalities/non-overlapping-index-variable-i/TestIndexVariable.py (1418 of 1785) PASS: lldb-api :: lang/objc/modules-incomplete/TestIncompleteModules.py (1419 of 1785) PASS: lldb-unit :: Utility/./UtilityTests/ReproducerTest.SetCapture (1420 of 1785) PASS: lldb-api :: lang/cpp/nested-class-other-compilation-unit/TestNestedClassWithParentInAnotherCU.py (1421 of 1785) PASS: lldb-api :: lang/objc/modules/TestObjCModules.py (1422 of 1785) PASS: lldb-shell :: ObjectFile/ELF/PT_LOAD-overlap-PT_TLS.yaml (1423 of 1785) PASS: lldb-unit :: Symbol/./SymbolTests/PostfixExpression.ParseOneExpression (1424 of 1785) PASS: lldb-unit :: UnwindAssembly/x86/./UnwindAssemblyx86Tests/Testx86AssemblyInspectionEngine.TestPushEBP (1425 of 1785) PASS: lldb-unit :: Host/./HostTests/FileSystemTest.GetByteSize (1426 of 1785) PASS: lldb-api :: functionalities/avoids-fd-leak/TestFdLeak.py (1427 of 1785) PASS: lldb-unit :: Target/./TargetTests/ModuleCacheTest.GetAndPutUuidExists (1428 of 1785) PASS: lldb-api :: functionalities/source-map/TestTargetSourceMap.py (1429 of 1785) UNSUPPORTED: lldb-api :: functionalities/tty/TestTerminal.py (1430 of 1785) PASS: lldb-unit :: Host/./HostTests/ProcessLaunchInfoTest.Constructor (1431 of 1785) PASS: lldb-unit :: Utility/./UtilityTests/StructuredDataTest.StringDump (1432 of 1785) PASS: lldb-unit :: Utility/./UtilityTests/StringExtractorTest.DecodeHexU8_Exact (1433 of 1785) PASS: lldb-unit :: Utility/./UtilityTests/BinaryStreamTest.PutSLEB128SixBytes (1434 of 1785) UNSUPPORTED: lldb-api :: functionalities/thread/concurrent_events/TestConcurrentManySignals.py (1435 of 1785) PASS: lldb-unit :: UnwindAssembly/x86/./UnwindAssemblyx86Tests/Testx86AssemblyInspectionEngine.Test32bitFramelessBigStackFrame (1436 of 1785) UNSUPPORTED: lldb-api :: tools/lldb-server/TestGdbRemoteAuxvSupport.py (1437 of 1785) PASS: lldb-unit :: Utility/./UtilityTests/RangeTest.DoesAdjoinOrIntersect (1438 of 1785) PASS: lldb-api :: functionalities/breakpoint/cpp_exception/TestCPPExceptionBreakpoint.py (1439 of 1785) PASS: lldb-shell :: SymbolFile/NativePDB/bitfields.cpp (1440 of 1785) PASS: lldb-unit :: Target/./TargetTests/ExecutionContextTest.GetByteOrder (1441 of 1785) PASS: lldb-unit :: Utility/./UtilityTests/LogTest.Register (1442 of 1785) PASS: lldb-unit :: Utility/./UtilityTests/RangeDataVector.FindEntryThatContains_Overlap (1443 of 1785) PASS: lldb-api :: lang/objc/unicode-string/TestUnicodeString.py (1444 of 1785) PASS: lldb-unit :: Symbol/./SymbolTests/TestClangASTContext.TestBuiltinTypeForEncodingAndBitSize (1445 of 1785) PASS: lldb-unit :: Expression/./ExpressionTests/ClangHostTest.ComputeClangResourceDirectory (1446 of 1785) PASS: lldb-unit :: Host/./HostTests/NativeProcessProtocolTest.ReadCStringFromMemory_CrossPageBoundary (1447 of 1785) PASS: lldb-api :: commands/log/basic/TestLogging.py (1448 of 1785) UNSUPPORTED: lldb-api :: functionalities/darwin_log/filter/exact_match/subsystem/TestDarwinLogFilterMatchSubsystem.py (1449 of 1785) PASS: lldb-shell :: SymbolFile/NativePDB/globals-fundamental.cpp (1450 of 1785) PASS: lldb-api :: lang/objc/foundation/TestSymbolTable.py (1451 of 1785) PASS: lldb-unit :: Utility/./UtilityTests/BinaryStreamTest.PutSLEB128Zero (1452 of 1785) UNSUPPORTED: lldb-api :: functionalities/darwin_log/filter/regex/message/TestDarwinLogFilterRegexMessage.py (1453 of 1785) PASS: lldb-unit :: Utility/./UtilityTests/DataExtractorTest.GetCStrAtNullOffset (1454 of 1785) PASS: lldb-api :: commands/expression/persistent_variables/TestPersistentVariables.py (1455 of 1785) PASS: lldb-unit :: Utility/./UtilityTests/ArgsTest.EscapeLLDBCommandArgument (1456 of 1785) PASS: lldb-api :: lang/cpp/class-template-parameter-pack/TestClassTemplateParameterPack.py (1457 of 1785) PASS: lldb-unit :: Process/minidump/./LLDBMinidumpTests/MinidumpParserTest.InvalidMinidump (1458 of 1785) PASS: lldb-api :: functionalities/data-formatter/data-formatter-ptr-to-array/TestPtrToArrayFormatting.py (1459 of 1785) PASS: lldb-api :: functionalities/thread/concurrent_events/TestConcurrentBreakpointOneDelayBreakpointThreads.py (1460 of 1785) PASS: lldb-unit :: ScriptInterpreter/Python/./ScriptInterpreterPythonTests/PythonExceptionStateTest.TestResetSemantics (1461 of 1785) PASS: lldb-api :: lang/objc/foundation/TestObjCMethodsString.py (1462 of 1785) PASS: lldb-unit :: Utility/./UtilityTests/IndexToObjectTest.ObjectForIndex (1463 of 1785) PASS: lldb-unit :: Utility/./UtilityTests/RecordReplayTest.InstrumentedFoo (1464 of 1785) PASS: lldb-api :: functionalities/gdb_remote_client/TestStopPCs.py (1465 of 1785) PASS: lldb-unit :: UnwindAssembly/x86/./UnwindAssemblyx86Tests/Testx86AssemblyInspectionEngine.TestSubESP (1466 of 1785) PASS: lldb-api :: commands/expression/rdar42038760/TestScalarURem.py (1467 of 1785) PASS: lldb-unit :: Language/CPlusPlus/./LanguageCPlusPlusTests/CPlusPlusLanguage.MethodNameParsing (1468 of 1785) PASS: lldb-unit :: Utility/./UtilityTests/FileSpecTest.CopyByAppendingPathComponent (1469 of 1785) PASS: lldb-unit :: Utility/./UtilityTests/StringExtractorTest.GetHexBytesAvail (1470 of 1785) PASS: lldb-api :: lang/cpp/inlines/TestInlines.py (1471 of 1785) PASS: lldb-unit :: Utility/./UtilityTests/StringListTest.Assignment (1472 of 1785) PASS: lldb-api :: functionalities/deleted-executable/TestDeletedExecutable.py (1473 of 1785) PASS: lldb-unit :: Utility/./UtilityTests/StringListTest.LongestCommonPrefixDuplicateElement (1474 of 1785) PASS: lldb-unit :: Utility/./UtilityTests/OptionsWithRawTest.WhitespaceSuffix (1475 of 1785) PASS: lldb-unit :: Utility/./UtilityTests/LogChannelTest.Disable (1476 of 1785) PASS: lldb-unit :: ObjectFile/Breakpad/./ObjectFileBreakpadTests/FileRecord.parse (1477 of 1785) PASS: lldb-unit :: Process/minidump/./LLDBMinidumpTests/RegisterContextMinidump.CheckRegisterContextMinidump_ARM (1478 of 1785) PASS: lldb-api :: functionalities/inline-stepping/TestInlineStepping.py (1479 of 1785) PASS: lldb-api :: functionalities/thread/crash_during_step/TestCrashDuringStep.py (1480 of 1785) PASS: lldb-unit :: Platform/./LLDBPlatformTests/PlatformDarwinTest.TestParseVersionBuildDir (1481 of 1785) PASS: lldb-unit :: Utility/./UtilityTests/RangeTest.Constructor (1482 of 1785) PASS: lldb-api :: lang/cpp/wchar_t/TestCxxWCharT.py (1483 of 1785) PASS: lldb-api :: python_api/objc_type/TestObjCType.py (1484 of 1785) PASS: lldb-unit :: Utility/./UtilityTests/StringExtractorTest.GetHexU8_InvalidHex_NoEof (1485 of 1785) PASS: lldb-unit :: Host/./HostTests/NativeProcessProtocolTest.SetBreakpointFailRead (1486 of 1785) PASS: lldb-unit :: Utility/./UtilityTests/UriParserTest.PortOverflow (1487 of 1785) PASS: lldb-api :: lang/cpp/scope/TestCppScope.py (1488 of 1785) PASS: lldb-shell :: Reproducer/TestWorkingDir.test (1489 of 1785) PASS: lldb-unit :: Interpreter/./InterpreterTests/CompletionTest.DirCompletionAbsolute (1490 of 1785) UNSUPPORTED: lldb-shell :: SymbolFile/NativePDB/typedefs.cpp (1491 of 1785) PASS: lldb-unit :: Utility/./UtilityTests/StringExtractorTest.GetHexBytes (1492 of 1785) UNSUPPORTED: lldb-api :: benchmarks/libcxxlist/TestBenchmarkLibcxxList.py (1493 of 1785) PASS: lldb-api :: tools/lldb-server/TestGdbRemoteHostInfo.py (1494 of 1785) PASS: lldb-unit :: Utility/./UtilityTests/StringListTest.LongestCommonPrefix (1495 of 1785) PASS: lldb-unit :: Utility/./UtilityTests/FileSpecTest.GetNormalizedPath (1496 of 1785) PASS: lldb-api :: commands/expression/import-std-module/stack/TestStack.py (1497 of 1785) PASS: lldb-api :: functionalities/tsan/thread_numbers/TestTsanThreadNumbers.py (1498 of 1785) PASS: lldb-unit :: Utility/./UtilityTests/DataExtractorTest.GetCStrAtEnd (1499 of 1785) PASS: lldb-shell :: SymbolFile/sizeless-symbol.test (1500 of 1785) PASS: lldb-unit :: Utility/./UtilityTests/ArchSpecTest.OperatorBool (1501 of 1785) PASS: lldb-api :: functionalities/data-formatter/var-in-aggregate-misuse/TestVarInAggregateMisuse.py (1502 of 1785) PASS: lldb-unit :: SymbolFile/NativePDB/./SymbolFileNativePDBTests/PDBFPOProgramToDWARFExpressionTests.UnresolvedDependentCyclicRegisterAssignmentReference (1503 of 1785) PASS: lldb-unit :: Utility/./UtilityTests/BinaryStreamTest.PutSLEB128FourBytes (1504 of 1785) PASS: lldb-api :: macosx/order/TestOrderFile.py (1505 of 1785) PASS: lldb-api :: functionalities/data-formatter/data-formatter-python-synth/TestDataFormatterPythonSynth.py (1506 of 1785) PASS: lldb-unit :: Core/./LLDBCoreTests/MangledTest.ResultForValidName (1507 of 1785) UNSUPPORTED: lldb-shell :: Unwind/unwind-plan-dwarf-dump.test (1508 of 1785) PASS: lldb-shell :: SymbolFile/DWARF/debug_aranges-empty-section.s (1509 of 1785) PASS: lldb-api :: functionalities/thread/concurrent_events/TestConcurrentDelaySignalWatch.py (1510 of 1785) UNSUPPORTED: lldb-api :: linux/add-symbols/TestTargetSymbolsAddCommand.py (1511 of 1785) PASS: lldb-api :: lang/cpp/nsimport/TestCppNsImport.py (1512 of 1785) PASS: lldb-api :: functionalities/data-formatter/pyobjsynthprovider/TestPyObjSynthProvider.py (1513 of 1785) PASS: lldb-unit :: Utility/./UtilityTests/StringExtractorTest.GetHexBytes_OddPair (1514 of 1785) PASS: lldb-unit :: Utility/./UtilityTests/ArgsTest.TestInsertArg (1515 of 1785) PASS: lldb-shell :: Reproducer/TestGDBRemoteRepro.test (1516 of 1785) UNSUPPORTED: lldb-shell :: Register/x86-gp-read.test (1517 of 1785) PASS: lldb-api :: lang/cpp/gmodules-templates/TestGModules.py (1518 of 1785) PASS: lldb-unit :: Utility/./UtilityTests/DeserializerTest.HasData (1519 of 1785) PASS: lldb-unit :: ScriptInterpreter/Python/./ScriptInterpreterPythonTests/PythonExceptionStateTest.TestAutoRestoreChanged (1520 of 1785) UNSUPPORTED: lldb-shell :: SymbolFile/PDB/variables.test (1521 of 1785) PASS: lldb-unit :: Symbol/./SymbolTests/DWARFCallFrameInfoTest.Basic_dwarf4 (1522 of 1785) PASS: lldb-api :: python_api/name_lookup/TestNameLookup.py (1523 of 1785) UNSUPPORTED: lldb-shell :: Register/aarch64-fp-read.test (1524 of 1785) PASS: lldb-unit :: Utility/./UtilityTests/LogChannelTest.Enable (1525 of 1785) PASS: lldb-api :: commands/statistics/basic/TestStats.py (1526 of 1785) PASS: lldb-api :: commands/watchpoints/watchpoint_commands/command/TestWatchpointCommandLLDB.py (1527 of 1785) PASS: lldb-api :: lang/cpp/char1632_t/TestChar1632T.py (1528 of 1785) PASS: lldb-unit :: ObjectFile/Breakpad/./ObjectFileBreakpadTests/ModuleRecord.parse (1529 of 1785) PASS: lldb-api :: commands/command/source/TestCommandSource.py (1530 of 1785) PASS: lldb-api :: commands/expression/calculator_mode/TestCalculatorMode.py (1531 of 1785) PASS: lldb-api :: python_api/lldbutil/process/TestPrintStackTraces.py (1532 of 1785) PASS: lldb-api :: functionalities/data-formatter/data-formatter-objc/TestDataFormatterObjCNSData.py (1533 of 1785) PASS: lldb-unit :: Utility/./UtilityTests/StringExtractorTest.DecodeHexU8_InvalidHex2 (1534 of 1785) PASS: lldb-unit :: Process/gdb-remote/./ProcessGdbRemoteTests/GDBRemoteCommunicationServerTest.SendErrorResponse_Status (1535 of 1785) PASS: lldb-shell :: ExecControl/StopHook/stop-hook.test (1536 of 1785) XFAIL: lldb-shell :: Register/x86-mm-xmm-write.test (1537 of 1785) PASS: lldb-api :: lang/cpp/namespace_definitions/TestNamespaceDefinitions.py (1538 of 1785) PASS: lldb-unit :: Utility/./UtilityTests/Flags.AnyClear (1539 of 1785) PASS: lldb-api :: functionalities/breakpoint/move_nearest/TestMoveNearest.py (1540 of 1785) PASS: lldb-api :: lang/c/conflicting-symbol/TestConflictingSymbol.py (1541 of 1785) PASS: lldb-api :: functionalities/dead-strip/TestDeadStrip.py (1542 of 1785) PASS: lldb-shell :: Minidump/fb-dump.test (1543 of 1785) PASS: lldb-shell :: Minidump/dump-all.test (1544 of 1785) PASS: lldb-unit :: Process/minidump/./LLDBMinidumpTests/MinidumpParserTest.GetThreadContext_x86_32_wow64 (1545 of 1785) UNSUPPORTED: lldb-shell :: SymbolFile/PDB/pointers.test (1546 of 1785) PASS: lldb-api :: python_api/signals/TestSignalsAPI.py (1547 of 1785) PASS: lldb-unit :: Utility/./UtilityTests/CompletionRequest.TryCompleteCurrentArgBad (1548 of 1785) PASS: lldb-unit :: Utility/./UtilityTests/ScalarTest.APIntConstructor (1549 of 1785) PASS: lldb-api :: functionalities/object-file/TestImageListMultiArchitecture.py (1550 of 1785) PASS: lldb-api :: functionalities/data-formatter/type_summary_list_script/TestTypeSummaryListScript.py (1551 of 1785) PASS: lldb-api :: commands/expression/timeout/TestCallWithTimeout.py (1552 of 1785) PASS: lldb-api :: python_api/sbstructureddata/TestStructuredDataAPI.py (1553 of 1785) UNSUPPORTED: lldb-shell :: Register/x86-64-zmm-read.test (1554 of 1785) PASS: lldb-unit :: Utility/./UtilityTests/DataExtractorTest.GetMaxU64_unchecked (1555 of 1785) PASS: lldb-unit :: Utility/./UtilityTests/ScalarTest.GetBytes (1556 of 1785) PASS: lldb-unit :: Utility/./UtilityTests/BinaryStreamTest.PutSLEB128OneByte (1557 of 1785) PASS: lldb-unit :: Utility/./UtilityTests/StatusTest.ErrorConstructor (1558 of 1785) UNSUPPORTED: lldb-api :: linux/mix-dwo-and-regular-objects/TestMixedDwarfBinary.py (1559 of 1785) PASS: lldb-api :: commands/expression/import-std-module/vector-basic/TestBasicVector.py (1560 of 1785) PASS: lldb-api :: lang/objc/foundation/TestObjCMethods.py (1561 of 1785) PASS: lldb-unit :: SymbolFile/NativePDB/./SymbolFileNativePDBTests/PDBFPOProgramToDWARFExpressionTests.InvalidAssignmentSingle (1562 of 1785) PASS: lldb-shell :: Driver/TestCommands.test (1563 of 1785) PASS: lldb-unit :: Utility/./UtilityTests/StreamTeeTest.GetStreamAtIndexOutOfBounds (1564 of 1785) PASS: lldb-shell :: Process/TestEnvironment.test (1565 of 1785) PASS: lldb-api :: lang/cpp/member-and-local-vars-with-same-name/TestMembersAndLocalsWithSameName.py (1566 of 1785) PASS: lldb-api :: functionalities/thread/concurrent_events/TestConcurrentSignalWatch.py (1567 of 1785) PASS: lldb-unit :: Process/minidump/./LLDBMinidumpTests/RegisterContextMinidump.ConvertMinidumpContext_x86_32 (1568 of 1785) PASS: lldb-api :: commands/expression/invalid-args/TestInvalidArgsExpression.py (1569 of 1785) PASS: lldb-unit :: Language/Highlighting/./HighlighterTests/HighlighterTest.FallbackHighlighter (1570 of 1785) PASS: lldb-unit :: Symbol/./SymbolTests/PostfixExpression.ParseFPOProgram (1571 of 1785) PASS: lldb-api :: python_api/thread/TestThreadAPI.py (1572 of 1785) PASS: lldb-unit :: UnwindAssembly/x86/./UnwindAssemblyx86Tests/Testx86AssemblyInspectionEngine.TestStackRealign8BitDisp_i386 (1573 of 1785) PASS: lldb-api :: lang/cpp/dynamic-value/TestDynamicValue.py (1574 of 1785) PASS: lldb-api :: functionalities/tail_call_frames/thread_step_out_or_return/TestSteppingOutWithArtificialFrames.py (1575 of 1785) PASS: lldb-unit :: Symbol/./SymbolTests/TestClangASTContext.TestRemoveFastQualifiers (1576 of 1785) UNSUPPORTED: lldb-shell :: Register/x86-zmm-read.test (1577 of 1785) PASS: lldb-api :: functionalities/gdb_remote_client/TestWriteMemory.py (1578 of 1785) PASS: lldb-unit :: Utility/./UtilityTests/ConstStringTest.FromMidOfBufferStringRef (1579 of 1785) PASS: lldb-unit :: ObjectFile/Breakpad/./ObjectFileBreakpadTests/LineRecord.parse (1580 of 1785) PASS: lldb-shell :: SymbolFile/DWARF/dir-separator-no-comp-dir.s (1581 of 1785) PASS: lldb-shell :: SymbolFile/Breakpad/symtab-macho.test (1582 of 1785) PASS: lldb-unit :: Host/./HostTests/SocketTest.DomainListenConnectAccept (1583 of 1785) PASS: lldb-api :: commands/expression/radar_9673664/TestExprHelpExamples.py (1584 of 1785) PASS: lldb-unit :: Utility/./UtilityTests/StringExtractorTest.GetHexU8_InvalidHex (1585 of 1785) UNSUPPORTED: lldb-shell :: SymbolFile/dissassemble-entry-point.s (1586 of 1785) PASS: lldb-shell :: SymbolFile/NativePDB/disassembly.cpp (1587 of 1785) PASS: lldb-unit :: ScriptInterpreter/Python/./ScriptInterpreterPythonTests/PythonDataObjectsTest.TestPythonFile (1588 of 1785) PASS: lldb-api :: commands/watchpoints/watchpoint_commands/TestWatchpointCommands.py (1589 of 1785) PASS: lldb-api :: commands/expression/completion/TestExprCompletion.py (1590 of 1785) PASS: lldb-shell :: Unwind/trap_frame_sym_ctx.test (1591 of 1785) PASS: lldb-unit :: Utility/./UtilityTests/StringListTest.CopyListSingle (1592 of 1785) PASS: lldb-unit :: Utility/./UtilityTests/ArgsTest.TestQuotedTrailingBackslash (1593 of 1785) PASS: lldb-api :: lang/cpp/modules-import/TestCXXModulesImport.py (1594 of 1785) PASS: lldb-unit :: Language/Highlighting/./HighlighterTests/HighlighterTest.ClangPPDirectives (1595 of 1785) UNSUPPORTED: lldb-api :: functionalities/darwin_log/source/debug/TestDarwinLogSourceDebug.py (1596 of 1785) PASS: lldb-api :: lang/cpp/bool/TestCPPBool.py (1597 of 1785) PASS: lldb-shell :: ObjectFile/ELF/aarch64-relocations.yaml (1598 of 1785) PASS: lldb-unit :: Utility/./UtilityTests/StatusTest.ErrorConversion (1599 of 1785) PASS: lldb-unit :: Symbol/./SymbolTests/TestClangASTContext.TestIsClangType (1600 of 1785) PASS: lldb-api :: lang/cpp/offsetof/TestOffsetofCpp.py (1601 of 1785) PASS: lldb-shell :: Commands/CommandScriptImmediateOutput/CommandScriptImmediateOutputFile.test (1602 of 1785) PASS: lldb-api :: functionalities/target_var/TestTargetVar.py (1603 of 1785) PASS: lldb-api :: lang/mixed/TestMixedLanguages.py (1604 of 1785) PASS: lldb-shell :: SymbolFile/DWARF/find-basic-variable.cpp (1605 of 1785) PASS: lldb-api :: functionalities/thread/step_until/TestStepUntil.py (1606 of 1785) PASS: lldb-api :: commands/watchpoints/watchpoint_disable/TestWatchpointDisable.py (1607 of 1785) PASS: lldb-unit :: Symbol/./SymbolTests/TestClangASTContext.TemplateArguments (1608 of 1785) PASS: lldb-unit :: Host/./HostTests/MainLoopTest.TerminatesImmediately (1609 of 1785) PASS: lldb-api :: lang/cpp/std-function-step-into-callable/TestStdFunctionStepIntoCallable.py (1610 of 1785) PASS: lldb-api :: commands/frame/recognizer/TestFrameRecognizer.py (1611 of 1785) PASS: lldb-api :: lang/objc/single-entry-dictionary/TestObjCSingleEntryDictionary.py (1612 of 1785) PASS: lldb-api :: commands/disassemble/basic/TestDisassembleBreakpoint.py (1613 of 1785) PASS: lldb-unit :: Utility/./UtilityTests/CompletionRequest.DuplicateFilteringWithComments (1614 of 1785) PASS: lldb-unit :: ScriptInterpreter/Python/./ScriptInterpreterPythonTests/PythonDataObjectsTest.TestTypeNameResolutionNoDot (1615 of 1785) PASS: lldb-unit :: ScriptInterpreter/Python/./ScriptInterpreterPythonTests/PythonDataObjectsTest.TestPythonCallableInvoke (1616 of 1785) PASS: lldb-api :: tools/lldb-server/TestGdbRemoteSingleStep.py (1617 of 1785) PASS: lldb-shell :: Reproducer/TestDriverOptions.test (1618 of 1785) PASS: lldb-unit :: Expression/./ExpressionTests/DiagnosticManagerTest.AppendMessageAttachToLastDiag (1619 of 1785) PASS: lldb-unit :: Expression/./ExpressionTests/ClangHostTest.MacOSX (1620 of 1785) PASS: lldb-unit :: Editline/./EditlineTests/EditlineTestFixture.EditlineReceivesMultiLineText (1621 of 1785) PASS: lldb-unit :: UnwindAssembly/x86/./UnwindAssemblyx86Tests/Testx86AssemblyInspectionEngine.TestPushESI (1622 of 1785) UNSUPPORTED: lldb-api :: functionalities/darwin_log/filter/regex/activity-chain/TestDarwinLogFilterRegexActivityChain.py (1623 of 1785) PASS: lldb-unit :: tools/lldb-server/tests/./LLDBServerTests/TestBase.DebugserverEnv (1624 of 1785) PASS: lldb-api :: lang/objc/objc-struct-argument/TestObjCStructArgument.py (1625 of 1785) UNSUPPORTED: lldb-shell :: Breakpoint/case-insensitive.test (1626 of 1785) UNSUPPORTED: lldb-api :: functionalities/darwin_log/basic/TestDarwinLogBasic.py (1627 of 1785) PASS: lldb-unit :: Utility/./UtilityTests/StreamTest.PutHex32ByteOrderBig (1628 of 1785) PASS: lldb-unit :: SymbolFile/NativePDB/./SymbolFileNativePDBTests/PDBFPOProgramToDWARFExpressionTests.InvalidOpBinary (1629 of 1785) PASS: lldb-shell :: Watchpoint/SetErrorCases.test (1630 of 1785) PASS: lldb-api :: lang/cpp/rvalue-references/TestRvalueReferences.py (1631 of 1785) PASS: lldb-unit :: Utility/./UtilityTests/StringListTest.ForRangeEmpty (1632 of 1785) PASS: lldb-unit :: Host/./HostTests/SocketTest.TCPListen0ConnectAccept (1633 of 1785) PASS: lldb-api :: python_api/formatters/TestFormattersSBAPI.py (1634 of 1785) PASS: lldb-shell :: ObjectFile/ELF/minidebuginfo-corrupt-xz.yaml (1635 of 1785) PASS: lldb-api :: commands/expression/call-function/TestCallUserDefinedFunction.py (1636 of 1785) PASS: lldb-api :: functionalities/var_path/TestVarPath.py (1637 of 1785) PASS: lldb-unit :: Utility/./UtilityTests/RangeTest.ContainsAddrInvalid (1638 of 1785) PASS: lldb-unit :: ScriptInterpreter/Python/./ScriptInterpreterPythonTests/PythonDataObjectsTest.TestPythonBoolean (1639 of 1785) PASS: lldb-unit :: Process/minidump/./LLDBMinidumpTests/MinidumpParserTest.GetFilteredModuleList (1640 of 1785) PASS: lldb-unit :: Expression/./ExpressionTests/DiagnosticManagerTest.PutStringSeverities (1641 of 1785) PASS: lldb-unit :: Host/./HostTests/ConnectionFileDescriptorTest.TCPGetURIv6 (1642 of 1785) UNSUPPORTED: lldb-api :: functionalities/thread/create_during_step/TestCreateDuringStep.py (1643 of 1785) PASS: lldb-api :: python_api/lldbutil/TestSwigVersion.py (1644 of 1785) PASS: lldb-unit :: ScriptInterpreter/Python/./ScriptInterpreterPythonTests/PythonDataObjectsTest.TestPythonTupleToStructuredList (1645 of 1785) PASS: lldb-shell :: SymbolFile/NativePDB/ast-functions.cpp (1646 of 1785) PASS: lldb-unit :: Utility/./UtilityTests/GeneratorTest.Get (1647 of 1785) PASS: lldb-api :: commands/expression/pr35310/TestExprsBug35310.py (1648 of 1785) PASS: lldb-unit :: Utility/./UtilityTests/OptionsWithRawTest.SingleWordSuffix (1649 of 1785) PASS: lldb-unit :: Target/./TargetTests/ExecutionContextTest.GetByteOrderTarget (1650 of 1785) PASS: lldb-unit :: Utility/./UtilityTests/StreamTeeTest.AppendStream (1651 of 1785) PASS: lldb-unit :: Language/CPlusPlus/./LanguageCPlusPlusTests/CPlusPlusLanguage.CPlusPlusNameParser (1652 of 1785) PASS: lldb-unit :: UnwindAssembly/x86/./UnwindAssemblyx86Tests/Testx86AssemblyInspectionEngine.TestReturnDetect (1653 of 1785) PASS: lldb-shell :: Quit/TestQuitExitCodeImplicit0.test (1654 of 1785) PASS: lldb-unit :: UnwindAssembly/x86/./UnwindAssemblyx86Tests/Testx86AssemblyInspectionEngine.TestStackRealign32BitDisp_x86_64 (1655 of 1785) PASS: lldb-api :: lang/objc/objc-static-method/TestObjCStaticMethod.py (1656 of 1785) PASS: lldb-shell :: Reproducer/TestFileRepro.test (1657 of 1785) UNSUPPORTED: lldb-api :: functionalities/darwin_log/filter/exact_match/category/TestDarwinLogFilterMatchCategory.py (1658 of 1785) PASS: lldb-api :: functionalities/tsan/basic/TestTsanBasic.py (1659 of 1785) PASS: lldb-unit :: SymbolFile/DWARF/./SymbolFileDWARFTests/SymbolFileDWARFTests.TestAbbrevOrder1Start5 (1660 of 1785) PASS: lldb-api :: lang/objc/foundation/TestObjectDescriptionAPI.py (1661 of 1785) PASS: lldb-api :: functionalities/thread/concurrent_events/TestConcurrentBreakpointDelayBreakpointOneSignal.py (1662 of 1785) PASS: lldb-unit :: Utility/./UtilityTests/SerializationRountripTest.SerializeDeserializePodPointers (1663 of 1785) PASS: lldb-shell :: ObjectFile/Breakpad/discontiguous-sections.test (1664 of 1785) PASS: lldb-api :: api/multiple-targets/TestMultipleTargets.py (1665 of 1785) PASS: lldb-api :: functionalities/thread/concurrent_events/TestConcurrentDelayedCrashWithBreakpointSignal.py (1666 of 1785) PASS: lldb-unit :: ScriptInterpreter/Python/./ScriptInterpreterPythonTests/PythonDataObjectsTest.TestPythonBytes (1667 of 1785) PASS: lldb-api :: commands/expression/xvalue/TestXValuePrinting.py (1668 of 1785) PASS: lldb-unit :: UnwindAssembly/x86/./UnwindAssemblyx86Tests/Testx86AssemblyInspectionEngine.TestPushR12 (1669 of 1785) PASS: lldb-shell :: Breakpoint/debug_addrx.test (1670 of 1785) PASS: lldb-unit :: Signals/./SignalsTests/UnixSignalsTest.GetInfo (1671 of 1785) PASS: lldb-unit :: Utility/./UtilityTests/ArchSpecTest.TestParseMachCPUDashSubtypeTripleSimple (1672 of 1785) PASS: lldb-unit :: Utility/./UtilityTests/StringExtractorTest.GetHexBytes_OddPair2 (1673 of 1785) PASS: lldb-unit :: Process/gdb-remote/./ProcessGdbRemoteTests/GDBRemoteClientBaseTest.SendContinueAndInterrupt2PacketBug (1674 of 1785) PASS: lldb-api :: lang/objc/foundation/TestFoundationDisassembly.py (1675 of 1785) PASS: lldb-unit :: Utility/./UtilityTests/StreamTest.PutCString (1676 of 1785) PASS: lldb-unit :: Utility/./UtilityTests/ScalarTest.SetValueFromCString (1677 of 1785) PASS: lldb-api :: functionalities/breakpoint/breakpoint_by_line_and_column/TestBreakpointByLineAndColumn.py (1678 of 1785) PASS: lldb-unit :: Utility/./UtilityTests/StringExtractorTest.GetHexBytesAvail_Underflow (1679 of 1785) PASS: lldb-api :: functionalities/gdb_remote_client/TestPlatformClient.py (1680 of 1785) PASS: lldb-unit :: Expression/./ExpressionTests/DiagnosticManagerTest.GetStringSeverityLabels (1681 of 1785) PASS: lldb-unit :: Core/./LLDBCoreTests/RichManglingContextTest.SwitchProvider (1682 of 1785) PASS: lldb-api :: functionalities/postmortem/elf-core/thread_crash/TestLinuxCoreThreads.py (1683 of 1785) PASS: lldb-api :: commands/command/invalid-args/TestInvalidArgsCommand.py (1684 of 1785) PASS: lldb-api :: commands/watchpoints/watchpoint_on_vectors/TestValueOfVectorVariable.py (1685 of 1785) PASS: lldb-api :: functionalities/thread/concurrent_events/TestConcurrentTwoBreakpointsOneSignal.py (1686 of 1785) PASS: lldb-api :: functionalities/thread/create_after_attach/TestCreateAfterAttach.py (1687 of 1785) PASS: lldb-api :: functionalities/thread/concurrent_events/TestConcurrentDelayWatchBreak.py (1688 of 1785) PASS: lldb-unit :: UnwindAssembly/x86/./UnwindAssemblyx86Tests/Testx86AssemblyInspectionEngine.TestCALLNextInsn (1689 of 1785) PASS: lldb-api :: functionalities/target-new-solib-notifications/TestModuleLoadedNotifys.py (1690 of 1785) PASS: lldb-shell :: SymbolFile/DWARF/find-basic-function.cpp (1691 of 1785) PASS: lldb-unit :: Symbol/./SymbolTests/SymbolsTest.LocateExecutableSymbolFileForUnknownExecutableAndMissingSymbolFile (1692 of 1785) PASS: lldb-api :: lang/c/struct_types/TestStructTypes.py (1693 of 1785) UNSUPPORTED: lldb-api :: benchmarks/frame_variable/TestFrameVariableResponse.py (1694 of 1785) PASS: lldb-shell :: ObjectFile/ELF/PT_LOAD-overlap.yaml (1695 of 1785) PASS: lldb-unit :: Core/./LLDBCoreTests/RichManglingContextTest.Basic (1696 of 1785) PASS: lldb-api :: functionalities/data-formatter/frameformat_smallstruct/TestFrameFormatSmallStruct.py (1697 of 1785) PASS: lldb-unit :: Utility/./UtilityTests/EventTest.DumpEventDataBytes (1698 of 1785) PASS: lldb-unit :: Utility/./UtilityTests/VMRange.ContainsAddr (1699 of 1785) PASS: lldb-unit :: Expression/./ExpressionTests/DiagnosticManagerTest.PutString (1700 of 1785) PASS: lldb-api :: commands/watchpoints/watchpoint_set_command/TestWatchLocationWithWatchSet.py (1701 of 1785) PASS: lldb-unit :: Utility/./UtilityTests/GeneratorTest.GetOrCreate (1702 of 1785) PASS: lldb-api :: functionalities/pre_run_dylibs/TestPreRunDylibs.py (1703 of 1785) PASS: lldb-api :: functionalities/breakpoint/breakpoint_ignore_count/TestBreakpointIgnoreCount.py (1704 of 1785) UNSUPPORTED: lldb-shell :: Register/x86-64-xmm16-read.test (1705 of 1785) PASS: lldb-api :: commands/frame/diagnose/dereference-function-return/TestDiagnoseDereferenceFunctionReturn.py (1706 of 1785) PASS: lldb-api :: commands/expression/test/TestExprs.py (1707 of 1785) PASS: lldb-shell :: BuildScript/modes.test (1708 of 1785) PASS: lldb-unit :: Symbol/./SymbolTests/TestClangASTContext.TestUnifyAccessSpecifiers (1709 of 1785) PASS: lldb-shell :: Quit/TestQuitExitCode-30.test (1710 of 1785) PASS: lldb-api :: python_api/watchpoint/watchlocation/TestTargetWatchAddress.py (1711 of 1785) PASS: lldb-shell :: Breakpoint/debug_rnglistx_rlex.test (1712 of 1785) PASS: lldb-unit :: Utility/./UtilityTests/ArgsTest.ReplaceArgumentAtIndexShort (1713 of 1785) PASS: lldb-unit :: Host/./HostTests/FileActionTest.Open (1714 of 1785) PASS: lldb-api :: commands/expression/top-level/TestTopLevelExprs.py (1715 of 1785) PASS: lldb-unit :: Utility/./UtilityTests/StreamTeeTest.DefaultConstructor (1716 of 1785) PASS: lldb-unit :: Utility/./UtilityTests/Flags.AnySet (1717 of 1785) UNSUPPORTED: lldb-shell :: ObjectFile/ELF/minidebuginfo-set-and-hit-breakpoint.test (1718 of 1785) UNSUPPORTED: lldb-api :: tools/lldb-vscode/step/TestVSCode_step.py (1719 of 1785) PASS: lldb-api :: functionalities/tail_call_frames/disambiguate_paths_to_common_sink/TestDisambiguatePathsToCommonSink.py (1720 of 1785) PASS: lldb-unit :: Core/./LLDBCoreTests/StreamCallbackTest.Callback (1721 of 1785) PASS: lldb-api :: functionalities/postmortem/minidump/TestMiniDump.py (1722 of 1785) PASS: lldb-api :: functionalities/breakpoint/source_regexp/TestSourceRegexBreakpoints.py (1723 of 1785) PASS: lldb-api :: functionalities/data-formatter/data-formatter-stl/libcxx/list/loop/TestDataFormatterLibcxxListLoop.py (1724 of 1785) UNSUPPORTED: lldb-api :: arm/breakpoint-thumb-codesection/TestBreakpointThumbCodesection.py (1725 of 1785) PASS: lldb-unit :: SymbolFile/NativePDB/./SymbolFileNativePDBTests/PDBFPOProgramToDWARFExpressionTests.MultipleDependentAssignments (1726 of 1785) PASS: lldb-unit :: Utility/./UtilityTests/StringListTest.JoinSingle (1727 of 1785) PASS: lldb-shell :: Quit/TestQuitExitCode30.test (1728 of 1785) PASS: lldb-unit :: SymbolFile/NativePDB/./SymbolFileNativePDBTests/PDBFPOProgramToDWARFExpressionTests.UnknownOp (1729 of 1785) PASS: lldb-api :: functionalities/data-formatter/user-format-vs-summary/TestUserFormatVsSummary.py (1730 of 1785) PASS: lldb-unit :: Utility/./UtilityTests/TimerTest.CategoryTimesNested (1731 of 1785) PASS: lldb-shell :: SymbolFile/DWARF/apple-index-is-used.cpp (1732 of 1785) PASS: lldb-unit :: Utility/./UtilityTests/OptionsWithRawTest.SingleWhitespaceInput (1733 of 1785) PASS: lldb-unit :: Utility/./UtilityTests/ScalarTest.CastOperations (1734 of 1785) PASS: lldb-api :: functionalities/data-formatter/hexcaps/TestDataFormatterHexCaps.py (1735 of 1785) PASS: lldb-unit :: Utility/./UtilityTests/StreamTeeTest.SetStreamAtIndexOverwrite (1736 of 1785) PASS: lldb-unit :: Expression/./ExpressionTests/CppModuleConfigurationTest.Sysroot (1737 of 1785) PASS: lldb-unit :: Core/./LLDBCoreTests/MangledTest.NameIndexes_FindFunctionSymbols (1738 of 1785) PASS: lldb-api :: lang/c/unicode/TestUnicodeSymbols.py (1739 of 1785) PASS: lldb-unit :: ObjectFile/ELF/./ObjectFileELFTests/ObjectFileELFTest.GetSymtab_NoSymEntryPointArmAddressClass (1740 of 1785) PASS: lldb-api :: functionalities/breakpoint/cpp/TestCPPBreakpointLocations.py (1741 of 1785) PASS: lldb-unit :: UnwindAssembly/x86/./UnwindAssemblyx86Tests/Testx86AssemblyInspectionEngine.TestDisassemblyJunkBytes (1742 of 1785) PASS: lldb-api :: commands/command/script/import/TestImport.py (1743 of 1785) PASS: lldb-unit :: ScriptInterpreter/Python/./ScriptInterpreterPythonTests/PythonDataObjectsTest.TestModuleNameResolutionNoDot (1744 of 1785) PASS: lldb-shell :: Driver/TestNoUseColor.test (1745 of 1785) PASS: lldb-api :: lang/cpp/unsigned_types/TestUnsignedTypes.py (1746 of 1785) PASS: lldb-unit :: Utility/./UtilityTests/StringListTest.JoinNonSpace (1747 of 1785) PASS: lldb-unit :: Utility/./UtilityTests/ArchSpecTest.TestParseMachCPUDashSubtypeTripleExtra (1748 of 1785) PASS: lldb-api :: functionalities/tail_call_frames/disambiguate_tail_call_seq/TestDisambiguateTailCallSeq.py (1749 of 1785) PASS: lldb-api :: commands/apropos/with-process/TestAproposWithProcess.py (1750 of 1785) PASS: lldb-api :: lang/cpp/overloaded-functions/TestOverloadedFunctions.py (1751 of 1785) PASS: lldb-shell :: ObjectFile/Breakpad/sections.test (1752 of 1785) PASS: lldb-unit :: SymbolFile/NativePDB/./SymbolFileNativePDBTests/PDBFPOProgramToDWARFExpressionTests.MissingTargetRegister (1753 of 1785) PASS: lldb-api :: lang/objc/ptr_refs/TestPtrRefsObjC.py (1754 of 1785) UNSUPPORTED: lldb-shell :: SymbolFile/PDB/enums-layout.test (1755 of 1785) UNSUPPORTED: lldb-api :: functionalities/data-formatter/data-formatter-stl/libstdcpp/list/TestDataFormatterStdList.py (1756 of 1785) PASS: lldb-api :: functionalities/data-formatter/data-formatter-objc/TestDataFormatterObjCPlain.py (1757 of 1785) PASS: lldb-unit :: Interpreter/./InterpreterTests/OptionArgParserTest.toBoolean (1758 of 1785) PASS: lldb-api :: functionalities/data-formatter/data-formatter-advanced/TestDataFormatterAdv.py (1759 of 1785) PASS: lldb-api :: lang/objcxx/class-name-clash/TestNameClash.py (1760 of 1785) PASS: lldb-unit :: SymbolFile/DWARF/./SymbolFileDWARFTests/SymbolFileDWARFTests.TestAbbrevMissingTerminator (1761 of 1785) PASS: lldb-api :: functionalities/data-formatter/synthcapping/TestSyntheticCapping.py (1762 of 1785) PASS: lldb-unit :: Utility/./UtilityTests/StringListTest.GetMaxStringLengthEqualSize (1763 of 1785) PASS: lldb-api :: commands/process/attach/attach_denied/TestAttachDenied.py (1764 of 1785) PASS: lldb-shell :: SymbolFile/Breakpad/stack-cfi-parsing.test (1765 of 1785) PASS: lldb-shell :: Reproducer/TestReuseDirectory.test (1766 of 1785) PASS: lldb-unit :: Utility/./UtilityTests/StatusTest.Formatv (1767 of 1785) PASS: lldb-api :: functionalities/thread/concurrent_events/TestConcurrentDelayedCrashWithBreakpointWatchpoint.py (1768 of 1785) UNSUPPORTED: lldb-api :: benchmarks/libcxxmap/TestBenchmarkLibcxxMap.py (1769 of 1785) PASS: lldb-api :: tools/lldb-server/inferior-crash/TestGdbRemoteSegFault.py (1770 of 1785) PASS: lldb-shell :: Expr/TestMultilineExpr.test (1771 of 1785) PASS: lldb-api :: functionalities/load_using_paths/TestLoadUsingPaths.py (1772 of 1785) PASS: lldb-api :: commands/target/create-no-such-arch/TestNoSuchArch.py (1773 of 1785) PASS: lldb-api :: source-manager/TestSourceManager.py (1774 of 1785) PASS: lldb-api :: lang/objc/objc-property/TestObjCProperty.py (1775 of 1785) PASS: lldb-api :: functionalities/breakpoint/consecutive_breakpoints/TestConsecutiveBreakpoints.py (1776 of 1785) PASS: lldb-api :: functionalities/breakpoint/breakpoint_conditions/TestBreakpointConditions.py (1777 of 1785) PASS: lldb-api :: functionalities/data-formatter/data-formatter-stl/libcxx/vbool/TestDataFormatterLibcxxVBool.py (1778 of 1785) PASS: lldb-api :: commands/expression/import_builtin_fileid/TestImportBuiltinFileID.py (1779 of 1785) PASS: lldb-api :: functionalities/data-formatter/data-formatter-stl/libcxx/optional/TestDataFormatterLibcxxOptional.py (1780 of 1785) PASS: lldb-api :: commands/watchpoints/watchpoint_commands/command/TestWatchpointCommandPython.py (1781 of 1785) PASS: lldb-api :: commands/expression/import-std-module/list-dbg-info-content/TestDbgInfoContentList.py (1782 of 1785) PASS: lldb-api :: functionalities/data-formatter/synthupdate/TestSyntheticFilterRecompute.py (1783 of 1785) PASS: lldb-api :: lang/objc/objc-ivar-protocols/TestIvarProtocols.py (1784 of 1785) PASS: lldb-api :: types/TestIntegerTypesExpr.py (1785 of 1785) Testing Time: 1678.58s ******************** Failing Tests (1): lldb-api :: tools/lldb-server/TestLldbGdbServer.py

Hide Details

Hide Details

Slowest Tests: -------------------------------------------------------------------------- 113.54s: lldb-api :: python_api/target/TestTargetAPI.py 118.03s: lldb-api :: functionalities/inferior-crashing/TestInferiorCrashingStep.py 121.60s: lldb-api :: commands/target/basic/TestTargetCommand.py 126.57s: lldb-api :: api/check_public_api_headers/TestPublicAPIHeaders.py 135.25s: lldb-api :: lang/objc/objc-new-syntax/TestObjCNewSyntaxArray.py 138.68s: lldb-api :: lang/objc/objc-new-syntax/TestObjCNewSyntaxDictionary.py 142.09s: lldb-api :: functionalities/return-value/TestReturnValue.py 143.32s: lldb-api :: functionalities/recursion/TestValueObjectRecursion.py 169.21s: lldb-api :: lang/objc/exceptions/TestObjCExceptions.py 175.49s: lldb-api :: lang/cpp/namespace/TestNamespaceLookup.py 185.39s: lldb-api :: functionalities/load_unload/TestLoadUnload.py 186.18s: lldb-api :: lang/objc/objc-new-syntax/TestObjCNewSyntaxLiteral.py 198.03s: lldb-api :: lang/objc/foundation/TestObjCMethods.py 213.00s: lldb-api :: lang/cpp/enum_types/TestCPP11EnumTypes.py 221.38s: lldb-api :: api/multithreaded/TestMultithreaded.py 233.83s: lldb-api :: lang/objc/hidden-ivars/TestHiddenIvars.py 255.30s: lldb-api :: tools/lldb-server/TestLldbGdbServer.py 372.72s: lldb-api :: types/TestIntegerTypes.py 417.32s: lldb-api :: types/TestIntegerTypesExpr.py 713.27s: lldb-api :: lang/objc/foundation/TestFoundationDisassembly.py

Hide Details

Tests Times: -------------------------------------------------------------------------- [ Range ] :: [ Percentage ] :: [ Count ] -------------------------------------------------------------------------- [ 0s, 50s) :: [************************************* ] :: [1659/1785] [ 50s,100s) :: [** ] :: [ 99/1785] [100s,150s) :: [ ] :: [ 14/1785] [150s,200s) :: [ ] :: [ 5/1785] [200s,250s) :: [ ] :: [ 4/1785] [250s,300s) :: [ ] :: [ 1/1785] [300s,350s) :: [ ] :: [ 0/1785] [350s,400s) :: [ ] :: [ 1/1785] [400s,450s) :: [ ] :: [ 1/1785] [450s,500s) :: [ ] :: [ 0/1785] [500s,550s) :: [ ] :: [ 0/1785] [550s,600s) :: [ ] :: [ 0/1785] [600s,650s) :: [ ] :: [ 0/1785] [650s,700s) :: [ ] :: [ 0/1785] [700s,750s) :: [ ] :: [ 1/1785] Expected Passes : 1636 Expected Failures : 6 Unsupported Tests : 142 Unexpected Failures: 1 FAILED: tools/lldb/test/CMakeFiles/check-lldb-lit cd /Users/buildslave/jenkins/workspace/lldb-cmake-sanitized/lldb-build/tools/lldb/test && /usr/bin/python /Users/buildslave/jenkins/workspace/lldb-cmake-sanitized/lldb-build/./bin/llvm-lit -v --time-tests --shuffle --xunit-xml-output=/Users/buildslave/jenkins/workspace/lldb-cmake-sanitized/test/results.xml -v --timeout 1200 /Users/buildslave/jenkins/workspace/lldb-cmake-sanitized/lldb-build/tools/lldb/test ninja: build stopped: subcommand failed. Command failed Command: ['/usr/bin/env', 'TERM=vt100', '/usr/local/bin/ninja', '-v', 'check-lldb'] [Pipeline] } [Pipeline] // timeout [Pipeline] } [Pipeline] // stage [Pipeline] stage [Pipeline] { (Declarative: Post Actions) [Pipeline] scanForIssues No credentials specified [Clang (LLVM based)] Sleeping for 5 seconds due to JENKINS-32191... [Clang (LLVM based)] Parsing console log (workspace: '/Users/buildslave/jenkins/workspace/lldb-cmake-sanitized') [Pipeline] junit Recording test results [Pipeline] } [Pipeline] // stage [Pipeline] } [Pipeline] // withEnv [Pipeline] } [Pipeline] // node [Pipeline] End of Pipeline [BFA] Scanning build for known causes... [BFA] Found failure cause(s): [BFA] Ninja target failed from category Compile [BFA] Regression test failed from category Test [BFA] Done. 0s ERROR: script returned exit code 1 Finished: FAILURE