FailedConsole Output

Skipping 7,969 KB.. Full Log
it :: Utility/./UtilityTests/FileSpecTest.FileAndDirectoryComponents (386 of 1787)
PASS: lldb-shell :: ObjectFile/ELF/PT_TLS-overlap-PT_LOAD.yaml (387 of 1787)
PASS: lldb-api :: lang/objc/foundation/TestRuntimeTypes.py (388 of 1787)
PASS: lldb-unit :: Utility/./UtilityTests/RecordReplayTest.InstrumentedBarPtr (389 of 1787)
PASS: lldb-unit :: Utility/./UtilityTests/LogChannelEnabledTest.LLDB_LOG_ERROR (390 of 1787)
PASS: lldb-api :: functionalities/unwind/noreturn/module-end/TestNoReturnModuleEnd.py (391 of 1787)
PASS: lldb-shell :: SymbolFile/Breakpad/stack-cfi-parsing.test (392 of 1787)
PASS: lldb-unit :: Host/./HostTests/Host.GetEnvironment (393 of 1787)
PASS: lldb-api :: python_api/class_members/TestSBTypeClassMembers.py (394 of 1787)
PASS: lldb-unit :: Utility/./UtilityTests/StringExtractorTest.GetU32LittleEndian (395 of 1787)
PASS: lldb-api :: functionalities/breakpoint/comp_dir_symlink/TestCompDirSymLink.py (396 of 1787)
PASS: lldb-unit :: SymbolFile/NativePDB/./SymbolFileNativePDBTests/PDBFPOProgramToDWARFExpressionTests.InvalidAssignmentMultiple (397 of 1787)
PASS: lldb-unit :: Utility/./UtilityTests/StreamTest.PutULEB128 (398 of 1787)
PASS: lldb-unit :: ScriptInterpreter/Python/./ScriptInterpreterPythonTests/PythonDataObjectsTest.TestPythonListManipulation (399 of 1787)
PASS: lldb-shell :: Driver/TestTarget.test (400 of 1787)
PASS: lldb-unit :: Process/minidump/./LLDBMinidumpTests/MinidumpParserTest.GetMemoryRegionInfoLinuxMaps (401 of 1787)
UNSUPPORTED: lldb-shell :: Register/x86-gp-write.test (402 of 1787)
PASS: lldb-api :: tools/lldb-server/TestGdbRemoteSingleStep.py (403 of 1787)
PASS: lldb-unit :: Utility/./UtilityTests/StreamTeeTest.SetStreamAtIndexOutOfBounds (404 of 1787)
PASS: lldb-unit :: Utility/./UtilityTests/ArgsTest.ReplaceArgumentAtIndexFarOutOfRange (405 of 1787)
PASS: lldb-api :: functionalities/thread/concurrent_events/TestConcurrentBreakpointDelayBreakpointOneSignal.py (406 of 1787)
PASS: lldb-api :: macosx/safe-to-func-call/TestSafeFuncCalls.py (407 of 1787)
PASS: lldb-unit :: Expression/./ExpressionTests/DiagnosticManagerTest.PutStringMultiple (408 of 1787)
PASS: lldb-unit :: Utility/./UtilityTests/UriParserTest.SchemeHostSeparator4 (409 of 1787)
PASS: lldb-api :: functionalities/data-formatter/data-formatter-objc/TestDataFormatterObjCNSURL.py (410 of 1787)
PASS: lldb-api :: lang/cpp/unique-types/TestUniqueTypes.py (411 of 1787)
PASS: lldb-unit :: Utility/./UtilityTests/StringExtractorTest.GetHexBytes_FullString (412 of 1787)
PASS: lldb-api :: commands/expression/import-std-module/stack/TestStack.py (413 of 1787)
PASS: lldb-api :: functionalities/thread/concurrent_events/TestConcurrentCrashWithWatchpointBreakpointSignal.py (414 of 1787)
UNSUPPORTED: lldb-api :: commands/expression/call-restarts/TestCallThatRestarts.py (415 of 1787)
PASS: lldb-api :: commands/expression/persistent_variables/TestPersistentVariables.py (416 of 1787)
PASS: lldb-shell :: Settings/TestFrameFormatColor.test (417 of 1787)
PASS: lldb-unit :: Utility/./UtilityTests/NameMatchesTest.RegularExpression (418 of 1787)
PASS: lldb-shell :: Host/TestCustomShell.test (419 of 1787)
PASS: lldb-unit :: Utility/./UtilityTests/ArchSpecTest.Compatibility (420 of 1787)
PASS: lldb-unit :: Utility/./UtilityTests/DataExtractorTest.GetMaxS64 (421 of 1787)
PASS: lldb-shell :: Expr/TestTypeOfDeclTypeExpr.test (422 of 1787)
PASS: lldb-shell :: Reproducer/TestGDBRemoteRepro.test (423 of 1787)
PASS: lldb-unit :: Process/minidump/./LLDBMinidumpTests/MinidumpParserTest.GetLinuxProcStatus_no_stream (424 of 1787)
PASS: lldb-api :: lang/c/conflicting-symbol/TestConflictingSymbol.py (425 of 1787)
PASS: lldb-api :: functionalities/abbreviation/TestCommonShortSpellings.py (426 of 1787)
PASS: lldb-unit :: Process/minidump/./LLDBMinidumpTests/MinidumpParserTest.GetArchitecture (427 of 1787)
PASS: lldb-api :: lang/cpp/namespace/TestNamespace.py (428 of 1787)
PASS: lldb-shell :: SymbolFile/DWARF/childless-compile-unit.s (429 of 1787)
PASS: lldb-unit :: SymbolFile/DWARF/./SymbolFileDWARFTests/SymbolFileDWARFTests.TestAbbrevOrder1Start5 (430 of 1787)
PASS: lldb-api :: commands/expression/radar_9673664/TestExprHelpExamples.py (431 of 1787)
PASS: lldb-unit :: Symbol/./SymbolTests/PostfixExpression.ToDWARF (432 of 1787)
PASS: lldb-unit :: Utility/./UtilityTests/RangeTest.Equal (433 of 1787)
PASS: lldb-unit :: SymbolFile/DWARF/./SymbolFileDWARFTests/SymbolFileDWARFTests.TestAbbrevInvalidNULLTag (434 of 1787)
XFAIL: lldb-shell :: Unwind/prefer-debug-over-eh-frame.test (435 of 1787)
UNSUPPORTED: lldb-api :: functionalities/darwin_log/filter/exact_match/message/TestDarwinLogFilterMatchMessage.py (436 of 1787)
PASS: lldb-unit :: Language/Highlighting/./HighlighterTests/HighlighterTest.DefaultHighlighterWithCursorOutOfBounds (437 of 1787)
PASS: lldb-shell :: SymbolFile/NativePDB/break-by-function.cpp (438 of 1787)
UNSUPPORTED: lldb-shell :: ObjectFile/ELF/minidebuginfo-no-lzma.yaml (439 of 1787)
PASS: lldb-shell :: ObjectFile/ELF/PT_LOAD-overlap-section.yaml (440 of 1787)
PASS: lldb-api :: functionalities/testid/TestTestId.py (441 of 1787)
PASS: lldb-api :: lang/objc/modules-cache/TestClangModulesCache.py (442 of 1787)
PASS: lldb-api :: functionalities/data-formatter/data-formatter-named-summaries/TestDataFormatterNamedSummaries.py (443 of 1787)
PASS: lldb-shell :: SymbolFile/Breakpad/symtab-macho.test (444 of 1787)
PASS: lldb-unit :: ScriptInterpreter/Python/./ScriptInterpreterPythonTests/PythonDataObjectsTest.TestPythonInteger (445 of 1787)
PASS: lldb-api :: lang/objc/objc-super/TestObjCSuper.py (446 of 1787)
PASS: lldb-unit :: Host/./HostTests/MainLoopTest.UnmonitoredSignal (447 of 1787)
PASS: lldb-shell :: Watchpoint/SetErrorCases.test (448 of 1787)
PASS: lldb-unit :: Language/Highlighting/./HighlighterTests/HighlighterTest.ClangIdentifiers (449 of 1787)
UNSUPPORTED: lldb-api :: functionalities/data-formatter/data-formatter-stl/libstdcpp/map/TestDataFormatterStdMap.py (450 of 1787)
PASS: lldb-api :: functionalities/signal/handle-abrt/TestHandleAbort.py (451 of 1787)
PASS: lldb-unit :: Utility/./UtilityTests/UriParserTest.TypicalPortPath (452 of 1787)
PASS: lldb-api :: python_api/rdar-12481949/Test-rdar-12481949.py (453 of 1787)
PASS: lldb-unit :: Utility/./UtilityTests/OptionsWithRawTest.TerminatedQuote (454 of 1787)
PASS: lldb-unit :: UnwindAssembly/x86/./UnwindAssemblyx86Tests/Testx86AssemblyInspectionEngine.Test32bitFramelessBigStackFrame (455 of 1787)
PASS: lldb-api :: functionalities/data-formatter/data-formatter-stl/libcxx/tuple/TestDataFormatterLibcxxTuple.py (456 of 1787)
PASS: lldb-api :: python_api/lldbutil/process/TestPrintStackTraces.py (457 of 1787)
PASS: lldb-shell :: BuildScript/script-args.test (458 of 1787)
PASS: lldb-unit :: Utility/./UtilityTests/StringExtractorTest.GetHexU8_Underflow (459 of 1787)
PASS: lldb-shell :: SymbolFile/NativePDB/ast-functions.cpp (460 of 1787)
PASS: lldb-api :: functionalities/data-formatter/data-formatter-stl/libcxx/string/TestDataFormatterLibcxxString.py (461 of 1787)
PASS: lldb-unit :: ScriptInterpreter/Python/./ScriptInterpreterPythonTests/PythonDataObjectsTest.TestPythonCallableInvoke (462 of 1787)
PASS: lldb-unit :: Utility/./UtilityTests/StringExtractorTest.GetHexU8_InvalidHex (463 of 1787)
PASS: lldb-shell :: Reproducer/TestWorkingDir.test (464 of 1787)
PASS: lldb-unit :: Utility/./UtilityTests/ArgsTest.TestSingleArg (465 of 1787)
PASS: lldb-shell :: SymbolFile/NativePDB/function-types-calling-conv.cpp (466 of 1787)
PASS: lldb-api :: commands/frame/var/TestFrameVar.py (467 of 1787)
PASS: lldb-api :: functionalities/tail_call_frames/sbapi_support/TestTailCallFrameSBAPI.py (468 of 1787)
PASS: lldb-api :: python_api/exprpath_synthetic/TestExprPathSynthetic.py (469 of 1787)
PASS: lldb-unit :: Utility/./UtilityTests/StreamTest.PutNHex8 (470 of 1787)
PASS: lldb-api :: types/TestIntegerTypes.py (471 of 1787)
PASS: lldb-unit :: Utility/./UtilityTests/BinaryStreamTest.PutSLEB128MaxValue (472 of 1787)
PASS: lldb-unit :: Symbol/./SymbolTests/TestClangASTContext.TestIsClangType (473 of 1787)
PASS: lldb-unit :: ScriptInterpreter/Python/./ScriptInterpreterPythonTests/PythonDataObjectsTest.TestPythonTupleSize (474 of 1787)
PASS: lldb-unit :: Process/gdb-remote/./ProcessGdbRemoteTests/GDBRemoteCommunicationClientTest.GetModulesInfo (475 of 1787)
PASS: lldb-api :: commands/expression/test/TestExprs2.py (476 of 1787)
PASS: lldb-unit :: Utility/./UtilityTests/StreamTest.PutBytesAsRawHex8ToMixedEndian (477 of 1787)
PASS: lldb-api :: functionalities/breakpoint/step_over_breakpoint/TestStepOverBreakpoint.py (478 of 1787)
PASS: lldb-shell :: Breakpoint/debug_addrx.test (479 of 1787)
XFAIL: lldb-shell :: SymbolFile/DWARF/find-type-in-function.cpp (480 of 1787)
PASS: lldb-api :: python_api/interpreter/TestCommandInterpreterAPI.py (481 of 1787)
PASS: lldb-shell :: Breakpoint/implicit_const_form_support.test (482 of 1787)
UNSUPPORTED: lldb-api :: commands/expression/completion-crash2/TestCompletionCrash2.py (483 of 1787)
PASS: lldb-unit :: Utility/./UtilityTests/StreamTeeTest.Assignment (484 of 1787)
PASS: lldb-unit :: Utility/./UtilityTests/StringListTest.SplitIntoLinesSingleTrailingCR (485 of 1787)
PASS: lldb-unit :: UnwindAssembly/x86/./UnwindAssemblyx86Tests/Testx86AssemblyInspectionEngine.TestPushR12 (486 of 1787)
PASS: lldb-unit :: Utility/./UtilityTests/GeneratorTest.Create (487 of 1787)
PASS: lldb-unit :: Utility/./UtilityTests/VMRange.SetEndAddress (488 of 1787)
PASS: lldb-unit :: Utility/./UtilityTests/BinaryStreamTest.PutSLEB128TwoBytes (489 of 1787)
PASS: lldb-api :: functionalities/thread/concurrent_events/TestConcurrentDelayedCrashWithBreakpointSignal.py (490 of 1787)
PASS: lldb-api :: commands/command/source/TestCommandSource.py (491 of 1787)
PASS: lldb-shell :: SymbolFile/DWARF/gnu-style-compression.cpp (492 of 1787)
UNSUPPORTED: lldb-shell :: SymbolFile/PDB/class-layout.test (493 of 1787)
PASS: lldb-unit :: Utility/./UtilityTests/RangeTest.DefaultConstructor (494 of 1787)
PASS: lldb-api :: functionalities/thread/concurrent_events/TestConcurrentDelayWatchBreak.py (495 of 1787)
PASS: lldb-api :: functionalities/return-value/TestReturnValue.py (496 of 1787)
PASS: lldb-shell :: SymbolFile/DWARF/debug-types-signature-loop.s (497 of 1787)
PASS: lldb-shell :: ObjectFile/PECOFF/subsections.yaml (498 of 1787)
PASS: lldb-unit :: Utility/./UtilityTests/ScalarTest.Promotion (499 of 1787)
PASS: lldb-api :: python_api/formatters/TestFormattersSBAPI.py (500 of 1787)
UNSUPPORTED: lldb-api :: benchmarks/stepping/TestSteppingSpeed.py (501 of 1787)
UNSUPPORTED: lldb-shell :: Breakpoint/case-insensitive.test (502 of 1787)
PASS: lldb-unit :: Utility/./UtilityTests/UserIDResolver.GetGroupName (503 of 1787)
PASS: lldb-shell :: SymbolFile/DWARF/debug-types-dwo-cross-reference.cpp (504 of 1787)
PASS: lldb-api :: commands/expression/import-std-module/list-dbg-info-content/TestDbgInfoContentList.py (505 of 1787)
PASS: lldb-unit :: Target/./TargetTests/MemoryRegionInfoTest.Formatv (506 of 1787)
PASS: lldb-unit :: Utility/./UtilityTests/StreamTest.PutBytesAsRawHex8ToLittleEndian (507 of 1787)
PASS: lldb-unit :: Editline/./EditlineTests/EditlineTestFixture.EditlineReceivesMultiLineText (508 of 1787)
PASS: lldb-unit :: Utility/./UtilityTests/RangeTest.LessThan (509 of 1787)
PASS: lldb-unit :: UnwindAssembly/x86/./UnwindAssemblyx86Tests/Testx86AssemblyInspectionEngine.TestPopR12 (510 of 1787)
PASS: lldb-unit :: debugserver/./debugserverTests/RNBSocket.LoopBackConnectIPv6 (511 of 1787)
UNSUPPORTED: lldb-api :: commands/watchpoints/variable_out_of_scope/TestWatchedVarHitWhenInScope.py (512 of 1787)
PASS: lldb-unit :: Process/gdb-remote/./ProcessGdbRemoteTests/GDBRemoteCommunicationClientTest.SendGetMetaDataPacket (513 of 1787)
PASS: lldb-unit :: Utility/./UtilityTests/StringLexerTest.NextIfList (514 of 1787)
PASS: lldb-unit :: Utility/./UtilityTests/RegularExpression.Valid (515 of 1787)
PASS: lldb-unit :: Utility/./UtilityTests/RangeTest.SetRangeBase (516 of 1787)
UNSUPPORTED: lldb-api :: functionalities/longjmp/TestLongjmp.py (517 of 1787)
PASS: lldb-api :: functionalities/value_md5_crash/TestValueMD5Crash.py (518 of 1787)
PASS: lldb-unit :: Utility/./UtilityTests/StringExtractorTest.DecodeHexU8_Extra (519 of 1787)
UNSUPPORTED: lldb-api :: benchmarks/turnaround/TestCompileRunToBreakpointTurnaround.py (520 of 1787)
PASS: lldb-unit :: ScriptInterpreter/Python/./ScriptInterpreterPythonTests/PythonDataObjectsTest.TestDictionaryResolutionWithDot (521 of 1787)
PASS: lldb-unit :: UnwindAssembly/x86/./UnwindAssemblyx86Tests/Testx86AssemblyInspectionEngine.TestReturnDetect (522 of 1787)
PASS: lldb-api :: functionalities/thread/concurrent_events/TestConcurrentBreakpointsDelayedBreakpointOneWatchpoint.py (523 of 1787)
PASS: lldb-unit :: Utility/./UtilityTests/StreamTest.PutHex32ByteOrderLittle (524 of 1787)
PASS: lldb-unit :: Utility/./UtilityTests/RangeTest.ClearWithStarAddress (525 of 1787)
PASS: lldb-shell :: Driver/TestCore.test (526 of 1787)
PASS: lldb-api :: functionalities/object-file/TestImageListMultiArchitecture.py (527 of 1787)
PASS: lldb-unit :: Language/Highlighting/./HighlighterTests/HighlighterTest.HighlighterSelectionType (528 of 1787)
PASS: lldb-unit :: ScriptInterpreter/Python/./ScriptInterpreterPythonTests/PythonDataObjectsTest.TestPythonByteArray (529 of 1787)
PASS: lldb-api :: commands/expression/vector_of_enums/TestVectorOfEnums.py (530 of 1787)
PASS: lldb-api :: tools/lldb-server/TestGdbRemoteExpeditedRegisters.py (531 of 1787)
PASS: lldb-shell :: ObjectFile/PECOFF/uuid.yaml (532 of 1787)
PASS: lldb-api :: commands/process/launch/TestProcessLaunch.py (533 of 1787)
PASS: lldb-api :: functionalities/data-formatter/language_category_updates/TestDataFormatterLanguageCategoryUpdates.py (534 of 1787)
PASS: lldb-unit :: Utility/./UtilityTests/StreamTest.PutCharWhitespace (535 of 1787)
PASS: lldb-unit :: Utility/./UtilityTests/AnsiTerminal.Unknown (536 of 1787)
PASS: lldb-unit :: Utility/./UtilityTests/StringListTest.AppendStringCString (537 of 1787)
PASS: lldb-unit :: Utility/./UtilityTests/OptionsWithRawTest.EmptyArgsOnlySuffix (538 of 1787)
PASS: lldb-api :: functionalities/gdb_remote_client/TestWriteMemory.py (539 of 1787)
PASS: lldb-api :: functionalities/step_scripted/TestStepScripted.py (540 of 1787)
PASS: lldb-unit :: Utility/./UtilityTests/BinaryStreamTest.PutULEB128OneByte (541 of 1787)
UNSUPPORTED: lldb-api :: functionalities/data-formatter/data-formatter-stl/libstdcpp/smart_ptr/TestDataFormatterStdSmartPtr.py (542 of 1787)
PASS: lldb-api :: commands/help/TestHelp.py (543 of 1787)
PASS: lldb-unit :: Host/./HostTests/FileActionTest.Open (544 of 1787)
PASS: lldb-api :: commands/quit/TestQuit.py (545 of 1787)
PASS: lldb-unit :: ScriptInterpreter/Python/./ScriptInterpreterPythonTests/PythonDataObjectsTest.TestObjectAttributes (546 of 1787)
PASS: lldb-unit :: Utility/./UtilityTests/LogChannelTest.Disable (547 of 1787)
PASS: lldb-api :: functionalities/data-formatter/varscript_formatting/TestDataFormatterVarScriptFormatting.py (548 of 1787)
PASS: lldb-unit :: Utility/./UtilityTests/StringExtractorTest.GetU64LittleEndian (549 of 1787)
PASS: lldb-api :: functionalities/thread/crash_during_step/TestCrashDuringStep.py (550 of 1787)
PASS: lldb-api :: functionalities/data-formatter/data-formatter-proper-plurals/TestFormattersOneIsSingular.py (551 of 1787)
PASS: lldb-api :: functionalities/load_using_paths/TestLoadUsingPaths.py (552 of 1787)
PASS: lldb-api :: functionalities/thread/concurrent_events/TestConcurrentManyCrash.py (553 of 1787)
PASS: lldb-unit :: Symbol/./SymbolTests/DWARFCallFrameInfoTest.Basic_dwarf3 (554 of 1787)
PASS: lldb-api :: functionalities/gdb_remote_client/TestNestedRegDefinitions.py (555 of 1787)
PASS: lldb-unit :: UnwindAssembly/x86/./UnwindAssemblyx86Tests/Testx86AssemblyInspectionEngine.TestPopRBPWithREX (556 of 1787)
PASS: lldb-unit :: Host/./HostTests/ConnectionFileDescriptorTest.TCPGetURIv4 (557 of 1787)
PASS: lldb-api :: commands/expression/import-std-module/conflicts/TestStdModuleWithConflicts.py (558 of 1787)
UNSUPPORTED: lldb-api :: functionalities/darwin_log/basic/TestDarwinLogBasic.py (559 of 1787)
PASS: lldb-api :: commands/disassemble/basic/TestFrameDisassemble.py (560 of 1787)
PASS: lldb-unit :: Interpreter/./InterpreterTests/CompletionTest.DirCompletionUsername (561 of 1787)
PASS: lldb-unit :: Utility/./UtilityTests/RangeTest.ContainsRangeStartingFromZero (562 of 1787)
PASS: lldb-unit :: Utility/./UtilityTests/RangeTest.ContainsAddrInvalid (563 of 1787)
PASS: lldb-unit :: Utility/./UtilityTests/StringExtractorTest.GetHexBytes_Partial (564 of 1787)
PASS: lldb-unit :: UnwindAssembly/x86/./UnwindAssemblyx86Tests/Testx86AssemblyInspectionEngine.Test32bitFramelessSmallStackFrame (565 of 1787)
PASS: lldb-shell :: Unwind/trap_frame_sym_ctx.test (566 of 1787)
PASS: lldb-unit :: Utility/./UtilityTests/FileSpecTest.PrependPathComponent (567 of 1787)
PASS: lldb-shell :: BuildScript/modes.test (568 of 1787)
PASS: lldb-shell :: SymbolFile/NativePDB/globals-bss.cpp (569 of 1787)
PASS: lldb-shell :: Commands/CommandScriptImmediateOutput/CommandScriptImmediateOutputFile.test (570 of 1787)
PASS: lldb-unit :: Utility/./UtilityTests/UriParserTest.MinimalPort (571 of 1787)
UNSUPPORTED: lldb-shell :: Register/x86-64-xmm16-read.test (572 of 1787)
PASS: lldb-unit :: Utility/./UtilityTests/LogTest.LLDB_LOG_nullptr (573 of 1787)
PASS: lldb-unit :: Utility/./UtilityTests/SerializationRountripTest.SerializeDeserializeCString (574 of 1787)
PASS: lldb-api :: commands/expression/import-std-module/weak_ptr-dbg-info-content/TestDbgInfoContentWeakPtr.py (575 of 1787)
PASS: lldb-shell :: Driver/LocalLLDBInit.test (576 of 1787)
PASS: lldb-unit :: Utility/./UtilityTests/StringLexerTest.PutBack (577 of 1787)
PASS: lldb-api :: commands/expression/char/TestExprsChar.py (578 of 1787)
PASS: lldb-unit :: Utility/./UtilityTests/Flags.GetBitSize (579 of 1787)
PASS: lldb-unit :: Utility/./UtilityTests/UriParserTest.MinimalPath (580 of 1787)
PASS: lldb-unit :: Language/Highlighting/./HighlighterTests/HighlighterTest.ClangScalarLiterals (581 of 1787)
PASS: lldb-api :: python_api/lldbutil/iter/TestRegistersIterator.py (582 of 1787)
PASS: lldb-unit :: Utility/./UtilityTests/StringExtractorTest.GetHexU8_Exact_NoEof (583 of 1787)
PASS: lldb-unit :: UnwindAssembly/x86/./UnwindAssemblyx86Tests/Testx86AssemblyInspectionEngine.TestMovRSPtoRBP (584 of 1787)
PASS: lldb-unit :: Utility/./UtilityTests/UriParserTest.LongPath (585 of 1787)
PASS: lldb-unit :: Utility/./UtilityTests/BinaryStreamTest.PutSLEB128FourBytes (586 of 1787)
PASS: lldb-api :: lang/objc/foundation/TestObjCMethodsString.py (587 of 1787)
PASS: lldb-unit :: SymbolFile/NativePDB/./SymbolFileNativePDBTests/PDBFPOProgramToDWARFExpressionTests.DependencyChain (588 of 1787)
PASS: lldb-api :: types/TestDoubleTypesExpr.py (589 of 1787)
PASS: lldb-unit :: Core/./LLDBCoreTests/MangledTest.EmptyForInvalidName (590 of 1787)
PASS: lldb-shell :: Settings/TestSettingsSet.test (591 of 1787)
PASS: lldb-api :: functionalities/data-formatter/data-formatter-stl/libcxx/multiset/TestDataFormatterLibcxxMultiSet.py (592 of 1787)
PASS: lldb-unit :: Process/minidump/./LLDBMinidumpTests/MinidumpParserTest.MinidumpDuplicateModuleMinAddress (593 of 1787)
PASS: lldb-api :: commands/expression/radar_9531204/TestPrintfAfterUp.py (594 of 1787)
UNSUPPORTED: lldb-shell :: SymbolFile/dissassemble-entry-point.s (595 of 1787)
PASS: lldb-unit :: UnwindAssembly/x86/./UnwindAssemblyx86Tests/Testx86AssemblyInspectionEngine.TestPushR15 (596 of 1787)
PASS: lldb-api :: lang/c/local_types/TestUseClosestType.py (597 of 1787)
PASS: lldb-api :: commands/frame/diagnose/virtual-method-call/TestDiagnoseDereferenceVirtualMethodCall.py (598 of 1787)
UNSUPPORTED: lldb-shell :: SymbolFile/PDB/ast-restore.test (599 of 1787)
PASS: lldb-api :: commands/expression/entry-bp/TestExprEntryBP.py (600 of 1787)
PASS: lldb-unit :: Utility/./UtilityTests/TimerTest.CategoryTimesNested (601 of 1787)
UNSUPPORTED: lldb-api :: tools/lldb-server/signal-filtering/TestGdbRemote_QPassSignals.py (602 of 1787)
PASS: lldb-shell :: SymbolFile/NativePDB/disassembly.cpp (603 of 1787)
UNSUPPORTED: lldb-api :: commands/register/register/intel_xtended_registers/TestMPXRegisters.py (604 of 1787)
PASS: lldb-unit :: Utility/./UtilityTests/LogChannelTest.Enable (605 of 1787)
UNSUPPORTED: lldb-api :: benchmarks/frame_variable/TestFrameVariableResponse.py (606 of 1787)
PASS: lldb-api :: functionalities/data-formatter/data-formatter-enum-format/TestDataFormatterEnumFormat.py (607 of 1787)
PASS: lldb-unit :: Utility/./UtilityTests/UriParserTest.BadPort (608 of 1787)
PASS: lldb-api :: functionalities/inferior-assert/TestInferiorAssert.py (609 of 1787)
PASS: lldb-unit :: Utility/./UtilityTests/StringExtractorTest.DecodeHexU8_InvalidHex (610 of 1787)
PASS: lldb-unit :: Utility/./UtilityTests/ScalarTest.Division (611 of 1787)
PASS: lldb-unit :: Utility/./UtilityTests/ArgsTest.AppendArguments (612 of 1787)
PASS: lldb-api :: functionalities/dead-strip/TestDeadStrip.py (613 of 1787)
PASS: lldb-unit :: Utility/./UtilityTests/StreamTeeTest.AppendStream (614 of 1787)
PASS: lldb-unit :: Utility/./UtilityTests/VMRange.ContainsAddr (615 of 1787)
PASS: lldb-unit :: Utility/./UtilityTests/BinaryStreamTest.PutSLEB128OneByte (616 of 1787)
PASS: lldb-unit :: Utility/./UtilityTests/TimerTest.CategoryTimesStats (617 of 1787)
PASS: lldb-api :: functionalities/thread/concurrent_events/TestConcurrentSignalDelayBreak.py (618 of 1787)
PASS: lldb-api :: lang/cpp/frame-var-anon-unions/TestFrameVariableAnonymousUnions.py (619 of 1787)
PASS: lldb-unit :: Utility/./UtilityTests/ArgsTest.GetArgumentArrayRef (620 of 1787)
PASS: lldb-unit :: Utility/./UtilityTests/StringListTest.AppendList (621 of 1787)
PASS: lldb-api :: tools/lldb-server/inferior-crash/TestGdbRemoteAbort.py (622 of 1787)
PASS: lldb-shell :: ObjectFile/ELF/build-id-case.yaml (623 of 1787)
PASS: lldb-unit :: Utility/./UtilityTests/StringListTest.JoinThree (624 of 1787)
PASS: lldb-unit :: Utility/./UtilityTests/StreamTest.PutHex16ByteOrderBig (625 of 1787)
PASS: lldb-api :: commands/expression/call-function/TestCallUserDefinedFunction.py (626 of 1787)
UNSUPPORTED: lldb-api :: benchmarks/continue/TestBenchmarkContinue.py (627 of 1787)
PASS: lldb-api :: functionalities/data-formatter/data-formatter-smart-array/TestDataFormatterSmartArray.py (628 of 1787)
PASS: lldb-shell :: Expr/TestIRMemoryMap.test (629 of 1787)
PASS: lldb-api :: commands/watchpoints/watchpoint_commands/TestWatchpointCommands.py (630 of 1787)
PASS: lldb-api :: functionalities/tail_call_frames/ambiguous_tail_call_seq2/TestAmbiguousTailCallSeq2.py (631 of 1787)
PASS: lldb-shell :: ObjectFile/ELF/aarch64-relocations.yaml (632 of 1787)
PASS: lldb-shell :: SymbolFile/DWARF/compilercontext.ll (633 of 1787)
PASS: lldb-api :: functionalities/thread/thread_exit/TestThreadExit.py (634 of 1787)
PASS: lldb-api :: functionalities/tsan/multiple/TestTsanMultiple.py (635 of 1787)
PASS: lldb-api :: lang/c/stepping/TestStepAndBreakpoints.py (636 of 1787)
PASS: lldb-api :: commands/settings/TestSettings.py (637 of 1787)
PASS: lldb-api :: functionalities/breakpoint/serialize/TestBreakpointSerialization.py (638 of 1787)
PASS: lldb-api :: commands/expression/argument_passing_restrictions/TestArgumentPassingRestrictions.py (639 of 1787)
PASS: lldb-unit :: Host/./HostTests/File.GetWaitableHandleFileno (640 of 1787)
PASS: lldb-unit :: Utility/./UtilityTests/VASprintfTest.NoBufferResize (641 of 1787)
PASS: lldb-unit :: Host/./HostTests/NativeProcessProtocolTest.ReadMemoryWithoutTrap (642 of 1787)
PASS: lldb-unit :: Symbol/./SymbolTests/TestClangASTContext.TestBuiltinTypeForEncodingAndBitSize (643 of 1787)
PASS: lldb-shell :: ObjectFile/Breakpad/breakpad-identification.test (644 of 1787)
PASS: lldb-unit :: UnwindAssembly/x86/./UnwindAssemblyx86Tests/Testx86AssemblyInspectionEngine.TestCALLNextInsn (645 of 1787)
PASS: lldb-api :: functionalities/mtc/simple/TestMTCSimple.py (646 of 1787)
PASS: lldb-api :: python_api/watchpoint/TestWatchpointIgnoreCount.py (647 of 1787)
PASS: lldb-api :: lang/cpp/class_static/TestStaticVariables.py (648 of 1787)
PASS: lldb-unit :: Utility/./UtilityTests/StringListTest.ShiftCString (649 of 1787)
PASS: lldb-api :: functionalities/data-formatter/format-propagation/TestFormatPropagation.py (650 of 1787)
PASS: lldb-api :: commands/expression/ignore-artificial-constructors/TestIgnoreArtificialConstructors.py (651 of 1787)
PASS: lldb-api :: lang/c/shared_lib/TestSharedLib.py (652 of 1787)
PASS: lldb-api :: functionalities/data-formatter/data-formatter-objc/TestDataFormatterObjCPlain.py (653 of 1787)
PASS: lldb-unit :: Expression/./ExpressionTests/CppModuleConfigurationTest.AmbiguousLibCpp (654 of 1787)
PASS: lldb-shell :: Breakpoint/debug_rnglistx_rlex.test (655 of 1787)
PASS: lldb-api :: python_api/watchpoint/watchlocation/TestTargetWatchAddress.py (656 of 1787)
PASS: lldb-unit :: Utility/./UtilityTests/VMRange.Clear (657 of 1787)
UNSUPPORTED: lldb-api :: functionalities/darwin_log/filter/exact_match/activity-chain/TestDarwinLogFilterMatchActivityChain.py (658 of 1787)
PASS: lldb-unit :: ScriptInterpreter/Python/./ScriptInterpreterPythonTests/PythonExceptionStateTest.TestAcquisitionSemantics (659 of 1787)
PASS: lldb-shell :: Driver/TestSingleQuote.test (660 of 1787)
UNSUPPORTED: lldb-api :: functionalities/unwind/ehframe/TestEhFrameUnwind.py (661 of 1787)
PASS: lldb-unit :: Utility/./UtilityTests/RangeTest.NotEqualInvalid (662 of 1787)
PASS: lldb-unit :: Utility/./UtilityTests/StringExtractorTest.GetHexBytesAvail_Underflow (663 of 1787)
PASS: lldb-unit :: Process/minidump/./LLDBMinidumpTests/MinidumpParserTest.GetArchitectureWindows (664 of 1787)
PASS: lldb-api :: commands/expression/completion/TestExprCompletion.py (665 of 1787)
PASS: lldb-unit :: Expression/./ExpressionTests/CppModuleConfigurationTest.IgnoreLibStdCpp (666 of 1787)
PASS: lldb-unit :: Utility/./UtilityTests/DataExtractorTest.GetCStrUnterminated (667 of 1787)
PASS: lldb-api :: commands/source/info/TestSourceInfo.py (668 of 1787)
PASS: lldb-unit :: Utility/./UtilityTests/StringListTest.LongestCommonPrefixSingleElement (669 of 1787)
PASS: lldb-unit :: UnwindAssembly/x86/./UnwindAssemblyx86Tests/Testx86AssemblyInspectionEngine.TestPopRBP (670 of 1787)
PASS: lldb-api :: lang/objcxx/class-name-clash/TestNameClash.py (671 of 1787)
PASS: lldb-api :: lang/c/inlines/TestRedefinitionsInInlines.py (672 of 1787)
PASS: lldb-unit :: Expression/./ExpressionTests/DiagnosticManagerTest.GetStringMultiline (673 of 1787)
PASS: lldb-shell :: Driver/TestProcessAttach.test (674 of 1787)
PASS: lldb-unit :: Expression/./ExpressionTests/CppModuleConfigurationTest.AmbiguousCLib (675 of 1787)
UNSUPPORTED: lldb-api :: tools/lldb-server/thread-name/TestGdbRemoteThreadName.py (676 of 1787)
PASS: lldb-unit :: Utility/./UtilityTests/BinaryStreamTest.PutSLEB128SixBytes (677 of 1787)
UNSUPPORTED: lldb-api :: functionalities/data-formatter/data-formatter-stl/libstdcpp/list/TestDataFormatterStdList.py (678 of 1787)
PASS: lldb-api :: tools/lldb-server/TestGdbRemote_vCont.py (679 of 1787)
PASS: lldb-shell :: Quit/TestQuitExitCode30.test (680 of 1787)
PASS: lldb-unit :: Utility/./UtilityTests/BinaryStreamTest.PutULEB128Zero (681 of 1787)
UNSUPPORTED: lldb-shell :: SymbolFile/PDB/vbases.test (682 of 1787)
PASS: lldb-unit :: Utility/./UtilityTests/ScalarTest.CastOperations (683 of 1787)
PASS: lldb-api :: functionalities/thread/concurrent_events/TestConcurrentManyWatchpoints.py (684 of 1787)
PASS: lldb-api :: lang/objc/print-obj/TestPrintObj.py (685 of 1787)
PASS: lldb-api :: python_api/sbvalue_const_addrof/TestSBValueConstAddrOf.py (686 of 1787)
PASS: lldb-unit :: Utility/./UtilityTests/ArgsTest.DoubleQuotedItem (687 of 1787)
PASS: lldb-api :: python_api/value/empty_class/TestValueAPIEmptyClass.py (688 of 1787)
PASS: lldb-unit :: Interpreter/./InterpreterTests/OptionArgParserTest.toScriptLanguage (689 of 1787)
PASS: lldb-api :: functionalities/memory/read/TestMemoryRead.py (690 of 1787)
PASS: lldb-unit :: Process/gdb-remote/./ProcessGdbRemoteTests/GDBRemoteCommunicationTest.ReadPacket_checksum (691 of 1787)
PASS: lldb-api :: commands/expression/import-std-module/shared_ptr-dbg-info-content/TestSharedPtrDbgInfoContent.py (692 of 1787)
UNSUPPORTED: lldb-api :: functionalities/thread/multi_break/TestMultipleBreakpoints.py (693 of 1787)
PASS: lldb-api :: functionalities/data-formatter/data-formatter-stl/libcxx/unordered/TestDataFormatterUnordered.py (694 of 1787)
UNSUPPORTED: lldb-shell :: SymbolFile/PDB/func-symbols.test (695 of 1787)
PASS: lldb-unit :: UnwindAssembly/x86/./UnwindAssemblyx86Tests/Testx86AssemblyInspectionEngine.TestPopEDI (696 of 1787)
PASS: lldb-api :: commands/target/basic/TestTargetCommand.py (697 of 1787)
PASS: lldb-unit :: Utility/./UtilityTests/ArgsTest.StringListConstructor (698 of 1787)
PASS: lldb-api :: functionalities/param_entry_vals/basic_entry_values_x86_64/TestBasicEntryValuesX86_64.py (699 of 1787)
PASS: lldb-api :: lang/cpp/class_types/TestClassTypesDisassembly.py (700 of 1787)
PASS: lldb-unit :: Expression/./ExpressionTests/DiagnosticManagerTest.AddDiagnostic (701 of 1787)
PASS: lldb-shell :: SymbolFile/DWARF/split-dwarf-multiple-cu.ll (702 of 1787)
PASS: lldb-unit :: Utility/./UtilityTests/IndexToObjectTest.ObjectForIndex (703 of 1787)
PASS: lldb-api :: functionalities/data-formatter/boolreference/TestFormattersBoolRefPtr.py (704 of 1787)
PASS: lldb-unit :: Utility/./UtilityTests/EnvironmentTest.EnvpConstruction (705 of 1787)
PASS: lldb-unit :: Utility/./UtilityTests/StreamTest.ShiftOperatorInts (706 of 1787)
PASS: lldb-unit :: Symbol/./SymbolTests/TestClangASTContext.TestRecordHasFields (707 of 1787)
UNSUPPORTED: lldb-shell :: SymbolFile/NativePDB/typedefs.cpp (708 of 1787)
PASS: lldb-shell :: ObjectFile/ELF/PT_LOAD-empty.yaml (709 of 1787)
PASS: lldb-api :: commands/expression/persist_objc_pointeetype/TestPersistObjCPointeeType.py (710 of 1787)
PASS: lldb-api :: functionalities/fat_archives/TestFatArchives.py (711 of 1787)
PASS: lldb-api :: functionalities/thread/concurrent_events/TestConcurrentTwoWatchpointThreads.py (712 of 1787)
PASS: lldb-unit :: SymbolFile/NativePDB/./SymbolFileNativePDBTests/PDBFPOProgramToDWARFExpressionTests.InvalidAssignmentSingle (713 of 1787)
UNSUPPORTED: lldb-shell :: SymbolFile/PDB/enums-layout.test (714 of 1787)
PASS: lldb-unit :: Target/./TargetTests/ModuleCacheTest.GetAndPut (715 of 1787)
PASS: lldb-api :: commands/watchpoints/watchpoint_events/TestWatchpointEvents.py (716 of 1787)
PASS: lldb-api :: functionalities/tail_call_frames/ambiguous_tail_call_seq1/TestAmbiguousTailCallSeq1.py (717 of 1787)
PASS: lldb-unit :: ScriptInterpreter/Python/./ScriptInterpreterPythonTests/PythonDataObjectsTest.TestPythonFile (718 of 1787)
PASS: lldb-api :: functionalities/data-formatter/data-formatter-objc/nsstring/TestDataFormatterNSString.py (719 of 1787)
PASS: lldb-api :: functionalities/data-formatter/data-formatter-python-synth/TestDataFormatterPythonSynth.py (720 of 1787)
PASS: lldb-api :: functionalities/postmortem/minidump-new/TestMiniDumpUUID.py (721 of 1787)
PASS: lldb-shell :: ObjectFile/ELF/minidebuginfo-find-symbols.yaml (722 of 1787)
PASS: lldb-unit :: Process/gdb-remote/./ProcessGdbRemoteTests/GDBRemoteCommunicationClientTest.SyncThreadState (723 of 1787)
PASS: lldb-unit :: SymbolFile/DWARF/./SymbolFileDWARFTests/DWARFASTParserClangTests.EnsureAllDIEsInDeclContextHaveBeenParsedParsesOnlyMatchingEntries (724 of 1787)
PASS: lldb-api :: functionalities/memory/cache/TestMemoryCache.py (725 of 1787)
PASS: lldb-unit :: UnwindAssembly/x86/./UnwindAssemblyx86Tests/Testx86AssemblyInspectionEngine.TestSpillRegToStackViaMOVx86_64 (726 of 1787)
PASS: lldb-api :: commands/frame/diagnose/inheritance/TestDiagnoseInheritance.py (727 of 1787)
UNSUPPORTED: lldb-api :: api/multiple-debuggers/TestMultipleDebuggers.py (728 of 1787)
PASS: lldb-unit :: Symbol/./SymbolTests/Type.GetTypeScopeAndBasename (729 of 1787)
UNSUPPORTED: lldb-shell :: SymbolFile/target-symbols-add-unwind.test (730 of 1787)
PASS: lldb-api :: lang/cpp/unicode-literals/TestUnicodeLiterals.py (731 of 1787)
PASS: lldb-api :: commands/expression/po_verbosity/TestPoVerbosity.py (732 of 1787)
PASS: lldb-unit :: UnwindAssembly/x86/./UnwindAssemblyx86Tests/Testx86AssemblyInspectionEngine.TestLEAVE (733 of 1787)
PASS: lldb-api :: commands/expression/import-std-module/forward_list-dbg-info-content/TestDbgInfoContentForwardList.py (734 of 1787)
PASS: lldb-shell :: SymbolFile/DWARF/debug-types-address-ranges.s (735 of 1787)
PASS: lldb-api :: lang/cpp/dynamic-value/TestCppValueCast.py (736 of 1787)
UNSUPPORTED: lldb-shell :: SymbolFile/PDB/pointers.test (737 of 1787)
PASS: lldb-unit :: Utility/./UtilityTests/UriParserTest.MinimalPortPath (738 of 1787)
PASS: lldb-api :: commands/add-dsym/uuid/TestAddDsymCommand.py (739 of 1787)
PASS: lldb-unit :: UnwindAssembly/x86/./UnwindAssemblyx86Tests/Testx86AssemblyInspectionEngine.TestPushExtended (740 of 1787)
PASS: lldb-api :: functionalities/modern-type-lookup/basic/TestBasicModernTypeLookup.py (741 of 1787)
PASS: lldb-api :: functionalities/asan/TestReportData.py (742 of 1787)
PASS: lldb-unit :: Utility/./UtilityTests/ConstStringTest.FromMidOfBufferStringRef (743 of 1787)
PASS: lldb-shell :: ObjectFile/MachO/lc_version_min.yaml (744 of 1787)
PASS: lldb-unit :: Utility/./UtilityTests/RegularExpression.CopyAssignment (745 of 1787)
PASS: lldb-unit :: ObjectFile/Breakpad/./ObjectFileBreakpadTests/StackWinRecord.parse (746 of 1787)
PASS: lldb-api :: api/check_public_api_headers/TestPublicAPIHeaders.py (747 of 1787)
PASS: lldb-unit :: Utility/./UtilityTests/StreamTeeTest.CopyConstructor (748 of 1787)
UNSUPPORTED: lldb-shell :: BuildScript/toolchain-msvc.test (749 of 1787)
PASS: lldb-api :: functionalities/breakpoint/breakpoint_by_line_and_column/TestBreakpointByLineAndColumn.py (750 of 1787)
PASS: lldb-shell :: SymbolFile/DWARF/debug-types-missing-signature.test (751 of 1787)
PASS: lldb-api :: commands/frame/var-scope/TestFrameVariableScope.py (752 of 1787)
PASS: lldb-api :: functionalities/data-formatter/data-formatter-stl/libcxx/atomic/TestLibCxxAtomic.py (753 of 1787)
PASS: lldb-api :: commands/expression/import-std-module/shared_ptr/TestSharedPtr.py (754 of 1787)
PASS: lldb-unit :: Utility/./UtilityTests/Flags.Reset (755 of 1787)
PASS: lldb-api :: lang/cpp/nested-class-other-compilation-unit/TestNestedClassWithParentInAnotherCU.py (756 of 1787)
PASS: lldb-api :: functionalities/breakpoint/debugbreak/TestDebugBreak.py (757 of 1787)
PASS: lldb-unit :: Utility/./UtilityTests/BroadcasterTest.EventTypeHasListeners (758 of 1787)
PASS: lldb-api :: commands/expression/anonymous-struct/TestCallUserAnonTypedef.py (759 of 1787)
PASS: lldb-api :: lang/c/find_struct_type/TestFindStructTypes.py (760 of 1787)
PASS: lldb-unit :: Utility/./UtilityTests/StringListTest.LongestCommonPrefixEmpty (761 of 1787)
PASS: lldb-unit :: Utility/./UtilityTests/ScalarTest.SetValueFromCString (762 of 1787)
PASS: lldb-shell :: ObjectFile/ELF/short-build-id.yaml (763 of 1787)
PASS: lldb-shell :: SymbolFile/DWARF/dwarf5-index-is-used.cpp (764 of 1787)
UNSUPPORTED: lldb-api :: tools/lldb-vscode/attach/TestVSCode_attach.py (765 of 1787)
PASS: lldb-api :: functionalities/tail_call_frames/disambiguate_paths_to_common_sink/TestDisambiguatePathsToCommonSink.py (766 of 1787)
PASS: lldb-unit :: ScriptInterpreter/Python/./ScriptInterpreterPythonTests/PythonDataObjectsTest.TestPythonDictionaryToStructuredDictionary (767 of 1787)
PASS: lldb-api :: commands/watchpoints/watchpoint_commands/command/TestWatchpointCommandLLDB.py (768 of 1787)
PASS: lldb-shell :: ObjectFile/Breakpad/sections-trailing-func.test (769 of 1787)
PASS: lldb-api :: functionalities/data-formatter/hexcaps/TestDataFormatterHexCaps.py (770 of 1787)
PASS: lldb-api :: functionalities/thread/thread_specific_break/TestThreadSpecificBreakpoint.py (771 of 1787)
PASS: lldb-api :: functionalities/paths/TestPaths.py (772 of 1787)
PASS: lldb-unit :: Utility/./UtilityTests/UriParserTest.Minimal (773 of 1787)
PASS: lldb-api :: functionalities/data-formatter/data-formatter-stl/libcxx/list/TestDataFormatterLibcxxList.py (774 of 1787)
PASS: lldb-api :: commands/frame/language/TestGuessLanguage.py (775 of 1787)
PASS: lldb-api :: functionalities/data-formatter/data-formatter-globals/TestDataFormatterGlobals.py (776 of 1787)
PASS: lldb-unit :: Process/minidump/./LLDBMinidumpTests/MinidumpParserTest.GetPidWow64 (777 of 1787)
PASS: lldb-unit :: Utility/./UtilityTests/RangeTest.DoesIntersect (778 of 1787)
PASS: lldb-api :: lang/objc/foundation/TestObjCMethods2.py (779 of 1787)
PASS: lldb-unit :: Utility/./UtilityTests/Flags.AllClear (780 of 1787)
UNSUPPORTED: lldb-shell :: SymbolFile/NativePDB/ast-functions-msvc.cpp (781 of 1787)
PASS: lldb-api :: functionalities/data-formatter/data-formatter-stl/libcxx/bitset/TestDataFormatterLibcxxBitset.py (782 of 1787)
PASS: lldb-api :: functionalities/plugins/python_os_plugin/TestPythonOSPlugin.py (783 of 1787)
PASS: lldb-unit :: Target/./TargetTests/ExecutionContextTest.GetByteOrderTarget (784 of 1787)
PASS: lldb-api :: commands/expression/call-function/TestCallStdStringFunction.py (785 of 1787)
UNSUPPORTED: lldb-api :: functionalities/darwin_log/filter/regex/subsystem/TestDarwinLogFilterRegexSubsystem.py (786 of 1787)
PASS: lldb-unit :: Utility/./UtilityTests/CompletionRequest.ShiftArguments (787 of 1787)
PASS: lldb-unit :: Utility/./UtilityTests/StringListTest.ShiftMove (788 of 1787)
PASS: lldb-api :: python_api/findvalue_duplist/TestSBFrameFindValue.py (789 of 1787)
PASS: lldb-unit :: Expression/./ExpressionTests/DiagnosticManagerTest.AppendMessageAttachToLastDiag (790 of 1787)
PASS: lldb-unit :: Utility/./UtilityTests/BinaryStreamTest.PutSLEB128SevenBytes (791 of 1787)
PASS: lldb-api :: lang/cpp/incomplete-types/TestCppIncompleteTypes.py (792 of 1787)
PASS: lldb-api :: functionalities/data-formatter/data-formatter-objc/nsindexpath/TestDataFormatterNSIndexPath.py (793 of 1787)
PASS: lldb-api :: lang/cpp/template-function/TestTemplateFunctions.py (794 of 1787)
PASS: lldb-api :: functionalities/postmortem/elf-core/thread_crash/TestLinuxCoreThreads.py (795 of 1787)
PASS: lldb-api :: functionalities/data-formatter/poarray/TestPrintObjectArray.py (796 of 1787)
PASS: lldb-api :: lang/cpp/breakpoint_in_member_func_w_non_primitive_params/TestBreakpointInMemberFuncWNonPrimitiveParams.py (797 of 1787)
PASS: lldb-api :: sample_test/TestSampleInlineTest.py (798 of 1787)
PASS: lldb-unit :: ScriptInterpreter/Python/./ScriptInterpreterPythonTests/PythonDataObjectsTest.TestPythonString (799 of 1787)
PASS: lldb-unit :: Utility/./UtilityTests/ArchSpecTest.TestParseMachCPUDashSubtypeTripleSimple (800 of 1787)
PASS: lldb-api :: functionalities/thread/backtrace_all/TestBacktraceAll.py (801 of 1787)
PASS: lldb-unit :: Utility/./UtilityTests/BroadcasterTest.BroadcastEvent (802 of 1787)
PASS: lldb-unit :: Utility/./UtilityTests/StreamTest.PutCString (803 of 1787)
PASS: lldb-api :: functionalities/thread/step_until/TestStepUntil.py (804 of 1787)
PASS: lldb-unit :: UnwindAssembly/x86/./UnwindAssemblyx86Tests/Testx86AssemblyInspectionEngine.TestStackRealignMSVC_i386 (805 of 1787)
PASS: lldb-unit :: Language/Highlighting/./HighlighterTests/HighlighterTest.ClangComments (806 of 1787)
UNSUPPORTED: lldb-api :: lang/objc/rdar-12408181/TestRdar12408181.py (807 of 1787)
PASS: lldb-shell :: SymbolFile/DWARF/split-dwarf-inlining.cpp (808 of 1787)
PASS: lldb-unit :: Process/gdb-remote/./ProcessGdbRemoteTests/GDBRemoteCommunicationServerTest.SendErrorResponse_UnimplementedError (809 of 1787)
PASS: lldb-unit :: Utility/./UtilityTests/EventTest.DumpEventDataBytes (810 of 1787)
PASS: lldb-shell :: Driver/TestNoUseColor.test (811 of 1787)
PASS: lldb-unit :: Utility/./UtilityTests/ArgsTest.ReplaceArgumentAtIndexOutOfRange (812 of 1787)
PASS: lldb-unit :: Utility/./UtilityTests/StringExtractorTest.GetHexBytesAvail_Partial (813 of 1787)
PASS: lldb-api :: commands/expression/formatters/TestFormatters.py (814 of 1787)
PASS: lldb-unit :: Utility/./UtilityTests/StringExtractorTest.GetHexU8_Underflow2 (815 of 1787)
PASS: lldb-unit :: debugserver/./debugserverTests/RNBSocket.LoopBackListenIPv4 (816 of 1787)
UNSUPPORTED: lldb-shell :: Register/x86-zmm-write.test (817 of 1787)
PASS: lldb-api :: lang/cpp/call-function/TestCallCPPFunction.py (818 of 1787)
PASS: lldb-shell :: Minidump/Windows/Sigsegv/sigsegv.test (819 of 1787)
PASS: lldb-api :: functionalities/thread/exit_during_break/TestExitDuringBreak.py (820 of 1787)
PASS: lldb-unit :: Utility/./UtilityTests/VMRange.CollectionContains (821 of 1787)
PASS: lldb-unit :: Symbol/./SymbolTests/PostfixExpression.ParseOneExpression (822 of 1787)
PASS: lldb-api :: functionalities/data-formatter/pyobjsynthprovider/TestPyObjSynthProvider.py (823 of 1787)
PASS: lldb-unit :: Process/gdb-remote/./ProcessGdbRemoteTests/GDBRemoteClientBaseTest.SendContinueAndWait (824 of 1787)
PASS: lldb-api :: commands/expression/import-std-module/weak_ptr/TestWeakPtr.py (825 of 1787)
PASS: lldb-api :: commands/expression/dont_allow_jit/TestAllowJIT.py (826 of 1787)
PASS: lldb-unit :: UnwindAssembly/x86/./UnwindAssemblyx86Tests/Testx86AssemblyInspectionEngine.TestSimple32bitFrameFunction (827 of 1787)
PASS: lldb-unit :: Process/gdb-remote/./ProcessGdbRemoteTests/GDBRemoteCommunicationClientTest.SendGetDataPacket (828 of 1787)
PASS: lldb-unit :: Utility/./UtilityTests/RecordReplayTest.InstrumentedBarRef (829 of 1787)
PASS: lldb-unit :: Utility/./UtilityTests/FileSpecTest.GetNormalizedPath (830 of 1787)
PASS: lldb-unit :: Utility/./UtilityTests/StringListTest.JoinEmpty (831 of 1787)
PASS: lldb-unit :: Utility/./UtilityTests/StringListTest.GetMaxStringLengthIncreasingSize (832 of 1787)
PASS: lldb-unit :: Utility/./UtilityTests/AnsiTerminal.Empty (833 of 1787)
PASS: lldb-unit :: Utility/./UtilityTests/UriParserTest.BracketedHostnamePort (834 of 1787)
PASS: lldb-shell :: ObjectFile/PECOFF/basic-info-arm64.yaml (835 of 1787)
PASS: lldb-api :: macosx/load-kext/TestLoadKext.py (836 of 1787)
PASS: lldb-api :: functionalities/thread/concurrent_events/TestConcurrentTwoBreakpointThreads.py (837 of 1787)
PASS: lldb-api :: lang/cpp/offsetof/TestOffsetofCpp.py (838 of 1787)
PASS: lldb-api :: functionalities/thread/step_out/TestThreadStepOut.py (839 of 1787)
PASS: lldb-unit :: Utility/./UtilityTests/DataExtractorTest.GetMaxU64 (840 of 1787)
UNSUPPORTED: lldb-shell :: Register/aarch64-gp-read.test (841 of 1787)
PASS: lldb-api :: lang/objc/orderedset/TestOrderedSet.py (842 of 1787)
PASS: lldb-shell :: SymbolFile/Breakpad/line-table-mixed-path-styles.test (843 of 1787)
PASS: lldb-unit :: Utility/./UtilityTests/ScalarTest.ExtractBitfield (844 of 1787)
PASS: lldb-unit :: Utility/./UtilityTests/LogChannelEnabledTest.log_options (845 of 1787)
PASS: lldb-api :: functionalities/thread/concurrent_events/TestConcurrentDelayedCrashWithBreakpointWatchpoint.py (846 of 1787)
PASS: lldb-unit :: Process/minidump/./LLDBMinidumpTests/MinidumpParserTest.GetPidWindows (847 of 1787)
PASS: lldb-api :: functionalities/data-formatter/data-formatter-skip-summary/TestDataFormatterSkipSummary.py (848 of 1787)
PASS: lldb-unit :: UnwindAssembly/x86/./UnwindAssemblyx86Tests/Testx86AssemblyInspectionEngine.TestPushR13 (849 of 1787)
PASS: lldb-unit :: Expression/./ExpressionTests/CppModuleConfigurationTest.LibCppV2 (850 of 1787)
PASS: lldb-unit :: Utility/./UtilityTests/StringListTest.JoinNonSpace (851 of 1787)
PASS: lldb-unit :: Process/minidump/./LLDBMinidumpTests/MinidumpParserTest.GetMiscInfoWindows (852 of 1787)
PASS: lldb-unit :: Utility/./UtilityTests/CompletionRequest.DuplicateFiltering (853 of 1787)
PASS: lldb-shell :: SymbolFile/DWARF/dir-separator-no-comp-dir.s (854 of 1787)
PASS: lldb-api :: python_api/function_symbol/TestDisasmAPI.py (855 of 1787)
UNSUPPORTED: lldb-api :: functionalities/data-formatter/data-formatter-stl/libstdcpp/string/TestDataFormatterStdString.py (856 of 1787)
PASS: lldb-api :: functionalities/tsan/global_location/TestTsanGlobalLocation.py (857 of 1787)
PASS: lldb-unit :: Utility/./UtilityTests/DataExtractorTest.PeekData (858 of 1787)
PASS: lldb-api :: lang/objc/unicode-string/TestUnicodeString.py (859 of 1787)
PASS: lldb-unit :: Utility/./UtilityTests/UUIDTest.SetFromStringRef (860 of 1787)
PASS: lldb-api :: commands/watchpoints/watchpoint_set_command/TestWatchLocationWithWatchSet.py (861 of 1787)
PASS: lldb-api :: commands/expression/radar_8638051/Test8638051.py (862 of 1787)
PASS: lldb-api :: python_api/symbol-context/two-files/TestSymbolContextTwoFiles.py (863 of 1787)
XFAIL: lldb-shell :: Register/x86-mm-xmm-write.test (864 of 1787)
PASS: lldb-unit :: Utility/./UtilityTests/OptionsWithRawTest.SingleWordSuffix (865 of 1787)
UNSUPPORTED: lldb-api :: macosx/macabi/TestMacABImacOSFramework.py (866 of 1787)
PASS: lldb-unit :: Utility/./UtilityTests/FileSpecTest.IsRelative (867 of 1787)
PASS: lldb-api :: commands/command/delete/TestCommandDelete.py (868 of 1787)
PASS: lldb-unit :: Utility/./UtilityTests/OptionsWithRawTest.SingleWhitespaceInput (869 of 1787)
PASS: lldb-shell :: ObjectFile/ELF/PT_LOAD-overlap.yaml (870 of 1787)
PASS: lldb-unit :: Editline/./EditlineTests/EditlineTestFixture.EditlineReceivesSingleLineText (871 of 1787)
PASS: lldb-unit :: UnwindAssembly/x86/./UnwindAssemblyx86Tests/Testx86AssemblyInspectionEngine.Testi386IgnoredRegisters (872 of 1787)
PASS: lldb-api :: commands/expression/call-function/TestCallStopAndContinue.py (873 of 1787)
PASS: lldb-api :: functionalities/gdb_remote_client/TestGDBRemoteClient.py (874 of 1787)
PASS: lldb-api :: lang/cpp/limit-debug-info/TestWithLimitDebugInfo.py (875 of 1787)
PASS: lldb-unit :: Utility/./UtilityTests/ScalarTest.Equality (876 of 1787)
UNSUPPORTED: lldb-api :: functionalities/thread/state/TestThreadStates.py (877 of 1787)
PASS: lldb-unit :: Utility/./UtilityTests/Flags.IsClear (878 of 1787)
PASS: lldb-unit :: Target/./TargetTests/ExecutionContextTest.GetByteOrderProcess (879 of 1787)
PASS: lldb-unit :: Utility/./UtilityTests/StringListTest.SetSize (880 of 1787)
PASS: lldb-shell :: Minidump/fb-dump.test (881 of 1787)
PASS: lldb-shell :: Minidump/breakpad-symbols.test (882 of 1787)
PASS: lldb-unit :: ObjectFile/PECOFF/./ObjectFilePECOFFTests/PECallFrameInfoTest.Chained_eh (883 of 1787)
PASS: lldb-unit :: Process/gdb-remote/./ProcessGdbRemoteTests/GDBRemoteCommunicationClientTest.SendGetTraceConfigPacket (884 of 1787)
PASS: lldb-unit :: Utility/./UtilityTests/ConstStringTest.CompareConstString (885 of 1787)
PASS: lldb-unit :: Utility/./UtilityTests/ProcessInstanceInfo.DumpTable (886 of 1787)
PASS: lldb-api :: tools/lldb-server/TestGdbRemoteAttach.py (887 of 1787)
PASS: lldb-unit :: Utility/./UtilityTests/StateTest.Formatv (888 of 1787)
PASS: lldb-unit :: Utility/./UtilityTests/StreamTest.ShiftOperatorStrings (889 of 1787)
PASS: lldb-unit :: Utility/./UtilityTests/StreamTeeTest.Constructor2Streams (890 of 1787)
PASS: lldb-api :: functionalities/data-formatter/data-formatter-objc/TestDataFormatterObjCNSBundle.py (891 of 1787)
PASS: lldb-unit :: Expression/./ExpressionTests/CppModuleConfigurationTest.LinuxLocalLibCpp (892 of 1787)
PASS: lldb-unit :: UnwindAssembly/x86/./UnwindAssemblyx86Tests/Testx86AssemblyInspectionEngine.TestPushEBP (893 of 1787)
PASS: lldb-unit :: Utility/./UtilityTests/UriParserTest.SchemeHostSeparator (894 of 1787)
PASS: lldb-unit :: Language/Highlighting/./HighlighterTests/HighlighterTest.Keywords (895 of 1787)
PASS: lldb-unit :: Process/minidump/./LLDBMinidumpTests/MinidumpParserTest.GetExceptionStream (896 of 1787)
PASS: lldb-unit :: Utility/./UtilityTests/StringExtractorTest.GetHexBytesAvail_FullString (897 of 1787)
PASS: lldb-api :: commands/expression/inline-namespace/TestInlineNamespace.py (898 of 1787)
PASS: lldb-unit :: Expression/./ExpressionTests/CppModuleConfigurationTest.Linux (899 of 1787)
PASS: lldb-unit :: Utility/./UtilityTests/OptionsWithRawTest.UnterminatedQuote (900 of 1787)
PASS: lldb-unit :: Expression/./ExpressionTests/DWARFExpression.DW_OP_convert (901 of 1787)
PASS: lldb-unit :: Utility/./UtilityTests/BinaryStreamTest.PutULEB128SevenBytes (902 of 1787)
PASS: lldb-unit :: Core/./LLDBCoreTests/StreamCallbackTest.Callback (903 of 1787)
PASS: lldb-unit :: SymbolFile/NativePDB/./SymbolFileNativePDBTests/PDBFPOProgramToDWARFExpressionTests.MissingTargetRegister (904 of 1787)
PASS: lldb-shell :: SymbolFile/DWARF/debug-names-compressed.cpp (905 of 1787)
PASS: lldb-api :: commands/command/script/import/TestImport.py (906 of 1787)
UNSUPPORTED: lldb-shell :: Register/x86-ymm-write.test (907 of 1787)
PASS: lldb-unit :: ScriptInterpreter/Python/./ScriptInterpreterPythonTests/PythonDataObjectsTest.TestPythonDictionaryManipulation (908 of 1787)
PASS: lldb-unit :: Utility/./UtilityTests/GeneratorTest.GetOrCreate (909 of 1787)
PASS: lldb-unit :: ScriptInterpreter/Python/./ScriptInterpreterPythonTests/PythonDataObjectsTest.TestPythonBytes (910 of 1787)
PASS: lldb-api :: functionalities/thread/concurrent_events/TestConcurrentTwoWatchpointsOneDelayBreakpoint.py (911 of 1787)
PASS: lldb-unit :: Utility/./UtilityTests/LogChannelTest.List (912 of 1787)
PASS: lldb-unit :: Utility/./UtilityTests/ScalarTest.APIntConstructor (913 of 1787)
PASS: lldb-unit :: Utility/./UtilityTests/BinaryStreamTest.PutULEB128NineBytes (914 of 1787)
PASS: lldb-api :: commands/expression/issue_11588/Test11588.py (915 of 1787)
UNSUPPORTED: lldb-api :: functionalities/thread/thread_specific_break_plus_condition/TestThreadSpecificBpPlusCondition.py (916 of 1787)
PASS: lldb-unit :: Utility/./UtilityTests/FileSpecTest.EqualSeparator (917 of 1787)
PASS: lldb-unit :: Utility/./UtilityTests/FileSpecTest.CopyByAppendingPathComponent (918 of 1787)
PASS: lldb-shell :: Minidump/dump-all.test (919 of 1787)
PASS: lldb-unit :: Utility/./UtilityTests/StringExtractorTest.GetNameColonValueContainsColon (920 of 1787)
PASS: lldb-api :: functionalities/history/TestHistoryRecall.py (921 of 1787)
PASS: lldb-api :: python_api/hello_world/TestHelloWorld.py (922 of 1787)
PASS: lldb-api :: functionalities/ubsan/user-expression/TestUbsanUserExpression.py (923 of 1787)
PASS: lldb-unit :: Host/./HostTests/FileSystemTest.EnumerateDirectory (924 of 1787)
PASS: lldb-api :: functionalities/data-formatter/data-formatter-objc/TestDataFormatterObjCNSDate.py (925 of 1787)
PASS: lldb-api :: commands/log/basic/TestLogging.py (926 of 1787)
PASS: lldb-api :: functionalities/data-formatter/data-formatter-advanced/TestDataFormatterAdv.py (927 of 1787)
PASS: lldb-shell :: Quit/TestQuitExitCodeHexA.test (928 of 1787)
PASS: lldb-unit :: ObjectFile/Breakpad/./ObjectFileBreakpadTests/LineRecord.parse (929 of 1787)
PASS: lldb-api :: functionalities/thread/concurrent_events/TestConcurrentTwoBreakpointsOneWatchpoint.py (930 of 1787)
PASS: lldb-unit :: Language/CPlusPlus/./LanguageCPlusPlusTests/CPlusPlusLanguage.ExtractContextAndIdentifier (931 of 1787)
PASS: lldb-unit :: Utility/./UtilityTests/StringExtractorTest.GetHexBytesAvail (932 of 1787)
PASS: lldb-api :: terminal/TestSTTYBeforeAndAfter.py (933 of 1787)
PASS: lldb-unit :: Host/./HostTests/NativeProcessProtocolTest.ReadCStringFromMemory_CrossPageBoundary (934 of 1787)
PASS: lldb-unit :: ScriptInterpreter/Python/./ScriptInterpreterPythonTests/PythonDataObjectsTest.TestInstanceNameResolutionNoDot (935 of 1787)
PASS: lldb-api :: functionalities/data-formatter/compactvectors/TestCompactVectors.py (936 of 1787)
PASS: lldb-api :: functionalities/target-new-solib-notifications/TestModuleLoadedNotifys.py (937 of 1787)
PASS: lldb-api :: lang/cpp/global_operators/TestCppGlobalOperators.py (938 of 1787)
PASS: lldb-api :: functionalities/data-formatter/data-formatter-stl/libcxx/multimap/TestDataFormatterLibccMultiMap.py (939 of 1787)
UNSUPPORTED: lldb-api :: python_api/disassemble-raw-data/TestDisassemble_VST1_64.py (940 of 1787)
PASS: lldb-api :: python_api/sbvalue_persist/TestSBValuePersist.py (941 of 1787)
PASS: lldb-api :: lang/cpp/namespace/TestNamespaceLookup.py (942 of 1787)
PASS: lldb-api :: python_api/value/TestValueAPI.py (943 of 1787)
PASS: lldb-api :: lang/cpp/wchar_t/TestCxxWCharT.py (944 of 1787)
PASS: lldb-api :: lang/objc/hidden-ivars/TestHiddenIvars.py (945 of 1787)
PASS: lldb-api :: lang/cpp/char8_t/TestCxxChar8_t.py (946 of 1787)
PASS: lldb-unit :: Process/gdb-remote/./ProcessGdbRemoteTests/GDBRemoteCommunicationClientTest.TestPacketSpeedJSON (947 of 1787)
UNSUPPORTED: lldb-api :: functionalities/darwin_log/source/debug/TestDarwinLogSourceDebug.py (948 of 1787)
PASS: lldb-unit :: Utility/./UtilityTests/StreamTeeTest.GetStreamAtIndexOutOfBounds (949 of 1787)
PASS: lldb-unit :: ScriptInterpreter/Python/./ScriptInterpreterPythonTests/PythonDataObjectsTest.TestPythonDictionaryValueEquality (950 of 1787)
PASS: lldb-api :: commands/platform/basic/TestPlatformPython.py (951 of 1787)
PASS: lldb-api :: lang/objc/real-definition/TestRealDefinition.py (952 of 1787)
PASS: lldb-unit :: UnwindAssembly/x86/./UnwindAssemblyx86Tests/Testx86AssemblyInspectionEngine.TestPopEBP (953 of 1787)
PASS: lldb-unit :: Utility/./UtilityTests/VASprintfTest.EncodingError (954 of 1787)
UNSUPPORTED: lldb-api :: linux/add-symbols/TestTargetSymbolsAddCommand.py (955 of 1787)
PASS: lldb-api :: lang/c/const_variables/TestConstVariables.py (956 of 1787)
PASS: lldb-unit :: Process/minidump/./LLDBMinidumpTests/MinidumpParserTest.InvalidMinidump (957 of 1787)
PASS: lldb-unit :: Symbol/./SymbolTests/TestClangASTContext.TestRemoveFastQualifiers (958 of 1787)
PASS: lldb-api :: commands/expression/rdar42038760/TestScalarURem.py (959 of 1787)
UNSUPPORTED: lldb-shell :: SymbolFile/PDB/type-quals.test (960 of 1787)
PASS: lldb-unit :: ScriptInterpreter/Python/./ScriptInterpreterPythonTests/PythonExceptionStateTest.TestAutoRestoreChanged (961 of 1787)
PASS: lldb-api :: commands/expression/import-std-module/unique_ptr/TestUniquePtr.py (962 of 1787)
PASS: lldb-unit :: Utility/./UtilityTests/DataExtractorTest.GetCStrAtEnd (963 of 1787)
PASS: lldb-unit :: Host/./HostTests/NativeProcessProtocolTest.SetBreakpointFailRead (964 of 1787)
PASS: lldb-api :: lang/objc/blocks/TestObjCIvarsInBlocks.py (965 of 1787)
PASS: lldb-unit :: Utility/./UtilityTests/StringExtractorTest.GetHexBytes_OddPair (966 of 1787)
PASS: lldb-api :: commands/expression/options/TestExprOptions.py (967 of 1787)
PASS: lldb-unit :: Utility/./UtilityTests/RangeTest.ContainsEndInclusive (968 of 1787)
PASS: lldb-unit :: Symbol/./SymbolTests/TestClangASTContext.TestUnifyAccessSpecifiers (969 of 1787)
PASS: lldb-unit :: Utility/./UtilityTests/UUIDTest.StringConverion (970 of 1787)
PASS: lldb-api :: lang/cpp/dynamic-value/TestDynamicValue.py (971 of 1787)
PASS: lldb-unit :: Language/Highlighting/./HighlighterTests/HighlighterTest.ClangEmptyInput (972 of 1787)
UNSUPPORTED: lldb-shell :: Expr/TestIRMemoryMapWindows.test (973 of 1787)
PASS: lldb-api :: lang/cpp/char1632_t/TestChar1632T.py (974 of 1787)
PASS: lldb-unit :: ScriptInterpreter/Python/./ScriptInterpreterPythonTests/PythonDataObjectsTest.TestPythonListValueEquality (975 of 1787)
PASS: lldb-unit :: Host/./HostTests/FileSystemTest.Readable (976 of 1787)
PASS: lldb-api :: functionalities/non-overlapping-index-variable-i/TestIndexVariable.py (977 of 1787)
PASS: lldb-api :: commands/watchpoints/step_over_watchpoint/TestStepOverWatchpoint.py (978 of 1787)
PASS: lldb-unit :: Language/Highlighting/./HighlighterTests/HighlighterTest.ClangStringLiterals (979 of 1787)
UNSUPPORTED: lldb-shell :: Unwind/unwind-plan-dwarf-dump.test (980 of 1787)
PASS: lldb-api :: commands/expression/import-std-module/sysroot/TestStdModuleSysroot.py (981 of 1787)
PASS: lldb-api :: functionalities/thread/create_after_attach/TestCreateAfterAttach.py (982 of 1787)
PASS: lldb-api :: lang/cpp/scope/TestCppScope.py (983 of 1787)
PASS: lldb-api :: functionalities/thread/backtrace_limit/TestBacktraceLimit.py (984 of 1787)
PASS: lldb-unit :: Language/Highlighting/./HighlighterTests/HighlighterTest.ClangUnterminatedString (985 of 1787)
PASS: lldb-unit :: Utility/./UtilityTests/StreamTeeTest.Write (986 of 1787)
PASS: lldb-unit :: Utility/./UtilityTests/StringListTest.LongestCommonPrefixDuplicateElement (987 of 1787)
PASS: lldb-api :: functionalities/breakpoint/breakpoint_command/TestBreakpointCommandsFromPython.py (988 of 1787)
PASS: lldb-api :: lang/cpp/static_methods/TestCPPStaticMethods.py (989 of 1787)
PASS: lldb-unit :: Utility/./UtilityTests/RangeTest.SizeTypes (990 of 1787)
PASS: lldb-unit :: Utility/./UtilityTests/ArgsTest.TestSingleArgWithQuotedSpace (991 of 1787)
PASS: lldb-api :: functionalities/thread/exit_during_step/TestExitDuringStep.py (992 of 1787)
UNSUPPORTED: lldb-api :: functionalities/data-formatter/data-formatter-stl/libstdcpp/unique_ptr/TestDataFormatterStdUniquePtr.py (993 of 1787)
PASS: lldb-shell :: SymbolFile/DWARF/find-method-local-struct.cpp (994 of 1787)
PASS: lldb-unit :: Expression/./ExpressionTests/ClangHostTest.ComputeClangResourceDirectory (995 of 1787)
PASS: lldb-api :: lang/objc/radar-9691614/TestObjCMethodReturningBOOL.py (996 of 1787)
UNSUPPORTED: lldb-api :: commands/register/register/intel_xtended_registers/mpx_bound_violation/TestBoundViolation.py (997 of 1787)
PASS: lldb-api :: macosx/universal/TestUniversal.py (998 of 1787)
PASS: lldb-unit :: Utility/./UtilityTests/StreamTeeTest.Flush (999 of 1787)
PASS: lldb-api :: functionalities/data-formatter/parray/TestPrintArray.py (1000 of 1787)
PASS: lldb-unit :: Utility/./UtilityTests/StringListTest.InsertStringAtIndexMove (1001 of 1787)
PASS: lldb-unit :: Utility/./UtilityTests/ArgsTest.ReplaceArgumentAtIndexLonger (1002 of 1787)
PASS: lldb-unit :: SymbolFile/DWARF/./SymbolFileDWARFTests/SymbolFileDWARFTests.TestAbbrevOrder1Start1 (1003 of 1787)
PASS: lldb-unit :: UnwindAssembly/x86/./UnwindAssemblyx86Tests/Testx86AssemblyInspectionEngine.TestPushR14 (1004 of 1787)
PASS: lldb-unit :: Utility/./UtilityTests/RangeTest.ContainsAddr (1005 of 1787)
PASS: lldb-unit :: Utility/./UtilityTests/ScalarTest.GetBytes (1006 of 1787)
PASS: lldb-api :: functionalities/thread/concurrent_events/TestConcurrentWatchBreak.py (1007 of 1787)
PASS: lldb-api :: tools/lldb-server/commandline/TestStubReverseConnect.py (1008 of 1787)
PASS: lldb-shell :: Quit/TestQuitExitCodeHex0.test (1009 of 1787)
PASS: lldb-api :: functionalities/postmortem/elf-core/gcore/TestGCore.py (1010 of 1787)
PASS: lldb-unit :: Utility/./UtilityTests/UriParserTest.BracketedHostname (1011 of 1787)
PASS: lldb-unit :: Utility/./UtilityTests/ArgsTest.ReplaceArgumentAtIndexEqual (1012 of 1787)
UNSUPPORTED: lldb-shell :: SymbolFile/PDB/variables-locations.test (1013 of 1787)
PASS: lldb-api :: lang/c/array_types/TestArrayTypes.py (1014 of 1787)
PASS: lldb-unit :: Core/./LLDBCoreTests/RichManglingContextTest.SwitchProvider (1015 of 1787)
UNSUPPORTED: lldb-api :: functionalities/thread/break_after_join/TestBreakAfterJoin.py (1016 of 1787)
PASS: lldb-unit :: Target/./TargetTests/PathMappingListTest.RelativeTests (1017 of 1787)
PASS: lldb-unit :: Expression/./ExpressionTests/DiagnosticManagerTest.PutStringSeverities (1018 of 1787)
PASS: lldb-api :: commands/expression/cast_int_to_anonymous_enum/TestCastIntToAnonymousEnum.py (1019 of 1787)
PASS: lldb-unit :: Utility/./UtilityTests/FileSpecTest.AppendPathComponent (1020 of 1787)
PASS: lldb-api :: functionalities/breakpoint/scripted_bkpt/TestScriptedResolver.py (1021 of 1787)
PASS: lldb-unit :: Utility/./UtilityTests/StringLexerTest.HasAtLeast (1022 of 1787)
PASS: lldb-unit :: ObjectFile/ELF/./ObjectFileELFTests/ObjectFileELFTest.GetSymtab_NoSymEntryPointArmThumbAddressClass (1023 of 1787)
PASS: lldb-api :: functionalities/inferior-crashing/TestInferiorCrashing.py (1024 of 1787)
PASS: lldb-api :: functionalities/tsan/thread_numbers/TestTsanThreadNumbers.py (1025 of 1787)
PASS: lldb-unit :: Expression/./ExpressionTests/DiagnosticManagerTest.PutString (1026 of 1787)
PASS: lldb-unit :: Utility/./UtilityTests/StringExtractorTest.GetHexU8_Exact (1027 of 1787)
PASS: lldb-unit :: Utility/./UtilityTests/RegularExpression.Empty (1028 of 1787)
PASS: lldb-api :: api/multiple-targets/TestMultipleTargets.py (1029 of 1787)
PASS: lldb-unit :: Symbol/./SymbolTests/Type.CompilerContextPattern (1030 of 1787)
PASS: lldb-api :: functionalities/data-formatter/data-formatter-disabling/TestDataFormatterDisabling.py (1031 of 1787)
PASS: lldb-unit :: Utility/./UtilityTests/UUIDTest.Validity (1032 of 1787)
PASS: lldb-unit :: Host/./HostTests/NativeProcessProtocolTest.SetBreakpoint (1033 of 1787)
PASS: lldb-unit :: Utility/./UtilityTests/RangeTest.Slide (1034 of 1787)
PASS: lldb-shell :: SymbolFile/DWARF/dwarf5_locations.s (1035 of 1787)
PASS: lldb-api :: api/command-return-object/TestSBCommandReturnObject.py (1036 of 1787)
PASS: lldb-api :: functionalities/data-formatter/data-formatter-stl/libcxx/forward_list/TestDataFormatterLibcxxForwardList.py (1037 of 1787)
PASS: lldb-api :: commands/expression/call-overridden-method/TestCallOverriddenMethod.py (1038 of 1787)
PASS: lldb-api :: functionalities/gdb_remote_client/TestThreadSelectionBug.py (1039 of 1787)
PASS: lldb-shell :: SymbolFile/DWARF/debug_aranges-empty-section.s (1040 of 1787)
PASS: lldb-unit :: Process/minidump/./LLDBMinidumpTests/MinidumpParserTest.GetMemoryRegionInfoFromMemory64List (1041 of 1787)
PASS: lldb-api :: lang/cpp/class_types/TestClassTypes.py (1042 of 1787)
PASS: lldb-unit :: Language/CPlusPlus/./LanguageCPlusPlusTests/CPlusPlusLanguage.FindAlternateFunctionManglings (1043 of 1787)
PASS: lldb-unit :: Host/./HostTests/SocketTest.UDPConnect (1044 of 1787)
PASS: lldb-api :: functionalities/breakpoint/address_breakpoints/TestBadAddressBreakpoints.py (1045 of 1787)
PASS: lldb-api :: functionalities/ubsan/basic/TestUbsanBasic.py (1046 of 1787)
UNSUPPORTED: lldb-shell :: SymbolFile/PDB/expressions.test (1047 of 1787)
PASS: lldb-unit :: Host/./HostTests/FileSystemTest.OpenErrno (1048 of 1787)
UNSUPPORTED: lldb-shell :: Register/aarch64-fp-read.test (1049 of 1787)
PASS: lldb-api :: commands/command/invalid-args/TestInvalidArgsCommand.py (1050 of 1787)
PASS: lldb-unit :: Utility/./UtilityTests/CompletionRequest.FakeLastArg (1051 of 1787)
PASS: lldb-api :: lang/c/forward/TestForwardDeclaration.py (1052 of 1787)
PASS: lldb-unit :: Process/gdb-remote/./ProcessGdbRemoteTests/GDBRemoteClientBaseTest.SendContinueDelegateStructuredDataReceipt (1053 of 1787)
PASS: lldb-unit :: Utility/./UtilityTests/StringExtractorTest.GetHexBytesAvail_OddPair2 (1054 of 1787)
PASS: lldb-api :: functionalities/set-data/TestSetData.py (1055 of 1787)
PASS: lldb-api :: lang/objc/objc-baseclass-sbtype/TestObjCBaseClassSBType.py (1056 of 1787)
PASS: lldb-api :: macosx/nslog/TestDarwinNSLogOutput.py (1057 of 1787)
PASS: lldb-unit :: Utility/./UtilityTests/UriParserTest.Empty (1058 of 1787)
PASS: lldb-unit :: Expression/./ExpressionTests/DiagnosticManagerTest.FixedExpression (1059 of 1787)
PASS: lldb-api :: macosx/indirect_symbol/TestIndirectSymbols.py (1060 of 1787)
PASS: lldb-shell :: SymbolFile/DWARF/debug_rnglists.s (1061 of 1787)
PASS: lldb-unit :: Expression/./ExpressionTests/DiagnosticManagerTest.AppendMessageNoDiag (1062 of 1787)
PASS: lldb-unit :: Target/./TargetTests/ModuleCacheTest.GetAndPutUuidExists (1063 of 1787)
PASS: lldb-api :: functionalities/breakpoint/breakpoint_options/TestBreakpointOptions.py (1064 of 1787)
PASS: lldb-unit :: Utility/./UtilityTests/StringExtractorTest.InitMisc (1065 of 1787)
PASS: lldb-unit :: Utility/./UtilityTests/StringListTest.InsertStringAtIndexStdString (1066 of 1787)
UNSUPPORTED: lldb-api :: commands/expression/multiline-completion/TestMultilineCompletion.py (1067 of 1787)
PASS: lldb-unit :: Utility/./UtilityTests/StatusTest.ErrorConversion (1068 of 1787)
PASS: lldb-unit :: Language/Highlighting/./HighlighterTests/HighlighterTest.ClangCursorPos (1069 of 1787)
PASS: lldb-unit :: Utility/./UtilityTests/Predicate.WaitForValueNotEqualTo (1070 of 1787)
PASS: lldb-api :: functionalities/tail_call_frames/unambiguous_sequence/TestUnambiguousTailCalls.py (1071 of 1787)
PASS: lldb-api :: lang/cpp/signed_types/TestSignedTypes.py (1072 of 1787)
PASS: lldb-api :: functionalities/dynamic_value_child_count/TestDynamicValueChildCount.py (1073 of 1787)
PASS: lldb-unit :: Utility/./UtilityTests/ProcessInstanceInfo.DumpTable_invalidUID (1074 of 1787)
PASS: lldb-api :: functionalities/breakpoint/inlined_breakpoints/TestInlinedBreakpoints.py (1075 of 1787)
PASS: lldb-api :: functionalities/gdb_remote_client/TestArmRegisterDefinition.py (1076 of 1787)
PASS: lldb-api :: lang/c/strings/TestCStrings.py (1077 of 1787)
PASS: lldb-unit :: UnwindAssembly/x86/./UnwindAssemblyx86Tests/Testx86AssemblyInspectionEngine.TestSpArithx86_64Augmented (1078 of 1787)
PASS: lldb-unit :: Utility/./UtilityTests/StringListTest.AppendStringMove (1079 of 1787)
PASS: lldb-unit :: Utility/./UtilityTests/CompletionRequest.TestCompletionOwnership (1080 of 1787)
PASS: lldb-api :: lang/c/blocks/TestBlocks.py (1081 of 1787)
PASS: lldb-unit :: Utility/./UtilityTests/StreamTest.PutHex32ByteOrderBig (1082 of 1787)
PASS: lldb-unit :: Process/minidump/./LLDBMinidumpTests/MinidumpParserTest.GetMiscInfo_no_stream (1083 of 1787)
PASS: lldb-unit :: Host/./HostTests/SocketTest.TCPListen0GetPort (1084 of 1787)
PASS: lldb-shell :: Python/crashlog.test (1085 of 1787)
PASS: lldb-unit :: Utility/./UtilityTests/StreamTest.PutCStringWithStringRef (1086 of 1787)
UNSUPPORTED: lldb-api :: functionalities/breakpoint/breakpoint_in_delayslot/TestAvoidBreakpointInDelaySlot.py (1087 of 1787)
PASS: lldb-api :: functionalities/breakpoint/objc/TestObjCBreakpoints.py (1088 of 1787)
PASS: lldb-unit :: Utility/./UtilityTests/VMRange.ContainsRange (1089 of 1787)
PASS: lldb-unit :: Host/./HostTests/ConnectionFileDescriptorTest.TCPGetURIv6 (1090 of 1787)
PASS: lldb-unit :: UnwindAssembly/x86/./UnwindAssemblyx86Tests/Testx86AssemblyInspectionEngine.TestPopR15 (1091 of 1787)
PASS: lldb-unit :: ObjectFile/Breakpad/./ObjectFileBreakpadTests/InfoRecord.parse (1092 of 1787)
PASS: lldb-unit :: Utility/./UtilityTests/FileSpecTest.EqualDotsPosix (1093 of 1787)
PASS: lldb-shell :: SymbolFile/DWARF/find-variable-file.cpp (1094 of 1787)
PASS: lldb-api :: lang/cpp/dynamic-value-same-basename/TestDynamicValueSameBase.py (1095 of 1787)
PASS: lldb-unit :: Utility/./UtilityTests/OptionsWithRawTest.QuotedSuffix (1096 of 1787)
PASS: lldb-api :: commands/frame/diagnose/dereference-function-return/TestDiagnoseDereferenceFunctionReturn.py (1097 of 1787)
PASS: lldb-unit :: Expression/./ExpressionTests/DiagnosticManagerTest.GetStringNoDiags (1098 of 1787)
PASS: lldb-unit :: ObjectFile/Breakpad/./ObjectFileBreakpadTests/ModuleRecord.parse (1099 of 1787)
PASS: lldb-api :: functionalities/thread/concurrent_events/TestConcurrentCrashWithBreak.py (1100 of 1787)
PASS: lldb-unit :: Utility/./UtilityTests/StringListTest.ForRangeEmpty (1101 of 1787)
UNSUPPORTED: lldb-api :: functionalities/darwin_log/filter/regex/message/TestDarwinLogFilterRegexMessage.py (1102 of 1787)
PASS: lldb-unit :: Process/gdb-remote/./ProcessGdbRemoteTests/GDBRemoteCommunicationClientTest.GetModulesInfo_UUID20 (1103 of 1787)
PASS: lldb-unit :: Signals/./SignalsTests/UnixSignalsTest.GetFilteredSignals (1104 of 1787)
PASS: lldb-api :: python_api/frame/get-variables/TestGetVariables.py (1105 of 1787)
PASS: lldb-api :: functionalities/pre_run_dylibs/TestPreRunDylibs.py (1106 of 1787)
UNSUPPORTED: lldb-api :: functionalities/darwin_log/filter/regex/activity/TestDarwinLogFilterRegexActivity.py (1107 of 1787)
PASS: lldb-unit :: Utility/./UtilityTests/StringExtractorTest.GetNameColonValueNoSemicolon (1108 of 1787)
PASS: lldb-api :: functionalities/asan/TestMemoryHistory.py (1109 of 1787)
PASS: lldb-unit :: Host/./HostTests/FileSystemTest.GetPermissions (1110 of 1787)
PASS: lldb-api :: functionalities/breakpoint/breakpoint_command/TestBreakpointCommand.py (1111 of 1787)
PASS: lldb-unit :: Utility/./UtilityTests/StringLexerTest.GetUnlexed (1112 of 1787)
PASS: lldb-api :: functionalities/stats_api/TestStatisticsAPI.py (1113 of 1787)
PASS: lldb-api :: lang/cpp/trivial_abi/TestTrivialABI.py (1114 of 1787)
UNSUPPORTED: lldb-shell :: SymbolFile/PDB/compilands.test (1115 of 1787)
PASS: lldb-shell :: ObjectFile/PECOFF/export-dllfunc.yaml (1116 of 1787)
PASS: lldb-shell :: ObjectFile/ELF/gnu-debuglink.yaml (1117 of 1787)
PASS: lldb-unit :: ObjectFile/Breakpad/./ObjectFileBreakpadTests/Record.classify (1118 of 1787)
PASS: lldb-api :: lang/objc/foundation/TestObjCMethodsNSError.py (1119 of 1787)
PASS: lldb-unit :: Language/Highlighting/./HighlighterTests/HighlighterTest.FallbackHighlighter (1120 of 1787)
PASS: lldb-unit :: Process/gdb-remote/./ProcessGdbRemoteTests/GDBRemoteCommunicationServerTest.SendErrorResponse_ErrorNumber (1121 of 1787)
UNSUPPORTED: lldb-api :: tools/lldb-vscode/stackTrace/TestVSCode_stackTrace.py (1122 of 1787)
PASS: lldb-api :: lang/cpp/operators/TestCppOperators.py (1123 of 1787)
PASS: lldb-api :: functionalities/data-formatter/data-formatter-script/TestDataFormatterScript.py (1124 of 1787)
PASS: lldb-shell :: Reproducer/Modules/TestModuleCXX.test (1125 of 1787)
PASS: lldb-api :: functionalities/breakpoint/dummy_target_breakpoints/TestBreakpointsWithNoTargets.py (1126 of 1787)
PASS: lldb-unit :: Utility/./UtilityTests/UserIDResolver.GetUserName (1127 of 1787)
PASS: lldb-api :: commands/watchpoints/watchpoint_disable/TestWatchpointDisable.py (1128 of 1787)
PASS: lldb-unit :: Core/./LLDBCoreTests/RichManglingContextTest.FromCxxMethodName (1129 of 1787)
PASS: lldb-api :: linux/builtin_trap/TestBuiltinTrap.py (1130 of 1787)
PASS: lldb-shell :: Quit/TestQuitExitCodeImplicit0.test (1131 of 1787)
PASS: lldb-unit :: Signals/./SignalsTests/UnixSignalsTest.GetInfo (1132 of 1787)
PASS: lldb-api :: functionalities/data-formatter/data-formatter-objc/TestDataFormatterObjCExpr.py (1133 of 1787)
PASS: lldb-api :: functionalities/data-formatter/synthupdate/TestSyntheticFilterRecompute.py (1134 of 1787)
PASS: lldb-api :: python_api/sbstructureddata/TestStructuredDataAPI.py (1135 of 1787)
PASS: lldb-api :: functionalities/tail_call_frames/thread_step_out_message/TestArtificialFrameStepOutMessage.py (1136 of 1787)
PASS: lldb-api :: lang/cpp/chained-calls/TestCppChainedCalls.py (1137 of 1787)
UNSUPPORTED: lldb-shell :: SymbolFile/NativePDB/stack_unwinding01.cpp (1138 of 1787)
PASS: lldb-unit :: Host/./HostTests/SocketTest.DomainListenConnectAccept (1139 of 1787)
PASS: lldb-api :: commands/expression/import-std-module/vector-basic/TestBasicVector.py (1140 of 1787)
PASS: lldb-api :: functionalities/recursion/TestValueObjectRecursion.py (1141 of 1787)
PASS: lldb-unit :: SymbolFile/NativePDB/./SymbolFileNativePDBTests/PDBFPOProgramToDWARFExpressionTests.SingleAssignmentRegisterRef (1142 of 1787)
UNSUPPORTED: lldb-shell :: SymbolFile/PDB/udt-layout.test (1143 of 1787)
PASS: lldb-api :: lang/objc/objc-new-syntax/TestObjCNewSyntaxArray.py (1144 of 1787)
PASS: lldb-api :: commands/target/create-deps/TestTargetCreateDeps.py (1145 of 1787)
PASS: lldb-unit :: UnwindAssembly/x86/./UnwindAssemblyx86Tests/Testx86AssemblyInspectionEngine.TestPushECX (1146 of 1787)
PASS: lldb-unit :: Utility/./UtilityTests/StreamTeeTest.Constructor1Stream (1147 of 1787)
PASS: lldb-api :: functionalities/multiword-commands/TestMultiWordCommands.py (1148 of 1787)
PASS: lldb-api :: functionalities/data-formatter/data-formatter-objc/TestDataFormatterObjCCF.py (1149 of 1787)
PASS: lldb-api :: commands/expression/class_template_specialization_empty_pack/TestClassTemplateSpecializationParametersHandling.py (1150 of 1787)
PASS: lldb-api :: lang/objc/global_ptrs/TestGlobalObjects.py (1151 of 1787)
PASS: lldb-api :: python_api/lldbutil/frame/TestFrameUtils.py (1152 of 1787)
PASS: lldb-api :: functionalities/data-formatter/synthcapping/TestSyntheticCapping.py (1153 of 1787)
PASS: lldb-api :: lang/objc/foundation/TestObjCMethods.py (1154 of 1787)
PASS: lldb-api :: functionalities/tsan/thread_leak/TestTsanThreadLeak.py (1155 of 1787)
PASS: lldb-api :: functionalities/abbreviation/TestAbbreviations.py (1156 of 1787)
PASS: lldb-api :: functionalities/thread/concurrent_events/TestConcurrentTwoWatchpointsOneSignal.py (1157 of 1787)
PASS: lldb-unit :: UnwindAssembly/x86/./UnwindAssemblyx86Tests/Testx86AssemblyInspectionEngine.TestSubESP (1158 of 1787)
PASS: lldb-unit :: Utility/./UtilityTests/ArgsTest.ReplaceArgumentAtIndexShort (1159 of 1787)
PASS: lldb-api :: functionalities/var_path/TestVarPath.py (1160 of 1787)
PASS: lldb-api :: functionalities/inline-stepping/TestInlineStepping.py (1161 of 1787)
PASS: lldb-api :: commands/expression/dollar-in-variable/TestDollarInVariable.py (1162 of 1787)
UNSUPPORTED: lldb-shell :: Register/x86-64-xmm16-write.test (1163 of 1787)
PASS: lldb-api :: functionalities/rerun/TestRerun.py (1164 of 1787)
PASS: lldb-unit :: Host/./HostTests/SocketTest.TCPGetConnectURI (1165 of 1787)
UNSUPPORTED: lldb-api :: functionalities/data-formatter/data-formatter-stl/libstdcpp/vbool/TestDataFormatterStdVBool.py (1166 of 1787)
PASS: lldb-shell :: ObjectFile/ELF/section-overlap.yaml (1167 of 1787)
PASS: lldb-unit :: Host/./HostTests/HostInfoTest.GetAugmentedArchSpec (1168 of 1787)
PASS: lldb-api :: lang/c/modules/TestCModules.py (1169 of 1787)
PASS: lldb-unit :: Process/minidump/./LLDBMinidumpTests/RegisterContextMinidump.ConvertMinidumpContext_x86_64 (1170 of 1787)
PASS: lldb-shell :: Reproducer/Functionalities/TestDataFormatter.test (1171 of 1787)
PASS: lldb-api :: functionalities/modern-type-lookup/basic-objc/TestBasicObjcModernTypeLookup.py (1172 of 1787)
PASS: lldb-api :: commands/expression/import-std-module/no-std-module/TestMissingStdModule.py (1173 of 1787)
UNSUPPORTED: lldb-shell :: Register/arm-fp-read.test (1174 of 1787)
PASS: lldb-unit :: Utility/./UtilityTests/StringExtractorTest.GetNameColonValueNoColon (1175 of 1787)
PASS: lldb-api :: commands/expression/top-level/TestTopLevelExprs.py (1176 of 1787)
UNSUPPORTED: lldb-api :: linux/mix-dwo-and-regular-objects/TestMixedDwarfBinary.py (1177 of 1787)
PASS: lldb-api :: commands/expression/import-std-module/queue/TestQueue.py (1178 of 1787)
PASS: lldb-unit :: Utility/./UtilityTests/ScalarTest.Comparison (1179 of 1787)
PASS: lldb-api :: lang/c/shared_lib_stripped_symbols/TestSharedLibStrippedSymbols.py (1180 of 1787)
PASS: lldb-shell :: Quit/TestQuitExitCode-30.test (1181 of 1787)
PASS: lldb-unit :: Expression/./ExpressionTests/CppModuleConfigurationTest.MissingLibCpp (1182 of 1787)
PASS: lldb-unit :: Interpreter/./InterpreterTests/CompletionTest.DirCompletionAbsolute (1183 of 1787)
PASS: lldb-unit :: Process/gdb-remote/./ProcessGdbRemoteTests/GDBRemoteClientBaseTest.SendContinueAndAsyncPacket (1184 of 1787)
PASS: lldb-shell :: SymbolFile/DWARF/dir-separator-posix.s (1185 of 1787)
PASS: lldb-api :: lang/c/enum_types/TestEnumTypes.py (1186 of 1787)
PASS: lldb-shell :: SymbolFile/sizeless-symbol.test (1187 of 1787)
PASS: lldb-api :: lang/cpp/member-and-local-vars-with-same-name/TestMembersAndLocalsWithSameName.py (1188 of 1787)
PASS: lldb-api :: commands/target/create-no-such-arch/TestNoSuchArch.py (1189 of 1787)
PASS: lldb-api :: functionalities/type_completion/TestTypeCompletion.py (1190 of 1787)
PASS: lldb-unit :: UnwindAssembly/x86/./UnwindAssemblyx86Tests/Testx86AssemblyInspectionEngine.TestAddESP (1191 of 1787)
PASS: lldb-unit :: Utility/./UtilityTests/ArgsTest.TestArgv (1192 of 1787)
PASS: lldb-shell :: ObjectFile/ELF/minidebuginfo-corrupt-xz.yaml (1193 of 1787)
PASS: lldb-api :: types/TestRecursiveTypes.py (1194 of 1787)
PASS: lldb-api :: functionalities/thread/concurrent_events/TestConcurrentBreakpointOneDelayBreakpointThreads.py (1195 of 1787)
PASS: lldb-api :: python_api/debugger/TestDebuggerAPI.py (1196 of 1787)
PASS: lldb-unit :: Process/minidump/./LLDBMinidumpTests/MinidumpParserTest.GetThreadContext_x86_32_wow64 (1197 of 1787)
PASS: lldb-api :: lang/objc/objc-struct-argument/TestObjCStructArgument.py (1198 of 1787)
UNSUPPORTED: lldb-api :: benchmarks/libcxxmap/TestBenchmarkLibcxxMap.py (1199 of 1787)
PASS: lldb-unit :: Utility/./UtilityTests/StreamTest.PutChar (1200 of 1787)
PASS: lldb-api :: functionalities/breakpoint/global_constructor/TestBreakpointInGlobalConstructor.py (1201 of 1787)
PASS: lldb-unit :: Utility/./UtilityTests/DataExtractorTest.GetCStrAtNullOffset (1202 of 1787)
PASS: lldb-shell :: SymbolFile/DWARF/dir-separator-no-comp-dir-relative-name.s (1203 of 1787)
PASS: lldb-unit :: Utility/./UtilityTests/StreamTest.ShiftOperatorUInts (1204 of 1787)
UNSUPPORTED: lldb-api :: tools/lldb-vscode/variables/TestVSCode_variables.py (1205 of 1787)
PASS: lldb-api :: commands/expression/rdar44436068/Test128BitsInteger.py (1206 of 1787)
PASS: lldb-shell :: Breakpoint/debug_rnglist_offset_pair.test (1207 of 1787)
PASS: lldb-api :: commands/expression/import-std-module/vector-dbg-info-content/TestDbgInfoContentVector.py (1208 of 1787)
PASS: lldb-shell :: SymbolFile/Breakpad/unwind-via-stack-win.test (1209 of 1787)
PASS: lldb-api :: lang/c/unions/TestUnionMembers.py (1210 of 1787)
UNSUPPORTED: lldb-shell :: Register/x86-zmm-read.test (1211 of 1787)
PASS: lldb-api :: source-manager/TestSourceManager.py (1212 of 1787)
PASS: lldb-unit :: Utility/./UtilityTests/StringLexerTest.NextIf (1213 of 1787)
PASS: lldb-unit :: Process/gdb-remote/./ProcessGdbRemoteTests/GDBRemoteCommunicationClientTest.GetMemoryRegionInfoInvalidResponse (1214 of 1787)
PASS: lldb-unit :: Utility/./UtilityTests/StringLexerTest.Peek (1215 of 1787)
UNSUPPORTED: lldb-api :: tools/lldb-vscode/breakpoint/TestVSCode_setFunctionBreakpoints.py (1216 of 1787)
PASS: lldb-unit :: Utility/./UtilityTests/OptionsWithRawTest.ArgsButNoLeadingDash (1217 of 1787)
PASS: lldb-unit :: Process/gdb-remote/./ProcessGdbRemoteTests/GDBRemoteClientBaseTest.SendContinueAndInterrupt2PacketBug (1218 of 1787)
PASS: lldb-unit :: Utility/./UtilityTests/TimerTest.CategoryTimes (1219 of 1787)
PASS: lldb-api :: lang/cpp/type_lookup/TestCppTypeLookup.py (1220 of 1787)
PASS: lldb-api :: python_api/watchpoint/TestSetWatchpoint.py (1221 of 1787)
PASS: lldb-shell :: Breakpoint/split-dwarf5-debug-stroffsets.test (1222 of 1787)
PASS: lldb-api :: lang/objc/objc-class-method/TestObjCClassMethod.py (1223 of 1787)
PASS: lldb-shell :: Commands/command-regex-delete.test (1224 of 1787)
PASS: lldb-api :: commands/command/script_alias/TestCommandScriptAlias.py (1225 of 1787)
UNSUPPORTED: lldb-api :: lang/objc/bitfield_ivars/TestBitfieldIvars.py (1226 of 1787)
PASS: lldb-api :: functionalities/breakpoint/breakpoint_names/TestBreakpointNames.py (1227 of 1787)
PASS: lldb-unit :: UnwindAssembly/x86/./UnwindAssemblyx86Tests/Testx86AssemblyInspectionEngine.Test32BitOnlyInstruction (1228 of 1787)
PASS: lldb-unit :: Utility/./UtilityTests/ConstStringTest.NullAndEmptyStates (1229 of 1787)
PASS: lldb-unit :: Utility/./UtilityTests/RangeTest.Clear (1230 of 1787)
PASS: lldb-shell :: ObjectFile/PECOFF/basic-info.yaml (1231 of 1787)
PASS: lldb-api :: python_api/sbtype_typeclass/TestSBTypeTypeClass.py (1232 of 1787)
PASS: lldb-unit :: Process/gdb-remote/./ProcessGdbRemoteTests/GDBRemoteCommunicationClientTest.SaveRestoreRegistersNoSuffix (1233 of 1787)
PASS: lldb-api :: commands/expression/fixits/TestFixIts.py (1234 of 1787)
UNSUPPORTED: lldb-api :: commands/watchpoints/multi_watchpoint_slots/TestWatchpointMultipleSlots.py (1235 of 1787)
PASS: lldb-api :: commands/disassemble/basic/TestDisassembleBreakpoint.py (1236 of 1787)
PASS: lldb-shell :: SymbolFile/DWARF/array-sizes.s (1237 of 1787)
PASS: lldb-unit :: Utility/./UtilityTests/StringListTest.PopBack (1238 of 1787)
UNSUPPORTED: lldb-shell :: ExecControl/StopHook/stop-hook-threads.test (1239 of 1787)
PASS: lldb-api :: python_api/default-constructor/TestDefaultConstructorForAPIObjects.py (1240 of 1787)
PASS: lldb-shell :: SymbolFile/Breakpad/unwind-via-stack-cfi.test (1241 of 1787)
PASS: lldb-shell :: ObjectFile/ELF/many-sections.s (1242 of 1787)
PASS: lldb-api :: functionalities/thread/concurrent_events/TestConcurrentCrashWithWatchpoint.py (1243 of 1787)
PASS: lldb-api :: python_api/type/TestTypeList.py (1244 of 1787)
PASS: lldb-unit :: Utility/./UtilityTests/SerializationRountripTest.SerializeDeserializeObjectPointer (1245 of 1787)
PASS: lldb-unit :: Process/minidump/./LLDBMinidumpTests/MinidumpParserTest.MinidumpModuleOrder (1246 of 1787)
PASS: lldb-unit :: Utility/./UtilityTests/RangeTest.SlideZero (1247 of 1787)
PASS: lldb-unit :: Breakpoint/./LLDBBreakpointTests/BreakpointIDTest.StringIsBreakpointName (1248 of 1787)
PASS: lldb-shell :: ObjectFile/MachO/symtab.yaml (1249 of 1787)
PASS: lldb-unit :: Utility/./UtilityTests/RegularExpression.Match (1250 of 1787)
PASS: lldb-shell :: Reproducer/Functionalities/TestStepping.test (1251 of 1787)
PASS: lldb-shell :: ObjectFile/ELF/section-addresses.yaml (1252 of 1787)
PASS: lldb-shell :: ObjectFile/ELF/compressed-sections.yaml (1253 of 1787)
PASS: lldb-api :: python_api/process/read-mem-cstring/TestReadMemCString.py (1254 of 1787)
PASS: lldb-api :: functionalities/thread/jump/TestThreadJump.py (1255 of 1787)
PASS: lldb-unit :: Utility/./UtilityTests/BinaryStreamTest.PutULEB128ThreeBytes (1256 of 1787)
PASS: lldb-unit :: Host/./HostTests/MainLoopTest.Signal (1257 of 1787)
PASS: lldb-api :: lang/cpp/llvm-style/TestLLVMStyle.py (1258 of 1787)
PASS: lldb-api :: macosx/version_zero/TestGetVersionZeroVersion.py (1259 of 1787)
PASS: lldb-api :: commands/expression/no-deadlock/TestExprDoesntBlock.py (1260 of 1787)
PASS: lldb-api :: commands/expression/import_builtin_fileid/TestImportBuiltinFileID.py (1261 of 1787)
PASS: lldb-shell :: SymbolFile/Breakpad/line-table-edgecases.test (1262 of 1787)
PASS: lldb-api :: commands/platform/process/TestProcessList.py (1263 of 1787)
PASS: lldb-unit :: Utility/./UtilityTests/OptionsWithRawTest.EmptyInput (1264 of 1787)
PASS: lldb-unit :: Utility/./UtilityTests/DataExtractorTest.GetCStrEmpty (1265 of 1787)
PASS: lldb-shell :: Process/TestEnvironment.test (1266 of 1787)
PASS: lldb-unit :: ScriptInterpreter/Python/./ScriptInterpreterPythonTests/PythonExceptionStateTest.TestDiscardSemantics (1267 of 1787)
PASS: lldb-unit :: SymbolFile/NativePDB/./SymbolFileNativePDBTests/PDBFPOProgramToDWARFExpressionTests.InvalidOpUnary (1268 of 1787)
PASS: lldb-unit :: Expression/./ExpressionTests/DiagnosticManagerTest.HasFixits (1269 of 1787)
PASS: lldb-api :: lang/objc/modules-incomplete/TestIncompleteModules.py (1270 of 1787)
PASS: lldb-unit :: Utility/./UtilityTests/StringListTest.ShiftStdString (1271 of 1787)
PASS: lldb-api :: lang/c/unicode/TestUnicodeSymbols.py (1272 of 1787)
PASS: lldb-api :: sample_test/TestSampleTest.py (1273 of 1787)
PASS: lldb-api :: commands/target/stop-hooks/TestStopHooks.py (1274 of 1787)
UNSUPPORTED: lldb-shell :: Register/x86-64-ymm16-write.test (1275 of 1787)
PASS: lldb-shell :: Breakpoint/debug_rnglist_rlestartend.test (1276 of 1787)
PASS: lldb-shell :: SymbolFile/DWARF/find-qualified-variable.cpp (1277 of 1787)
PASS: lldb-api :: functionalities/data-formatter/data-formatter-synthtype/TestDataFormatterSynthType.py (1278 of 1787)
PASS: lldb-unit :: ScriptInterpreter/Python/./ScriptInterpreterPythonTests/PythonDataObjectsTest.TestPythonCallableCheck (1279 of 1787)
PASS: lldb-unit :: Process/gdb-remote/./ProcessGdbRemoteTests/GDBRemoteClientBaseTest.SendContinueAndAsyncSignal (1280 of 1787)
PASS: lldb-api :: functionalities/data-formatter/dump_dynamic/TestDumpDynamic.py (1281 of 1787)
PASS: lldb-api :: commands/apropos/with-process/TestAproposWithProcess.py (1282 of 1787)
PASS: lldb-unit :: Utility/./UtilityTests/ArgsTest.BareSingleQuote (1283 of 1787)
PASS: lldb-unit :: Utility/./UtilityTests/GeneratorTest.Get (1284 of 1787)
PASS: lldb-unit :: Symbol/./SymbolTests/SymbolsTest.TerminateLocateExecutableSymbolFileForUnknownExecutableAndUnknownSymbolFile (1285 of 1787)
PASS: lldb-api :: commands/expression/namespace_local_var_same_name_cpp_and_c/TestNamespaceLocalVarSameNameCppAndC.py (1286 of 1787)
PASS: lldb-api :: lang/cpp/const_this/TestConstThis.py (1287 of 1787)
PASS: lldb-shell :: SymbolFile/DWARF/apple-index-is-used.cpp (1288 of 1787)
PASS: lldb-shell :: Driver/TestRepl.test (1289 of 1787)
PASS: lldb-unit :: Language/Highlighting/./HighlighterTests/HighlighterTest.ClangCursorPosEndOfLine (1290 of 1787)
PASS: lldb-api :: functionalities/breakpoint/breakpoint_ignore_count/TestBreakpointIgnoreCount.py (1291 of 1787)
PASS: lldb-unit :: Utility/./UtilityTests/AnsiTerminal.WhiteSpace (1292 of 1787)
PASS: lldb-unit :: Host/./HostTests/FileSystemTest.MakeAbsolute (1293 of 1787)
PASS: lldb-unit :: UnwindAssembly/x86/./UnwindAssemblyx86Tests/Testx86AssemblyInspectionEngine.TestPopRBX (1294 of 1787)
PASS: lldb-api :: python_api/interpreter/TestRunCommandInterpreterAPI.py (1295 of 1787)
PASS: lldb-unit :: Process/minidump/./LLDBMinidumpTests/MinidumpParserTest.GetThreadContext_x86_32 (1296 of 1787)
PASS: lldb-api :: functionalities/inferior-crashing/TestInferiorCrashingStep.py (1297 of 1787)
PASS: lldb-unit :: ScriptInterpreter/Python/./ScriptInterpreterPythonTests/PythonDataObjectsTest.TestOwnedReferences (1298 of 1787)
PASS: lldb-shell :: SymbolFile/DWARF/debug-types-dwarf5.s (1299 of 1787)
PASS: lldb-api :: lang/objc/objc-ivar-offsets/TestObjCIvarOffsets.py (1300 of 1787)
UNSUPPORTED: lldb-api :: linux/thread/create_during_instruction_step/TestCreateDuringInstructionStep.py (1301 of 1787)
UNSUPPORTED: lldb-api :: functionalities/darwin_log/filter/exact_match/activity/TestDarwinLogFilterMatchActivity.py (1302 of 1787)
PASS: lldb-api :: lang/cpp/virtual/TestVirtual.py (1303 of 1787)
PASS: lldb-shell :: Reproducer/TestRelativePath.test (1304 of 1787)
PASS: lldb-unit :: Utility/./UtilityTests/OptionsWithRawTest.EmptySuffixSingleWhitespace (1305 of 1787)
PASS: lldb-shell :: ObjectFile/MachO/subsections.yaml (1306 of 1787)
PASS: lldb-unit :: Interpreter/./InterpreterTests/CompletionTest.FileCompletionAbsolute (1307 of 1787)
PASS: lldb-unit :: Utility/./UtilityTests/StringListTest.LongestCommonPrefix (1308 of 1787)
PASS: lldb-unit :: Utility/./UtilityTests/LogTest.Unregister (1309 of 1787)
PASS: lldb-api :: macosx/queues/TestQueues.py (1310 of 1787)
PASS: lldb-api :: commands/expression/function_template_specialization_temp_args/TestFunctionTemplateSpecializationTempArgs.py (1311 of 1787)
PASS: lldb-api :: functionalities/inferior-crashing/recursive-inferior/TestRecursiveInferiorStep.py (1312 of 1787)
PASS: lldb-api :: functionalities/data-formatter/data-formatter-stl/libstdcpp/unique_ptr/invalid/TestDataFormatterInvalidStdUniquePtr.py (1313 of 1787)
PASS: lldb-unit :: Utility/./UtilityTests/StringExtractorTest.InitEmpty (1314 of 1787)
PASS: lldb-api :: functionalities/data-formatter/frameformat_smallstruct/TestFrameFormatSmallStruct.py (1315 of 1787)
PASS: lldb-api :: functionalities/signal/TestSendSignal.py (1316 of 1787)
PASS: lldb-api :: functionalities/gdb_remote_client/TestPlatformClient.py (1317 of 1787)
PASS: lldb-shell :: Minidump/Windows/find-module.test (1318 of 1787)
PASS: lldb-api :: functionalities/data-formatter/data-formatter-cpp/TestDataFormatterCpp.py (1319 of 1787)
PASS: lldb-unit :: Utility/./UtilityTests/ArchSpecTest.MergeFromMachOUnknown (1320 of 1787)
PASS: lldb-unit :: Process/minidump/./LLDBMinidumpTests/MinidumpParserTest.GetThreadContext_x86_64 (1321 of 1787)
PASS: lldb-unit :: Utility/./UtilityTests/SerializationRountripTest.SerializeDeserializePod (1322 of 1787)
PASS: lldb-api :: functionalities/gdb_remote_client/TestRestartBug.py (1323 of 1787)
PASS: lldb-shell :: ObjectFile/ELF/PT_LOAD-overlap-PT_TLS.yaml (1324 of 1787)
PASS: lldb-api :: commands/process/attach/attach_denied/TestAttachDenied.py (1325 of 1787)
PASS: lldb-shell :: Reproducer/TestReuseDirectory.test (1326 of 1787)
PASS: lldb-api :: lang/objc/modules/TestObjCModules.py (1327 of 1787)
PASS: lldb-api :: functionalities/data-formatter/user-format-vs-summary/TestUserFormatVsSummary.py (1328 of 1787)
PASS: lldb-unit :: Host/./HostTests/File.GetStreamFromDescriptor (1329 of 1787)
PASS: lldb-unit :: Utility/./UtilityTests/CompletionRequest.TryCompleteCurrentArgGood (1330 of 1787)
PASS: lldb-api :: functionalities/data-formatter/summary-string-onfail/Test-rdar-9974002.py (1331 of 1787)
PASS: lldb-unit :: Utility/./UtilityTests/StreamTest.PutSLEB128 (1332 of 1787)
PASS: lldb-api :: functionalities/unwind/noreturn/TestNoreturnUnwind.py (1333 of 1787)
PASS: lldb-unit :: Utility/./UtilityTests/BinaryStreamTest.PutSLEB128One (1334 of 1787)
PASS: lldb-unit :: Utility/./UtilityTests/ScalarTest.RightShiftOperator (1335 of 1787)
PASS: lldb-api :: lang/objc/rdar-10967107/TestRdar10967107.py (1336 of 1787)
PASS: lldb-api :: python_api/symbol-context/TestSymbolContext.py (1337 of 1787)
UNSUPPORTED: lldb-api :: functionalities/data-formatter/data-formatter-stl/libstdcpp/vector/TestDataFormatterStdVector.py (1338 of 1787)
PASS: lldb-api :: commands/register/register/register_command/TestRegisters.py (1339 of 1787)
PASS: lldb-api :: commands/expression/save_jit_objects/TestSaveJITObjects.py (1340 of 1787)
PASS: lldb-api :: commands/expression/scoped_enums/TestScopedEnumType.py (1341 of 1787)
PASS: lldb-api :: tools/lldb-server/TestGdbRemoteProcessInfo.py (1342 of 1787)
PASS: lldb-api :: commands/expression/import-std-module/deque-basic/TestBasicDeque.py (1343 of 1787)
PASS: lldb-unit :: UnwindAssembly/x86/./UnwindAssemblyx86Tests/Testx86AssemblyInspectionEngine.Test64bitFramelessSmallStackFrame (1344 of 1787)
PASS: lldb-shell :: Heap/heap-cstr.test (1345 of 1787)
PASS: lldb-unit :: ScriptInterpreter/Python/./ScriptInterpreterPythonTests/PythonDataObjectsTest.TestTypeNameResolutionNoDot (1346 of 1787)
PASS: lldb-shell :: Quit/TestQuitExitCodeTooManyArgs.test (1347 of 1787)
PASS: lldb-api :: lang/objcxx/cxx-bridged-po/TestObjCXXBridgedPO.py (1348 of 1787)
UNSUPPORTED: lldb-shell :: Process/Windows/exception_access_violation.cpp (1349 of 1787)
PASS: lldb-unit :: Utility/./UtilityTests/VMRange.Reset (1350 of 1787)
PASS: lldb-unit :: Language/Highlighting/./HighlighterTests/HighlighterTest.ClangCursorPosInOtherToken (1351 of 1787)
PASS: lldb-shell :: SymbolFile/Breakpad/line-table-missing-file.test (1352 of 1787)
PASS: lldb-api :: functionalities/data-formatter/nsarraysynth/TestNSArraySynthetic.py (1353 of 1787)
PASS: lldb-api :: commands/expression/two-files/TestObjCTypeQueryFromOtherCompileUnit.py (1354 of 1787)
PASS: lldb-shell :: SymbolFile/DWARF/find-method.cpp (1355 of 1787)
PASS: lldb-unit :: Host/./HostTests/FileSystemTest.Resolve (1356 of 1787)
PASS: lldb-shell :: Settings/TestSettingsWrite.test (1357 of 1787)
FAIL: lldb-api :: tools/lldb-server/commandline/TestStubSetSID.py (1358 of 1787)
******************** TEST 'lldb-api :: tools/lldb-server/commandline/TestStubSetSID.py' FAILED ********************
lldb version 10.0.99 (http://labmaster3.local/git/llvm-project.git revision e6125fc0ec3418d6529b52f15853a06e000d478d)
  clang revision 9129a281cd5b8b1fb804be1de396de4a42676570
  llvm revision 9129a281cd5b8b1fb804be1de396de4a42676570
LLDB library dir: /Users/buildslave/jenkins/workspace/lldb-cmake-sanitized/lldb-build/bin
LLDB import library dir: /Users/buildslave/jenkins/workspace/lldb-cmake-sanitized/lldb-build/bin
libstdcxx tests will not be run because: Don't know how to build with libstdcxx on macosx
Skipping following debug info categories: ['dwo']

Hide Details

Session logs for test failures/errors/unexpected successes will go into directory '/Users/buildslave/jenkins/workspace/lldb-cmake-sanitized/test/logs' Command invoked: /Users/buildslave/jenkins/workspace/lldb-cmake-sanitized/llvm-project/lldb/test/API/dotest.py --arch=x86_64 -s /Users/buildslave/jenkins/workspace/lldb-cmake-sanitized/lldb-build/lldb-test-traces -S nm -u CXXFLAGS -u CFLAGS --executable /Users/buildslave/jenkins/workspace/lldb-cmake-sanitized/lldb-build/./bin/lldb --dsymutil /Users/buildslave/jenkins/workspace/lldb-cmake-sanitized/lldb-build/./bin/dsymutil --filecheck /Users/buildslave/jenkins/workspace/lldb-cmake-sanitized/lldb-build/./bin/FileCheck -C /Users/buildslave/jenkins/workspace/lldb-cmake-sanitized/host-compiler/bin/clang --codesign-identity lldb_codesign --server /Users/buildslave/jenkins/workspace/lldb-cmake-sanitized/lldb-build/./bin/debugserver --arch x86_64 --build-dir /Users/buildslave/jenkins/workspace/lldb-cmake-sanitized/lldb-build/lldb-test-build.noindex -s=/Users/buildslave/jenkins/workspace/lldb-cmake-sanitized/test/logs -t --env TERM=vt100 --env LLVM_LIBS_DIR=/Users/buildslave/jenkins/workspace/lldb-cmake-sanitized/lldb-build/./lib --build-dir /Users/buildslave/jenkins/workspace/lldb-cmake-sanitized/lldb-build/tools/lldb/lldb-test-build.noindex --lldb-module-cache-dir /Users/buildslave/jenkins/workspace/lldb-cmake-sanitized/lldb-build/tools/lldb/lldb-test-build.noindex/module-cache-lldb/lldb-api --clang-module-cache-dir /Users/buildslave/jenkins/workspace/lldb-cmake-sanitized/lldb-build/tools/lldb/lldb-test-build.noindex/module-cache-clang/lldb-api /Users/buildslave/jenkins/workspace/lldb-cmake-sanitized/llvm-project/lldb/packages/Python/lldbsuite/test/tools/lldb-server/commandline -p TestStubSetSID.py Change dir to: /Users/buildslave/jenkins/workspace/lldb-cmake-sanitized/llvm-project/lldb/packages/Python/lldbsuite/test/tools/lldb-server/commandline runCmd: settings set symbols.enable-external-lookup false output:

Hide Details

runCmd: settings set plugin.process.gdb-remote.packet-timeout 60 output:

Hide Details

runCmd: settings set symbols.clang-modules-cache-path "/Users/buildslave/jenkins/workspace/lldb-cmake-sanitized/lldb-build/tools/lldb/lldb-test-build.noindex/module-cache-lldb/lldb-api" output:

Hide Details

runCmd: settings set use-color false output:

Hide Details

Adding tearDown hook: def shutdown_named_pipe(): # Close the pipe. try: named_pipe.close() except: print("failed to close named pipe") None

Hide Details

# Delete the pipe. try: os.remove(named_pipe_path) except: print("failed to delete named pipe: {}".format(named_pipe_path)) None

Hide Details

# Delete the temp directory. try: os.rmdir(temp_dir) except: print( "failed to delete temp dir: {}, directory contents: '{}'".format( temp_dir, os.listdir(temp_dir))) None

Hide Details

Hide Details

Adding tearDown hook: def cleanupSubprocesses(self): # Ensure any subprocesses are cleaned up for p in self.subprocesses: p.terminate() del p del self.subprocesses[:] # Ensure any forked processes are cleaned up for pid in self.forkedProcessPids: if os.path.exists("/proc/" + str(pid)): os.kill(pid, signal.SIGTERM)

Hide Details

Hide Details

Executing tearDown hook: def cleanupSubprocesses(self): # Ensure any subprocesses are cleaned up for p in self.subprocesses: p.terminate() del p del self.subprocesses[:] # Ensure any forked processes are cleaned up for pid in self.forkedProcessPids: if os.path.exists("/proc/" + str(pid)): os.kill(pid, signal.SIGTERM)

Hide Details

Hide Details

Executing tearDown hook: def shutdown_named_pipe(): # Close the pipe. try: named_pipe.close() except: print("failed to close named pipe") None

Hide Details

# Delete the pipe. try: os.remove(named_pipe_path) except: print("failed to delete named pipe: {}".format(named_pipe_path)) None

Hide Details

# Delete the temp directory. try: os.rmdir(temp_dir) except: print( "failed to delete temp dir: {}, directory contents: '{}'".format( temp_dir, os.listdir(temp_dir))) None

Hide Details

Hide Details

PASS: LLDB (/Users/buildslave/jenkins/workspace/lldb-cmake-sanitized/host-compiler/bin/clang-10-x86_64) :: test_sid_is_different_with_S_debugserver (TestStubSetSID.TestStubSetSIDTestCase) runCmd: settings set symbols.enable-external-lookup false output:

Hide Details

runCmd: settings set plugin.process.gdb-remote.packet-timeout 60 output:

Hide Details

runCmd: settings set symbols.clang-modules-cache-path "/Users/buildslave/jenkins/workspace/lldb-cmake-sanitized/lldb-build/tools/lldb/lldb-test-build.noindex/module-cache-lldb/lldb-api" output:

Hide Details

runCmd: settings set use-color false output:

Hide Details

UNSUPPORTED: LLDB (/Users/buildslave/jenkins/workspace/lldb-cmake-sanitized/host-compiler/bin/clang-10-x86_64) :: test_sid_is_different_with_S_llgs (TestStubSetSID.TestStubSetSIDTestCase) (llgs tests) runCmd: settings set symbols.enable-external-lookup false output:

Hide Details

runCmd: settings set plugin.process.gdb-remote.packet-timeout 60 output:

Hide Details

runCmd: settings set symbols.clang-modules-cache-path "/Users/buildslave/jenkins/workspace/lldb-cmake-sanitized/lldb-build/tools/lldb/lldb-test-build.noindex/module-cache-lldb/lldb-api" output:

Hide Details

runCmd: settings set use-color false output:

Hide Details

Adding tearDown hook: def shutdown_named_pipe(): # Close the pipe. try: named_pipe.close() except: print("failed to close named pipe") None

Hide Details

# Delete the pipe. try: os.remove(named_pipe_path) except: print("failed to delete named pipe: {}".format(named_pipe_path)) None

Hide Details

# Delete the temp directory. try: os.rmdir(temp_dir) except: print( "failed to delete temp dir: {}, directory contents: '{}'".format( temp_dir, os.listdir(temp_dir))) None

Hide Details

Hide Details

Adding tearDown hook: def cleanupSubprocesses(self): # Ensure any subprocesses are cleaned up for p in self.subprocesses: p.terminate() del p del self.subprocesses[:] # Ensure any forked processes are cleaned up for pid in self.forkedProcessPids: if os.path.exists("/proc/" + str(pid)): os.kill(pid, signal.SIGTERM)

Hide Details

Hide Details

Executing tearDown hook: def cleanupSubprocesses(self): # Ensure any subprocesses are cleaned up for p in self.subprocesses: p.terminate() del p del self.subprocesses[:] # Ensure any forked processes are cleaned up for pid in self.forkedProcessPids: if os.path.exists("/proc/" + str(pid)): os.kill(pid, signal.SIGTERM)

Hide Details

Hide Details

Executing tearDown hook: def shutdown_named_pipe(): # Close the pipe. try: named_pipe.close() except: print("failed to close named pipe") None

Hide Details

# Delete the pipe. try: os.remove(named_pipe_path) except: print("failed to delete named pipe: {}".format(named_pipe_path)) None

Hide Details

# Delete the temp directory. try: os.rmdir(temp_dir) except: print( "failed to delete temp dir: {}, directory contents: '{}'".format( temp_dir, os.listdir(temp_dir))) None

Hide Details

Hide Details

PASS: LLDB (/Users/buildslave/jenkins/workspace/lldb-cmake-sanitized/host-compiler/bin/clang-10-x86_64) :: test_sid_is_different_with_setsid_debugserver (TestStubSetSID.TestStubSetSIDTestCase) runCmd: settings set symbols.enable-external-lookup false output:

Hide Details

runCmd: settings set plugin.process.gdb-remote.packet-timeout 60 output:

Hide Details

runCmd: settings set symbols.clang-modules-cache-path "/Users/buildslave/jenkins/workspace/lldb-cmake-sanitized/lldb-build/tools/lldb/lldb-test-build.noindex/module-cache-lldb/lldb-api" output:

Hide Details

runCmd: settings set use-color false output:

Hide Details

UNSUPPORTED: LLDB (/Users/buildslave/jenkins/workspace/lldb-cmake-sanitized/host-compiler/bin/clang-10-x86_64) :: test_sid_is_different_with_setsid_llgs (TestStubSetSID.TestStubSetSIDTestCase) (llgs tests) runCmd: settings set symbols.enable-external-lookup false output:

Hide Details

runCmd: settings set plugin.process.gdb-remote.packet-timeout 60 output:

Hide Details

runCmd: settings set symbols.clang-modules-cache-path "/Users/buildslave/jenkins/workspace/lldb-cmake-sanitized/lldb-build/tools/lldb/lldb-test-build.noindex/module-cache-lldb/lldb-api" output:

Hide Details

runCmd: settings set use-color false output:

Hide Details

Adding tearDown hook: def shutdown_named_pipe(): # Close the pipe. try: named_pipe.close() except: print("failed to close named pipe") None

Hide Details

# Delete the pipe. try: os.remove(named_pipe_path) except: print("failed to delete named pipe: {}".format(named_pipe_path)) None

Hide Details

# Delete the temp directory. try: os.rmdir(temp_dir) except: print( "failed to delete temp dir: {}, directory contents: '{}'".format( temp_dir, os.listdir(temp_dir))) None

Hide Details

Hide Details

Adding tearDown hook: def cleanupSubprocesses(self): # Ensure any subprocesses are cleaned up for p in self.subprocesses: p.terminate() del p del self.subprocesses[:] # Ensure any forked processes are cleaned up for pid in self.forkedProcessPids: if os.path.exists("/proc/" + str(pid)): os.kill(pid, signal.SIGTERM)

Hide Details

Hide Details

FAIL: LLDB (/Users/buildslave/jenkins/workspace/lldb-cmake-sanitized/host-compiler/bin/clang-10-x86_64) :: test_sid_is_same_without_setsid_debugserver (TestStubSetSID.TestStubSetSIDTestCase) Executing tearDown hook: def cleanupSubprocesses(self): # Ensure any subprocesses are cleaned up for p in self.subprocesses: p.terminate() del p del self.subprocesses[:] # Ensure any forked processes are cleaned up for pid in self.forkedProcessPids: if os.path.exists("/proc/" + str(pid)): os.kill(pid, signal.SIGTERM)

Hide Details

Hide Details

Executing tearDown hook: def shutdown_named_pipe(): # Close the pipe. try: named_pipe.close() except: print("failed to close named pipe") None

Hide Details

# Delete the pipe. try: os.remove(named_pipe_path) except: print("failed to delete named pipe: {}".format(named_pipe_path)) None

Hide Details

# Delete the temp directory. try: os.rmdir(temp_dir) except: print( "failed to delete temp dir: {}, directory contents: '{}'".format( temp_dir, os.listdir(temp_dir))) None

Hide Details

Hide Details

runCmd: settings set symbols.enable-external-lookup false output:

Hide Details

runCmd: settings set plugin.process.gdb-remote.packet-timeout 60 output:

Hide Details

runCmd: settings set symbols.clang-modules-cache-path "/Users/buildslave/jenkins/workspace/lldb-cmake-sanitized/lldb-build/tools/lldb/lldb-test-build.noindex/module-cache-lldb/lldb-api" output:

Hide Details

runCmd: settings set use-color false output:

Hide Details

UNSUPPORTED: LLDB (/Users/buildslave/jenkins/workspace/lldb-cmake-sanitized/host-compiler/bin/clang-10-x86_64) :: test_sid_is_same_without_setsid_llgs (TestStubSetSID.TestStubSetSIDTestCase) (llgs tests) Restore dir to: /Users/buildslave/jenkins/workspace/lldb-cmake-sanitized/lldb-build/tools/lldb/test ====================================================================== FAIL: test_sid_is_same_without_setsid_debugserver (TestStubSetSID.TestStubSetSIDTestCase) ---------------------------------------------------------------------- Traceback (most recent call last): File "/Users/buildslave/jenkins/workspace/lldb-cmake-sanitized/llvm-project/lldb/packages/Python/lldbsuite/test/decorators.py", line 141, in wrapper func(*args, **kwargs) File "/Users/buildslave/jenkins/workspace/lldb-cmake-sanitized/llvm-project/lldb/packages/Python/lldbsuite/test/decorators.py", line 141, in wrapper func(*args, **kwargs) File "/Users/buildslave/jenkins/workspace/lldb-cmake-sanitized/llvm-project/lldb/packages/Python/lldbsuite/test/tools/lldb-server/commandline/TestStubSetSID.py", line 48, in test_sid_is_same_without_setsid_debugserver self.sid_is_same_without_setsid() File "/Users/buildslave/jenkins/workspace/lldb-cmake-sanitized/llvm-project/lldb/packages/Python/lldbsuite/test/tools/lldb-server/commandline/TestStubSetSID.py", line 32, in sid_is_same_without_setsid stub_sid = self.get_stub_sid() File "/Users/buildslave/jenkins/workspace/lldb-cmake-sanitized/llvm-project/lldb/packages/Python/lldbsuite/test/tools/lldb-server/commandline/TestStubSetSID.py", line 26, in get_stub_sid server.pid, True)) AssertionError: False is not True Config=x86_64-/Users/buildslave/jenkins/workspace/lldb-cmake-sanitized/host-compiler/bin/clang-10 ---------------------------------------------------------------------- Ran 6 tests in 9.892s

Hide Details

RESULT: FAILED (2 passes, 1 failures, 0 errors, 3 skipped, 0 expected failures, 0 unexpected successes)

Hide Details

******************** PASS: lldb-unit :: Utility/./UtilityTests/StringListTest.GetMaxStringLengthEqualSize (1359 of 1787) PASS: lldb-api :: commands/expression/unwind_expression/TestUnwindExpression.py (1360 of 1787) PASS: lldb-api :: lang/objc/foundation/TestSymbolTable.py (1361 of 1787) PASS: lldb-unit :: Utility/./UtilityTests/StringExtractorTest.GetHexU8_Underflow_NoEof (1362 of 1787) PASS: lldb-unit :: UnwindAssembly/x86/./UnwindAssemblyx86Tests/Testx86AssemblyInspectionEngine.TestPopR13 (1363 of 1787) PASS: lldb-api :: functionalities/data-formatter/data-formatter-synthval/TestDataFormatterSynthVal.py (1364 of 1787) PASS: lldb-shell :: ObjectFile/PECOFF/sections-names.yaml (1365 of 1787) PASS: lldb-api :: functionalities/unwind/sigtramp/TestSigtrampUnwind.py (1366 of 1787) PASS: lldb-api :: functionalities/data-formatter/var-in-aggregate-misuse/TestVarInAggregateMisuse.py (1367 of 1787) PASS: lldb-api :: lang/objc/variadic_methods/TestVariadicMethods.py (1368 of 1787) PASS: lldb-api :: lang/cpp/rvalue-references/TestRvalueReferences.py (1369 of 1787) PASS: lldb-unit :: Signals/./SignalsTests/UnixSignalsTest.Iteration (1370 of 1787) PASS: lldb-unit :: Language/Highlighting/./HighlighterTests/HighlighterTest.ClangCursorPosBeforeOtherToken (1371 of 1787) PASS: lldb-api :: functionalities/conditional_break/TestConditionalBreak.py (1372 of 1787) PASS: lldb-api :: lang/c/bitfields/TestBitfields.py (1373 of 1787) PASS: lldb-unit :: Utility/./UtilityTests/RangeTest.Constructor (1374 of 1787) PASS: lldb-unit :: Utility/./UtilityTests/StreamTest.PutCharNull (1375 of 1787) PASS: lldb-unit :: Expression/./ExpressionTests/DiagnosticManagerTest.GetStringBasic (1376 of 1787) PASS: lldb-api :: functionalities/thread/num_threads/TestNumThreads.py (1377 of 1787) PASS: lldb-api :: lang/cpp/namespace_definitions/TestNamespaceDefinitions.py (1378 of 1787) PASS: lldb-api :: functionalities/memory/find/TestMemoryFind.py (1379 of 1787) PASS: lldb-unit :: ScriptInterpreter/Python/./ScriptInterpreterPythonTests/PythonDataObjectsTest.TestBorrowedReferences (1380 of 1787) PASS: lldb-api :: functionalities/jitloader_gdb/TestJITLoaderGDB.py (1381 of 1787) PASS: lldb-unit :: ObjectFile/ELF/./ObjectFileELFTests/ObjectFileELFTest.SectionsResolveConsistently (1382 of 1787) PASS: lldb-unit :: Language/Highlighting/./HighlighterTests/HighlighterTest.HighlighterSelectionPath (1383 of 1787) PASS: lldb-unit :: Utility/./UtilityTests/TimeoutTest.Format (1384 of 1787) UNSUPPORTED: lldb-api :: benchmarks/expression/TestExpressionCmd.py (1385 of 1787) UNSUPPORTED: lldb-api :: functionalities/darwin_log/filter/regex/activity-chain/TestDarwinLogFilterRegexActivityChain.py (1386 of 1787) PASS: lldb-api :: functionalities/data-formatter/stringprinter/TestStringPrinter.py (1387 of 1787) PASS: lldb-unit :: Process/minidump/./LLDBMinidumpTests/MinidumpParserTest.FindMemoryRange (1388 of 1787) PASS: lldb-shell :: SymbolFile/DWARF/find-inline-method.s (1389 of 1787) PASS: lldb-unit :: Symbol/./SymbolTests/TestClangASTContext.TemplateArguments (1390 of 1787) PASS: lldb-unit :: SymbolFile/DWARF/./SymbolFileDWARFTests/SymbolFileDWARFTests.TestAbbrevOutOfOrder (1391 of 1787) PASS: lldb-api :: lang/cpp/this/TestCPPThis.py (1392 of 1787) PASS: lldb-api :: functionalities/data-formatter/data-formatter-categories/TestDataFormatterCategories.py (1393 of 1787) PASS: lldb-api :: lang/mixed/TestMixedLanguages.py (1394 of 1787) PASS: lldb-unit :: Utility/./UtilityTests/StringListTest.AppendListCStringArray (1395 of 1787) PASS: lldb-shell :: SymbolFile/DWARF/dwarf5-partial-index.cpp (1396 of 1787) PASS: lldb-api :: commands/settings/quoting/TestQuoting.py (1397 of 1787) PASS: lldb-shell :: SymbolFile/DWARF/debug-line-basic.s (1398 of 1787) PASS: lldb-api :: commands/expression/completion-in-lambda-and-unnnamed-class/TestCompletionInLambdaAndUnnamedClass.py (1399 of 1787) PASS: lldb-shell :: ObjectFile/Breakpad/discontiguous-sections.test (1400 of 1787) PASS: lldb-unit :: ObjectFile/PECOFF/./ObjectFilePECOFFTests/PECallFrameInfoTest.Frame_reg_eh (1401 of 1787) PASS: lldb-api :: functionalities/breakpoint/breakpoint_hit_count/TestBreakpointHitCount.py (1402 of 1787) PASS: lldb-api :: functionalities/source-map/TestTargetSourceMap.py (1403 of 1787) PASS: lldb-unit :: Utility/./UtilityTests/AnsiTerminal.AtEnd (1404 of 1787) PASS: lldb-unit :: Utility/./UtilityTests/StreamTest.PutHex64ByteOrderBig (1405 of 1787) PASS: lldb-unit :: Utility/./UtilityTests/BinaryStreamTest.PutULEB128One (1406 of 1787) PASS: lldb-api :: tools/lldb-server/TestGdbRemoteKill.py (1407 of 1787) PASS: lldb-unit :: UnwindAssembly/x86/./UnwindAssemblyx86Tests/Testx86AssemblyInspectionEngine.TestSubRSP (1408 of 1787) PASS: lldb-api :: functionalities/thread/concurrent_events/TestConcurrentWatchpointDelayWatchpointOneBreakpoint.py (1409 of 1787) PASS: lldb-api :: lang/cpp/lambdas/TestLambdas.py (1410 of 1787) PASS: lldb-api :: commands/watchpoints/watchpoint_on_vectors/TestValueOfVectorVariable.py (1411 of 1787) PASS: lldb-api :: functionalities/data-formatter/data-formatter-stl/libcxx/initializerlist/TestInitializerList.py (1412 of 1787) PASS: lldb-api :: python_api/lldbutil/iter/TestLLDBIterator.py (1413 of 1787) PASS: lldb-api :: lang/cpp/breakpoint-commands/TestCPPBreakpointCommands.py (1414 of 1787) PASS: lldb-api :: lang/objc/rdar-11355592/TestRdar11355592.py (1415 of 1787) PASS: lldb-unit :: Utility/./UtilityTests/VASprintfTest.BufferResize (1416 of 1787) PASS: lldb-unit :: Utility/./UtilityTests/ListenerTest.GetEventImmediate (1417 of 1787) PASS: lldb-unit :: Utility/./UtilityTests/StringExtractorTest.GetHexU8_Extra_NoEof (1418 of 1787) PASS: lldb-unit :: Host/./HostTests/FileSystemTest.FileAndDirectoryComponents (1419 of 1787) PASS: lldb-shell :: SymbolFile/NativePDB/globals-fundamental.cpp (1420 of 1787) PASS: lldb-unit :: Utility/./UtilityTests/StringListTest.AppendListCStringArrayEmpty (1421 of 1787) PASS: lldb-shell :: ObjectFile/ELF/section-permissions.yaml (1422 of 1787) PASS: lldb-api :: functionalities/data-formatter/data-formatter-stl/libcxx/variant/TestDataFormatterLibcxxVariant.py (1423 of 1787) PASS: lldb-unit :: Host/./HostTests/SocketTest.TCPGetAddress (1424 of 1787) PASS: lldb-unit :: Utility/./UtilityTests/RecordReplayTest.InstrumentedBar (1425 of 1787) PASS: lldb-unit :: Utility/./UtilityTests/ConstStringTest.format_provider (1426 of 1787) PASS: lldb-unit :: Target/./TargetTests/ModuleCacheTest.GetAndPutStrangeHostname (1427 of 1787) PASS: lldb-unit :: Symbol/./SymbolTests/LineEntryTest.GetSameLineContiguousAddressRangeNestedInline (1428 of 1787) PASS: lldb-unit :: SymbolFile/DWARF/./SymbolFileDWARFTests/SymbolFileDWARFTests.TestAbbrevValidAttrNullForm (1429 of 1787) PASS: lldb-unit :: Utility/./UtilityTests/StreamTest.PutRawBytesToBigEndian (1430 of 1787) PASS: lldb-unit :: Utility/./UtilityTests/TildeExpressionResolver.ResolveFullPath (1431 of 1787) PASS: lldb-api :: python_api/frame/inlines/TestInlinedFrame.py (1432 of 1787) PASS: lldb-unit :: Utility/./UtilityTests/BinaryStreamTest.PutSLEB128EightBytes (1433 of 1787) PASS: lldb-unit :: Utility/./UtilityTests/UriParserTest.PortOverflow (1434 of 1787) PASS: lldb-api :: lang/cpp/class-template-parameter-pack/TestClassTemplateParameterPack.py (1435 of 1787) UNSUPPORTED: lldb-api :: lang/cpp/function-template-parameter-pack/TestFunctionTemplateParameterPack.py (1436 of 1787) UNSUPPORTED: lldb-api :: tools/lldb-vscode/breakpoint/TestVSCode_setExceptionBreakpoints.py (1437 of 1787) PASS: lldb-api :: lang/objc/self/TestObjCSelf.py (1438 of 1787) PASS: lldb-unit :: tools/lldb-server/tests/./LLDBServerTests/TestBase.LaunchModePreservesEnvironment (1439 of 1787) PASS: lldb-unit :: Utility/./UtilityTests/VMRange.IsValid (1440 of 1787) PASS: lldb-unit :: Process/minidump/./LLDBMinidumpTests/MinidumpParserTest.FindMemoryRangeWithFullMemoryMinidump (1441 of 1787) PASS: lldb-unit :: debugserver/./debugserverTests/RNBSocket.AnyListen (1442 of 1787) PASS: lldb-unit :: Utility/./UtilityTests/ConstStringTest.UpdateMangledCounterpart (1443 of 1787) PASS: lldb-api :: macosx/find-app-in-bundle/TestFindAppInBundle.py (1444 of 1787) PASS: lldb-api :: functionalities/breakpoint/consecutive_breakpoints/TestConsecutiveBreakpoints.py (1445 of 1787) PASS: lldb-api :: lang/objc/objc-stepping/TestObjCStepping.py (1446 of 1787) PASS: lldb-unit :: Utility/./UtilityTests/StringExtractorTest.GetHexU8_InvalidHex_NoEof (1447 of 1787) PASS: lldb-unit :: Language/Highlighting/./HighlighterTests/HighlighterTest.DefaultHighlighterWithCursor (1448 of 1787) PASS: lldb-api :: python_api/signals/TestSignalsAPI.py (1449 of 1787) PASS: lldb-api :: tools/lldb-server/TestGdbRemoteExitCode.py (1450 of 1787) PASS: lldb-api :: lang/objc/objc-struct-return/TestObjCStructReturn.py (1451 of 1787) PASS: lldb-unit :: Utility/./UtilityTests/RegisterValueTest.GetSet8 (1452 of 1787) PASS: lldb-unit :: Utility/./UtilityTests/BinaryStreamTest.PutULEB128FiveBytes (1453 of 1787) PASS: lldb-unit :: Symbol/./SymbolTests/TestClangASTContext.TestGetBasicTypeFromEnum (1454 of 1787) PASS: lldb-api :: python_api/value/linked_list/TestValueAPILinkedList.py (1455 of 1787) PASS: lldb-unit :: UnwindAssembly/x86/./UnwindAssemblyx86Tests/Testx86AssemblyInspectionEngine.TestPushImm (1456 of 1787) PASS: lldb-api :: functionalities/load_unload/TestLoadUnload.py (1457 of 1787) PASS: lldb-api :: functionalities/thread/concurrent_events/TestConcurrentDelaySignalWatch.py (1458 of 1787) XFAIL: lldb-shell :: Register/x86-64-ymm-write.test (1459 of 1787) PASS: lldb-shell :: SymbolFile/DWARF/find-basic-namespace.cpp (1460 of 1787) PASS: lldb-unit :: Utility/./UtilityTests/FileSpecTest.FormatFileSpec (1461 of 1787) PASS: lldb-api :: lang/cpp/bool/TestCPPBool.py (1462 of 1787) PASS: lldb-unit :: Utility/./UtilityTests/StringListTest.Join (1463 of 1787) PASS: lldb-shell :: Driver/TestCommands.test (1464 of 1787) PASS: lldb-api :: api/log/TestAPILog.py (1465 of 1787) PASS: lldb-api :: commands/expression/call-function/TestCallBuiltinFunction.py (1466 of 1787) PASS: lldb-unit :: Utility/./UtilityTests/BinaryStreamTest.PutULEB128SixBytes (1467 of 1787) PASS: lldb-api :: functionalities/avoids-fd-leak/TestFdLeak.py (1468 of 1787) UNSUPPORTED: lldb-api :: lang/cpp/printf/TestPrintf.py (1469 of 1787) PASS: lldb-unit :: Language/Highlighting/./HighlighterTests/HighlighterTest.ClangOperators (1470 of 1787) PASS: lldb-unit :: Expression/./ExpressionTests/CppModuleConfigurationTest.UnknownLibCppFile (1471 of 1787) PASS: lldb-api :: lang/cpp/auto/TestCPPAuto.py (1472 of 1787) PASS: lldb-unit :: ObjectFile/Breakpad/./ObjectFileBreakpadTests/FileRecord.parse (1473 of 1787) UNSUPPORTED: lldb-api :: functionalities/breakpoint/hardware_breakpoints/hardware_breakpoint_on_multiple_threads/TestHWBreakMultiThread.py (1474 of 1787) PASS: lldb-unit :: UnwindAssembly/x86/./UnwindAssemblyx86Tests/Testx86AssemblyInspectionEngine.TestDisassemblyJunkBytes (1475 of 1787) PASS: lldb-unit :: Process/gdb-remote/./ProcessGdbRemoteTests/GDBRemoteCommunicationClientTest.ReadRegister (1476 of 1787) PASS: lldb-unit :: Utility/./UtilityTests/EnvironmentTest.EnvpConversion (1477 of 1787) PASS: lldb-api :: commands/expression/calculator_mode/TestCalculatorMode.py (1478 of 1787) PASS: lldb-unit :: Host/./HostTests/NativeProcessProtocolTest.ReadCStringFromMemory (1479 of 1787) PASS: lldb-api :: functionalities/postmortem/netbsd-core/TestNetBSDCore.py (1480 of 1787) PASS: lldb-unit :: Utility/./UtilityTests/ArgsTest.TestTrailingBackslash (1481 of 1787) PASS: lldb-api :: python_api/watchpoint/watchlocation/TestSetWatchlocation.py (1482 of 1787) PASS: lldb-unit :: Host/./HostTests/TaskPoolTest.AddTask (1483 of 1787) PASS: lldb-unit :: SymbolFile/DWARF/./SymbolFileDWARFTests/SymbolFileDWARFTests.TestAbilitiesForDWARF (1484 of 1787) PASS: lldb-unit :: Utility/./UtilityTests/LogChannelEnabledTest.LogThread (1485 of 1787) PASS: lldb-api :: lang/c/offsetof/TestOffsetof.py (1486 of 1787) PASS: lldb-api :: lang/cpp/accelerator-table/TestCPPAccelerator.py (1487 of 1787) PASS: lldb-unit :: ScriptInterpreter/Python/./ScriptInterpreterPythonTests/PythonDataObjectsTest.TestPythonIntegerToStr (1488 of 1787) PASS: lldb-shell :: SymbolFile/NativePDB/source-list.cpp (1489 of 1787) PASS: lldb-shell :: Register/x86-64-ymm-read.test (1490 of 1787) PASS: lldb-unit :: Symbol/./SymbolTests/DWARFCallFrameInfoTest.Basic_dwarf4 (1491 of 1787) PASS: lldb-api :: functionalities/breakpoint/require_hw_breakpoints/TestRequireHWBreakpoints.py (1492 of 1787) PASS: lldb-unit :: Host/./HostTests/NativeProcessProtocolTest.ReadCStringFromMemory_MaxSize (1493 of 1787) PASS: lldb-api :: lang/c/vla/TestVLA.py (1494 of 1787) PASS: lldb-shell :: ObjectFile/MachO/lc_build_version_notools.yaml (1495 of 1787) UNSUPPORTED: lldb-shell :: Register/x86-gp-read.test (1496 of 1787) PASS: lldb-api :: functionalities/deleted-executable/TestDeletedExecutable.py (1497 of 1787) PASS: lldb-api :: commands/watchpoints/multiple_threads/TestWatchpointMultipleThreads.py (1498 of 1787) PASS: lldb-shell :: Driver/TestConvenienceVariables.test (1499 of 1787) PASS: lldb-api :: commands/expression/expr-in-syscall/TestExpressionInSyscall.py (1500 of 1787) PASS: lldb-unit :: ScriptInterpreter/Python/./ScriptInterpreterPythonTests/PythonExceptionStateTest.TestManualRestoreSemantics (1501 of 1787) PASS: lldb-unit :: Language/CPlusPlus/./LanguageCPlusPlusTests/CPlusPlusLanguage.MethodNameParsing (1502 of 1787) PASS: lldb-api :: functionalities/breakpoint/cpp/TestCPPBreakpointLocations.py (1503 of 1787) PASS: lldb-api :: functionalities/data-formatter/type_summary_list_arg/TestTypeSummaryListArg.py (1504 of 1787) PASS: lldb-api :: macosx/order/TestOrderFile.py (1505 of 1787) UNSUPPORTED: lldb-api :: functionalities/darwin_log/filter/exact_match/category/TestDarwinLogFilterMatchCategory.py (1506 of 1787) PASS: lldb-unit :: Utility/./UtilityTests/ReproducerTest.SetReplay (1507 of 1787) PASS: lldb-shell :: SymbolFile/DWARF/find-basic-type.cpp (1508 of 1787) TIMEOUT: lldb-api :: tools/lldb-server/inferior-crash/TestGdbRemoteSegFault.py (1509 of 1787) ******************** TEST 'lldb-api :: tools/lldb-server/inferior-crash/TestGdbRemoteSegFault.py' FAILED ******************** Reached timeout of 1200 seconds ******************** PASS: lldb-api :: functionalities/thread/concurrent_events/TestConcurrentSignalNWatchNBreak.py (1510 of 1787) UNSUPPORTED: lldb-api :: functionalities/darwin_log/filter/regex/category/TestDarwinLogFilterRegexCategory.py (1511 of 1787) PASS: lldb-api :: functionalities/thread/concurrent_events/TestConcurrentSignalWatch.py (1512 of 1787) PASS: lldb-api :: functionalities/data-formatter/typedef_array/TestTypedefArray.py (1513 of 1787) PASS: lldb-unit :: Utility/./UtilityTests/StringListTest.InsertStringAtIndexStart (1514 of 1787) PASS: lldb-api :: functionalities/float-display/TestFloatDisplay.py (1515 of 1787) PASS: lldb-api :: python_api/value_var_update/TestValueVarUpdate.py (1516 of 1787) PASS: lldb-unit :: Language/Highlighting/./HighlighterTests/HighlighterTest.DefaultHighlighter (1517 of 1787) UNSUPPORTED: lldb-shell :: SymbolFile/PDB/variables.test (1518 of 1787) PASS: lldb-shell :: Settings/TestDisableColor.test (1519 of 1787) PASS: lldb-unit :: Utility/./UtilityTests/ArgsTest.TestQuotedUnknownEscape (1520 of 1787) PASS: lldb-api :: lang/cpp/symbols/TestSymbols.py (1521 of 1787) PASS: lldb-unit :: Utility/./UtilityTests/UUIDTest.RelationalOperators (1522 of 1787) PASS: lldb-unit :: Utility/./UtilityTests/RangeTest.DoesAdjoinOrIntersect (1523 of 1787) PASS: lldb-shell :: SymbolFile/DWARF/forward-declarations.s (1524 of 1787) PASS: lldb-api :: lang/cpp/diamond/TestDiamond.py (1525 of 1787) PASS: lldb-unit :: Utility/./UtilityTests/StringExtractorTest.DecodeHexU8_Underflow2 (1526 of 1787) PASS: lldb-unit :: Utility/./UtilityTests/BinaryStreamTest.PutSLEB128NineBytes (1527 of 1787) PASS: lldb-api :: commands/command/nested_alias/TestNestedAlias.py (1528 of 1787) PASS: lldb-api :: lang/cpp/unsigned_types/TestUnsignedTypes.py (1529 of 1787) PASS: lldb-unit :: SymbolFile/NativePDB/./SymbolFileNativePDBTests/PDBFPOProgramToDWARFExpressionTests.UnresolvedCyclicRegisterAssignmentReference (1530 of 1787) PASS: lldb-api :: functionalities/tail_call_frames/disambiguate_call_site/TestDisambiguateCallSite.py (1531 of 1787) PASS: lldb-unit :: ObjectFile/PECOFF/./ObjectFilePECOFFTests/PECallFrameInfoTest.Basic_eh (1532 of 1787) UNSUPPORTED: lldb-api :: commands/expression/macros/TestMacros.py (1533 of 1787) PASS: lldb-api :: lang/objc/objc++/TestObjCXX.py (1534 of 1787) PASS: lldb-unit :: Utility/./UtilityTests/StatusTest.Formatv (1535 of 1787) PASS: lldb-unit :: Utility/./UtilityTests/OptionsWithRawTest.WhitespaceInput (1536 of 1787) PASS: lldb-unit :: ScriptInterpreter/Python/./ScriptInterpreterPythonTests/PythonDataObjectsTest.TestExtractingUInt64ThroughStructuredData (1537 of 1787) PASS: lldb-shell :: ObjectFile/ELF/base-address.yaml (1538 of 1787) PASS: lldb-api :: commands/expression/pr35310/TestExprsBug35310.py (1539 of 1787) PASS: lldb-shell :: BuildScript/compiler-full-path.test (1540 of 1787) PASS: lldb-shell :: Breakpoint/case-sensitive.test (1541 of 1787) PASS: lldb-api :: functionalities/data-formatter/data-formatter-stl/libcxx/queue/TestDataFormatterLibcxxQueue.py (1542 of 1787) PASS: lldb-shell :: Commands/command-source.test (1543 of 1787) PASS: lldb-api :: lang/cpp/modules-import/TestCXXModulesImport.py (1544 of 1787) UNSUPPORTED: lldb-api :: commands/gui/basic/TestGuiBasic.py (1545 of 1787) PASS: lldb-shell :: Settings/TestModuleCacheSanity.test (1546 of 1787) PASS: lldb-shell :: Breakpoint/split-dwarf-5-addrbase.test (1547 of 1787) PASS: lldb-api :: functionalities/data-formatter/ostypeformatting/TestFormattersOsType.py (1548 of 1787) PASS: lldb-api :: lang/objc/single-entry-dictionary/TestObjCSingleEntryDictionary.py (1549 of 1787) PASS: lldb-api :: commands/command/history/TestCommandHistory.py (1550 of 1787) PASS: lldb-unit :: UnwindAssembly/x86/./UnwindAssemblyx86Tests/Testx86AssemblyInspectionEngine.TestPushEAX (1551 of 1787) UNSUPPORTED: lldb-shell :: Register/x86-ymm-read.test (1552 of 1787) PASS: lldb-api :: lang/objc/foundation/TestObjCMethodsNSArray.py (1553 of 1787) UNSUPPORTED: lldb-api :: tools/lldb-vscode/launch/TestVSCode_launch.py (1554 of 1787) PASS: lldb-unit :: Symbol/./SymbolTests/LineEntryTest.GetSameLineContiguousAddressRangeNoInlines (1555 of 1787) PASS: lldb-api :: functionalities/breakpoint/address_breakpoints/TestAddressBreakpoints.py (1556 of 1787) UNSUPPORTED: lldb-api :: functionalities/data-formatter/data-formatter-stl/libstdcpp/tuple/TestDataFormatterStdTuple.py (1557 of 1787) PASS: lldb-shell :: SymbolFile/NativePDB/ast-methods.cpp (1558 of 1787) PASS: lldb-unit :: Process/minidump/./LLDBMinidumpTests/MinidumpParserTest.GetLinuxProcStatus (1559 of 1787) PASS: lldb-unit :: Utility/./UtilityTests/AnsiTerminal.Incomplete (1560 of 1787) PASS: lldb-api :: tools/lldb-server/TestAppleSimulatorOSType.py (1561 of 1787) PASS: lldb-shell :: ObjectFile/PECOFF/basic-info-arm.yaml (1562 of 1787) PASS: lldb-shell :: SymbolFile/DWARF/debug-types-line-tables.s (1563 of 1787) PASS: lldb-shell :: BuildScript/toolchain-clang.test (1564 of 1787) PASS: lldb-api :: python_api/section/TestSectionAPI.py (1565 of 1787) PASS: lldb-shell :: Register/x86-64-gp-read.test (1566 of 1787) PASS: lldb-unit :: Utility/./UtilityTests/StringListTest.InsertStringAtIndexEnd (1567 of 1787) UNSUPPORTED: lldb-shell :: SymbolFile/PDB/calling-conventions.test (1568 of 1787) UNSUPPORTED: lldb-shell :: Register/x86-64-zmm-write.test (1569 of 1787) PASS: lldb-shell :: Commands/command-regex-unalias.test (1570 of 1787) PASS: lldb-unit :: Utility/./UtilityTests/StringExtractorTest.GetHexBytesAvail_OddPair (1571 of 1787) PASS: lldb-unit :: Utility/./UtilityTests/StreamTest.PutHex16ByteOrderLittle (1572 of 1787) PASS: lldb-api :: functionalities/postmortem/mach-core/TestMachCore.py (1573 of 1787) PASS: lldb-unit :: Utility/./UtilityTests/ScalarTest.Scalar_512 (1574 of 1787) PASS: lldb-unit :: Process/minidump/./LLDBMinidumpTests/MinidumpParserTest.GetMemoryRegionInfoFromMemoryList (1575 of 1787) PASS: lldb-api :: python_api/disassemble-raw-data/TestDisassembleRawData.py (1576 of 1787) UNSUPPORTED: lldb-shell :: SymbolFile/PDB/typedefs.test (1577 of 1787) PASS: lldb-api :: functionalities/tail_call_frames/inlining_and_tail_calls/TestInliningAndTailCalls.py (1578 of 1787) PASS: lldb-api :: commands/expression/import-std-module/unique_ptr-dbg-info-content/TestUniquePtrDbgInfoContent.py (1579 of 1787) PASS: lldb-unit :: Utility/./UtilityTests/LogChannelTest.EnableOptions (1580 of 1787) PASS: lldb-unit :: Utility/./UtilityTests/StringListTest.CopyListEmpty (1581 of 1787) PASS: lldb-unit :: Utility/./UtilityTests/StreamTest.PutHex8 (1582 of 1787) PASS: lldb-api :: macosx/find-dsym/bundle-with-dot-in-filename/TestBundleWithDotInFilename.py (1583 of 1787) PASS: lldb-api :: commands/expression/weak_symbols/TestWeakSymbols.py (1584 of 1787) UNSUPPORTED: lldb-api :: linux/sepdebugsymlink/TestTargetSymbolsSepDebugSymlink.py (1585 of 1787) PASS: lldb-api :: commands/watchpoints/hello_watchpoint/TestMyFirstWatchpoint.py (1586 of 1787) UNSUPPORTED: lldb-api :: tools/lldb-server/libraries-svr4/TestGdbRemoteLibrariesSvr4Support.py (1587 of 1787) PASS: lldb-api :: lang/c/anonymous/TestAnonymous.py (1588 of 1787) PASS: lldb-api :: api/multithreaded/TestMultithreaded.py (1589 of 1787) PASS: lldb-unit :: Utility/./UtilityTests/RangeTest.ContainsRange (1590 of 1787) PASS: lldb-unit :: Host/./HostTests/SocketAddressTest.GetAddressInfo (1591 of 1787) PASS: lldb-shell :: ObjectFile/ELF/duplicate-section.yaml (1592 of 1787) PASS: lldb-unit :: Process/gdb-remote/./ProcessGdbRemoteTests/GDBRemoteClientBaseTest.SendPacketAndReceiveResponseWithOutputSupport (1593 of 1787) PASS: lldb-unit :: Utility/./UtilityTests/BinaryStreamTest.PutSLEB128Zero (1594 of 1787) PASS: lldb-api :: commands/version/TestVersion.py (1595 of 1787) PASS: lldb-unit :: Utility/./UtilityTests/RangeTest.NotEqual (1596 of 1787) PASS: lldb-api :: lang/objc/ptr_refs/TestPtrRefsObjC.py (1597 of 1787) PASS: lldb-unit :: ScriptInterpreter/Python/./ScriptInterpreterPythonTests/PythonDataObjectsTest.TestPythonTupleToStructuredList (1598 of 1787) PASS: lldb-unit :: Utility/./UtilityTests/RangeDataVector.FindEntryThatContains_Overlap (1599 of 1787) PASS: lldb-api :: functionalities/data-formatter/data-formatter-synth/TestDataFormatterSynth.py (1600 of 1787) PASS: lldb-shell :: Reproducer/TestDriverOptions.test (1601 of 1787) PASS: lldb-api :: commands/expression/import-std-module/basic/TestImportStdModule.py (1602 of 1787) PASS: lldb-unit :: UnwindAssembly/x86/./UnwindAssemblyx86Tests/Testx86AssemblyInspectionEngine.TestPushRBPWithREX (1603 of 1787) PASS: lldb-unit :: Utility/./UtilityTests/RangeTest.EqualInvalid (1604 of 1787) PASS: lldb-unit :: Core/./LLDBCoreTests/RichManglingContextTest.Basic (1605 of 1787) PASS: lldb-unit :: Expression/./ExpressionTests/ClangHostTest.MacOSX (1606 of 1787) PASS: lldb-api :: commands/command/script/TestCommandScript.py (1607 of 1787) UNSUPPORTED: lldb-api :: lang/cpp/static_members/TestCPPStaticMembers.py (1608 of 1787) PASS: lldb-api :: functionalities/data-formatter/setvaluefromcstring/TestSetValueFromCString.py (1609 of 1787) PASS: lldb-api :: tools/lldb-server/TestGdbRemote_qThreadStopInfo.py (1610 of 1787) PASS: lldb-shell :: Register/x86-64-read.test (1611 of 1787) PASS: lldb-unit :: UnwindAssembly/x86/./UnwindAssemblyx86Tests/Testx86AssemblyInspectionEngine.TestPopESI (1612 of 1787) PASS: lldb-api :: lang/cpp/std-function-step-into-callable/TestStdFunctionStepIntoCallable.py (1613 of 1787) PASS: lldb-api :: functionalities/type_lookup/TestTypeLookup.py (1614 of 1787) PASS: lldb-unit :: Utility/./UtilityTests/DataExtractorTest.GetCStr (1615 of 1787) UNSUPPORTED: lldb-shell :: Breakpoint/ppc64-localentry.test (1616 of 1787) PASS: lldb-api :: functionalities/breakpoint/auto_continue/TestBreakpointAutoContinue.py (1617 of 1787) PASS: lldb-unit :: Utility/./UtilityTests/StringListTest.SplitIntoLinesEmpty (1618 of 1787) PASS: lldb-api :: lang/cpp/extern_c/TestExternCSymbols.py (1619 of 1787) PASS: lldb-api :: lang/objc/objc-new-syntax/TestObjCNewSyntaxLiteral.py (1620 of 1787) PASS: lldb-api :: commands/apropos/basic/TestApropos.py (1621 of 1787) PASS: lldb-unit :: Utility/./UtilityTests/StringExtractorTest.GetHexBytes_OddPair2 (1622 of 1787) PASS: lldb-api :: functionalities/data-formatter/data-formatter-objc/TestDataFormatterObjCNSData.py (1623 of 1787) PASS: lldb-unit :: Utility/./UtilityTests/BinaryStreamTest.PutSLEB128ThreeBytes (1624 of 1787) PASS: lldb-unit :: Language/Highlighting/./HighlighterTests/HighlighterTest.ClangPPDirectives (1625 of 1787) PASS: lldb-unit :: Symbol/./SymbolTests/TestClangASTContext.TestGetBasicTypeFromName (1626 of 1787) PASS: lldb-unit :: Process/minidump/./LLDBMinidumpTests/MinidumpParserTest.GetFilteredModuleList (1627 of 1787) PASS: lldb-shell :: ObjectFile/ELF/netbsd-core-amd64.test (1628 of 1787) PASS: lldb-unit :: Host/./HostTests/SocketAddressTest.Set (1629 of 1787) PASS: lldb-api :: functionalities/thread/concurrent_events/TestConcurrentTwoWatchpointsOneBreakpoint.py (1630 of 1787) PASS: lldb-api :: python_api/watchpoint/condition/TestWatchpointConditionAPI.py (1631 of 1787) PASS: lldb-unit :: Language/Highlighting/./HighlighterTests/HighlighterTest.Colons (1632 of 1787) PASS: lldb-api :: commands/expression/call-throws/TestCallThatThrows.py (1633 of 1787) PASS: lldb-api :: python_api/value/change_values/TestChangeValueAPI.py (1634 of 1787) PASS: lldb-api :: functionalities/thread/concurrent_events/TestConcurrentWatchBreakDelay.py (1635 of 1787) PASS: lldb-unit :: ScriptInterpreter/Python/./ScriptInterpreterPythonTests/PythonDataObjectsTest.TestPythonListToStructuredList (1636 of 1787) PASS: lldb-unit :: Target/./TargetTests/ExecutionContextTest.GetByteOrder (1637 of 1787) PASS: lldb-unit :: Utility/./UtilityTests/TimerTest.CategoryTimes2 (1638 of 1787) UNSUPPORTED: lldb-api :: arm/breakpoint-it/TestBreakpointIt.py (1639 of 1787) PASS: lldb-api :: python_api/process/TestProcessAPI.py (1640 of 1787) PASS: lldb-shell :: Minidump/disassemble-no-module.yaml (1641 of 1787) PASS: lldb-unit :: Expression/./ExpressionTests/CppModuleConfigurationTest.MissingUsrInclude (1642 of 1787) UNSUPPORTED: lldb-shell :: Register/arm-gp-read.test (1643 of 1787) PASS: lldb-unit :: Utility/./UtilityTests/StreamTest.PutRawBytesToLittleEndian (1644 of 1787) PASS: lldb-api :: functionalities/data-formatter/data-formatter-objc/TestDataFormatterObjNSException.py (1645 of 1787) PASS: lldb-api :: lang/objc/objc-checker/TestObjCCheckers.py (1646 of 1787) PASS: lldb-unit :: Utility/./UtilityTests/ArgsTest.TestMultipleArgs (1647 of 1787) PASS: lldb-unit :: Utility/./UtilityTests/ProcessInfoTest.Constructor (1648 of 1787) PASS: lldb-api :: python_api/sblaunchinfo/TestSBLaunchInfo.py (1649 of 1787) PASS: lldb-unit :: Utility/./UtilityTests/DataExtractorTest.GetMaxU64_unchecked (1650 of 1787) PASS: lldb-unit :: Utility/./UtilityTests/FileSpecTest.EqualDotsPosixRoot (1651 of 1787) UNSUPPORTED: lldb-shell :: SymbolFile/PDB/function-level-linking.test (1652 of 1787) PASS: lldb-unit :: Host/./HostTests/NativeProcessProtocolTest.SetBreakpointFailWrite (1653 of 1787) PASS: lldb-unit :: Utility/./UtilityTests/StreamTest.ShiftOperatorPtr (1654 of 1787) PASS: lldb-unit :: Target/./TargetTests/PathMappingListTest.RemapRoot (1655 of 1787) PASS: lldb-api :: tools/lldb-server/TestGdbRemoteThreadsInStopReply.py (1656 of 1787) PASS: lldb-unit :: UnwindAssembly/x86/./UnwindAssemblyx86Tests/Testx86AssemblyInspectionEngine.TestPushESI (1657 of 1787) PASS: lldb-api :: lang/c/step-target/TestStepTarget.py (1658 of 1787) PASS: lldb-api :: lang/objc/objc-runtime-ivars/TestRuntimeIvars.py (1659 of 1787) PASS: lldb-unit :: Utility/./UtilityTests/ArgsTest.TestQuotedTrailingBackslash (1660 of 1787) PASS: lldb-api :: commands/frame/diagnose/dereference-this/TestDiagnoseDereferenceThis.py (1661 of 1787) PASS: lldb-unit :: Utility/./UtilityTests/StringListTest.CopyListSingle (1662 of 1787) PASS: lldb-unit :: SymbolFile/DWARF/./SymbolFileDWARFTests/SymbolFileDWARFTests.TestAbbrevMissingTerminator (1663 of 1787) PASS: lldb-shell :: SymbolFile/NativePDB/function-types-builtins.cpp (1664 of 1787) PASS: lldb-api :: lang/cpp/virtual-overload/TestVirtualOverload.py (1665 of 1787) PASS: lldb-api :: macosx/add-dsym/TestAddDsymMidExecutionCommand.py (1666 of 1787) PASS: lldb-api :: commands/watchpoints/watchpoint_size/TestWatchpointSizes.py (1667 of 1787) PASS: lldb-unit :: Utility/./UtilityTests/StringListTest.CopyList (1668 of 1787) PASS: lldb-api :: functionalities/postmortem/wow64_minidump/TestWow64MiniDump.py (1669 of 1787) PASS: lldb-shell :: SymbolFile/NativePDB/s_constant.cpp (1670 of 1787) PASS: lldb-unit :: Utility/./UtilityTests/StringListTest.DefaultConstructor (1671 of 1787) PASS: lldb-api :: lang/objc/objc-ivar-protocols/TestIvarProtocols.py (1672 of 1787) PASS: lldb-unit :: Utility/./UtilityTests/StringExtractorTest.GetU32BigEndian (1673 of 1787) PASS: lldb-unit :: Host/./HostTests/MainLoopTest.ReadObject (1674 of 1787) PASS: lldb-api :: functionalities/tsan/basic/TestTsanBasic.py (1675 of 1787) PASS: lldb-api :: functionalities/thread/concurrent_events/TestConcurrentSignalBreak.py (1676 of 1787) PASS: lldb-shell :: SymbolFile/NativePDB/function-types-classes.cpp (1677 of 1787) PASS: lldb-unit :: Utility/./UtilityTests/StreamTeeTest.SetStreamAtIndexOverwrite (1678 of 1787) PASS: lldb-api :: sanity/TestModuleCacheSanity.py (1679 of 1787) PASS: lldb-shell :: SymbolFile/DWARF/find-basic-variable.cpp (1680 of 1787) PASS: lldb-unit :: Utility/./UtilityTests/ArchSpecTest.TestSetTriple (1681 of 1787) PASS: lldb-shell :: SymbolFile/DWARF/debug_ranges_and_rnglists.test (1682 of 1787) PASS: lldb-api :: python_api/target/TestTargetAPI.py (1683 of 1787) PASS: lldb-unit :: Host/./HostTests/SocketTest.DomainGetConnectURI (1684 of 1787) PASS: lldb-api :: functionalities/breakpoint/breakpoint_locations/TestBreakpointLocations.py (1685 of 1787) PASS: lldb-api :: python_api/lldbutil/TestSwigVersion.py (1686 of 1787) PASS: lldb-unit :: Host/./HostTests/SocketTest.DecodeHostAndPort (1687 of 1787) PASS: lldb-unit :: ScriptInterpreter/Python/./ScriptInterpreterPythonTests/PythonDataObjectsTest.TestGlobalNameResolutionNoDot (1688 of 1787) PASS: lldb-unit :: Process/gdb-remote/./ProcessGdbRemoteTests/GDBRemoteCommunicationServerTest.SendErrorResponse_StringError (1689 of 1787) UNSUPPORTED: lldb-shell :: Unwind/eh-frame-small-fde.test (1690 of 1787) PASS: lldb-api :: lang/objc/objc-static-method/TestObjCStaticMethod.py (1691 of 1787) PASS: lldb-unit :: Utility/./UtilityTests/Predicate.WaitForValueEqualTo (1692 of 1787) PASS: lldb-unit :: Utility/./UtilityTests/NameMatchesTest.Contains (1693 of 1787) PASS: lldb-unit :: Utility/./UtilityTests/ProcessInstanceInfo.Dump (1694 of 1787) PASS: lldb-api :: functionalities/completion/TestCompletion.py (1695 of 1787) PASS: lldb-shell :: SymbolFile/DWARF/debug_loc.s (1696 of 1787) PASS: lldb-unit :: Utility/./UtilityTests/VMRange.Ordering (1697 of 1787) PASS: lldb-unit :: Core/./LLDBCoreTests/UniqueCStringMap.NoDefaultConstructor (1698 of 1787) PASS: lldb-unit :: Symbol/./SymbolTests/LineEntryTest.GetSameLineContiguousAddressRangeOneInline (1699 of 1787) PASS: lldb-api :: functionalities/modern-type-lookup/objc-modules/TestObjModulesModernTypeLookup.py (1700 of 1787) PASS: lldb-unit :: Utility/./UtilityTests/UriParserTest.BracketedHostnameWithColon (1701 of 1787) PASS: lldb-unit :: Utility/./UtilityTests/BinaryStreamTest.PutULEB128MaxValue (1702 of 1787) PASS: lldb-unit :: Utility/./UtilityTests/StructuredDataTest.StringDump (1703 of 1787) PASS: lldb-api :: functionalities/gdb_remote_client/TestStopPCs.py (1704 of 1787) PASS: lldb-unit :: Utility/./UtilityTests/DeserializerTest.HasData (1705 of 1787) PASS: lldb-unit :: Utility/./UtilityTests/StringListTest.Clear (1706 of 1787) PASS: lldb-unit :: Host/./HostTests/HostInfoTest.GetHostname (1707 of 1787) PASS: lldb-unit :: ScriptInterpreter/Python/./ScriptInterpreterPythonTests/PythonDataObjectsTest.TestPythonIntegerToStructuredInteger (1708 of 1787) PASS: lldb-api :: lang/objc/objc-optimized/TestObjcOptimized.py (1709 of 1787) PASS: lldb-unit :: Expression/./ExpressionTests/DWARFExpression.DW_OP_pick (1710 of 1787) UNSUPPORTED: lldb-api :: tools/lldb-vscode/breakpoint/TestVSCode_setBreakpoints.py (1711 of 1787) PASS: lldb-api :: lang/objcxx/hide-runtime-values/TestObjCXXHideRuntimeValues.py (1712 of 1787) PASS: lldb-unit :: Utility/./UtilityTests/VMRange.Comparison (1713 of 1787) PASS: lldb-api :: lang/cpp/gmodules-templates/TestGModules.py (1714 of 1787) PASS: lldb-api :: commands/reproducer/invalid-args/TestInvalidArgsReproducer.py (1715 of 1787) PASS: lldb-api :: lang/objc/conflicting-definition/TestConflictingDefinition.py (1716 of 1787) PASS: lldb-api :: lang/c/stepping/TestThreadStepping.py (1717 of 1787) PASS: lldb-unit :: Utility/./UtilityTests/StructuredDataTest.ParseJSONFromFile (1718 of 1787) PASS: lldb-unit :: Core/./LLDBCoreTests/MangledTest.ResultForValidName (1719 of 1787) PASS: lldb-api :: lang/cpp/gmodules/TestWithModuleDebugging.py (1720 of 1787) PASS: lldb-unit :: Process/gdb-remote/./ProcessGdbRemoteTests/GDBRemoteCommunicationClientTest.GetModulesInfoInvalidResponse (1721 of 1787) PASS: lldb-api :: functionalities/breakpoint/breakpoint_language/TestBreakpointLanguage.py (1722 of 1787) PASS: lldb-api :: functionalities/tail_call_frames/disambiguate_tail_call_seq/TestDisambiguateTailCallSeq.py (1723 of 1787) PASS: lldb-api :: commands/expression/import-std-module/vector-of-vectors/TestVectorOfVectors.py (1724 of 1787) PASS: lldb-unit :: Utility/./UtilityTests/BinaryStreamTest.PutULEB128TwoBytes (1725 of 1787) PASS: lldb-shell :: Settings/TestStopCommandSourceOnError.test (1726 of 1787) PASS: lldb-api :: commands/expression/import-std-module/empty-module/TestEmptyStdModule.py (1727 of 1787) XFAIL: lldb-shell :: Register/x86-64-write.test (1728 of 1787) PASS: lldb-unit :: Utility/./UtilityTests/RangeDataVector.FindEntryThatContains (1729 of 1787) PASS: lldb-unit :: UnwindAssembly/x86/./UnwindAssemblyx86Tests/Testx86AssemblyInspectionEngine.TestPopEBX (1730 of 1787) PASS: lldb-unit :: SymbolFile/NativePDB/./SymbolFileNativePDBTests/PDBFPOProgramToDWARFExpressionTests.MultipleDependentAssignments (1731 of 1787) PASS: lldb-unit :: Utility/./UtilityTests/AnsiTerminal.Twice (1732 of 1787) PASS: lldb-api :: functionalities/gdb_remote_client/TestGDBRemoteLoad.py (1733 of 1787) PASS: lldb-unit :: Utility/./UtilityTests/LogChannelEnabledTest.LogGetLogThread (1734 of 1787) PASS: lldb-api :: functionalities/breakpoint/cpp_exception/TestCPPExceptionBreakpoint.py (1735 of 1787) PASS: lldb-unit :: Utility/./UtilityTests/ListenerTest.GetEventWait (1736 of 1787) PASS: lldb-shell :: ObjectFile/ELF/netbsd-exec-8.99.30-amd64.yaml (1737 of 1787) PASS: lldb-unit :: Utility/./UtilityTests/SerializationRountripTest.SerializeDeserializeObjectReference (1738 of 1787) PASS: lldb-shell :: Breakpoint/debug_rnglist_basic.test (1739 of 1787) PASS: lldb-unit :: Utility/./UtilityTests/AnsiTerminal.Basic (1740 of 1787) PASS: lldb-unit :: Process/gdb-remote/./ProcessGdbRemoteTests/GDBRemoteCommunicationClientTest.WriteRegisterNoSuffix (1741 of 1787) PASS: lldb-shell :: ExecControl/StopHook/stop-hook.test (1742 of 1787) PASS: lldb-unit :: ObjectFile/ELF/./ObjectFileELFTests/ObjectFileELFTest.GetSymtab_NoSymEntryPointArmAddressClass (1743 of 1787) PASS: lldb-shell :: SymbolFile/DWARF/debug_ranges-missing-section.s (1744 of 1787) PASS: lldb-api :: commands/expression/import-std-module/deque-dbg-info-content/TestDbgInfoContentDeque.py (1745 of 1787) PASS: lldb-api :: commands/expression/timeout/TestCallWithTimeout.py (1746 of 1787) PASS: lldb-unit :: ObjectFile/Breakpad/./ObjectFileBreakpadTests/FuncRecord.parse (1747 of 1787) PASS: lldb-api :: lang/objc/exceptions/TestObjCExceptions.py (1748 of 1787) PASS: lldb-api :: types/TestDoubleTypes.py (1749 of 1787) PASS: lldb-unit :: Utility/./UtilityTests/FileSpecTest.EqualDotsWindows (1750 of 1787) PASS: lldb-unit :: SymbolFile/NativePDB/./SymbolFileNativePDBTests/PDBFPOProgramToDWARFExpressionTests.UnsupportedRASearch (1751 of 1787) PASS: lldb-unit :: Utility/./UtilityTests/StringListTest.LongestCommonPrefixNoPrefix (1752 of 1787) PASS: lldb-unit :: Language/Highlighting/./HighlighterTests/HighlighterTest.ClangCursorPosAfterOtherToken (1753 of 1787) PASS: lldb-unit :: Utility/./UtilityTests/FileSpecTest.GuessPathStyle (1754 of 1787) PASS: lldb-api :: lang/objcxx/objcxx-ivar-vector/TestIvarVector.py (1755 of 1787) PASS: lldb-api :: lang/cpp/operator-overload/TestOperatorOverload.py (1756 of 1787) PASS: lldb-unit :: Utility/./UtilityTests/CompletionRequest.TryCompleteCurrentArgBad (1757 of 1787) PASS: lldb-unit :: UnwindAssembly/x86/./UnwindAssemblyx86Tests/Testx86AssemblyInspectionEngine.TestPushEDI (1758 of 1787) PASS: lldb-shell :: SymbolFile/NativePDB/bitfields.cpp (1759 of 1787) UNSUPPORTED: lldb-api :: functionalities/data-formatter/data-formatter-stl/libstdcpp/iterator/TestDataFormatterStdIterator.py (1760 of 1787) PASS: lldb-unit :: Utility/./UtilityTests/ConstStringTest.CompareStringRef (1761 of 1787) PASS: lldb-api :: functionalities/data-formatter/data-formatter-stl/libcxx/iterator/TestDataFormatterLibccIterator.py (1762 of 1787) PASS: lldb-api :: functionalities/thread/concurrent_events/TestConcurrentCrashWithSignal.py (1763 of 1787) PASS: lldb-unit :: ObjectFile/ELF/./ObjectFileELFTests/ObjectFileELFTest.GetModuleSpecifications_EarlySectionHeaders (1764 of 1787) PASS: lldb-shell :: SymbolFile/DWARF/debug_ranges.s (1765 of 1787) PASS: lldb-api :: commands/expression/test/TestExprs.py (1766 of 1787) PASS: lldb-api :: python_api/thread/TestThreadAPI.py (1767 of 1787) PASS: lldb-unit :: Interpreter/./InterpreterTests/OptionArgParserTest.toBoolean (1768 of 1787) PASS: lldb-unit :: ScriptInterpreter/Python/./ScriptInterpreterPythonTests/PythonDataObjectsTest.TestCallable (1769 of 1787) PASS: lldb-api :: lang/c/tls_globals/TestTlsGlobals.py (1770 of 1787) PASS: lldb-unit :: tools/lldb-server/tests/./LLDBServerTests/TestBase.DebugserverEnv (1771 of 1787) PASS: lldb-shell :: ObjectFile/ELF/section-types.yaml (1772 of 1787) PASS: lldb-api :: lang/objc/objc-builtin-types/TestObjCBuiltinTypes.py (1773 of 1787) PASS: lldb-api :: functionalities/postmortem/minidump-new/TestMiniDumpNew.py (1774 of 1787) UNSUPPORTED: lldb-api :: python_api/event/TestEvents.py (1775 of 1787) PASS: lldb-shell :: SymbolFile/DWARF/find-function-regex.cpp (1776 of 1787) PASS: lldb-api :: lang/cpp/stl/TestStdCXXDisassembly.py (1777 of 1787) PASS: lldb-api :: lang/objc/modules-auto-import/TestModulesAutoImport.py (1778 of 1787) PASS: lldb-api :: commands/expression/import-std-module/list-basic/TestBasicList.py (1779 of 1787) PASS: lldb-api :: lang/objc/foundation/TestObjectDescriptionAPI.py (1780 of 1787) PASS: lldb-api :: python_api/module_section/TestModuleAndSection.py (1781 of 1787) PASS: lldb-api :: functionalities/breakpoint/breakpoint_conditions/TestBreakpointConditions.py (1782 of 1787) PASS: lldb-api :: lang/objc/objc-property/TestObjCProperty.py (1783 of 1787) PASS: lldb-api :: lang/objc/foundation/TestFoundationDisassembly.py (1784 of 1787) PASS: lldb-api :: tools/lldb-server/TestLldbGdbServer.py (1785 of 1787) PASS: lldb-api :: lang/cpp/enum_types/TestCPP11EnumTypes.py (1786 of 1787) PASS: lldb-api :: types/TestIntegerTypesExpr.py (1787 of 1787) Testing Time: 1666.54s ******************** Failing Tests (1): lldb-api :: tools/lldb-server/commandline/TestStubSetSID.py

Hide Details

******************** Timed Out Tests (1): lldb-api :: tools/lldb-server/inferior-crash/TestGdbRemoteSegFault.py

Hide Details

Hide Details

Slowest Tests: -------------------------------------------------------------------------- 106.50s: lldb-api :: functionalities/inferior-crashing/TestInferiorCrashingStep.py 114.44s: lldb-api :: commands/expression/import-std-module/stack/TestStack.py 114.79s: lldb-api :: api/check_public_api_headers/TestPublicAPIHeaders.py 116.93s: lldb-api :: lang/objc/foundation/TestObjCMethodsString.py 118.40s: lldb-api :: commands/target/basic/TestTargetCommand.py 121.22s: lldb-api :: functionalities/load_unload/TestLoadUnload.py 131.09s: lldb-api :: lang/objc/objc-new-syntax/TestObjCNewSyntaxArray.py 137.50s: lldb-api :: lang/objc/objc-new-syntax/TestObjCNewSyntaxDictionary.py 155.58s: lldb-api :: lang/objc/exceptions/TestObjCExceptions.py 158.33s: lldb-api :: functionalities/recursion/TestValueObjectRecursion.py 166.80s: lldb-api :: lang/objc/objc-new-syntax/TestObjCNewSyntaxLiteral.py 174.86s: lldb-api :: functionalities/return-value/TestReturnValue.py 178.20s: lldb-api :: lang/cpp/namespace/TestNamespaceLookup.py 186.95s: lldb-api :: lang/objc/foundation/TestObjCMethods.py 212.64s: lldb-api :: api/multithreaded/TestMultithreaded.py 217.62s: lldb-api :: lang/objc/hidden-ivars/TestHiddenIvars.py 293.28s: lldb-api :: types/TestIntegerTypesExpr.py 401.04s: lldb-api :: types/TestIntegerTypes.py 646.28s: lldb-api :: lang/objc/foundation/TestFoundationDisassembly.py 1200.35s: lldb-api :: tools/lldb-server/inferior-crash/TestGdbRemoteSegFault.py

Hide Details

Tests Times: -------------------------------------------------------------------------- [ Range ] :: [ Percentage ] :: [ Count ] -------------------------------------------------------------------------- [ 0s, 100s) :: [*************************************** ] :: [1760/1787] [ 100s, 200s) :: [ ] :: [ 20/1787] [ 200s, 300s) :: [ ] :: [ 3/1787] [ 300s, 400s) :: [ ] :: [ 1/1787] [ 400s, 500s) :: [ ] :: [ 1/1787] [ 500s, 600s) :: [ ] :: [ 0/1787] [ 600s, 700s) :: [ ] :: [ 1/1787] [ 700s, 800s) :: [ ] :: [ 0/1787] [ 800s, 900s) :: [ ] :: [ 0/1787] [ 900s,1000s) :: [ ] :: [ 0/1787] [1000s,1100s) :: [ ] :: [ 0/1787] [1100s,1200s) :: [ ] :: [ 0/1787] [1200s,1300s) :: [ ] :: [ 1/1787] Expected Passes : 1635 Expected Failures : 6 Unsupported Tests : 144 Unexpected Failures: 1 Individual Timeouts: 1 FAILED: tools/lldb/test/CMakeFiles/check-lldb-lit cd /Users/buildslave/jenkins/workspace/lldb-cmake-sanitized/lldb-build/tools/lldb/test && /usr/bin/python /Users/buildslave/jenkins/workspace/lldb-cmake-sanitized/lldb-build/./bin/llvm-lit -v --time-tests --shuffle --xunit-xml-output=/Users/buildslave/jenkins/workspace/lldb-cmake-sanitized/test/results.xml -v --timeout 1200 /Users/buildslave/jenkins/workspace/lldb-cmake-sanitized/lldb-build/tools/lldb/test ninja: build stopped: subcommand failed. Command failed Command: ['/usr/bin/env', 'TERM=vt100', '/usr/local/bin/ninja', '-v', 'check-lldb'] [Pipeline] } [Pipeline] // timeout [Pipeline] } [Pipeline] // stage [Pipeline] stage [Pipeline] { (Declarative: Post Actions) [Pipeline] scanForIssues No credentials specified [Clang (LLVM based)] Sleeping for 5 seconds due to JENKINS-32191... [Clang (LLVM based)] Parsing console log (workspace: '/Users/buildslave/jenkins/workspace/lldb-cmake-sanitized') [Pipeline] junit Recording test results [Pipeline] } [Pipeline] // stage [Pipeline] } [Pipeline] // withEnv [Pipeline] } [Pipeline] // node [Pipeline] End of Pipeline [BFA] Scanning build for known causes... [BFA] Found failure cause(s): [BFA] Ninja target failed from category Compile [BFA] Regression test failed from category Test [BFA] Done. 1s ERROR: script returned exit code 1 Finished: FAILURE