FailedConsole Output

Skipping 6,841 KB.. Full Log
88)
PASS: lldb-api :: python_api/formatters/TestFormattersSBAPI.py (390 of 1788)
PASS: lldb-api :: functionalities/thread/concurrent_events/TestConcurrentSignalNWatchNBreak.py (391 of 1788)
PASS: lldb-unit :: Utility/./UtilityTests/StringListTest.AppendStringCString (392 of 1788)
PASS: lldb-unit :: Utility/./UtilityTests/StringExtractorTest.GetHexBytesAvail_OddPair2 (393 of 1788)
PASS: lldb-unit :: UnwindAssembly/x86/./UnwindAssemblyx86Tests/Testx86AssemblyInspectionEngine.TestPushR13 (394 of 1788)
PASS: lldb-shell :: Reproducer/TestDriverOptions.test (395 of 1788)
PASS: lldb-unit :: Utility/./UtilityTests/ArchSpecTest.TripleComponentsWereSpecified (396 of 1788)
UNSUPPORTED: lldb-api :: functionalities/thread/concurrent_events/TestConcurrentManySignals.py (397 of 1788)
UNSUPPORTED: lldb-api :: functionalities/breakpoint/hardware_breakpoints/hardware_breakpoint_on_multiple_threads/TestHWBreakMultiThread.py (398 of 1788)
PASS: lldb-unit :: Utility/./UtilityTests/StringListTest.PopBack (399 of 1788)
PASS: lldb-api :: lang/cpp/lambdas/TestLambdas.py (400 of 1788)
PASS: lldb-api :: functionalities/pre_run_dylibs/TestPreRunDylibs.py (401 of 1788)
PASS: lldb-unit :: Utility/./UtilityTests/StreamTest.PutMaxHex64ByteOrderBig (402 of 1788)
PASS: lldb-unit :: Symbol/./SymbolTests/LineEntryTest.GetSameLineContiguousAddressRangeNestedInline (403 of 1788)
PASS: lldb-unit :: Process/minidump/./LLDBMinidumpTests/MinidumpParserTest.InvalidMinidump (404 of 1788)
PASS: lldb-unit :: Utility/./UtilityTests/AnsiTerminal.KnownPrefix (405 of 1788)
PASS: lldb-api :: functionalities/type_completion/TestTypeCompletion.py (406 of 1788)
PASS: lldb-api :: functionalities/data-formatter/boolreference/TestFormattersBoolRefPtr.py (407 of 1788)
PASS: lldb-shell :: SymbolFile/DWARF/debug-types-dwarf5.s (408 of 1788)
PASS: lldb-unit :: Core/./LLDBCoreTests/MangledTest.EmptyForInvalidName (409 of 1788)
PASS: lldb-api :: lang/cpp/enum_types/TestCPP11EnumTypes.py (410 of 1788)
PASS: lldb-unit :: Process/gdb-remote/./ProcessGdbRemoteTests/GDBRemoteClientBaseTest.SendContinueAndAsyncPacket (411 of 1788)
PASS: lldb-api :: terminal/TestSTTYBeforeAndAfter.py (412 of 1788)
PASS: lldb-unit :: Host/./HostTests/FileActionTest.Open (413 of 1788)
PASS: lldb-unit :: Utility/./UtilityTests/LogChannelEnabledTest.log_options (414 of 1788)
PASS: lldb-unit :: Utility/./UtilityTests/StringExtractorTest.GetHexBytesAvail (415 of 1788)
PASS: lldb-api :: lang/c/bitfields/TestBitfields.py (416 of 1788)
PASS: lldb-api :: commands/expression/po_verbosity/TestPoVerbosity.py (417 of 1788)
PASS: lldb-api :: tools/lldb-server/TestGdbRemoteProcessInfo.py (418 of 1788)
UNSUPPORTED: lldb-shell :: Register/x86-gp-read.test (419 of 1788)
PASS: lldb-unit :: Utility/./UtilityTests/RegisterValueTest.GetSet8 (420 of 1788)
PASS: lldb-api :: commands/frame/language/TestGuessLanguage.py (421 of 1788)
PASS: lldb-shell :: ObjectFile/PECOFF/uuid.yaml (422 of 1788)
PASS: lldb-unit :: tools/lldb-server/tests/./LLDBServerTests/TestBase.LaunchModePreservesEnvironment (423 of 1788)
UNSUPPORTED: lldb-api :: commands/expression/completion-crash-incomplete-record/TestCompletionCrashIncompleteRecord.py (424 of 1788)
PASS: lldb-shell :: Commands/command-regex-delete.test (425 of 1788)
PASS: lldb-shell :: SymbolFile/NativePDB/break-by-function.cpp (426 of 1788)
PASS: lldb-shell :: SymbolFile/DWARF/debug_ranges_and_rnglists.test (427 of 1788)
PASS: lldb-api :: functionalities/abbreviation/TestAbbreviations.py (428 of 1788)
PASS: lldb-api :: lang/objc/conflicting-definition/TestConflictingDefinition.py (429 of 1788)
PASS: lldb-unit :: Utility/./UtilityTests/RangeTest.Union (430 of 1788)
PASS: lldb-unit :: Utility/./UtilityTests/ScalarTest.APIntConstructor (431 of 1788)
PASS: lldb-unit :: Utility/./UtilityTests/RangeTest.ContainsEndInclusive (432 of 1788)
PASS: lldb-api :: functionalities/dead-strip/TestDeadStrip.py (433 of 1788)
PASS: lldb-api :: lang/c/array_types/TestArrayTypes.py (434 of 1788)
PASS: lldb-api :: functionalities/breakpoint/cpp/TestCPPBreakpointLocations.py (435 of 1788)
PASS: lldb-api :: functionalities/asan/TestMemoryHistory.py (436 of 1788)
PASS: lldb-unit :: Process/gdb-remote/./ProcessGdbRemoteTests/GDBRemoteCommunicationClientTest.SendGetTraceConfigPacket (437 of 1788)
PASS: lldb-unit :: Host/./HostTests/NativeProcessProtocolTest.SetBreakpointFailWrite (438 of 1788)
UNSUPPORTED: lldb-api :: commands/expression/multiline-completion/TestMultilineCompletion.py (439 of 1788)
PASS: lldb-api :: commands/expression/rdar42038760/TestScalarURem.py (440 of 1788)
PASS: lldb-unit :: Utility/./UtilityTests/StringListTest.AppendListCStringArray (441 of 1788)
PASS: lldb-api :: functionalities/data-formatter/data-formatter-objc/nsindexpath/TestDataFormatterNSIndexPath.py (442 of 1788)
PASS: lldb-api :: functionalities/unwind/noreturn/module-end/TestNoReturnModuleEnd.py (443 of 1788)
PASS: lldb-shell :: Minidump/breakpad-symbols.test (444 of 1788)
PASS: lldb-api :: functionalities/thread/concurrent_events/TestConcurrentBreakpointDelayBreakpointOneSignal.py (445 of 1788)
PASS: lldb-api :: macosx/nslog/TestDarwinNSLogOutput.py (446 of 1788)
PASS: lldb-unit :: Utility/./UtilityTests/RangeTest.ContainsRangeStartingFromZero (447 of 1788)
UNSUPPORTED: lldb-shell :: SymbolFile/NativePDB/ast-functions-msvc.cpp (448 of 1788)
PASS: lldb-shell :: ObjectFile/ELF/build-id-case.yaml (449 of 1788)
PASS: lldb-unit :: Host/./HostTests/TaskPoolTest.RunTasks (450 of 1788)
PASS: lldb-shell :: ObjectFile/Breakpad/discontiguous-sections.test (451 of 1788)
PASS: lldb-api :: lang/cpp/gmodules-templates/TestGModules.py (452 of 1788)
PASS: lldb-unit :: Interpreter/./InterpreterTests/CompletionTest.DirCompletionUsername (453 of 1788)
PASS: lldb-api :: commands/log/basic/TestLogging.py (454 of 1788)
PASS: lldb-api :: commands/expression/import-std-module/deque-basic/TestBasicDeque.py (455 of 1788)
PASS: lldb-shell :: SymbolFile/DWARF/array-sizes.s (456 of 1788)
PASS: lldb-api :: commands/statistics/basic/TestStats.py (457 of 1788)
PASS: lldb-unit :: Symbol/./SymbolTests/TestClangASTContext.TestBuiltinTypeForEncodingAndBitSize (458 of 1788)
PASS: lldb-unit :: Utility/./UtilityTests/StreamTest.PutBytesAsRawHex8ToLittleEndian (459 of 1788)
PASS: lldb-unit :: Utility/./UtilityTests/OptionsWithRawTest.TerminatedQuote (460 of 1788)
PASS: lldb-shell :: ObjectFile/PECOFF/basic-info-arm.yaml (461 of 1788)
PASS: lldb-shell :: Host/TestCustomShell.test (462 of 1788)
UNSUPPORTED: lldb-api :: commands/expression/completion-crash1/TestCompletionCrash1.py (463 of 1788)
PASS: lldb-unit :: Utility/./UtilityTests/StreamTest.PutStringAsRawHex8 (464 of 1788)
FAIL: lldb-api :: tools/lldb-server/commandline/TestStubSetSID.py (465 of 1788)
******************** TEST 'lldb-api :: tools/lldb-server/commandline/TestStubSetSID.py' FAILED ********************
lldb version 10.0.99 (http://labmaster3.local/git/llvm-project.git revision afb163f53ad567d72757e05c95e4059d3eb8de24)
  clang revision afb163f53ad567d72757e05c95e4059d3eb8de24
  llvm revision afb163f53ad567d72757e05c95e4059d3eb8de24
LLDB library dir: /Users/buildslave/jenkins/workspace/lldb-cmake-sanitized/lldb-build/bin
LLDB import library dir: /Users/buildslave/jenkins/workspace/lldb-cmake-sanitized/lldb-build/bin
libstdcxx tests will not be run because: Don't know how to build with libstdcxx on macosx
Skipping following debug info categories: ['dwo']

Hide Details

Session logs for test failures/errors/unexpected successes will go into directory '/Users/buildslave/jenkins/workspace/lldb-cmake-sanitized/test/logs' Command invoked: /Users/buildslave/jenkins/workspace/lldb-cmake-sanitized/llvm-project/lldb/test/API/dotest.py --arch=x86_64 -s /Users/buildslave/jenkins/workspace/lldb-cmake-sanitized/lldb-build/lldb-test-traces -S nm -u CXXFLAGS -u CFLAGS --executable /Users/buildslave/jenkins/workspace/lldb-cmake-sanitized/lldb-build/./bin/lldb --dsymutil /Users/buildslave/jenkins/workspace/lldb-cmake-sanitized/lldb-build/./bin/dsymutil --filecheck /Users/buildslave/jenkins/workspace/lldb-cmake-sanitized/lldb-build/./bin/FileCheck -C /Users/buildslave/jenkins/workspace/lldb-cmake-sanitized/host-compiler/bin/clang --codesign-identity lldb_codesign --server /Users/buildslave/jenkins/workspace/lldb-cmake-sanitized/lldb-build/./bin/debugserver --arch x86_64 --build-dir /Users/buildslave/jenkins/workspace/lldb-cmake-sanitized/lldb-build/lldb-test-build.noindex -s=/Users/buildslave/jenkins/workspace/lldb-cmake-sanitized/test/logs -t --env TERM=vt100 --env LLVM_LIBS_DIR=/Users/buildslave/jenkins/workspace/lldb-cmake-sanitized/lldb-build/./lib --build-dir /Users/buildslave/jenkins/workspace/lldb-cmake-sanitized/lldb-build/tools/lldb/lldb-test-build.noindex --lldb-module-cache-dir /Users/buildslave/jenkins/workspace/lldb-cmake-sanitized/lldb-build/tools/lldb/lldb-test-build.noindex/module-cache-lldb/lldb-api --clang-module-cache-dir /Users/buildslave/jenkins/workspace/lldb-cmake-sanitized/lldb-build/tools/lldb/lldb-test-build.noindex/module-cache-clang/lldb-api /Users/buildslave/jenkins/workspace/lldb-cmake-sanitized/llvm-project/lldb/packages/Python/lldbsuite/test/tools/lldb-server/commandline -p TestStubSetSID.py Change dir to: /Users/buildslave/jenkins/workspace/lldb-cmake-sanitized/llvm-project/lldb/packages/Python/lldbsuite/test/tools/lldb-server/commandline runCmd: settings set symbols.enable-external-lookup false output:

Hide Details

runCmd: settings set plugin.process.gdb-remote.packet-timeout 60 output:

Hide Details

runCmd: settings set symbols.clang-modules-cache-path "/Users/buildslave/jenkins/workspace/lldb-cmake-sanitized/lldb-build/tools/lldb/lldb-test-build.noindex/module-cache-lldb/lldb-api" output:

Hide Details

runCmd: settings set use-color false output:

Hide Details

Adding tearDown hook: def shutdown_named_pipe(): # Close the pipe. try: named_pipe.close() except: print("failed to close named pipe") None

Hide Details

# Delete the pipe. try: os.remove(named_pipe_path) except: print("failed to delete named pipe: {}".format(named_pipe_path)) None

Hide Details

# Delete the temp directory. try: os.rmdir(temp_dir) except: print( "failed to delete temp dir: {}, directory contents: '{}'".format( temp_dir, os.listdir(temp_dir))) None

Hide Details

Hide Details

Adding tearDown hook: def cleanupSubprocesses(self): # Ensure any subprocesses are cleaned up for p in self.subprocesses: p.terminate() del p del self.subprocesses[:] # Ensure any forked processes are cleaned up for pid in self.forkedProcessPids: if os.path.exists("/proc/" + str(pid)): os.kill(pid, signal.SIGTERM)

Hide Details

Hide Details

Executing tearDown hook: def cleanupSubprocesses(self): # Ensure any subprocesses are cleaned up for p in self.subprocesses: p.terminate() del p del self.subprocesses[:] # Ensure any forked processes are cleaned up for pid in self.forkedProcessPids: if os.path.exists("/proc/" + str(pid)): os.kill(pid, signal.SIGTERM)

Hide Details

Hide Details

Executing tearDown hook: def shutdown_named_pipe(): # Close the pipe. try: named_pipe.close() except: print("failed to close named pipe") None

Hide Details

# Delete the pipe. try: os.remove(named_pipe_path) except: print("failed to delete named pipe: {}".format(named_pipe_path)) None

Hide Details

# Delete the temp directory. try: os.rmdir(temp_dir) except: print( "failed to delete temp dir: {}, directory contents: '{}'".format( temp_dir, os.listdir(temp_dir))) None

Hide Details

Hide Details

PASS: LLDB (/Users/buildslave/jenkins/workspace/lldb-cmake-sanitized/host-compiler/bin/clang-10-x86_64) :: test_sid_is_different_with_S_debugserver (TestStubSetSID.TestStubSetSIDTestCase) runCmd: settings set symbols.enable-external-lookup false output:

Hide Details

runCmd: settings set plugin.process.gdb-remote.packet-timeout 60 output:

Hide Details

runCmd: settings set symbols.clang-modules-cache-path "/Users/buildslave/jenkins/workspace/lldb-cmake-sanitized/lldb-build/tools/lldb/lldb-test-build.noindex/module-cache-lldb/lldb-api" output:

Hide Details

runCmd: settings set use-color false output:

Hide Details

UNSUPPORTED: LLDB (/Users/buildslave/jenkins/workspace/lldb-cmake-sanitized/host-compiler/bin/clang-10-x86_64) :: test_sid_is_different_with_S_llgs (TestStubSetSID.TestStubSetSIDTestCase) (llgs tests) runCmd: settings set symbols.enable-external-lookup false output:

Hide Details

runCmd: settings set plugin.process.gdb-remote.packet-timeout 60 output:

Hide Details

runCmd: settings set symbols.clang-modules-cache-path "/Users/buildslave/jenkins/workspace/lldb-cmake-sanitized/lldb-build/tools/lldb/lldb-test-build.noindex/module-cache-lldb/lldb-api" output:

Hide Details

runCmd: settings set use-color false output:

Hide Details

Adding tearDown hook: def shutdown_named_pipe(): # Close the pipe. try: named_pipe.close() except: print("failed to close named pipe") None

Hide Details

# Delete the pipe. try: os.remove(named_pipe_path) except: print("failed to delete named pipe: {}".format(named_pipe_path)) None

Hide Details

# Delete the temp directory. try: os.rmdir(temp_dir) except: print( "failed to delete temp dir: {}, directory contents: '{}'".format( temp_dir, os.listdir(temp_dir))) None

Hide Details

Hide Details

Adding tearDown hook: def cleanupSubprocesses(self): # Ensure any subprocesses are cleaned up for p in self.subprocesses: p.terminate() del p del self.subprocesses[:] # Ensure any forked processes are cleaned up for pid in self.forkedProcessPids: if os.path.exists("/proc/" + str(pid)): os.kill(pid, signal.SIGTERM)

Hide Details

Hide Details

Executing tearDown hook: def cleanupSubprocesses(self): # Ensure any subprocesses are cleaned up for p in self.subprocesses: p.terminate() del p del self.subprocesses[:] # Ensure any forked processes are cleaned up for pid in self.forkedProcessPids: if os.path.exists("/proc/" + str(pid)): os.kill(pid, signal.SIGTERM)

Hide Details

Hide Details

Executing tearDown hook: def shutdown_named_pipe(): # Close the pipe. try: named_pipe.close() except: print("failed to close named pipe") None

Hide Details

# Delete the pipe. try: os.remove(named_pipe_path) except: print("failed to delete named pipe: {}".format(named_pipe_path)) None

Hide Details

# Delete the temp directory. try: os.rmdir(temp_dir) except: print( "failed to delete temp dir: {}, directory contents: '{}'".format( temp_dir, os.listdir(temp_dir))) None

Hide Details

Hide Details

PASS: LLDB (/Users/buildslave/jenkins/workspace/lldb-cmake-sanitized/host-compiler/bin/clang-10-x86_64) :: test_sid_is_different_with_setsid_debugserver (TestStubSetSID.TestStubSetSIDTestCase) runCmd: settings set symbols.enable-external-lookup false output:

Hide Details

runCmd: settings set plugin.process.gdb-remote.packet-timeout 60 output:

Hide Details

runCmd: settings set symbols.clang-modules-cache-path "/Users/buildslave/jenkins/workspace/lldb-cmake-sanitized/lldb-build/tools/lldb/lldb-test-build.noindex/module-cache-lldb/lldb-api" output:

Hide Details

runCmd: settings set use-color false output:

Hide Details

UNSUPPORTED: LLDB (/Users/buildslave/jenkins/workspace/lldb-cmake-sanitized/host-compiler/bin/clang-10-x86_64) :: test_sid_is_different_with_setsid_llgs (TestStubSetSID.TestStubSetSIDTestCase) (llgs tests) runCmd: settings set symbols.enable-external-lookup false output:

Hide Details

runCmd: settings set plugin.process.gdb-remote.packet-timeout 60 output:

Hide Details

runCmd: settings set symbols.clang-modules-cache-path "/Users/buildslave/jenkins/workspace/lldb-cmake-sanitized/lldb-build/tools/lldb/lldb-test-build.noindex/module-cache-lldb/lldb-api" output:

Hide Details

runCmd: settings set use-color false output:

Hide Details

Adding tearDown hook: def shutdown_named_pipe(): # Close the pipe. try: named_pipe.close() except: print("failed to close named pipe") None

Hide Details

# Delete the pipe. try: os.remove(named_pipe_path) except: print("failed to delete named pipe: {}".format(named_pipe_path)) None

Hide Details

# Delete the temp directory. try: os.rmdir(temp_dir) except: print( "failed to delete temp dir: {}, directory contents: '{}'".format( temp_dir, os.listdir(temp_dir))) None

Hide Details

Hide Details

Adding tearDown hook: def cleanupSubprocesses(self): # Ensure any subprocesses are cleaned up for p in self.subprocesses: p.terminate() del p del self.subprocesses[:] # Ensure any forked processes are cleaned up for pid in self.forkedProcessPids: if os.path.exists("/proc/" + str(pid)): os.kill(pid, signal.SIGTERM)

Hide Details

Hide Details

FAIL: LLDB (/Users/buildslave/jenkins/workspace/lldb-cmake-sanitized/host-compiler/bin/clang-10-x86_64) :: test_sid_is_same_without_setsid_debugserver (TestStubSetSID.TestStubSetSIDTestCase) Executing tearDown hook: def cleanupSubprocesses(self): # Ensure any subprocesses are cleaned up for p in self.subprocesses: p.terminate() del p del self.subprocesses[:] # Ensure any forked processes are cleaned up for pid in self.forkedProcessPids: if os.path.exists("/proc/" + str(pid)): os.kill(pid, signal.SIGTERM)

Hide Details

Hide Details

Executing tearDown hook: def shutdown_named_pipe(): # Close the pipe. try: named_pipe.close() except: print("failed to close named pipe") None

Hide Details

# Delete the pipe. try: os.remove(named_pipe_path) except: print("failed to delete named pipe: {}".format(named_pipe_path)) None

Hide Details

# Delete the temp directory. try: os.rmdir(temp_dir) except: print( "failed to delete temp dir: {}, directory contents: '{}'".format( temp_dir, os.listdir(temp_dir))) None

Hide Details

Hide Details

runCmd: settings set symbols.enable-external-lookup false output:

Hide Details

runCmd: settings set plugin.process.gdb-remote.packet-timeout 60 output:

Hide Details

runCmd: settings set symbols.clang-modules-cache-path "/Users/buildslave/jenkins/workspace/lldb-cmake-sanitized/lldb-build/tools/lldb/lldb-test-build.noindex/module-cache-lldb/lldb-api" output:

Hide Details

runCmd: settings set use-color false output:

Hide Details

UNSUPPORTED: LLDB (/Users/buildslave/jenkins/workspace/lldb-cmake-sanitized/host-compiler/bin/clang-10-x86_64) :: test_sid_is_same_without_setsid_llgs (TestStubSetSID.TestStubSetSIDTestCase) (llgs tests) Restore dir to: /Users/buildslave/jenkins/workspace/lldb-cmake-sanitized/lldb-build/tools/lldb/test ====================================================================== FAIL: test_sid_is_same_without_setsid_debugserver (TestStubSetSID.TestStubSetSIDTestCase) ---------------------------------------------------------------------- Traceback (most recent call last): File "/Users/buildslave/jenkins/workspace/lldb-cmake-sanitized/llvm-project/lldb/packages/Python/lldbsuite/test/decorators.py", line 141, in wrapper func(*args, **kwargs) File "/Users/buildslave/jenkins/workspace/lldb-cmake-sanitized/llvm-project/lldb/packages/Python/lldbsuite/test/decorators.py", line 141, in wrapper func(*args, **kwargs) File "/Users/buildslave/jenkins/workspace/lldb-cmake-sanitized/llvm-project/lldb/packages/Python/lldbsuite/test/tools/lldb-server/commandline/TestStubSetSID.py", line 48, in test_sid_is_same_without_setsid_debugserver self.sid_is_same_without_setsid() File "/Users/buildslave/jenkins/workspace/lldb-cmake-sanitized/llvm-project/lldb/packages/Python/lldbsuite/test/tools/lldb-server/commandline/TestStubSetSID.py", line 32, in sid_is_same_without_setsid stub_sid = self.get_stub_sid() File "/Users/buildslave/jenkins/workspace/lldb-cmake-sanitized/llvm-project/lldb/packages/Python/lldbsuite/test/tools/lldb-server/commandline/TestStubSetSID.py", line 26, in get_stub_sid server.pid, True)) AssertionError: False is not True Config=x86_64-/Users/buildslave/jenkins/workspace/lldb-cmake-sanitized/host-compiler/bin/clang-10 ---------------------------------------------------------------------- Ran 6 tests in 14.725s

Hide Details

RESULT: FAILED (2 passes, 1 failures, 0 errors, 3 skipped, 0 expected failures, 0 unexpected successes)

Hide Details

******************** PASS: lldb-unit :: Utility/./UtilityTests/ScalarTest.ExtractBitfield (466 of 1788) PASS: lldb-unit :: Utility/./UtilityTests/DataExtractorTest.GetMaxU64 (467 of 1788) PASS: lldb-unit :: Host/./HostTests/ConnectionFileDescriptorTest.TCPGetURIv4 (468 of 1788) PASS: lldb-api :: lang/objc/variadic_methods/TestVariadicMethods.py (469 of 1788) UNSUPPORTED: lldb-shell :: SymbolFile/PDB/class-layout.test (470 of 1788) PASS: lldb-shell :: Commands/command-regex-unalias.test (471 of 1788) PASS: lldb-unit :: Host/./HostTests/SocketTest.UDPConnect (472 of 1788) PASS: lldb-unit :: Expression/./ExpressionTests/DiagnosticManagerTest.HasFixits (473 of 1788) PASS: lldb-shell :: Reproducer/Functionalities/TestImageList.test (474 of 1788) PASS: lldb-api :: functionalities/data-formatter/data-formatter-objc/nsstring/TestDataFormatterNSString.py (475 of 1788) PASS: lldb-unit :: UnwindAssembly/x86/./UnwindAssemblyx86Tests/Testx86AssemblyInspectionEngine.TestPopEBX (476 of 1788) PASS: lldb-api :: functionalities/thread/concurrent_events/TestConcurrentDelayedCrashWithBreakpointSignal.py (477 of 1788) PASS: lldb-api :: functionalities/thread/concurrent_events/TestConcurrentTwoBreakpointsOneWatchpoint.py (478 of 1788) PASS: lldb-api :: lang/objc/exceptions/TestObjCExceptions.py (479 of 1788) PASS: lldb-api :: commands/watchpoints/watchpoint_commands/condition/TestWatchpointConditionCmd.py (480 of 1788) PASS: lldb-api :: commands/expression/completion-in-lambda-and-unnnamed-class/TestCompletionInLambdaAndUnnamedClass.py (481 of 1788) PASS: lldb-api :: tools/lldb-server/TestGdbRemoteKill.py (482 of 1788) PASS: lldb-api :: python_api/lldbutil/TestSwigVersion.py (483 of 1788) PASS: lldb-unit :: SymbolFile/NativePDB/./SymbolFileNativePDBTests/PDBFPOProgramToDWARFExpressionTests.MultipleIndependentAssignments (484 of 1788) PASS: lldb-api :: functionalities/thread/crash_during_step/TestCrashDuringStep.py (485 of 1788) PASS: lldb-api :: commands/command/delete/TestCommandDelete.py (486 of 1788) PASS: lldb-unit :: Utility/./UtilityTests/TimerTest.CategoryTimes (487 of 1788) UNSUPPORTED: lldb-api :: functionalities/breakpoint/breakpoint_in_delayslot/TestAvoidBreakpointInDelaySlot.py (488 of 1788) PASS: lldb-shell :: SymbolFile/DWARF/debug_ranges-missing-section.s (489 of 1788) PASS: lldb-unit :: Utility/./UtilityTests/CompletionRequest.FakeLastArg (490 of 1788) PASS: lldb-api :: python_api/interpreter/TestRunCommandInterpreterAPI.py (491 of 1788) PASS: lldb-unit :: Utility/./UtilityTests/UriParserTest.BracketedHostnamePort (492 of 1788) PASS: lldb-api :: functionalities/breakpoint/global_constructor/TestBreakpointInGlobalConstructor.py (493 of 1788) PASS: lldb-api :: functionalities/modern-type-lookup/basic/TestBasicModernTypeLookup.py (494 of 1788) PASS: lldb-api :: lang/c/tls_globals/TestTlsGlobals.py (495 of 1788) PASS: lldb-unit :: Utility/./UtilityTests/StructuredDataTest.StringDump (496 of 1788) UNSUPPORTED: lldb-api :: functionalities/darwin_log/filter/exact_match/message/TestDarwinLogFilterMatchMessage.py (497 of 1788) PASS: lldb-unit :: Utility/./UtilityTests/StringListTest.SetSize (498 of 1788) PASS: lldb-unit :: Utility/./UtilityTests/StreamTeeTest.Write (499 of 1788) PASS: lldb-shell :: BuildScript/script-args.test (500 of 1788) PASS: lldb-unit :: Utility/./UtilityTests/StringListTest.CopyListEmpty (501 of 1788) PASS: lldb-shell :: Breakpoint/debug_addrx.test (502 of 1788) PASS: lldb-api :: types/TestDoubleTypesExpr.py (503 of 1788) PASS: lldb-unit :: Utility/./UtilityTests/RecordReplayTest.InstrumentedBarPtr (504 of 1788) PASS: lldb-unit :: Language/CPlusPlus/./LanguageCPlusPlusTests/CPlusPlusLanguage.FindAlternateFunctionManglings (505 of 1788) PASS: lldb-api :: functionalities/inferior-crashing/TestInferiorCrashingStep.py (506 of 1788) PASS: lldb-shell :: SymbolFile/DWARF/dir-separator-no-comp-dir-relative-name.s (507 of 1788) PASS: lldb-unit :: Expression/./ExpressionTests/CppModuleConfigurationTest.Linux (508 of 1788) PASS: lldb-unit :: Utility/./UtilityTests/VMRange.CollectionContains (509 of 1788) PASS: lldb-shell :: SymbolFile/DWARF/find-method.cpp (510 of 1788) PASS: lldb-api :: lang/objcxx/cxx-bridged-po/TestObjCXXBridgedPO.py (511 of 1788) PASS: lldb-api :: functionalities/rerun/TestRerun.py (512 of 1788) PASS: lldb-api :: lang/cpp/dynamic-value/TestDynamicValue.py (513 of 1788) PASS: lldb-api :: functionalities/tail_call_frames/thread_step_out_message/TestArtificialFrameStepOutMessage.py (514 of 1788) PASS: lldb-api :: functionalities/data-formatter/data-formatter-objc/TestDataFormatterObjCKVO.py (515 of 1788) PASS: lldb-unit :: debugserver/./debugserverTests/RNBSocket.LoopBackConnectIPv4 (516 of 1788) PASS: lldb-unit :: ObjectFile/Breakpad/./ObjectFileBreakpadTests/PublicRecord.parse (517 of 1788) PASS: lldb-api :: functionalities/breakpoint/require_hw_breakpoints/TestRequireHWBreakpoints.py (518 of 1788) PASS: lldb-api :: commands/expression/radar_9673664/TestExprHelpExamples.py (519 of 1788) PASS: lldb-api :: functionalities/thread/concurrent_events/TestConcurrentWatchpointWithDelayWatchpointThreads.py (520 of 1788) PASS: lldb-unit :: Utility/./UtilityTests/SerializationRountripTest.SerializeDeserializePod (521 of 1788) PASS: lldb-shell :: SymbolFile/DWARF/debug_loc.s (522 of 1788) PASS: lldb-api :: lang/cpp/virtual/TestVirtual.py (523 of 1788) PASS: lldb-unit :: Utility/./UtilityTests/StringExtractorTest.GetHexBytesAvail_Underflow (524 of 1788) PASS: lldb-unit :: Utility/./UtilityTests/RangeDataVector.FindEntryThatContains_Overlap (525 of 1788) UNSUPPORTED: lldb-api :: iohandler/completion/TestIOHandlerCompletion.py (526 of 1788) PASS: lldb-shell :: Breakpoint/debug_rnglist_rlestartend.test (527 of 1788) PASS: lldb-api :: functionalities/signal/handle-abrt/TestHandleAbort.py (528 of 1788) UNSUPPORTED: lldb-api :: arm/breakpoint-thumb-codesection/TestBreakpointThumbCodesection.py (529 of 1788) PASS: lldb-unit :: ScriptInterpreter/Python/./ScriptInterpreterPythonTests/PythonDataObjectsTest.TestPythonTupleSize (530 of 1788) PASS: lldb-api :: tools/lldb-server/TestGdbRemoteAttach.py (531 of 1788) PASS: lldb-shell :: SymbolFile/NativePDB/tag-types.cpp (532 of 1788) UNSUPPORTED: lldb-api :: functionalities/data-formatter/data-formatter-stl/libstdcpp/iterator/TestDataFormatterStdIterator.py (533 of 1788) PASS: lldb-shell :: Breakpoint/debug_rnglist_offset_pair.test (534 of 1788) PASS: lldb-unit :: Utility/./UtilityTests/BinaryStreamTest.PutULEB128TwoBytes (535 of 1788) PASS: lldb-unit :: Utility/./UtilityTests/StringExtractorTest.GetHexBytes_Underflow (536 of 1788) PASS: lldb-api :: functionalities/data-formatter/data-formatter-objc/TestDataFormatterObjCCF.py (537 of 1788) PASS: lldb-api :: api/log/TestAPILog.py (538 of 1788) PASS: lldb-unit :: UnwindAssembly/x86/./UnwindAssemblyx86Tests/Testx86AssemblyInspectionEngine.TestPopR14 (539 of 1788) PASS: lldb-api :: python_api/value/TestValueAPI.py (540 of 1788) PASS: lldb-unit :: Utility/./UtilityTests/ArgsTest.TestQuotedUnknownEscape (541 of 1788) PASS: lldb-api :: functionalities/thread/concurrent_events/TestConcurrentCrashWithSignal.py (542 of 1788) PASS: lldb-api :: functionalities/data-formatter/data-formatter-categories/TestDataFormatterCategories.py (543 of 1788) UNSUPPORTED: lldb-shell :: SymbolFile/PDB/calling-conventions.test (544 of 1788) PASS: lldb-api :: lang/objc/foundation/TestSymbolTable.py (545 of 1788) PASS: lldb-unit :: Expression/./ExpressionTests/DiagnosticManagerTest.GetStringSeverityLabels (546 of 1788) PASS: lldb-api :: functionalities/thread/concurrent_events/TestConcurrentCrashWithWatchpoint.py (547 of 1788) PASS: lldb-api :: python_api/function_symbol/TestSymbolAPI.py (548 of 1788) PASS: lldb-shell :: Driver/TestProcessAttach.test (549 of 1788) UNSUPPORTED: lldb-api :: lang/objc/objc-dynamic-value/TestObjCDynamicValue.py (550 of 1788) PASS: lldb-shell :: SymbolFile/NativePDB/nested-types.cpp (551 of 1788) PASS: lldb-api :: functionalities/thread/exit_during_step/TestExitDuringStep.py (552 of 1788) PASS: lldb-unit :: Utility/./UtilityTests/ArgsTest.AppendArguments (553 of 1788) PASS: lldb-shell :: Commands/command-source.test (554 of 1788) PASS: lldb-api :: commands/command/script/import/TestImport.py (555 of 1788) PASS: lldb-unit :: Utility/./UtilityTests/StringListTest.DefaultConstructor (556 of 1788) PASS: lldb-api :: functionalities/breakpoint/breakpoint_set_restart/TestBreakpointSetRestart.py (557 of 1788) PASS: lldb-api :: functionalities/thread/concurrent_events/TestConcurrentTwoWatchpointsOneDelayBreakpoint.py (558 of 1788) PASS: lldb-unit :: Utility/./UtilityTests/ConstStringTest.format_provider (559 of 1788) PASS: lldb-unit :: debugserver/./debugserverTests/RNBSocket.LoopBackListenIPv4 (560 of 1788) PASS: lldb-api :: lang/objc/rdar-10967107/TestRdar10967107.py (561 of 1788) PASS: lldb-api :: commands/watchpoints/watchpoint_events/TestWatchpointEvents.py (562 of 1788) PASS: lldb-api :: python_api/value_var_update/TestValueVarUpdate.py (563 of 1788) PASS: lldb-api :: functionalities/data-formatter/data-formatter-objc/TestDataFormatterObjCNSError.py (564 of 1788) PASS: lldb-api :: tools/lldb-server/TestGdbRemote_vCont.py (565 of 1788) UNSUPPORTED: lldb-api :: functionalities/unwind/standard/TestStandardUnwind.py (566 of 1788) PASS: lldb-api :: functionalities/type_lookup/TestTypeLookup.py (567 of 1788) UNSUPPORTED: lldb-api :: python_api/event/TestEvents.py (568 of 1788) PASS: lldb-api :: lang/objc/foundation/TestObjCMethodsString.py (569 of 1788) PASS: lldb-unit :: Utility/./UtilityTests/StringListTest.AppendListCStringArrayEmpty (570 of 1788) PASS: lldb-api :: functionalities/data-formatter/data-formatter-enum-format/TestDataFormatterEnumFormat.py (571 of 1788) PASS: lldb-api :: functionalities/data-formatter/synthcapping/TestSyntheticCapping.py (572 of 1788) PASS: lldb-unit :: UnwindAssembly/x86/./UnwindAssemblyx86Tests/Testx86AssemblyInspectionEngine.TestPushEDI (573 of 1788) PASS: lldb-unit :: Host/./HostTests/FileSystemTest.Resolve (574 of 1788) PASS: lldb-unit :: Utility/./UtilityTests/EventTest.DumpEventDataBytes (575 of 1788) PASS: lldb-unit :: UnwindAssembly/x86/./UnwindAssemblyx86Tests/Testx86AssemblyInspectionEngine.TestPushR15 (576 of 1788) PASS: lldb-unit :: ObjectFile/Breakpad/./ObjectFileBreakpadTests/StackWinRecord.parse (577 of 1788) PASS: lldb-unit :: Utility/./UtilityTests/StateTest.Formatv (578 of 1788) PASS: lldb-unit :: Utility/./UtilityTests/StatusTest.ErrorConstructor (579 of 1788) PASS: lldb-api :: functionalities/breakpoint/cpp_exception/TestCPPExceptionBreakpoint.py (580 of 1788) PASS: lldb-shell :: SymbolFile/Breakpad/line-table-edgecases.test (581 of 1788) PASS: lldb-unit :: Expression/./ExpressionTests/DiagnosticManagerTest.AppendMessageAttachToLastDiag (582 of 1788) PASS: lldb-unit :: Utility/./UtilityTests/LogTest.Register (583 of 1788) PASS: lldb-api :: python_api/lldbutil/process/TestPrintStackTraces.py (584 of 1788) PASS: lldb-unit :: Utility/./UtilityTests/StringListTest.LongestCommonPrefixEmpty (585 of 1788) PASS: lldb-unit :: Process/gdb-remote/./ProcessGdbRemoteTests/GDBRemoteClientBaseTest.SendContinueDelegateStructuredDataReceipt (586 of 1788) PASS: lldb-api :: functionalities/target-new-solib-notifications/TestModuleLoadedNotifys.py (587 of 1788) PASS: lldb-unit :: Utility/./UtilityTests/BinaryStreamTest.PutULEB128OneByte (588 of 1788) PASS: lldb-api :: lang/c/blocks/TestBlocks.py (589 of 1788) PASS: lldb-unit :: Utility/./UtilityTests/StringExtractorTest.InitMisc (590 of 1788) PASS: lldb-unit :: Process/gdb-remote/./ProcessGdbRemoteTests/GDBRemoteCommunicationClientTest.WriteRegister (591 of 1788) PASS: lldb-api :: commands/expression/persistent_types/TestPersistentTypes.py (592 of 1788) PASS: lldb-unit :: Utility/./UtilityTests/BinaryStreamTest.PutULEB128FourBytes (593 of 1788) PASS: lldb-api :: functionalities/show_location/TestShowLocationDwarf5.py (594 of 1788) PASS: lldb-api :: lang/cpp/class_static/TestStaticVariables.py (595 of 1788) PASS: lldb-unit :: Utility/./UtilityTests/StreamTest.PutSLEB128 (596 of 1788) PASS: lldb-api :: functionalities/load_unload/TestLoadUnload.py (597 of 1788) PASS: lldb-unit :: ScriptInterpreter/Python/./ScriptInterpreterPythonTests/PythonExceptionStateTest.TestAutoRestoreSemantics (598 of 1788) PASS: lldb-unit :: SymbolFile/NativePDB/./SymbolFileNativePDBTests/PDBFPOProgramToDWARFExpressionTests.UnresolvedRegisterReference (599 of 1788) PASS: lldb-unit :: Expression/./ExpressionTests/DiagnosticManagerTest.FixedExpression (600 of 1788) UNSUPPORTED: lldb-api :: functionalities/darwin_log/filter/regex/activity/TestDarwinLogFilterRegexActivity.py (601 of 1788) PASS: lldb-unit :: Utility/./UtilityTests/StringExtractorTest.DecodeHexU8_Underflow2 (602 of 1788) PASS: lldb-unit :: ScriptInterpreter/Python/./ScriptInterpreterPythonTests/PythonDataObjectsTest.TestModuleNameResolutionNoDot (603 of 1788) UNSUPPORTED: lldb-api :: functionalities/data-formatter/data-formatter-stl/libstdcpp/vbool/TestDataFormatterStdVBool.py (604 of 1788) PASS: lldb-api :: functionalities/data-formatter/vector-types/TestVectorTypesFormatting.py (605 of 1788) PASS: lldb-shell :: ObjectFile/ELF/PT_LOAD-overlap-section.yaml (606 of 1788) PASS: lldb-unit :: Utility/./UtilityTests/BinaryStreamTest.PutSLEB128SevenBytes (607 of 1788) PASS: lldb-api :: tools/lldb-server/TestAppleSimulatorOSType.py (608 of 1788) PASS: lldb-unit :: SymbolFile/DWARF/./SymbolFileDWARFTests/SymbolFileDWARFTests.TestAbbrevValidAttrNullForm (609 of 1788) PASS: lldb-api :: functionalities/data-formatter/data-formatter-stl/libcxx/queue/TestDataFormatterLibcxxQueue.py (610 of 1788) PASS: lldb-unit :: Utility/./UtilityTests/StringExtractorTest.GetHexBytesAvail_FullString (611 of 1788) PASS: lldb-api :: commands/process/launch/TestProcessLaunch.py (612 of 1788) PASS: lldb-unit :: UnwindAssembly/x86/./UnwindAssemblyx86Tests/Testx86AssemblyInspectionEngine.TestDisassemblyMidFunctionEpilogues (613 of 1788) PASS: lldb-unit :: Utility/./UtilityTests/DataExtractorTest.GetCStrAtEnd (614 of 1788) PASS: lldb-api :: functionalities/thread/concurrent_events/TestConcurrentNWatchNBreak.py (615 of 1788) PASS: lldb-api :: functionalities/thread/concurrent_events/TestConcurrentDelayedCrashWithBreakpointWatchpoint.py (616 of 1788) PASS: lldb-unit :: Host/./HostTests/SocketTest.TCPListen0ConnectAccept (617 of 1788) PASS: lldb-unit :: Target/./TargetTests/PathMappingListTest.RelativeTests (618 of 1788) PASS: lldb-api :: functionalities/breakpoint/breakpoint_ids/TestBreakpointIDs.py (619 of 1788) PASS: lldb-api :: tools/lldb-server/TestGdbRemoteHostInfo.py (620 of 1788) PASS: lldb-api :: lang/cpp/chained-calls/TestCppChainedCalls.py (621 of 1788) PASS: lldb-api :: functionalities/breakpoint/address_breakpoints/TestBadAddressBreakpoints.py (622 of 1788) PASS: lldb-api :: commands/expression/import-std-module/list-dbg-info-content/TestDbgInfoContentList.py (623 of 1788) UNSUPPORTED: lldb-api :: benchmarks/libcxxmap/TestBenchmarkLibcxxMap.py (624 of 1788) PASS: lldb-unit :: debugserver/./debugserverTests/RNBSocket.LoopBackConnectIPv6 (625 of 1788) PASS: lldb-shell :: Settings/TestDisableColor.test (626 of 1788) PASS: lldb-unit :: Utility/./UtilityTests/StringExtractorTest.GetU32BigEndian (627 of 1788) PASS: lldb-unit :: SymbolFile/NativePDB/./SymbolFileNativePDBTests/PDBFPOProgramToDWARFExpressionTests.UnresolvedDependentCyclicRegisterAssignmentReference (628 of 1788) PASS: lldb-unit :: Utility/./UtilityTests/StringListTest.InsertStringAtIndexMove (629 of 1788) PASS: lldb-shell :: Breakpoint/jitbp_elf.test (630 of 1788) PASS: lldb-api :: functionalities/breakpoint/auto_continue/TestBreakpointAutoContinue.py (631 of 1788) PASS: lldb-unit :: Utility/./UtilityTests/CompletionRequest.DuplicateFilteringWithComments (632 of 1788) PASS: lldb-unit :: Utility/./UtilityTests/StreamTeeTest.CopyConstructor (633 of 1788) PASS: lldb-unit :: Language/Highlighting/./HighlighterTests/HighlighterTest.DefaultHighlighterWithCursor (634 of 1788) PASS: lldb-api :: functionalities/breakpoint/inlined_breakpoints/TestInlinedBreakpoints.py (635 of 1788) UNSUPPORTED: lldb-api :: functionalities/unwind/ehframe/TestEhFrameUnwind.py (636 of 1788) PASS: lldb-unit :: Host/./HostTests/FileSystemTest.Readable (637 of 1788) PASS: lldb-shell :: Driver/TestCommands.test (638 of 1788) PASS: lldb-shell :: Breakpoint/implicit_const_form_support.test (639 of 1788) PASS: lldb-api :: functionalities/set-data/TestSetData.py (640 of 1788) PASS: lldb-api :: python_api/sbvalue_const_addrof/TestSBValueConstAddrOf.py (641 of 1788) PASS: lldb-unit :: Utility/./UtilityTests/FileSpecTest.EqualDotsPosix (642 of 1788) PASS: lldb-api :: commands/expression/entry-bp/TestExprEntryBP.py (643 of 1788) PASS: lldb-api :: commands/process/attach/TestProcessAttach.py (644 of 1788) UNSUPPORTED: lldb-shell :: SymbolFile/DWARF/debug-types-expressions.test (645 of 1788) PASS: lldb-shell :: ObjectFile/ELF/aarch64-relocations.yaml (646 of 1788) PASS: lldb-unit :: Utility/./UtilityTests/NameMatchesTest.StartsWith (647 of 1788) PASS: lldb-api :: functionalities/backticks/TestBackticksWithoutATarget.py (648 of 1788) PASS: lldb-api :: lang/cpp/class_types/TestClassTypes.py (649 of 1788) PASS: lldb-unit :: Utility/./UtilityTests/StringLexerTest.PutBack (650 of 1788) PASS: lldb-unit :: Language/Highlighting/./HighlighterTests/HighlighterTest.ClangSquareBrackets (651 of 1788) PASS: lldb-unit :: Utility/./UtilityTests/StreamTeeTest.SetStreamAtIndexOutOfBounds (652 of 1788) PASS: lldb-unit :: Process/minidump/./LLDBMinidumpTests/MinidumpParserTest.GetMemoryRegionInfo (653 of 1788) PASS: lldb-unit :: ScriptInterpreter/Python/./ScriptInterpreterPythonTests/PythonDataObjectsTest.TestPythonTupleToStructuredList (654 of 1788) PASS: lldb-api :: commands/expression/top-level/TestTopLevelExprs.py (655 of 1788) PASS: lldb-api :: types/TestIntegerTypesExpr.py (656 of 1788) PASS: lldb-unit :: Utility/./UtilityTests/ArchSpecTest.MergeFromMachOUnknown (657 of 1788) PASS: lldb-shell :: ObjectFile/Breakpad/sections.test (658 of 1788) PASS: lldb-api :: functionalities/data-formatter/type_summary_list_script/TestTypeSummaryListScript.py (659 of 1788) PASS: lldb-shell :: Process/TestEnvironment.test (660 of 1788) UNSUPPORTED: lldb-shell :: SymbolFile/PDB/function-nested-block.test (661 of 1788) PASS: lldb-shell :: SymbolFile/DWARF/debug_aranges-empty-section.s (662 of 1788) PASS: lldb-unit :: Language/Highlighting/./HighlighterTests/HighlighterTest.ClangScalarLiterals (663 of 1788) PASS: lldb-unit :: Interpreter/./InterpreterTests/OptionArgParserTest.toScriptLanguage (664 of 1788) PASS: lldb-api :: python_api/value/empty_class/TestValueAPIEmptyClass.py (665 of 1788) PASS: lldb-api :: lang/objc/modules-auto-import/TestModulesAutoImport.py (666 of 1788) PASS: lldb-api :: tools/lldb-server/TestGdbRemote_qThreadStopInfo.py (667 of 1788) UNSUPPORTED: lldb-shell :: SymbolFile/PDB/function-level-linking.test (668 of 1788) PASS: lldb-api :: sanity/TestModuleCacheSanity.py (669 of 1788) PASS: lldb-shell :: Python/crashlog.test (670 of 1788) PASS: lldb-api :: functionalities/thread/concurrent_events/TestConcurrentWatchpointDelayWatchpointOneBreakpoint.py (671 of 1788) PASS: lldb-api :: commands/apropos/with-process/TestAproposWithProcess.py (672 of 1788) PASS: lldb-unit :: Utility/./UtilityTests/StringExtractorTest.GetHexU8_Underflow (673 of 1788) PASS: lldb-unit :: Target/./TargetTests/MemoryRegionInfoTest.Formatv (674 of 1788) PASS: lldb-api :: functionalities/data-formatter/data-formatter-objc/TestDataFormatterObjCPlain.py (675 of 1788) PASS: lldb-unit :: Utility/./UtilityTests/SerializationRountripTest.SerializeDeserializeCString (676 of 1788) PASS: lldb-unit :: Process/minidump/./LLDBMinidumpTests/MinidumpParserTest.GetExceptionStream (677 of 1788) PASS: lldb-unit :: Utility/./UtilityTests/StreamTest.PutHex32ByteOrderBig (678 of 1788) PASS: lldb-api :: commands/expression/import-std-module/vector-bool/TestBoolVector.py (679 of 1788) PASS: lldb-shell :: Reproducer/TestRelativePath.test (680 of 1788) PASS: lldb-unit :: Process/gdb-remote/./ProcessGdbRemoteTests/GDBRemoteClientBaseTest.InterruptNoResponse (681 of 1788) PASS: lldb-api :: python_api/sbvalue_persist/TestSBValuePersist.py (682 of 1788) UNSUPPORTED: lldb-api :: functionalities/darwin_log/filter/regex/category/TestDarwinLogFilterRegexCategory.py (683 of 1788) PASS: lldb-unit :: Host/./HostTests/FileSystemTest.GetByteSize (684 of 1788) PASS: lldb-api :: tools/lldb-server/inferior-crash/TestGdbRemoteSegFault.py (685 of 1788) PASS: lldb-api :: commands/expression/inline-namespace/TestInlineNamespace.py (686 of 1788) PASS: lldb-api :: lang/cpp/inlines/TestInlines.py (687 of 1788) PASS: lldb-api :: functionalities/data-formatter/nssetsynth/TestNSSetSynthetic.py (688 of 1788) PASS: lldb-unit :: Utility/./UtilityTests/CompletionRequest.Constructor (689 of 1788) PASS: lldb-unit :: Host/./HostTests/Host.WaitStatusFormat (690 of 1788) PASS: lldb-unit :: Utility/./UtilityTests/StringListTest.LongestCommonPrefixSingleElement (691 of 1788) PASS: lldb-unit :: Utility/./UtilityTests/ArgsTest.ReplaceArgumentAtIndexEqual (692 of 1788) PASS: lldb-shell :: ObjectFile/ELF/netbsd-core-amd64.test (693 of 1788) PASS: lldb-unit :: Utility/./UtilityTests/DataExtractorTest.GetCStrAtNullOffset (694 of 1788) PASS: lldb-api :: commands/target/create-no-such-arch/TestNoSuchArch.py (695 of 1788) UNSUPPORTED: lldb-api :: tools/lldb-server/platform-process-connect/TestPlatformProcessConnect.py (696 of 1788) PASS: lldb-unit :: Utility/./UtilityTests/ScalarTest.GetValue (697 of 1788) PASS: lldb-unit :: debugserver/./debugserverTests/RNBSocket.LoopBackListenIPv6 (698 of 1788) PASS: lldb-unit :: Signals/./SignalsTests/UnixSignalsTest.GetInfo (699 of 1788) PASS: lldb-api :: python_api/rdar-12481949/Test-rdar-12481949.py (700 of 1788) PASS: lldb-unit :: Utility/./UtilityTests/UUIDTest.StringConverion (701 of 1788) PASS: lldb-api :: functionalities/memory/read/TestMemoryRead.py (702 of 1788) PASS: lldb-unit :: Symbol/./SymbolTests/TestClangASTContext.TestIsClangType (703 of 1788) PASS: lldb-unit :: Symbol/./SymbolTests/DWARFCallFrameInfoTest.Basic_dwarf3 (704 of 1788) PASS: lldb-unit :: Utility/./UtilityTests/RangeTest.SetRangeBase (705 of 1788) PASS: lldb-unit :: Utility/./UtilityTests/StringExtractorTest.GetNameColonValueNoSemicolon (706 of 1788) PASS: lldb-unit :: Utility/./UtilityTests/StreamTest.PutMaxHex64ByteOrderLittle (707 of 1788) PASS: lldb-unit :: Utility/./UtilityTests/RangeTest.DefaultConstructor (708 of 1788) PASS: lldb-unit :: UnwindAssembly/x86/./UnwindAssemblyx86Tests/Testx86AssemblyInspectionEngine.TestPushEDX (709 of 1788) PASS: lldb-unit :: Utility/./UtilityTests/RegularExpression.Empty (710 of 1788) PASS: lldb-unit :: Utility/./UtilityTests/RangeTest.LessThan (711 of 1788) PASS: lldb-unit :: Utility/./UtilityTests/StreamTest.PutHex32ByteOrderLittle (712 of 1788) PASS: lldb-api :: functionalities/tsan/thread_numbers/TestTsanThreadNumbers.py (713 of 1788) PASS: lldb-api :: functionalities/inferior-crashing/recursive-inferior/TestRecursiveInferior.py (714 of 1788) PASS: lldb-api :: functionalities/data-formatter/ostypeformatting/TestFormattersOsType.py (715 of 1788) PASS: lldb-api :: commands/frame/var/TestFrameVar.py (716 of 1788) PASS: lldb-api :: commands/expression/import-std-module/no-std-module/TestMissingStdModule.py (717 of 1788) PASS: lldb-unit :: Host/./HostTests/SocketAddressTest.Set (718 of 1788) PASS: lldb-unit :: Core/./LLDBCoreTests/UniqueCStringMap.NoDefaultConstructor (719 of 1788) PASS: lldb-unit :: Utility/./UtilityTests/StreamTest.ChangingByteOrder (720 of 1788) PASS: lldb-api :: functionalities/data-formatter/user-format-vs-summary/TestUserFormatVsSummary.py (721 of 1788) PASS: lldb-unit :: Utility/./UtilityTests/ArchSpecTest.Compatibility (722 of 1788) PASS: lldb-api :: functionalities/data-formatter/data-formatter-objc/TestDataFormatterObjCNSData.py (723 of 1788) PASS: lldb-unit :: Host/./HostTests/File.GetStreamFromDescriptor (724 of 1788) UNSUPPORTED: lldb-api :: lang/c/typedef/Testtypedef.py (725 of 1788) PASS: lldb-api :: tools/lldb-server/commandline/TestStubReverseConnect.py (726 of 1788) PASS: lldb-api :: functionalities/step-avoids-no-debug/TestStepNoDebug.py (727 of 1788) PASS: lldb-unit :: Language/Highlighting/./HighlighterTests/HighlighterTest.ClangCursorPosEndOfLine (728 of 1788) UNSUPPORTED: lldb-api :: functionalities/darwin_log/filter/regex/subsystem/TestDarwinLogFilterRegexSubsystem.py (729 of 1788) PASS: lldb-unit :: UnwindAssembly/x86/./UnwindAssemblyx86Tests/Testx86AssemblyInspectionEngine.TestSpillRegToStackViaMOVx86_64 (730 of 1788) PASS: lldb-unit :: Host/./HostTests/NativeProcessProtocolTest.ReadCStringFromMemory (731 of 1788) PASS: lldb-api :: functionalities/thread/concurrent_events/TestConcurrentTwoWatchpointsOneBreakpoint.py (732 of 1788) PASS: lldb-unit :: Utility/./UtilityTests/StreamTest.PutRawBytesToMixedEndian (733 of 1788) PASS: lldb-shell :: SymbolFile/Breakpad/line-table-missing-file.test (734 of 1788) UNSUPPORTED: lldb-api :: functionalities/signal/handle-segv/TestHandleSegv.py (735 of 1788) PASS: lldb-api :: commands/watchpoints/hello_watchpoint/TestMyFirstWatchpoint.py (736 of 1788) PASS: lldb-api :: functionalities/data-formatter/data-formatter-proper-plurals/TestFormattersOneIsSingular.py (737 of 1788) PASS: lldb-unit :: Language/Highlighting/./HighlighterTests/HighlighterTest.FallbackHighlighter (738 of 1788) PASS: lldb-unit :: Core/./LLDBCoreTests/RichManglingContextTest.IPDRealloc (739 of 1788) PASS: lldb-unit :: Utility/./UtilityTests/CompletionRequest.DuplicateFiltering (740 of 1788) PASS: lldb-api :: functionalities/data-formatter/data-formatter-stl/libcxx/tuple/TestDataFormatterLibcxxTuple.py (741 of 1788) PASS: lldb-api :: functionalities/data-formatter/varscript_formatting/TestDataFormatterVarScriptFormatting.py (742 of 1788) PASS: lldb-unit :: Utility/./UtilityTests/ArgsTest.BareSingleQuote (743 of 1788) PASS: lldb-shell :: Breakpoint/debug_rnglistx_rlex.test (744 of 1788) XFAIL: lldb-shell :: Register/x86-mm-xmm-write.test (745 of 1788) PASS: lldb-api :: functionalities/thread/concurrent_events/TestConcurrentSignalDelayBreak.py (746 of 1788) PASS: lldb-unit :: UnwindAssembly/x86/./UnwindAssemblyx86Tests/Testx86AssemblyInspectionEngine.TestPush0 (747 of 1788) PASS: lldb-unit :: Utility/./UtilityTests/Flags.Reset (748 of 1788) PASS: lldb-api :: functionalities/data-formatter/nsarraysynth/TestNSArraySynthetic.py (749 of 1788) PASS: lldb-shell :: ObjectFile/PECOFF/basic-info.yaml (750 of 1788) PASS: lldb-api :: functionalities/postmortem/minidump-new/TestMiniDumpNew.py (751 of 1788) PASS: lldb-unit :: Utility/./UtilityTests/OptionsWithRawTest.ArgsButNoDelimiter (752 of 1788) PASS: lldb-api :: commands/watchpoints/multiple_hits/TestMultipleHits.py (753 of 1788) PASS: lldb-unit :: Host/./HostTests/MainLoopTest.DetectsEOF (754 of 1788) PASS: lldb-unit :: Utility/./UtilityTests/UriParserTest.BracketedHostnameWithColon (755 of 1788) PASS: lldb-unit :: Process/minidump/./LLDBMinidumpTests/MinidumpParserTest.GetMemoryRegionInfoFromMemoryList (756 of 1788) PASS: lldb-shell :: SymbolFile/Breakpad/line-table-discontinuous-file-ids.test (757 of 1788) PASS: lldb-unit :: Utility/./UtilityTests/StringListTest.InsertStringAtIndexStdString (758 of 1788) PASS: lldb-shell :: SymbolFile/DWARF/gnu-style-compression.cpp (759 of 1788) PASS: lldb-shell :: Unwind/eh-frame-dwarf-unwind.test (760 of 1788) PASS: lldb-api :: macosx/find-dsym/deep-bundle/TestDeepBundle.py (761 of 1788) PASS: lldb-shell :: ObjectFile/ELF/section-types-edgecases.yaml (762 of 1788) UNSUPPORTED: lldb-api :: functionalities/data-formatter/data-formatter-stl/libstdcpp/unique_ptr/TestDataFormatterStdUniquePtr.py (763 of 1788) PASS: lldb-api :: functionalities/data-formatter/data-formatter-skip-summary/TestDataFormatterSkipSummary.py (764 of 1788) UNSUPPORTED: lldb-shell :: Register/x86-ymm-write.test (765 of 1788) PASS: lldb-api :: python_api/sbstructureddata/TestStructuredDataAPI.py (766 of 1788) PASS: lldb-shell :: SymbolFile/DWARF/split-dwarf-multiple-cu.ll (767 of 1788) PASS: lldb-unit :: Utility/./UtilityTests/AnsiTerminal.Unknown (768 of 1788) UNSUPPORTED: lldb-shell :: Register/x86-gp-write.test (769 of 1788) PASS: lldb-api :: lang/c/step-target/TestStepTarget.py (770 of 1788) PASS: lldb-unit :: Utility/./UtilityTests/RegularExpression.Match (771 of 1788) PASS: lldb-unit :: Utility/./UtilityTests/StreamTeeTest.Constructor1Stream (772 of 1788) PASS: lldb-api :: lang/cpp/virtual-overload/TestVirtualOverload.py (773 of 1788) PASS: lldb-unit :: Utility/./UtilityTests/Flags.GetBitSize (774 of 1788) PASS: lldb-api :: lang/cpp/modules-import/TestCXXModulesImport.py (775 of 1788) PASS: lldb-api :: functionalities/tail_call_frames/disambiguate_tail_call_seq/TestDisambiguateTailCallSeq.py (776 of 1788) PASS: lldb-api :: python_api/objc_type/TestObjCType.py (777 of 1788) PASS: lldb-shell :: Settings/TestDisassemblyFormat.test (778 of 1788) PASS: lldb-unit :: Utility/./UtilityTests/ReproducerTest.SetReplay (779 of 1788) UNSUPPORTED: lldb-shell :: SymbolFile/PDB/enums-layout.test (780 of 1788) PASS: lldb-unit :: ObjectFile/Breakpad/./ObjectFileBreakpadTests/StackCFIRecord.parse (781 of 1788) PASS: lldb-unit :: Utility/./UtilityTests/TimerTest.CategoryTimesNested (782 of 1788) PASS: lldb-api :: lang/objc/objc-dyn-sbtype/TestObjCDynamicSBType.py (783 of 1788) PASS: lldb-unit :: Utility/./UtilityTests/OptionsWithRawTest.EmptyInput (784 of 1788) PASS: lldb-api :: macosx/thread-names/TestInterruptThreadNames.py (785 of 1788) PASS: lldb-api :: functionalities/gdb_remote_client/TestTargetXMLArch.py (786 of 1788) PASS: lldb-unit :: Utility/./UtilityTests/StringListTest.GetMaxStringLengthMixed (787 of 1788) PASS: lldb-unit :: Process/minidump/./LLDBMinidumpTests/MinidumpParserTest.FindMemoryRangeWithFullMemoryMinidump (788 of 1788) PASS: lldb-api :: lang/cpp/overloaded-functions/TestOverloadedFunctions.py (789 of 1788) PASS: lldb-unit :: Utility/./UtilityTests/ArgsTest.TestMultipleArgs (790 of 1788) PASS: lldb-api :: lang/objc/forward-decl/TestForwardDecl.py (791 of 1788) PASS: lldb-unit :: ScriptInterpreter/Python/./ScriptInterpreterPythonTests/PythonDataObjectsTest.TestPythonListManipulation (792 of 1788) PASS: lldb-unit :: UnwindAssembly/x86/./UnwindAssemblyx86Tests/Testx86AssemblyInspectionEngine.TestPushESI (793 of 1788) PASS: lldb-api :: functionalities/unwind/noreturn/TestNoreturnUnwind.py (794 of 1788) PASS: lldb-unit :: Utility/./UtilityTests/UriParserTest.MinimalPortPath (795 of 1788) PASS: lldb-unit :: Utility/./UtilityTests/FileSpecTest.IsRelative (796 of 1788) PASS: lldb-api :: functionalities/gdb_remote_client/TestThreadSelectionBug.py (797 of 1788) PASS: lldb-unit :: debugserver/./debugserverTests/RNBSocket.AnyListen (798 of 1788) PASS: lldb-unit :: Utility/./UtilityTests/ConstStringTest.CompareConstString (799 of 1788) PASS: lldb-api :: commands/expression/ir-interpreter-phi-nodes/TestIRInterpreterPHINodes.py (800 of 1788) PASS: lldb-shell :: SymbolFile/Breakpad/unwind-via-raSearch.test (801 of 1788) PASS: lldb-unit :: Utility/./UtilityTests/StringExtractorTest.GetHexBytes_OddPair2 (802 of 1788) PASS: lldb-unit :: Utility/./UtilityTests/LogChannelEnabledTest.LogGetLogThread (803 of 1788) PASS: lldb-unit :: Utility/./UtilityTests/UserIDResolver.GetUserName (804 of 1788) PASS: lldb-api :: lang/c/inlines/TestRedefinitionsInInlines.py (805 of 1788) PASS: lldb-unit :: Expression/./ExpressionTests/CppModuleConfigurationTest.UnknownLibCppFile (806 of 1788) PASS: lldb-shell :: ObjectFile/ELF/minidebuginfo-find-symbols.yaml (807 of 1788) PASS: lldb-api :: commands/disassemble/basic/TestFrameDisassemble.py (808 of 1788) PASS: lldb-api :: python_api/debugger/TestDebuggerAPI.py (809 of 1788) PASS: lldb-api :: commands/expression/two-files/TestObjCTypeQueryFromOtherCompileUnit.py (810 of 1788) PASS: lldb-api :: lang/c/global_variables/TestGlobalVariables.py (811 of 1788) PASS: lldb-unit :: ObjectFile/Breakpad/./ObjectFileBreakpadTests/Record.classify (812 of 1788) PASS: lldb-api :: functionalities/memory/find/TestMemoryFind.py (813 of 1788) PASS: lldb-api :: lang/objc/foundation/TestObjCMethodsNSArray.py (814 of 1788) PASS: lldb-api :: commands/settings/TestSettings.py (815 of 1788) PASS: lldb-api :: lang/objc/objc-static-method/TestObjCStaticMethod.py (816 of 1788) PASS: lldb-unit :: SymbolFile/NativePDB/./SymbolFileNativePDBTests/PDBFPOProgramToDWARFExpressionTests.DependencyChain (817 of 1788) UNSUPPORTED: lldb-api :: functionalities/darwin_log/source/info/TestDarwinLogSourceInfo.py (818 of 1788) PASS: lldb-api :: lang/cpp/global_operators/TestCppGlobalOperators.py (819 of 1788) PASS: lldb-api :: lang/objc/objc-class-method/TestObjCClassMethod.py (820 of 1788) PASS: lldb-api :: functionalities/thread/concurrent_events/TestConcurrentTwoBreakpointsOneDelaySignal.py (821 of 1788) PASS: lldb-api :: functionalities/tail_call_frames/disambiguate_paths_to_common_sink/TestDisambiguatePathsToCommonSink.py (822 of 1788) PASS: lldb-shell :: ObjectFile/ELF/section-addresses.yaml (823 of 1788) UNSUPPORTED: lldb-api :: functionalities/exec/TestExec.py (824 of 1788) PASS: lldb-api :: types/TestIntegerTypes.py (825 of 1788) PASS: lldb-api :: lang/cpp/const_this/TestConstThis.py (826 of 1788) PASS: lldb-api :: functionalities/param_entry_vals/basic_entry_values_x86_64/TestBasicEntryValuesX86_64.py (827 of 1788) UNSUPPORTED: lldb-api :: functionalities/thread/state/TestThreadStates.py (828 of 1788) PASS: lldb-unit :: ScriptInterpreter/Python/./ScriptInterpreterPythonTests/PythonDataObjectsTest.TestPythonIntegerToStructuredInteger (829 of 1788) PASS: lldb-unit :: Utility/./UtilityTests/StreamTest.PutCharWhitespace (830 of 1788) PASS: lldb-api :: functionalities/thread/num_threads/TestNumThreads.py (831 of 1788) PASS: lldb-unit :: UnwindAssembly/x86/./UnwindAssemblyx86Tests/Testx86AssemblyInspectionEngine.TestPopRBP (832 of 1788) PASS: lldb-api :: api/multithreaded/TestMultithreaded.py (833 of 1788) UNSUPPORTED: lldb-shell :: SymbolFile/PDB/vbases.test (834 of 1788) PASS: lldb-unit :: Expression/./ExpressionTests/DiagnosticManagerTest.GetStringPreserveOrder (835 of 1788) PASS: lldb-api :: commands/command/nested_alias/TestNestedAlias.py (836 of 1788) PASS: lldb-unit :: Utility/./UtilityTests/AnsiTerminal.Incomplete (837 of 1788) PASS: lldb-unit :: Utility/./UtilityTests/ArgsTest.StringListConstructor (838 of 1788) PASS: lldb-unit :: Utility/./UtilityTests/StringExtractorTest.GetHexBytes (839 of 1788) PASS: lldb-unit :: Language/CPlusPlus/./LanguageCPlusPlusTests/CPlusPlusLanguage.ExtractContextAndIdentifier (840 of 1788) PASS: lldb-api :: macosx/add-dsym/TestAddDsymMidExecutionCommand.py (841 of 1788) PASS: lldb-api :: functionalities/data-formatter/data-formatter-globals/TestDataFormatterGlobals.py (842 of 1788) PASS: lldb-unit :: Utility/./UtilityTests/DataExtractorTest.GetCStrEmpty (843 of 1788) PASS: lldb-api :: functionalities/data-formatter/format-propagation/TestFormatPropagation.py (844 of 1788) PASS: lldb-api :: lang/cpp/diamond/TestDiamond.py (845 of 1788) PASS: lldb-shell :: SymbolFile/DWARF/childless-compile-unit.s (846 of 1788) PASS: lldb-api :: commands/expression/context-object/TestContextObject.py (847 of 1788) PASS: lldb-api :: commands/expression/ignore-artificial-constructors/TestIgnoreArtificialConstructors.py (848 of 1788) PASS: lldb-unit :: Target/./TargetTests/ExecutionContextTest.GetByteOrderProcess (849 of 1788) PASS: lldb-shell :: SymbolFile/NativePDB/globals-bss.cpp (850 of 1788) PASS: lldb-unit :: Utility/./UtilityTests/StreamTest.PutHex64ByteOrderBig (851 of 1788) PASS: lldb-unit :: Host/./HostTests/MainLoopTest.ReadObject (852 of 1788) PASS: lldb-api :: python_api/watchpoint/TestWatchpointIgnoreCount.py (853 of 1788) PASS: lldb-shell :: SymbolFile/DWARF/apple-index-is-used.cpp (854 of 1788) PASS: lldb-api :: api/command-return-object/TestSBCommandReturnObject.py (855 of 1788) UNSUPPORTED: lldb-shell :: Register/x86-64-gp-write.test (856 of 1788) UNSUPPORTED: lldb-shell :: Register/x86-zmm-write.test (857 of 1788) PASS: lldb-api :: functionalities/thread/concurrent_events/TestConcurrentSignalWatch.py (858 of 1788) UNSUPPORTED: lldb-api :: benchmarks/expression/TestExpressionCmd.py (859 of 1788) PASS: lldb-unit :: Process/gdb-remote/./ProcessGdbRemoteTests/GDBRemoteClientBaseTest.SendContinueAndWait (860 of 1788) UNSUPPORTED: lldb-shell :: SymbolFile/PDB/func-symbols.test (861 of 1788) PASS: lldb-unit :: Utility/./UtilityTests/FileSpecTest.EqualDotsPosixRoot (862 of 1788) PASS: lldb-unit :: UnwindAssembly/x86/./UnwindAssemblyx86Tests/Testx86AssemblyInspectionEngine.Testi386IgnoredRegisters (863 of 1788) PASS: lldb-api :: lang/cpp/member-and-local-vars-with-same-name/TestMembersAndLocalsWithSameName.py (864 of 1788) PASS: lldb-api :: lang/cpp/nested-class-other-compilation-unit/TestNestedClassWithParentInAnotherCU.py (865 of 1788) PASS: lldb-api :: lang/c/struct_types/TestStructTypes.py (866 of 1788) PASS: lldb-api :: functionalities/dynamic_value_child_count/TestDynamicValueChildCount.py (867 of 1788) PASS: lldb-api :: lang/objc/foundation/TestObjCMethods2.py (868 of 1788) PASS: lldb-shell :: SymbolFile/NativePDB/source-list.cpp (869 of 1788) PASS: lldb-api :: commands/target/create-deps/TestTargetCreateDeps.py (870 of 1788) PASS: lldb-unit :: Expression/./ExpressionTests/DiagnosticManagerTest.PutString (871 of 1788) PASS: lldb-shell :: SymbolFile/NativePDB/function-types-classes.cpp (872 of 1788) PASS: lldb-unit :: Utility/./UtilityTests/UUIDTest.RelationalOperators (873 of 1788) PASS: lldb-api :: python_api/type/TestTypeList.py (874 of 1788) PASS: lldb-api :: lang/cpp/trivial_abi/TestTrivialABI.py (875 of 1788) PASS: lldb-unit :: Process/gdb-remote/./ProcessGdbRemoteTests/GDBRemoteCommunicationClientTest.TestPacketSpeedJSON (876 of 1788) PASS: lldb-api :: commands/platform/basic/TestPlatformCommand.py (877 of 1788) PASS: lldb-unit :: Utility/./UtilityTests/VASprintfTest.NoBufferResize (878 of 1788) PASS: lldb-unit :: Utility/./UtilityTests/StringExtractorTest.DecodeHexU8_Exact (879 of 1788) PASS: lldb-unit :: Process/minidump/./LLDBMinidumpTests/MinidumpParserTest.GetThreadsAndGetThreadContext (880 of 1788) PASS: lldb-unit :: Utility/./UtilityTests/DeserializerTest.HasData (881 of 1788) PASS: lldb-shell :: Breakpoint/single-file-split-dwarf.test (882 of 1788) PASS: lldb-unit :: Utility/./UtilityTests/StringListTest.Assignment (883 of 1788) PASS: lldb-unit :: Symbol/./SymbolTests/LineEntryTest.GetSameLineContiguousAddressRangeOneInline (884 of 1788) PASS: lldb-api :: lang/cpp/signed_types/TestSignedTypes.py (885 of 1788) PASS: lldb-unit :: Expression/./ExpressionTests/CppModuleConfigurationTest.UnrelatedLibrary (886 of 1788) PASS: lldb-api :: lang/objc/objc-runtime-ivars/TestRuntimeIvars.py (887 of 1788) PASS: lldb-api :: functionalities/tsan/basic/TestTsanBasic.py (888 of 1788) UNSUPPORTED: lldb-shell :: SymbolFile/NativePDB/typedefs.cpp (889 of 1788) PASS: lldb-shell :: SymbolFile/NativePDB/global-classes.cpp (890 of 1788) PASS: lldb-unit :: Utility/./UtilityTests/VMRange.Comparison (891 of 1788) PASS: lldb-unit :: UnwindAssembly/x86/./UnwindAssemblyx86Tests/Testx86AssemblyInspectionEngine.TestSimple32bitFrameFunction (892 of 1788) PASS: lldb-unit :: Utility/./UtilityTests/FileSpecTest.FormatFileSpec (893 of 1788) PASS: lldb-unit :: UnwindAssembly/x86/./UnwindAssemblyx86Tests/Testx86AssemblyInspectionEngine.TestPushEAX (894 of 1788) PASS: lldb-shell :: Minidump/dump-all.test (895 of 1788) PASS: lldb-unit :: ObjectFile/ELF/./ObjectFileELFTests/ObjectFileELFTest.GetSymtab_NoSymEntryPointArmThumbAddressClass (896 of 1788) PASS: lldb-unit :: Utility/./UtilityTests/CompletionRequest.ShiftArguments (897 of 1788) PASS: lldb-api :: lang/objc/objc-struct-argument/TestObjCStructArgument.py (898 of 1788) PASS: lldb-unit :: Utility/./UtilityTests/StringExtractorTest.GetU64BigEndian (899 of 1788) UNSUPPORTED: lldb-shell :: SymbolFile/PDB/pointers.test (900 of 1788) UNSUPPORTED: lldb-api :: benchmarks/expression/TestRepeatedExprs.py (901 of 1788) PASS: lldb-api :: functionalities/var_path/TestVarPath.py (902 of 1788) PASS: lldb-unit :: SymbolFile/DWARF/./SymbolFileDWARFTests/SymbolFileDWARFTests.TestAbbrevOutOfOrder (903 of 1788) PASS: lldb-unit :: Utility/./UtilityTests/UriParserTest.Minimal (904 of 1788) PASS: lldb-shell :: Commands/command-script-import.test (905 of 1788) PASS: lldb-unit :: ScriptInterpreter/Python/./ScriptInterpreterPythonTests/PythonDataObjectsTest.TestPythonString (906 of 1788) PASS: lldb-api :: lang/c/const_variables/TestConstVariables.py (907 of 1788) PASS: lldb-api :: functionalities/data-formatter/data-formatter-synth/TestDataFormatterSynth.py (908 of 1788) PASS: lldb-api :: functionalities/tail_call_frames/ambiguous_tail_call_seq2/TestAmbiguousTailCallSeq2.py (909 of 1788) PASS: lldb-api :: functionalities/thread/step_until/TestStepUntil.py (910 of 1788) PASS: lldb-api :: commands/frame/select/TestFrameSelect.py (911 of 1788) PASS: lldb-shell :: SymbolFile/NativePDB/break-by-line.cpp (912 of 1788) PASS: lldb-unit :: Host/./HostTests/ConnectionFileDescriptorTest.TCPGetURIv6 (913 of 1788) PASS: lldb-api :: commands/frame/diagnose/bad-reference/TestBadReference.py (914 of 1788) PASS: lldb-unit :: tools/lldb-server/tests/./LLDBServerTests/StandardStartupTest.TestStopReplyContainsThreadPcs (915 of 1788) PASS: lldb-api :: commands/watchpoints/watchpoint_size/TestWatchpointSizes.py (916 of 1788) UNSUPPORTED: lldb-api :: tools/lldb-server/thread-name/TestGdbRemoteThreadName.py (917 of 1788) PASS: lldb-unit :: ScriptInterpreter/Python/./ScriptInterpreterPythonTests/PythonExceptionStateTest.TestDiscardSemantics (918 of 1788) PASS: lldb-unit :: Expression/./ExpressionTests/DiagnosticManagerTest.AppendMessageNoDiag (919 of 1788) PASS: lldb-api :: lang/cpp/namespace_conflicts/TestNamespaceConflicts.py (920 of 1788) PASS: lldb-api :: functionalities/breakpoint/serialize/TestBreakpointSerialization.py (921 of 1788) PASS: lldb-shell :: SymbolFile/NativePDB/ast-methods.cpp (922 of 1788) PASS: lldb-unit :: Utility/./UtilityTests/ScalarTest.Division (923 of 1788) PASS: lldb-api :: python_api/symbol-context/two-files/TestSymbolContextTwoFiles.py (924 of 1788) PASS: lldb-unit :: UnwindAssembly/x86/./UnwindAssemblyx86Tests/Testx86AssemblyInspectionEngine.TestPushR12 (925 of 1788) PASS: lldb-unit :: Utility/./UtilityTests/BinaryStreamTest.PutSLEB128Zero (926 of 1788) PASS: lldb-unit :: Utility/./UtilityTests/UserIDResolver.GetGroupName (927 of 1788) PASS: lldb-api :: commands/expression/cast_int_to_anonymous_enum/TestCastIntToAnonymousEnum.py (928 of 1788) PASS: lldb-unit :: Utility/./UtilityTests/FileSpecTest.CopyByAppendingPathComponent (929 of 1788) PASS: lldb-api :: python_api/process/io/TestProcessIO.py (930 of 1788) PASS: lldb-api :: lang/c/local_variables/TestLocalVariables.py (931 of 1788) PASS: lldb-unit :: Utility/./UtilityTests/StringListTest.SplitIntoLinesSingleTrailingCR (932 of 1788) PASS: lldb-unit :: Utility/./UtilityTests/NameMatchesTest.EndsWith (933 of 1788) PASS: lldb-shell :: SymbolFile/DWARF/dwarf5-index-is-used.cpp (934 of 1788) UNSUPPORTED: lldb-api :: linux/mix-dwo-and-regular-objects/TestMixedDwarfBinary.py (935 of 1788) UNSUPPORTED: lldb-api :: commands/expression/call-restarts/TestCallThatRestarts.py (936 of 1788) PASS: lldb-unit :: Host/./HostTests/NativeProcessProtocolTest.ReadMemoryWithoutTrap (937 of 1788) UNSUPPORTED: lldb-api :: macosx/macabi/TestMacABImacOSFramework.py (938 of 1788) PASS: lldb-api :: lang/cpp/incomplete-types/TestCppIncompleteTypes.py (939 of 1788) UNSUPPORTED: lldb-api :: commands/gui/basic/TestGuiBasic.py (940 of 1788) PASS: lldb-unit :: Utility/./UtilityTests/StringExtractorTest.GetNameColonValueNoColon (941 of 1788) PASS: lldb-unit :: Expression/./ExpressionTests/DiagnosticManagerTest.AddDiagnostic (942 of 1788) UNSUPPORTED: lldb-api :: python_api/disassemble-raw-data/TestDisassemble_VST1_64.py (943 of 1788) PASS: lldb-unit :: UnwindAssembly/x86/./UnwindAssemblyx86Tests/Testx86AssemblyInspectionEngine.TestMovRSPtoRBP (944 of 1788) PASS: lldb-unit :: ScriptInterpreter/Python/./ScriptInterpreterPythonTests/PythonDataObjectsTest.TestGlobalNameResolutionNoDot (945 of 1788) PASS: lldb-unit :: Utility/./UtilityTests/StringExtractorTest.GetHexBytesAvail_Partial (946 of 1788) PASS: lldb-unit :: Utility/./UtilityTests/StatusTest.ErrorConversion (947 of 1788) PASS: lldb-unit :: Utility/./UtilityTests/VMRange.Reset (948 of 1788) PASS: lldb-api :: functionalities/breakpoint/breakpoint_hit_count/TestBreakpointHitCount.py (949 of 1788) PASS: lldb-unit :: Utility/./UtilityTests/Flags.AnySet (950 of 1788) PASS: lldb-unit :: SymbolFile/NativePDB/./SymbolFileNativePDBTests/PDBFPOProgramToDWARFExpressionTests.InvalidAssignmentMultiple (951 of 1788) PASS: lldb-unit :: ObjectFile/ELF/./ObjectFileELFTests/ObjectFileELFTest.GetSymtab_NoSymEntryPointArmAddressClass (952 of 1788) PASS: lldb-api :: lang/cpp/unicode-literals/TestUnicodeLiterals.py (953 of 1788) PASS: lldb-api :: functionalities/thread/concurrent_events/TestConcurrentWatchBreak.py (954 of 1788) PASS: lldb-shell :: Breakpoint/debug_rnglist_basic.test (955 of 1788) PASS: lldb-unit :: Utility/./UtilityTests/LogChannelTest.List (956 of 1788) UNSUPPORTED: lldb-api :: commands/register/register/intel_xtended_registers/TestMPXRegisters.py (957 of 1788) PASS: lldb-unit :: Utility/./UtilityTests/StringListTest.JoinMultiCharSeparator (958 of 1788) PASS: lldb-unit :: UnwindAssembly/x86/./UnwindAssemblyx86Tests/Testx86AssemblyInspectionEngine.TestPopR15 (959 of 1788) PASS: lldb-shell :: BuildScript/toolchain-clang.test (960 of 1788) UNSUPPORTED: lldb-api :: functionalities/darwin_log/source/debug/TestDarwinLogSourceDebug.py (961 of 1788) PASS: lldb-unit :: Utility/./UtilityTests/StringListTest.AppendStringStdString (962 of 1788) PASS: lldb-shell :: Settings/TestStopCommandSourceOnError.test (963 of 1788) PASS: lldb-unit :: UnwindAssembly/x86/./UnwindAssemblyx86Tests/Testx86AssemblyInspectionEngine.TestAddESP (964 of 1788) PASS: lldb-api :: commands/expression/static-initializers/TestStaticInitializers.py (965 of 1788) PASS: lldb-api :: python_api/disassemble-raw-data/TestDisassembleRawData.py (966 of 1788) PASS: lldb-unit :: Utility/./UtilityTests/UriParserTest.BracketedHostname (967 of 1788) PASS: lldb-api :: functionalities/abbreviation/TestCommonShortSpellings.py (968 of 1788) PASS: lldb-unit :: Utility/./UtilityTests/StringExtractorTest.GetHexBytes_OddPair (969 of 1788) PASS: lldb-api :: commands/command/script_alias/TestCommandScriptAlias.py (970 of 1788) PASS: lldb-api :: commands/expression/import_builtin_fileid/TestImportBuiltinFileID.py (971 of 1788) PASS: lldb-unit :: Utility/./UtilityTests/StreamTeeTest.Constructor2Streams (972 of 1788) PASS: lldb-api :: functionalities/data-formatter/pyobjsynthprovider/TestPyObjSynthProvider.py (973 of 1788) PASS: lldb-api :: functionalities/plugins/command_plugin/TestPluginCommands.py (974 of 1788) PASS: lldb-shell :: ObjectFile/ELF/section-types.yaml (975 of 1788) PASS: lldb-shell :: Breakpoint/split-dwarf-5-addrbase.test (976 of 1788) UNSUPPORTED: lldb-api :: functionalities/thread/break_after_join/TestBreakAfterJoin.py (977 of 1788) PASS: lldb-unit :: Utility/./UtilityTests/StringExtractorTest.DecodeHexU8_InvalidHex (978 of 1788) PASS: lldb-api :: commands/watchpoints/watchpoint_set_command/TestWatchLocationWithWatchSet.py (979 of 1788) PASS: lldb-api :: commands/expression/no-deadlock/TestExprDoesntBlock.py (980 of 1788) PASS: lldb-unit :: Utility/./UtilityTests/AnsiTerminal.WhiteSpace (981 of 1788) PASS: lldb-api :: functionalities/data-formatter/data-formatter-stl/libstdcpp/unique_ptr/invalid/TestDataFormatterInvalidStdUniquePtr.py (982 of 1788) PASS: lldb-unit :: Host/./HostTests/SocketTest.DomainGetConnectURI (983 of 1788) PASS: lldb-api :: commands/reproducer/invalid-args/TestInvalidArgsReproducer.py (984 of 1788) PASS: lldb-api :: functionalities/postmortem/minidump/TestMiniDump.py (985 of 1788) PASS: lldb-api :: commands/expression/call-function/TestCallStopAndContinue.py (986 of 1788) PASS: lldb-shell :: SymbolFile/DWARF/find-variable-dwo.cpp (987 of 1788) PASS: lldb-unit :: Utility/./UtilityTests/BinaryStreamTest.PutSLEB128NineBytes (988 of 1788) PASS: lldb-api :: commands/disassemble/basic/TestDisassembleBreakpoint.py (989 of 1788) PASS: lldb-shell :: SymbolFile/DWARF/find-method-local-struct.cpp (990 of 1788) UNSUPPORTED: lldb-shell :: SymbolFile/NativePDB/local-variables.cpp (991 of 1788) UNSUPPORTED: lldb-api :: benchmarks/frame_variable/TestFrameVariableResponse.py (992 of 1788) PASS: lldb-unit :: Language/Highlighting/./HighlighterTests/HighlighterTest.ClangUnterminatedString (993 of 1788) PASS: lldb-unit :: Utility/./UtilityTests/ProcessInfoTest.Constructor (994 of 1788) PASS: lldb-unit :: Utility/./UtilityTests/UriParserTest.SchemeHostSeparator4 (995 of 1788) PASS: lldb-unit :: Utility/./UtilityTests/RangeTest.Constructor (996 of 1788) PASS: lldb-unit :: ScriptInterpreter/Python/./ScriptInterpreterPythonTests/PythonDataObjectsTest.TestExtractingUInt64ThroughStructuredData (997 of 1788) PASS: lldb-unit :: Utility/./UtilityTests/RecordReplayTest.InstrumentedBar (998 of 1788) PASS: lldb-unit :: Host/./HostTests/FileSystemTest.GetPermissions (999 of 1788) PASS: lldb-api :: lang/objc/objc-new-syntax/TestObjCNewSyntaxDictionary.py (1000 of 1788) PASS: lldb-unit :: Utility/./UtilityTests/DataExtractorTest.GetCStr (1001 of 1788) PASS: lldb-api :: commands/expression/import-std-module/list-basic/TestBasicList.py (1002 of 1788) PASS: lldb-api :: functionalities/postmortem/minidump-new/TestMiniDumpUUID.py (1003 of 1788) PASS: lldb-unit :: Language/Highlighting/./HighlighterTests/HighlighterTest.ClangCursorPosAfterOtherToken (1004 of 1788) PASS: lldb-api :: python_api/exprpath_synthetic/TestExprPathSynthetic.py (1005 of 1788) UNSUPPORTED: lldb-shell :: Register/x86-ymm-read.test (1006 of 1788) PASS: lldb-api :: functionalities/inferior-changed/TestInferiorChanged.py (1007 of 1788) PASS: lldb-unit :: UnwindAssembly/x86/./UnwindAssemblyx86Tests/Testx86AssemblyInspectionEngine.TestPopESI (1008 of 1788) UNSUPPORTED: lldb-api :: lang/cpp/function-template-parameter-pack/TestFunctionTemplateParameterPack.py (1009 of 1788) UNSUPPORTED: lldb-api :: lang/cpp/static_members/TestCPPStaticMembers.py (1010 of 1788) PASS: lldb-unit :: ScriptInterpreter/Python/./ScriptInterpreterPythonTests/PythonDataObjectsTest.TestGlobalNameResolutionWithDot (1011 of 1788) PASS: lldb-api :: python_api/default-constructor/TestDefaultConstructorForAPIObjects.py (1012 of 1788) PASS: lldb-unit :: Process/minidump/./LLDBMinidumpTests/RegisterContextMinidump.ConvertMinidumpContext_x86_64 (1013 of 1788) PASS: lldb-unit :: Host/./HostTests/MainLoopTest.TerminatesImmediately (1014 of 1788) PASS: lldb-api :: lang/cpp/char8_t/TestCxxChar8_t.py (1015 of 1788) PASS: lldb-api :: functionalities/data-formatter/data-formatter-cpp/TestDataFormatterCpp.py (1016 of 1788) UNSUPPORTED: lldb-api :: tools/lldb-vscode/attach/TestVSCode_attach.py (1017 of 1788) PASS: lldb-shell :: SymbolFile/DWARF/deterministic-build.cpp (1018 of 1788) PASS: lldb-api :: python_api/frame/TestFrames.py (1019 of 1788) PASS: lldb-api :: lang/cpp/symbols/TestSymbols.py (1020 of 1788) UNSUPPORTED: lldb-api :: functionalities/darwin_log/basic/TestDarwinLogBasic.py (1021 of 1788) PASS: lldb-api :: lang/c/register_variables/TestRegisterVariables.py (1022 of 1788) PASS: lldb-api :: functionalities/paths/TestPaths.py (1023 of 1788) PASS: lldb-unit :: UnwindAssembly/x86/./UnwindAssemblyx86Tests/Testx86AssemblyInspectionEngine.TestPushEBX (1024 of 1788) UNSUPPORTED: lldb-shell :: ObjectFile/ELF/minidebuginfo-set-and-hit-breakpoint.test (1025 of 1788) PASS: lldb-api :: commands/expression/call-function/TestCallStdStringFunction.py (1026 of 1788) PASS: lldb-unit :: Utility/./UtilityTests/OptionsWithRawTest.SingleWordSuffix (1027 of 1788) PASS: lldb-unit :: Utility/./UtilityTests/StringListTest.JoinNonSpace (1028 of 1788) PASS: lldb-unit :: Utility/./UtilityTests/LogChannelEnabledTest.LogThread (1029 of 1788) UNSUPPORTED: lldb-shell :: Register/aarch64-gp-read.test (1030 of 1788) PASS: lldb-unit :: Utility/./UtilityTests/UriParserTest.SchemeHostSeparator3 (1031 of 1788) PASS: lldb-api :: python_api/frame/inlines/TestInlinedFrame.py (1032 of 1788) PASS: lldb-api :: commands/platform/basic/TestPlatformPython.py (1033 of 1788) PASS: lldb-unit :: ObjectFile/Breakpad/./ObjectFileBreakpadTests/LineRecord.parse (1034 of 1788) PASS: lldb-api :: functionalities/data-formatter/data-formatter-stl/libcxx/optional/TestDataFormatterLibcxxOptional.py (1035 of 1788) PASS: lldb-api :: lang/cpp/operator-overload/TestOperatorOverload.py (1036 of 1788) PASS: lldb-unit :: Process/minidump/./LLDBMinidumpTests/MinidumpParserTest.GetPidWindows (1037 of 1788) UNSUPPORTED: lldb-shell :: SymbolFile/PDB/variables.test (1038 of 1788) PASS: lldb-api :: commands/frame/diagnose/dereference-argument/TestDiagnoseDereferenceArgument.py (1039 of 1788) PASS: lldb-api :: lang/objc/objc-ivar-protocols/TestIvarProtocols.py (1040 of 1788) PASS: lldb-unit :: ScriptInterpreter/Python/./ScriptInterpreterPythonTests/PythonExceptionStateTest.TestManualRestoreSemantics (1041 of 1788) PASS: lldb-unit :: Utility/./UtilityTests/StringLexerTest.HasAtLeast (1042 of 1788) PASS: lldb-unit :: Utility/./UtilityTests/StreamTeeTest.SetStreamAtIndexOverwrite (1043 of 1788) PASS: lldb-api :: functionalities/modern-type-lookup/libcxx/TestLibCxxModernTypeLookup.py (1044 of 1788) PASS: lldb-api :: lang/cpp/namespace/TestNamespaceLookup.py (1045 of 1788) PASS: lldb-shell :: Settings/TestSettingsSet.test (1046 of 1788) PASS: lldb-api :: lang/cpp/template/TestTemplateArgs.py (1047 of 1788) PASS: lldb-shell :: ObjectFile/ELF/gnu-debuglink.yaml (1048 of 1788) PASS: lldb-unit :: Utility/./UtilityTests/RangeTest.LessThanInvalid (1049 of 1788) PASS: lldb-unit :: Host/./HostTests/FileSystemTest.MakeAbsolute (1050 of 1788) PASS: lldb-api :: macosx/safe-to-func-call/TestSafeFuncCalls.py (1051 of 1788) PASS: lldb-unit :: Process/gdb-remote/./ProcessGdbRemoteTests/GDBRemoteCommunicationServerTest.SendErrorResponse_ErrorNumber (1052 of 1788) PASS: lldb-unit :: Utility/./UtilityTests/StreamTest.PutBytesAsRawHex8ToMixedEndian (1053 of 1788) PASS: lldb-api :: tools/lldb-server/TestGdbRemoteSingleStep.py (1054 of 1788) PASS: lldb-unit :: Expression/./ExpressionTests/CppModuleConfigurationTest.AmbiguousCLib (1055 of 1788) PASS: lldb-unit :: ScriptInterpreter/Python/./ScriptInterpreterPythonTests/PythonDataObjectsTest.TestPythonListValueEquality (1056 of 1788) PASS: lldb-api :: lang/objc/objc-new-syntax/TestObjCNewSyntaxLiteral.py (1057 of 1788) PASS: lldb-unit :: Utility/./UtilityTests/RangeTest.Clear (1058 of 1788) PASS: lldb-api :: functionalities/tsan/global_location/TestTsanGlobalLocation.py (1059 of 1788) PASS: lldb-unit :: Utility/./UtilityTests/StringExtractorTest.GetHexU8_Underflow2_NoEof (1060 of 1788) XFAIL: lldb-shell :: Register/x86-64-ymm-write.test (1061 of 1788) PASS: lldb-shell :: Reproducer/TestSynchronous.test (1062 of 1788) PASS: lldb-api :: commands/expression/expr-in-syscall/TestExpressionInSyscall.py (1063 of 1788) PASS: lldb-shell :: SymbolFile/DWARF/find-basic-namespace.cpp (1064 of 1788) PASS: lldb-api :: functionalities/tail_call_frames/inlining_and_tail_calls/TestInliningAndTailCalls.py (1065 of 1788) PASS: lldb-api :: commands/expression/persistent_types/TestNestedPersistentTypes.py (1066 of 1788) UNSUPPORTED: lldb-api :: benchmarks/startup/TestStartupDelays.py (1067 of 1788) PASS: lldb-api :: lang/cpp/thread_local/TestThreadLocal.py (1068 of 1788) PASS: lldb-unit :: Utility/./UtilityTests/StreamTeeTest.AppendStream (1069 of 1788) PASS: lldb-unit :: Utility/./UtilityTests/StringLexerTest.Peek (1070 of 1788) UNSUPPORTED: lldb-api :: tools/lldb-server/TestGdbRemoteModuleInfo.py (1071 of 1788) PASS: lldb-api :: functionalities/data-formatter/data-formatter-stl/libcxx/bitset/TestDataFormatterLibcxxBitset.py (1072 of 1788) PASS: lldb-api :: commands/frame/diagnose/complicated-expression/TestComplicatedExpression.py (1073 of 1788) PASS: lldb-unit :: Process/gdb-remote/./ProcessGdbRemoteTests/GDBRemoteCommunicationClientTest.GetMemoryRegionInfoInvalidResponse (1074 of 1788) PASS: lldb-api :: commands/expression/argument_passing_restrictions/TestArgumentPassingRestrictions.py (1075 of 1788) PASS: lldb-unit :: Language/Highlighting/./HighlighterTests/HighlighterTest.ClangEmptyInput (1076 of 1788) PASS: lldb-api :: functionalities/ubsan/user-expression/TestUbsanUserExpression.py (1077 of 1788) UNSUPPORTED: lldb-api :: tools/lldb-server/signal-filtering/TestGdbRemote_QPassSignals.py (1078 of 1788) PASS: lldb-api :: functionalities/thread/concurrent_events/TestConcurrentBreakpointsDelayedBreakpointOneWatchpoint.py (1079 of 1788) PASS: lldb-api :: lang/objc/self/TestObjCSelf.py (1080 of 1788) PASS: lldb-shell :: ObjectFile/ELF/section-overlap.yaml (1081 of 1788) PASS: lldb-unit :: Process/minidump/./LLDBMinidumpTests/MinidumpParserTest.GetLinuxProcStatus_no_stream (1082 of 1788) PASS: lldb-shell :: Driver/TestConvenienceVariables.test (1083 of 1788) PASS: lldb-api :: commands/expression/vector_of_enums/TestVectorOfEnums.py (1084 of 1788) PASS: lldb-api :: commands/watchpoints/watchpoint_commands/TestWatchpointCommands.py (1085 of 1788) UNSUPPORTED: lldb-api :: functionalities/thread/create_during_step/TestCreateDuringStep.py (1086 of 1788) PASS: lldb-unit :: Symbol/./SymbolTests/DWARFCallFrameInfoTest.Basic_dwarf4 (1087 of 1788) PASS: lldb-api :: functionalities/data-formatter/data-formatter-script/TestDataFormatterScript.py (1088 of 1788) PASS: lldb-unit :: Process/minidump/./LLDBMinidumpTests/MinidumpParserTest.GetThreadContext_x86_32 (1089 of 1788) PASS: lldb-api :: lang/objc/objc-checker/TestObjCCheckers.py (1090 of 1788) PASS: lldb-api :: lang/cpp/auto/TestCPPAuto.py (1091 of 1788) PASS: lldb-api :: commands/expression/xvalue/TestXValuePrinting.py (1092 of 1788) PASS: lldb-api :: functionalities/data-formatter/data-formatter-stl/libcxx/list/TestDataFormatterLibcxxList.py (1093 of 1788) PASS: lldb-api :: functionalities/memory-region/TestMemoryRegion.py (1094 of 1788) PASS: lldb-api :: functionalities/gdb_remote_client/TestArmRegisterDefinition.py (1095 of 1788) PASS: lldb-api :: lang/cpp/wchar_t/TestCxxWCharT.py (1096 of 1788) PASS: lldb-unit :: Utility/./UtilityTests/ArgsTest.TestSingleArg (1097 of 1788) PASS: lldb-shell :: ObjectFile/ELF/PT_LOAD-overlap-PT_TLS.yaml (1098 of 1788) PASS: lldb-shell :: ObjectFile/PECOFF/dep-modules.yaml (1099 of 1788) PASS: lldb-api :: commands/expression/import-std-module/unique_ptr/TestUniquePtr.py (1100 of 1788) PASS: lldb-api :: commands/watchpoints/watchpoint_on_vectors/TestValueOfVectorVariable.py (1101 of 1788) PASS: lldb-shell :: SymbolFile/DWARF/find-basic-variable.cpp (1102 of 1788) PASS: lldb-unit :: Process/minidump/./LLDBMinidumpTests/MinidumpParserTest.GetPid (1103 of 1788) PASS: lldb-api :: functionalities/unwind/sigtramp/TestSigtrampUnwind.py (1104 of 1788) PASS: lldb-unit :: Utility/./UtilityTests/NameMatchesTest.Contains (1105 of 1788) PASS: lldb-api :: python_api/findvalue_duplist/TestSBFrameFindValue.py (1106 of 1788) UNSUPPORTED: lldb-shell :: SymbolFile/PDB/udt-layout.test (1107 of 1788) PASS: lldb-api :: functionalities/data-formatter/data-formatter-stl/libcxx/variant/TestDataFormatterLibcxxVariant.py (1108 of 1788) PASS: lldb-shell :: SymbolFile/DWARF/debug-types-dwo-cross-reference.cpp (1109 of 1788) PASS: lldb-api :: commands/expression/diagnostics/TestExprDiagnostics.py (1110 of 1788) XFAIL: lldb-shell :: Register/x86-mm-xmm-read.test (1111 of 1788) PASS: lldb-api :: lang/objc/rdar-11355592/TestRdar11355592.py (1112 of 1788) UNSUPPORTED: lldb-api :: functionalities/thread/thread_specific_break_plus_condition/TestThreadSpecificBpPlusCondition.py (1113 of 1788) PASS: lldb-unit :: Utility/./UtilityTests/UUIDTest.Validity (1114 of 1788) PASS: lldb-unit :: Process/minidump/./LLDBMinidumpTests/MinidumpParserTest.GetMiscInfoWindows (1115 of 1788) PASS: lldb-unit :: Utility/./UtilityTests/ScalarTest.Promotion (1116 of 1788) PASS: lldb-unit :: UnwindAssembly/x86/./UnwindAssemblyx86Tests/Testx86AssemblyInspectionEngine.TestStackRealign8BitDisp_i386 (1117 of 1788) PASS: lldb-unit :: Expression/./ExpressionTests/DiagnosticManagerTest.GetStringMultiline (1118 of 1788) PASS: lldb-api :: lang/objc/objc-builtin-types/TestObjCBuiltinTypes.py (1119 of 1788) PASS: lldb-shell :: Minidump/Windows/find-module.test (1120 of 1788) PASS: lldb-unit :: Utility/./UtilityTests/ArgsTest.TestInsertArg (1121 of 1788) PASS: lldb-unit :: Utility/./UtilityTests/VMRange.Ordering (1122 of 1788) PASS: lldb-unit :: UnwindAssembly/x86/./UnwindAssemblyx86Tests/Testx86AssemblyInspectionEngine.TestPopRBPWithREX (1123 of 1788) PASS: lldb-unit :: SymbolFile/DWARF/./SymbolFileDWARFTests/SymbolFileDWARFTests.TestAbbrevOrder1Start1 (1124 of 1788) PASS: lldb-api :: commands/quit/TestQuit.py (1125 of 1788) PASS: lldb-shell :: Driver/LocalLLDBInit.test (1126 of 1788) PASS: lldb-unit :: Utility/./UtilityTests/FileSpecTest.GuessPathStyle (1127 of 1788) PASS: lldb-unit :: Utility/./UtilityTests/OptionsWithRawTest.EmptySuffix (1128 of 1788) PASS: lldb-unit :: Utility/./UtilityTests/StringListTest.ShiftCString (1129 of 1788) PASS: lldb-shell :: SymbolFile/DWARF/debug-types-missing-signature.test (1130 of 1788) PASS: lldb-unit :: Utility/./UtilityTests/ConstStringTest.UpdateMangledCounterpart (1131 of 1788) PASS: lldb-unit :: Symbol/./SymbolTests/SymbolsTest.TerminateLocateExecutableSymbolFileForUnknownExecutableAndUnknownSymbolFile (1132 of 1788) PASS: lldb-unit :: Host/./HostTests/SocketTest.UDPGetConnectURI (1133 of 1788) PASS: lldb-unit :: Utility/./UtilityTests/StructuredDataTest.ParseJSONFromFile (1134 of 1788) PASS: lldb-unit :: Utility/./UtilityTests/Flags.Clear (1135 of 1788) PASS: lldb-unit :: Utility/./UtilityTests/RangeDataVector.FindEntryThatContains (1136 of 1788) PASS: lldb-unit :: Expression/./ExpressionTests/DiagnosticManagerTest.GetStringMultipleDiags (1137 of 1788) PASS: lldb-unit :: Utility/./UtilityTests/TimeoutTest.Format (1138 of 1788) PASS: lldb-api :: commands/expression/import-std-module/empty-module/TestEmptyStdModule.py (1139 of 1788) PASS: lldb-unit :: Utility/./UtilityTests/DataExtractorTest.GetBitfield (1140 of 1788) PASS: lldb-api :: functionalities/tail_call_frames/ambiguous_tail_call_seq1/TestAmbiguousTailCallSeq1.py (1141 of 1788) PASS: lldb-api :: lang/cpp/breakpoint_in_member_func_w_non_primitive_params/TestBreakpointInMemberFuncWNonPrimitiveParams.py (1142 of 1788) PASS: lldb-api :: commands/expression/import-std-module/stack/TestStack.py (1143 of 1788) PASS: lldb-unit :: SymbolFile/NativePDB/./SymbolFileNativePDBTests/PDBFPOProgramToDWARFExpressionTests.MultipleDependentAssignments (1144 of 1788) PASS: lldb-unit :: Host/./HostTests/HostInfoTest.GetAugmentedArchSpec (1145 of 1788) PASS: lldb-api :: lang/objc/objc-static-method-stripped/TestObjCStaticMethodStripped.py (1146 of 1788) PASS: lldb-unit :: UnwindAssembly/x86/./UnwindAssemblyx86Tests/Testx86AssemblyInspectionEngine.TestStackRealign32BitDisp_x86_64 (1147 of 1788) UNSUPPORTED: lldb-api :: functionalities/darwin_log/filter/regex/activity-chain/TestDarwinLogFilterRegexActivityChain.py (1148 of 1788) PASS: lldb-unit :: ScriptInterpreter/Python/./ScriptInterpreterPythonTests/PythonDataObjectsTest.TestPythonCallableCheck (1149 of 1788) PASS: lldb-api :: commands/expression/persist_objc_pointeetype/TestPersistObjCPointeeType.py (1150 of 1788) PASS: lldb-api :: lang/cpp/template-function/TestTemplateFunctions.py (1151 of 1788) PASS: lldb-api :: commands/expression/import-std-module/basic/TestImportStdModule.py (1152 of 1788) PASS: lldb-unit :: ObjectFile/PECOFF/./ObjectFilePECOFFTests/PECallFrameInfoTest.Frame_reg_eh (1153 of 1788) PASS: lldb-api :: lang/objc/foundation/TestObjCMethodsNSError.py (1154 of 1788) PASS: lldb-unit :: Symbol/./SymbolTests/PostfixExpression.ParseOneExpression (1155 of 1788) PASS: lldb-unit :: Utility/./UtilityTests/StreamTeeTest.Assignment (1156 of 1788) PASS: lldb-unit :: Utility/./UtilityTests/ProcessInstanceInfo.Dump (1157 of 1788) PASS: lldb-api :: lang/cpp/namespace_definitions/TestNamespaceDefinitions.py (1158 of 1788) PASS: lldb-api :: commands/expression/call-function/TestCallBuiltinFunction.py (1159 of 1788) PASS: lldb-api :: functionalities/data-formatter/data-formatter-ptr-to-array/TestPtrToArrayFormatting.py (1160 of 1788) PASS: lldb-unit :: Utility/./UtilityTests/DataExtractorTest.PeekData (1161 of 1788) UNSUPPORTED: lldb-shell :: BuildScript/toolchain-msvc.test (1162 of 1788) PASS: lldb-api :: functionalities/postmortem/mach-core/TestMachCore.py (1163 of 1788) PASS: lldb-api :: functionalities/gdb_remote_client/TestRecognizeBreakpoint.py (1164 of 1788) PASS: lldb-unit :: Process/minidump/./LLDBMinidumpTests/MinidumpParserTest.GetMiscInfo_no_stream (1165 of 1788) PASS: lldb-api :: lang/objc/foundation/TestObjCMethods.py (1166 of 1788) PASS: lldb-shell :: SymbolFile/DWARF/dir-separator-no-comp-dir.s (1167 of 1788) PASS: lldb-api :: commands/add-dsym/uuid/TestAddDsymCommand.py (1168 of 1788) UNSUPPORTED: lldb-api :: functionalities/data-formatter/data-formatter-stl/libstdcpp/vector/TestDataFormatterStdVector.py (1169 of 1788) PASS: lldb-unit :: Utility/./UtilityTests/StringListTest.ShiftStdString (1170 of 1788) PASS: lldb-shell :: ObjectFile/MachO/lc_build_version.yaml (1171 of 1788) PASS: lldb-unit :: Utility/./UtilityTests/StatusTest.Formatv (1172 of 1788) PASS: lldb-unit :: Language/Highlighting/./HighlighterTests/HighlighterTest.DefaultHighlighter (1173 of 1788) UNSUPPORTED: lldb-api :: functionalities/darwin_log/format/TestDarwinLogMessageFormat.py (1174 of 1788) PASS: lldb-unit :: Core/./LLDBCoreTests/MangledTest.NameIndexes_FindFunctionSymbols (1175 of 1788) UNSUPPORTED: lldb-api :: api/multiple-debuggers/TestMultipleDebuggers.py (1176 of 1788) PASS: lldb-unit :: Utility/./UtilityTests/BinaryStreamTest.PutULEB128One (1177 of 1788) PASS: lldb-unit :: Utility/./UtilityTests/StringListTest.CopyListSingle (1178 of 1788) PASS: lldb-unit :: Symbol/./SymbolTests/PostfixExpression.ParseFPOProgram (1179 of 1788) PASS: lldb-unit :: SymbolFile/NativePDB/./SymbolFileNativePDBTests/PDBFPOProgramToDWARFExpressionTests.MissingTargetRegister (1180 of 1788) PASS: lldb-unit :: Symbol/./SymbolTests/Type.GetTypeScopeAndBasename (1181 of 1788) PASS: lldb-unit :: Process/gdb-remote/./ProcessGdbRemoteTests/GDBRemoteClientBaseTest.SendPacketAndReceiveResponseWithOutputSupport (1182 of 1788) PASS: lldb-unit :: Core/./LLDBCoreTests/RichManglingContextTest.FromCxxMethodName (1183 of 1788) PASS: lldb-unit :: Process/gdb-remote/./ProcessGdbRemoteTests/GDBRemoteClientBaseTest.SendContinueAndAsyncSignal (1184 of 1788) PASS: lldb-api :: lang/objc/foundation/TestObjectDescriptionAPI.py (1185 of 1788) PASS: lldb-shell :: ObjectFile/Breakpad/breakpad-identification.test (1186 of 1788) PASS: lldb-unit :: Utility/./UtilityTests/EnvironmentTest.EnvpConstruction (1187 of 1788) PASS: lldb-unit :: Utility/./UtilityTests/VMRange.ContainsRange (1188 of 1788) UNSUPPORTED: lldb-api :: benchmarks/continue/TestBenchmarkContinue.py (1189 of 1788) PASS: lldb-unit :: Expression/./ExpressionTests/CppModuleConfigurationTest.LibCppV2 (1190 of 1788) PASS: lldb-api :: functionalities/modern-type-lookup/objc-modules/TestObjModulesModernTypeLookup.py (1191 of 1788) PASS: lldb-unit :: Utility/./UtilityTests/TimerTest.CategoryTimes2 (1192 of 1788) UNSUPPORTED: lldb-api :: tools/lldb-vscode/stackTrace/TestVSCode_stackTrace.py (1193 of 1788) PASS: lldb-api :: lang/cpp/static_methods/TestCPPStaticMethods.py (1194 of 1788) PASS: lldb-unit :: Utility/./UtilityTests/StringLexerTest.GetUnlexed (1195 of 1788) PASS: lldb-unit :: Utility/./UtilityTests/ScalarTest.GetBytes (1196 of 1788) PASS: lldb-unit :: Utility/./UtilityTests/ArchSpecTest.TestParseMachCPUDashSubtypeTripleSimple (1197 of 1788) PASS: lldb-unit :: ScriptInterpreter/Python/./ScriptInterpreterPythonTests/PythonDataObjectsTest.TestPythonTupleValues (1198 of 1788) PASS: lldb-unit :: Utility/./UtilityTests/GeneratorTest.GetOrCreate (1199 of 1788) PASS: lldb-api :: tools/lldb-server/TestGdbRemoteExitCode.py (1200 of 1788) PASS: lldb-unit :: Utility/./UtilityTests/StreamTest.ShiftOperatorPtr (1201 of 1788) PASS: lldb-shell :: SymbolFile/DWARF/dir-separator-posix.s (1202 of 1788) PASS: lldb-unit :: Utility/./UtilityTests/OptionsWithRawTest.LeadingSpaceArgs (1203 of 1788) PASS: lldb-api :: functionalities/archives/TestBSDArchives.py (1204 of 1788) PASS: lldb-unit :: tools/lldb-server/tests/./LLDBServerTests/TestBase.DebugserverEnv (1205 of 1788) PASS: lldb-shell :: SymbolFile/DWARF/compilercontext.ll (1206 of 1788) PASS: lldb-api :: sample_test/TestSampleInlineTest.py (1207 of 1788) PASS: lldb-unit :: Utility/./UtilityTests/StringExtractorTest.GetNameColonValueSuccess (1208 of 1788) PASS: lldb-api :: commands/watchpoints/watchpoint_disable/TestWatchpointDisable.py (1209 of 1788) PASS: lldb-shell :: SymbolFile/DWARF/find-variable-file.cpp (1210 of 1788) PASS: lldb-unit :: ScriptInterpreter/Python/./ScriptInterpreterPythonTests/PythonDataObjectsTest.TestBorrowedReferences (1211 of 1788) PASS: lldb-api :: functionalities/gdb_remote_client/TestPlatformClient.py (1212 of 1788) PASS: lldb-api :: lang/cpp/char1632_t/TestChar1632T.py (1213 of 1788) PASS: lldb-unit :: Process/minidump/./LLDBMinidumpTests/MinidumpParserTest.GetMemory (1214 of 1788) PASS: lldb-unit :: Utility/./UtilityTests/BinaryStreamTest.PutULEB128NineBytes (1215 of 1788) PASS: lldb-unit :: Host/./HostTests/NativeProcessProtocolTest.ReadCStringFromMemory_MaxSize (1216 of 1788) PASS: lldb-unit :: Utility/./UtilityTests/StringListTest.SplitIntoLines (1217 of 1788) PASS: lldb-unit :: UnwindAssembly/x86/./UnwindAssemblyx86Tests/Testx86AssemblyInspectionEngine.TestSpArithx86_64Augmented (1218 of 1788) PASS: lldb-unit :: Utility/./UtilityTests/StreamTest.PutHex64ByteOrderLittle (1219 of 1788) PASS: lldb-api :: functionalities/data-formatter/data-formatter-synthtype/TestDataFormatterSynthType.py (1220 of 1788) PASS: lldb-shell :: Settings/TestEchoCommands.test (1221 of 1788) PASS: lldb-api :: functionalities/thread/exit_during_break/TestExitDuringBreak.py (1222 of 1788) PASS: lldb-unit :: Utility/./UtilityTests/RangeTest.NotEqual (1223 of 1788) PASS: lldb-unit :: Process/gdb-remote/./ProcessGdbRemoteTests/GDBRemoteCommunicationServerTest.SendErrorResponse_Status (1224 of 1788) PASS: lldb-unit :: Process/minidump/./LLDBMinidumpTests/MinidumpParserTest.FindMemoryRange (1225 of 1788) PASS: lldb-unit :: Utility/./UtilityTests/BroadcasterTest.BroadcastEvent (1226 of 1788) PASS: lldb-shell :: Unwind/trap_frame_sym_ctx.test (1227 of 1788) PASS: lldb-unit :: UnwindAssembly/x86/./UnwindAssemblyx86Tests/Testx86AssemblyInspectionEngine.TestPushRBP (1228 of 1788) PASS: lldb-api :: commands/process/attach-resume/TestAttachResume.py (1229 of 1788) PASS: lldb-shell :: Reproducer/Functionalities/TestDataFormatter.test (1230 of 1788) PASS: lldb-api :: functionalities/thread/concurrent_events/TestConcurrentCrashWithWatchpointBreakpointSignal.py (1231 of 1788) PASS: lldb-unit :: Utility/./UtilityTests/VMRange.ContainsAddr (1232 of 1788) PASS: lldb-api :: commands/expression/unwind_expression/TestUnwindExpression.py (1233 of 1788) PASS: lldb-api :: functionalities/wrong_commands/TestWrongCommands.py (1234 of 1788) PASS: lldb-unit :: Utility/./UtilityTests/UriParserTest.Empty (1235 of 1788) PASS: lldb-shell :: ObjectFile/ELF/PT_LOAD.yaml (1236 of 1788) PASS: lldb-api :: python_api/symbol-context/TestSymbolContext.py (1237 of 1788) PASS: lldb-unit :: Utility/./UtilityTests/Flags.AllClear (1238 of 1788) PASS: lldb-unit :: ScriptInterpreter/Python/./ScriptInterpreterPythonTests/PythonDataObjectsTest.TestOwnedReferences (1239 of 1788) PASS: lldb-unit :: Symbol/./SymbolTests/TestClangASTContext.TestRemoveFastQualifiers (1240 of 1788) PASS: lldb-unit :: Core/./LLDBCoreTests/StreamCallbackTest.Callback (1241 of 1788) PASS: lldb-api :: python_api/value/change_values/TestChangeValueAPI.py (1242 of 1788) PASS: lldb-api :: lang/objc/modules-inline-functions/TestModulesInlineFunctions.py (1243 of 1788) UNSUPPORTED: lldb-api :: functionalities/darwin_log/filter/regex/message/TestDarwinLogFilterRegexMessage.py (1244 of 1788) PASS: lldb-unit :: Utility/./UtilityTests/OptionsWithRawTest.WhitespaceInput (1245 of 1788) PASS: lldb-api :: commands/watchpoints/multiple_threads/TestWatchpointMultipleThreads.py (1246 of 1788) PASS: lldb-unit :: Utility/./UtilityTests/RangeTest.Slide (1247 of 1788) PASS: lldb-shell :: BuildScript/compiler-full-path.test (1248 of 1788) PASS: lldb-unit :: Utility/./UtilityTests/ArgsTest.GetArgumentArrayRef (1249 of 1788) PASS: lldb-unit :: Utility/./UtilityTests/CompletionRequest.TestCompletionOwnership (1250 of 1788) PASS: lldb-unit :: Utility/./UtilityTests/RangeTest.ContainsRange (1251 of 1788) PASS: lldb-api :: api/multiple-targets/TestMultipleTargets.py (1252 of 1788) PASS: lldb-unit :: Utility/./UtilityTests/StreamTest.ShiftOperatorChars (1253 of 1788) PASS: lldb-unit :: UnwindAssembly/x86/./UnwindAssemblyx86Tests/Testx86AssemblyInspectionEngine.Test32bitFramelessSmallStackFrame (1254 of 1788) PASS: lldb-api :: lang/objc/blocks/TestObjCIvarsInBlocks.py (1255 of 1788) PASS: lldb-api :: python_api/sbdata/TestSBData.py (1256 of 1788) PASS: lldb-shell :: SymbolFile/NativePDB/function-types-calling-conv.cpp (1257 of 1788) PASS: lldb-shell :: ObjectFile/ELF/many-sections.s (1258 of 1788) PASS: lldb-api :: commands/expression/dollar-in-variable/TestDollarInVariable.py (1259 of 1788) PASS: lldb-api :: functionalities/thread/concurrent_events/TestConcurrentTwoWatchpointThreads.py (1260 of 1788) PASS: lldb-unit :: Process/minidump/./LLDBMinidumpTests/RegisterContextMinidump.CheckRegisterContextMinidump_ARM (1261 of 1788) PASS: lldb-unit :: Utility/./UtilityTests/NameMatchesTest.Ignore (1262 of 1788) PASS: lldb-shell :: ObjectFile/ELF/base-address.yaml (1263 of 1788) PASS: lldb-unit :: ScriptInterpreter/Python/./ScriptInterpreterPythonTests/PythonDataObjectsTest.TestDictionaryResolutionWithDot (1264 of 1788) PASS: lldb-api :: lang/cpp/accelerator-table/TestCPPAccelerator.py (1265 of 1788) UNSUPPORTED: lldb-api :: commands/watchpoints/variable_out_of_scope/TestWatchedVarHitWhenInScope.py (1266 of 1788) PASS: lldb-unit :: UnwindAssembly/x86/./UnwindAssemblyx86Tests/Testx86AssemblyInspectionEngine.TestDisassemblyJunkBytes (1267 of 1788) PASS: lldb-api :: commands/expression/import-std-module/shared_ptr/TestSharedPtr.py (1268 of 1788) PASS: lldb-unit :: Utility/./UtilityTests/StringListTest.InsertStringAtIndexStart (1269 of 1788) PASS: lldb-unit :: Utility/./UtilityTests/StreamTest.ShiftOperatorStrings (1270 of 1788) PASS: lldb-unit :: Utility/./UtilityTests/FileSpecTest.AppendPathComponent (1271 of 1788) PASS: lldb-unit :: SymbolFile/DWARF/./SymbolFileDWARFTests/DWARFASTParserClangTests.EnsureAllDIEsInDeclContextHaveBeenParsedParsesOnlyMatchingEntries (1272 of 1788) UNSUPPORTED: lldb-api :: android/platform/TestDefaultCacheLineSize.py (1273 of 1788) UNSUPPORTED: lldb-shell :: Register/x86-64-xmm16-write.test (1274 of 1788) PASS: lldb-api :: lang/c/unions/TestUnionMembers.py (1275 of 1788) PASS: lldb-api :: commands/expression/call-function/TestCallUserDefinedFunction.py (1276 of 1788) PASS: lldb-api :: lang/cpp/stl/TestSTL.py (1277 of 1788) PASS: lldb-api :: commands/process/attach/attach_denied/TestAttachDenied.py (1278 of 1788) PASS: lldb-unit :: Utility/./UtilityTests/StringExtractorTest.GetHexU8_Underflow_NoEof (1279 of 1788) PASS: lldb-api :: lang/cpp/frame-var-anon-unions/TestFrameVariableAnonymousUnions.py (1280 of 1788) PASS: lldb-api :: python_api/value/linked_list/TestValueAPILinkedList.py (1281 of 1788) PASS: lldb-unit :: Language/Highlighting/./HighlighterTests/HighlighterTest.ClangCursorPos (1282 of 1788) PASS: lldb-unit :: Utility/./UtilityTests/EnvironmentTest.EnvpConversion (1283 of 1788) PASS: lldb-api :: functionalities/data-formatter/data-formatter-objc/TestDataFormatterObjCNSContainer.py (1284 of 1788) UNSUPPORTED: lldb-api :: tools/lldb-vscode/breakpoint/TestVSCode_setBreakpoints.py (1285 of 1788) PASS: lldb-api :: functionalities/breakpoint/breakpoint_command/TestRegexpBreakCommand.py (1286 of 1788) PASS: lldb-api :: commands/expression/call-throws/TestCallThatThrows.py (1287 of 1788) PASS: lldb-unit :: Utility/./UtilityTests/StreamTest.PutBytesAsRawHex8ToBigEndian (1288 of 1788) PASS: lldb-unit :: Process/minidump/./LLDBMinidumpTests/MinidumpParserTest.GetPidWow64 (1289 of 1788) PASS: lldb-unit :: Utility/./UtilityTests/DataExtractorTest.GetMaxS64 (1290 of 1788) PASS: lldb-api :: commands/process/launch-with-shellexpand/TestLaunchWithShellExpand.py (1291 of 1788) UNSUPPORTED: lldb-api :: functionalities/darwin_log/filter/exact_match/category/TestDarwinLogFilterMatchCategory.py (1292 of 1788) PASS: lldb-api :: source-manager/TestSourceManager.py (1293 of 1788) PASS: lldb-shell :: SymbolFile/Breakpad/line-table.test (1294 of 1788) PASS: lldb-api :: functionalities/memory/cache/TestMemoryCache.py (1295 of 1788) UNSUPPORTED: lldb-shell :: ExecControl/StopHook/stop-hook-threads.test (1296 of 1788) PASS: lldb-api :: functionalities/thread/concurrent_events/TestConcurrentSignalDelayWatch.py (1297 of 1788) PASS: lldb-api :: lang/cpp/namespace/TestNamespace.py (1298 of 1788) PASS: lldb-unit :: ScriptInterpreter/Python/./ScriptInterpreterPythonTests/PythonDataObjectsTest.TestObjectAttributes (1299 of 1788) PASS: lldb-unit :: Utility/./UtilityTests/ArgsTest.TestSingleArgWithQuotedSpace (1300 of 1788) PASS: lldb-unit :: Utility/./UtilityTests/ScalarTest.Equality (1301 of 1788) PASS: lldb-unit :: ScriptInterpreter/Python/./ScriptInterpreterPythonTests/PythonDataObjectsTest.TestResetting (1302 of 1788) PASS: lldb-api :: types/TestDoubleTypes.py (1303 of 1788) PASS: lldb-unit :: Interpreter/./InterpreterTests/OptionArgParserTest.toChar (1304 of 1788) PASS: lldb-unit :: Core/./LLDBCoreTests/RichManglingContextTest.Basic (1305 of 1788) PASS: lldb-api :: commands/target/stop-hooks/TestStopHooks.py (1306 of 1788) PASS: lldb-unit :: Utility/./UtilityTests/StringExtractorTest.GetU64LittleEndian (1307 of 1788) PASS: lldb-api :: functionalities/data-formatter/typedef_array/TestTypedefArray.py (1308 of 1788) PASS: lldb-unit :: Interpreter/./InterpreterTests/OptionArgParserTest.toBoolean (1309 of 1788) UNSUPPORTED: lldb-api :: functionalities/darwin_log/filter/exact_match/activity-chain/TestDarwinLogFilterMatchActivityChain.py (1310 of 1788) PASS: lldb-api :: lang/c/stepping/TestStepAndBreakpoints.py (1311 of 1788) PASS: lldb-unit :: UnwindAssembly/x86/./UnwindAssemblyx86Tests/Testx86AssemblyInspectionEngine.TestPushExtended (1312 of 1788) PASS: lldb-api :: functionalities/breakpoint/source_regexp/TestSourceRegexBreakpoints.py (1313 of 1788) PASS: lldb-unit :: Utility/./UtilityTests/NameMatchesTest.Equals (1314 of 1788) PASS: lldb-unit :: Utility/./UtilityTests/StringListTest.RemoveBlankLines (1315 of 1788) PASS: lldb-unit :: Process/gdb-remote/./ProcessGdbRemoteTests/GDBRemoteCommunicationClientTest.SendGetDataPacket (1316 of 1788) PASS: lldb-api :: functionalities/data-formatter/var-in-aggregate-misuse/TestVarInAggregateMisuse.py (1317 of 1788) PASS: lldb-unit :: ScriptInterpreter/Python/./ScriptInterpreterPythonTests/PythonDataObjectsTest.TestTypeNameResolutionNoDot (1318 of 1788) PASS: lldb-unit :: Utility/./UtilityTests/UriParserTest.SchemeHostSeparator (1319 of 1788) PASS: lldb-shell :: Quit/TestQuitExitCodeHex0.test (1320 of 1788) PASS: lldb-shell :: Register/x86-64-ymm-read.test (1321 of 1788) PASS: lldb-unit :: Utility/./UtilityTests/BinaryStreamTest.PutSLEB128MaxValue (1322 of 1788) PASS: lldb-api :: functionalities/data-formatter/data-formatter-advanced/TestDataFormatterAdv.py (1323 of 1788) PASS: lldb-api :: commands/frame/diagnose/dereference-function-return/TestDiagnoseDereferenceFunctionReturn.py (1324 of 1788) PASS: lldb-api :: functionalities/object-file/TestImageListMultiArchitecture.py (1325 of 1788) PASS: lldb-api :: commands/expression/options/TestExprOptions.py (1326 of 1788) PASS: lldb-unit :: Process/gdb-remote/./ProcessGdbRemoteTests/GDBRemoteCommunicationClientTest.SendStopTracePacket (1327 of 1788) PASS: lldb-api :: commands/log/invalid-args/TestInvalidArgsLog.py (1328 of 1788) PASS: lldb-unit :: Utility/./UtilityTests/ScalarTest.ComparisonFloat (1329 of 1788) PASS: lldb-unit :: Language/Highlighting/./HighlighterTests/HighlighterTest.ClangIdentifiers (1330 of 1788) PASS: lldb-unit :: UnwindAssembly/x86/./UnwindAssemblyx86Tests/Testx86AssemblyInspectionEngine.Test64bitFramelessSmallStackFrame (1331 of 1788) PASS: lldb-api :: functionalities/inferior-crashing/recursive-inferior/TestRecursiveInferiorStep.py (1332 of 1788) PASS: lldb-shell :: Expr/TestIRMemoryMap.test (1333 of 1788) PASS: lldb-api :: functionalities/thread/concurrent_events/TestConcurrentTwoBreakpointsOneSignal.py (1334 of 1788) PASS: lldb-unit :: ScriptInterpreter/Python/./ScriptInterpreterPythonTests/PythonDataObjectsTest.TestPythonStringToStructuredString (1335 of 1788) PASS: lldb-api :: lang/cpp/type_lookup/TestCppTypeLookup.py (1336 of 1788) PASS: lldb-unit :: Utility/./UtilityTests/StringListTest.AppendList (1337 of 1788) PASS: lldb-unit :: Process/gdb-remote/./ProcessGdbRemoteTests/GDBRemoteClientBaseTest.SendContinueAndLateInterrupt (1338 of 1788) PASS: lldb-shell :: ObjectFile/ELF/compressed-sections.yaml (1339 of 1788) PASS: lldb-unit :: SymbolFile/DWARF/./SymbolFileDWARFTests/SymbolFileDWARFTests.TestAbbrevOrder1Start5 (1340 of 1788) PASS: lldb-unit :: ObjectFile/PECOFF/./ObjectFilePECOFFTests/PECallFrameInfoTest.Chained_eh (1341 of 1788) PASS: lldb-shell :: SymbolFile/DWARF/parallel-indexing-stress.s (1342 of 1788) PASS: lldb-unit :: Utility/./UtilityTests/BinaryStreamTest.PutSLEB128EightBytes (1343 of 1788) PASS: lldb-unit :: SymbolFile/NativePDB/./SymbolFileNativePDBTests/PDBFPOProgramToDWARFExpressionTests.UnresolvedCyclicRegisterAssignmentReference (1344 of 1788) PASS: lldb-api :: functionalities/data-formatter/data-formatter-objc/TestDataFormatterObjNSException.py (1345 of 1788) PASS: lldb-unit :: Utility/./UtilityTests/StringExtractorTest.GetHexU8_Exact_NoEof (1346 of 1788) PASS: lldb-unit :: UnwindAssembly/x86/./UnwindAssemblyx86Tests/Testx86AssemblyInspectionEngine.TestSubESP (1347 of 1788) PASS: lldb-api :: lang/c/stepping/TestThreadStepping.py (1348 of 1788) PASS: lldb-unit :: Utility/./UtilityTests/RecordReplayTest.InstrumentedBarRef (1349 of 1788) PASS: lldb-shell :: SymbolFile/DWARF/dwarf5-partial-index.cpp (1350 of 1788) PASS: lldb-unit :: SymbolFile/DWARF/./SymbolFileDWARFTests/SymbolFileDWARFTests.TestAbbrevNullAttrValidForm (1351 of 1788) PASS: lldb-api :: functionalities/thread/thread_exit/TestThreadExit.py (1352 of 1788) PASS: lldb-unit :: Utility/./UtilityTests/UriParserTest.SchemeHostSeparator2 (1353 of 1788) PASS: lldb-shell :: Expr/TestTypeOfDeclTypeExpr.test (1354 of 1788) PASS: lldb-unit :: Host/./HostTests/FileSystemTest.EnumerateDirectory (1355 of 1788) UNSUPPORTED: lldb-shell :: Breakpoint/ppc64-localentry.test (1356 of 1788) PASS: lldb-unit :: Utility/./UtilityTests/ScalarTest.RightShiftOperator (1357 of 1788) PASS: lldb-unit :: Language/Highlighting/./HighlighterTests/HighlighterTest.ClangStringLiterals (1358 of 1788) PASS: lldb-unit :: Language/Highlighting/./HighlighterTests/HighlighterTest.HighlighterSelectionPath (1359 of 1788) PASS: lldb-unit :: SymbolFile/NativePDB/./SymbolFileNativePDBTests/PDBFPOProgramToDWARFExpressionTests.InvalidAssignmentSingle (1360 of 1788) PASS: lldb-api :: commands/command/source/TestCommandSource.py (1361 of 1788) PASS: lldb-unit :: Process/gdb-remote/./ProcessGdbRemoteTests/GDBRemoteCommunicationServerTest.SendErrorResponse_ErrorList (1362 of 1788) PASS: lldb-unit :: Host/./HostTests/FileSystemTest.OpenErrno (1363 of 1788) PASS: lldb-shell :: Reproducer/TestReuseDirectory.test (1364 of 1788) PASS: lldb-unit :: Utility/./UtilityTests/BroadcasterTest.EventTypeHasListeners (1365 of 1788) PASS: lldb-unit :: ScriptInterpreter/Python/./ScriptInterpreterPythonTests/PythonDataObjectsTest.TestPythonDictionaryManipulation (1366 of 1788) PASS: lldb-unit :: Utility/./UtilityTests/StreamTeeTest.DefaultConstructor (1367 of 1788) PASS: lldb-shell :: ExecControl/StopHook/stop-hook.test (1368 of 1788) PASS: lldb-shell :: ObjectFile/MachO/lc_build_version_notools.yaml (1369 of 1788) PASS: lldb-unit :: Core/./LLDBCoreTests/MangledTest.ResultForValidName (1370 of 1788) PASS: lldb-unit :: Process/minidump/./LLDBMinidumpTests/MinidumpParserTest.GetMemoryRegionInfoLinuxMaps (1371 of 1788) PASS: lldb-api :: functionalities/thread/concurrent_events/TestConcurrentDelayWatchBreak.py (1372 of 1788) PASS: lldb-unit :: ObjectFile/Breakpad/./ObjectFileBreakpadTests/FuncRecord.parse (1373 of 1788) UNSUPPORTED: lldb-shell :: Register/x86-zmm-read.test (1374 of 1788) PASS: lldb-unit :: Process/gdb-remote/./ProcessGdbRemoteTests/GDBRemoteCommunicationClientTest.SendSignalsToIgnore (1375 of 1788) PASS: lldb-api :: commands/expression/import-std-module/shared_ptr-dbg-info-content/TestSharedPtrDbgInfoContent.py (1376 of 1788) PASS: lldb-unit :: Breakpoint/./LLDBBreakpointTests/BreakpointIDTest.StringIsBreakpointName (1377 of 1788) PASS: lldb-unit :: Utility/./UtilityTests/SerializationRountripTest.SerializeDeserializeObjectReference (1378 of 1788) PASS: lldb-api :: commands/command/invalid-args/TestInvalidArgsCommand.py (1379 of 1788) PASS: lldb-api :: commands/expression/radar_8638051/Test8638051.py (1380 of 1788) PASS: lldb-unit :: Utility/./UtilityTests/StringListTest.ForRangeEmpty (1381 of 1788) PASS: lldb-unit :: Utility/./UtilityTests/StringListTest.LongestCommonPrefixNoPrefix (1382 of 1788) PASS: lldb-unit :: Utility/./UtilityTests/LogTest.Unregister (1383 of 1788) PASS: lldb-api :: functionalities/data-formatter/data-formatter-stl/libcxx/initializerlist/TestInitializerList.py (1384 of 1788) PASS: lldb-unit :: Utility/./UtilityTests/RangeTest.EqualInvalid (1385 of 1788) PASS: lldb-api :: functionalities/process_group/TestChangeProcessGroup.py (1386 of 1788) PASS: lldb-api :: commands/expression/pr35310/TestExprsBug35310.py (1387 of 1788) PASS: lldb-api :: functionalities/breakpoint/address_breakpoints/TestAddressBreakpoints.py (1388 of 1788) PASS: lldb-api :: commands/expression/dont_allow_jit/TestAllowJIT.py (1389 of 1788) PASS: lldb-unit :: Editline/./EditlineTests/EditlineTestFixture.EditlineReceivesMultiLineText (1390 of 1788) PASS: lldb-shell :: SymbolFile/DWARF/debug_ranges.s (1391 of 1788) PASS: lldb-api :: python_api/watchpoint/condition/TestWatchpointConditionAPI.py (1392 of 1788) PASS: lldb-unit :: SymbolFile/NativePDB/./SymbolFileNativePDBTests/PDBFPOProgramToDWARFExpressionTests.UnsupportedRASearch (1393 of 1788) PASS: lldb-unit :: UnwindAssembly/x86/./UnwindAssemblyx86Tests/Testx86AssemblyInspectionEngine.TestPopEDI (1394 of 1788) PASS: lldb-unit :: Utility/./UtilityTests/StreamTest.PutPtr (1395 of 1788) PASS: lldb-unit :: Process/minidump/./LLDBMinidumpTests/MinidumpParserTest.GetArchitecture (1396 of 1788) PASS: lldb-shell :: SymbolFile/NativePDB/s_constant.cpp (1397 of 1788) PASS: lldb-api :: functionalities/breakpoint/breakpoint_conditions/TestBreakpointConditions.py (1398 of 1788) PASS: lldb-api :: tools/lldb-server/inferior-crash/TestGdbRemoteAbort.py (1399 of 1788) PASS: lldb-shell :: ObjectFile/PECOFF/sections-names.yaml (1400 of 1788) PASS: lldb-api :: functionalities/data-formatter/data-formatter-stl/libcxx/atomic/TestLibCxxAtomic.py (1401 of 1788) PASS: lldb-api :: functionalities/thread/concurrent_events/TestConcurrentDelaySignalWatch.py (1402 of 1788) PASS: lldb-unit :: Utility/./UtilityTests/StringLexerTest.AdvanceIf (1403 of 1788) PASS: lldb-unit :: Utility/./UtilityTests/StringExtractorTest.GetHexU8_Underflow2 (1404 of 1788) PASS: lldb-api :: functionalities/data-formatter/hexcaps/TestDataFormatterHexCaps.py (1405 of 1788) PASS: lldb-api :: lang/objc/objc-ivar-stripped/TestObjCIvarStripped.py (1406 of 1788) PASS: lldb-shell :: Minidump/Windows/Sigsegv/sigsegv.test (1407 of 1788) PASS: lldb-unit :: Utility/./UtilityTests/LogChannelTest.Enable (1408 of 1788) PASS: lldb-unit :: Process/gdb-remote/./ProcessGdbRemoteTests/GDBRemoteCommunicationServerTest.SendErrorResponse_StringError (1409 of 1788) PASS: lldb-unit :: SymbolFile/DWARF/./SymbolFileDWARFTests/SymbolFileDWARFTests.TestAbbrevInvalidNULLTag (1410 of 1788) PASS: lldb-shell :: Register/x86-64-gp-read.test (1411 of 1788) PASS: lldb-api :: commands/expression/namespace_local_var_same_name_obj_c/TestNamespaceLocalVarSameNameObjC.py (1412 of 1788) PASS: lldb-shell :: Settings/TestFrameFormatNoColor.test (1413 of 1788) PASS: lldb-api :: commands/expression/import-std-module/queue/TestQueue.py (1414 of 1788) PASS: lldb-api :: lang/cpp/gmodules/TestWithModuleDebugging.py (1415 of 1788) UNSUPPORTED: lldb-api :: linux/thread/create_during_instruction_step/TestCreateDuringInstructionStep.py (1416 of 1788) UNSUPPORTED: lldb-api :: benchmarks/turnaround/TestCompileRunToBreakpointTurnaround.py (1417 of 1788) PASS: lldb-api :: lang/c/shared_lib/TestSharedLib.py (1418 of 1788) PASS: lldb-unit :: Expression/./ExpressionTests/DiagnosticManagerTest.GetStringNoDiags (1419 of 1788) PASS: lldb-api :: commands/expression/import-std-module/sysroot/TestStdModuleSysroot.py (1420 of 1788) PASS: lldb-api :: lang/objc/objc-new-syntax/TestObjCNewSyntaxArray.py (1421 of 1788) PASS: lldb-api :: lang/cpp/dynamic-value/TestCppValueCast.py (1422 of 1788) PASS: lldb-api :: commands/expression/ir-interpreter/TestIRInterpreter.py (1423 of 1788) PASS: lldb-unit :: Utility/./UtilityTests/ArgsTest.TestArgv (1424 of 1788) PASS: lldb-api :: lang/cpp/global_variables/TestCPPGlobalVariables.py (1425 of 1788) PASS: lldb-api :: functionalities/gdb_remote_client/TestNestedRegDefinitions.py (1426 of 1788) PASS: lldb-unit :: Target/./TargetTests/ModuleCacheTest.GetAndPutStrangeHostname (1427 of 1788) PASS: lldb-unit :: Process/minidump/./LLDBMinidumpTests/MinidumpParserTest.MinidumpModuleOrder (1428 of 1788) PASS: lldb-unit :: Language/Highlighting/./HighlighterTests/HighlighterTest.ClangPPDirectives (1429 of 1788) PASS: lldb-unit :: SymbolFile/NativePDB/./SymbolFileNativePDBTests/PDBFPOProgramToDWARFExpressionTests.InvalidOpUnary (1430 of 1788) PASS: lldb-unit :: Utility/./UtilityTests/OptionsWithRawTest.ArgsButNoLeadingDash (1431 of 1788) PASS: lldb-unit :: Utility/./UtilityTests/StringLexerTest.NextIf (1432 of 1788) UNSUPPORTED: lldb-shell :: Register/x86-64-zmm-write.test (1433 of 1788) PASS: lldb-api :: types/TestFloatTypes.py (1434 of 1788) PASS: lldb-unit :: Utility/./UtilityTests/ConstStringTest.CompareStringRef (1435 of 1788) PASS: lldb-api :: lang/objc/objc-baseclass-sbtype/TestObjCBaseClassSBType.py (1436 of 1788) PASS: lldb-unit :: Process/gdb-remote/./ProcessGdbRemoteTests/GDBRemoteCommunicationTest.ReadPacket_checksum (1437 of 1788) PASS: lldb-api :: commands/gui/invalid-args/TestInvalidArgsGui.py (1438 of 1788) PASS: lldb-unit :: Utility/./UtilityTests/RangeTest.Copy (1439 of 1788) PASS: lldb-api :: commands/expression/call-overridden-method/TestCallOverriddenMethod.py (1440 of 1788) PASS: lldb-api :: functionalities/data-formatter/data-formatter-named-summaries/TestDataFormatterNamedSummaries.py (1441 of 1788) PASS: lldb-unit :: Utility/./UtilityTests/ConstStringTest.FromMidOfBufferStringRef (1442 of 1788) PASS: lldb-api :: commands/command/history/TestCommandHistory.py (1443 of 1788) PASS: lldb-api :: macosx/version_zero/TestGetVersionZeroVersion.py (1444 of 1788) PASS: lldb-api :: lang/cpp/unsigned_types/TestUnsignedTypes.py (1445 of 1788) PASS: lldb-unit :: Utility/./UtilityTests/StringExtractorTest.GetHexU8_InvalidHex (1446 of 1788) PASS: lldb-unit :: ScriptInterpreter/Python/./ScriptInterpreterPythonTests/PythonDataObjectsTest.TestPythonBoolean (1447 of 1788) PASS: lldb-api :: commands/expression/import-std-module/deque-dbg-info-content/TestDbgInfoContentDeque.py (1448 of 1788) PASS: lldb-api :: functionalities/thread/concurrent_events/TestConcurrentManyWatchpoints.py (1449 of 1788) PASS: lldb-api :: linux/builtin_trap/TestBuiltinTrap.py (1450 of 1788) PASS: lldb-api :: arm/emulation/TestEmulations.py (1451 of 1788) PASS: lldb-unit :: Process/gdb-remote/./ProcessGdbRemoteTests/GDBRemoteClientBaseTest.SendContinueAndInterrupt (1452 of 1788) PASS: lldb-api :: python_api/watchpoint/watchlocation/TestSetWatchlocation.py (1453 of 1788) PASS: lldb-api :: python_api/module_section/TestModuleAndSection.py (1454 of 1788) PASS: lldb-api :: functionalities/data-formatter/compactvectors/TestCompactVectors.py (1455 of 1788) PASS: lldb-unit :: Utility/./UtilityTests/OptionsWithRawTest.WhitespaceSuffix (1456 of 1788) PASS: lldb-shell :: ObjectFile/MachO/subsections.yaml (1457 of 1788) PASS: lldb-unit :: Expression/./ExpressionTests/CppModuleConfigurationTest.MissingLibCpp (1458 of 1788) PASS: lldb-unit :: Language/Highlighting/./HighlighterTests/HighlighterTest.ClangCommas (1459 of 1788) PASS: lldb-shell :: SymbolFile/NativePDB/function-types-builtins.cpp (1460 of 1788) UNSUPPORTED: lldb-shell :: SymbolFile/PDB/type-quals.test (1461 of 1788) PASS: lldb-api :: python_api/file_handle/TestFileHandle.py (1462 of 1788) PASS: lldb-unit :: ScriptInterpreter/Python/./ScriptInterpreterPythonTests/PythonDataObjectsTest.TestPythonInteger (1463 of 1788) XFAIL: lldb-shell :: SymbolFile/DWARF/find-type-in-function.cpp (1464 of 1788) PASS: lldb-unit :: ScriptInterpreter/Python/./ScriptInterpreterPythonTests/PythonDataObjectsTest.TestPythonIntegerToStr (1465 of 1788) PASS: lldb-unit :: ObjectFile/Breakpad/./ObjectFileBreakpadTests/ModuleRecord.parse (1466 of 1788) PASS: lldb-unit :: Utility/./UtilityTests/StreamTest.PutCString (1467 of 1788) UNSUPPORTED: lldb-api :: functionalities/darwin_log/filter/exact_match/subsystem/TestDarwinLogFilterMatchSubsystem.py (1468 of 1788) PASS: lldb-unit :: Utility/./UtilityTests/GeneratorTest.Get (1469 of 1788) PASS: lldb-unit :: Utility/./UtilityTests/RangeTest.Equal (1470 of 1788) PASS: lldb-unit :: Utility/./UtilityTests/VASprintfTest.EncodingError (1471 of 1788) PASS: lldb-unit :: UnwindAssembly/x86/./UnwindAssemblyx86Tests/Testx86AssemblyInspectionEngine.TestPushRBPWithREX (1472 of 1788) PASS: lldb-api :: types/TestFloatTypesExpr.py (1473 of 1788) PASS: lldb-shell :: Heap/heap-cstr.test (1474 of 1788) PASS: lldb-shell :: Driver/TestCore.test (1475 of 1788) PASS: lldb-api :: lang/cpp/dynamic-value-same-basename/TestDynamicValueSameBase.py (1476 of 1788) PASS: lldb-unit :: Utility/./UtilityTests/NameMatchesTest.RegularExpression (1477 of 1788) PASS: lldb-unit :: ScriptInterpreter/Python/./ScriptInterpreterPythonTests/PythonDataObjectsTest.TestPythonByteArray (1478 of 1788) PASS: lldb-api :: functionalities/tsan/thread_leak/TestTsanThreadLeak.py (1479 of 1788) PASS: lldb-api :: python_api/process/TestProcessAPI.py (1480 of 1788) PASS: lldb-api :: functionalities/tail_call_frames/sbapi_support/TestTailCallFrameSBAPI.py (1481 of 1788) UNSUPPORTED: lldb-api :: functionalities/process_save_core/TestProcessSaveCore.py (1482 of 1788) PASS: lldb-unit :: Expression/./ExpressionTests/CppModuleConfigurationTest.AmbiguousLibCpp (1483 of 1788) PASS: lldb-api :: functionalities/data-formatter/data-formatter-python-synth/TestDataFormatterPythonSynth.py (1484 of 1788) PASS: lldb-unit :: ScriptInterpreter/Python/./ScriptInterpreterPythonTests/PythonDataObjectsTest.TestPythonListToStructuredList (1485 of 1788) PASS: lldb-unit :: Utility/./UtilityTests/DataExtractorTest.GetCStrUnterminated (1486 of 1788) PASS: lldb-unit :: Utility/./UtilityTests/StreamTest.PutChar (1487 of 1788) PASS: lldb-unit :: Utility/./UtilityTests/VMRange.Clear (1488 of 1788) UNSUPPORTED: lldb-shell :: Register/x86-64-zmm-read.test (1489 of 1788) PASS: lldb-api :: functionalities/tail_call_frames/thread_step_out_or_return/TestSteppingOutWithArtificialFrames.py (1490 of 1788) PASS: lldb-unit :: Utility/./UtilityTests/Flags.IsClear (1491 of 1788) PASS: lldb-unit :: Utility/./UtilityTests/FileSpecTest.RemoveLastPathComponent (1492 of 1788) PASS: lldb-api :: functionalities/value_md5_crash/TestValueMD5Crash.py (1493 of 1788) PASS: lldb-unit :: Host/./HostTests/SocketAddressTest.GetAddressInfo (1494 of 1788) PASS: lldb-api :: functionalities/inferior-crashing/TestInferiorCrashing.py (1495 of 1788) PASS: lldb-unit :: Expression/./ExpressionTests/DiagnosticManagerTest.PutStringMultiple (1496 of 1788) PASS: lldb-unit :: Symbol/./SymbolTests/TestClangASTContext.TestUnifyAccessSpecifiers (1497 of 1788) PASS: lldb-unit :: Utility/./UtilityTests/FileSpecTest.EqualDotsWindows (1498 of 1788) PASS: lldb-unit :: Utility/./UtilityTests/StringListTest.GetSize (1499 of 1788) PASS: lldb-unit :: ObjectFile/PECOFF/./ObjectFilePECOFFTests/PECallFrameInfoTest.Basic_eh (1500 of 1788) PASS: lldb-unit :: Utility/./UtilityTests/TimerTest.CategoryTimesStats (1501 of 1788) PASS: lldb-api :: lang/c/enum_types/TestEnumTypes.py (1502 of 1788) PASS: lldb-unit :: Target/./TargetTests/PathMappingListTest.RemapRoot (1503 of 1788) PASS: lldb-shell :: SymbolFile/DWARF/debug_rnglists.s (1504 of 1788) PASS: lldb-unit :: Utility/./UtilityTests/BinaryStreamTest.PutULEB128FiveBytes (1505 of 1788) PASS: lldb-unit :: Utility/./UtilityTests/RangeTest.NotEqualInvalid (1506 of 1788) PASS: lldb-api :: lang/c/conflicting-symbol/TestConflictingSymbol.py (1507 of 1788) PASS: lldb-api :: lang/c/function_types/TestFunctionTypes.py (1508 of 1788) PASS: lldb-unit :: Utility/./UtilityTests/StreamTest.PutRawBytesToLittleEndian (1509 of 1788) PASS: lldb-unit :: Expression/./ExpressionTests/CppModuleConfigurationTest.LinuxLocalLibCpp (1510 of 1788) PASS: lldb-api :: commands/expression/test/TestExprs.py (1511 of 1788) PASS: lldb-unit :: Language/Highlighting/./HighlighterTests/HighlighterTest.DefaultHighlighterWithCursorOutOfBounds (1512 of 1788) PASS: lldb-shell :: Quit/TestQuitExitCodeTooManyArgs.test (1513 of 1788) PASS: lldb-unit :: Expression/./ExpressionTests/DWARFExpression.DW_OP_pick (1514 of 1788) PASS: lldb-unit :: UnwindAssembly/x86/./UnwindAssemblyx86Tests/Testx86AssemblyInspectionEngine.TestSimplei386ugmented (1515 of 1788) PASS: lldb-api :: functionalities/breakpoint/step_over_breakpoint/TestStepOverBreakpoint.py (1516 of 1788) PASS: lldb-unit :: Expression/./ExpressionTests/CppModuleConfigurationTest.MissingUsrInclude (1517 of 1788) PASS: lldb-api :: functionalities/gdb_remote_client/TestGDBRemoteClient.py (1518 of 1788) PASS: lldb-api :: commands/expression/scoped_enums/TestScopedEnumType.py (1519 of 1788) PASS: lldb-api :: lang/objc/radar-9691614/TestObjCMethodReturningBOOL.py (1520 of 1788) PASS: lldb-unit :: Utility/./UtilityTests/StreamTest.QuotedCString (1521 of 1788) PASS: lldb-unit :: Platform/./LLDBPlatformTests/PlatformDarwinTest.TestParseVersionBuildDir (1522 of 1788) PASS: lldb-shell :: ObjectFile/ELF/PT_TLS-overlap-PT_LOAD.yaml (1523 of 1788) PASS: lldb-api :: python_api/lldbutil/iter/TestLLDBIterator.py (1524 of 1788) PASS: lldb-shell :: ObjectFile/ELF/PT_LOAD-overlap.yaml (1525 of 1788) PASS: lldb-unit :: Utility/./UtilityTests/LogChannelEnabledTest.LogVerboseThread (1526 of 1788) PASS: lldb-unit :: Utility/./UtilityTests/StreamTest.PutRawBytesToBigEndian (1527 of 1788) PASS: lldb-shell :: Reproducer/Modules/TestModuleCXX.test (1528 of 1788) PASS: lldb-api :: functionalities/data-formatter/data-formatter-stl/libcxx/multiset/TestDataFormatterLibcxxMultiSet.py (1529 of 1788) PASS: lldb-unit :: Signals/./SignalsTests/UnixSignalsTest.GetFilteredSignals (1530 of 1788) PASS: lldb-shell :: Commands/CommandScriptImmediateOutput/CommandScriptImmediateOutputFile.test (1531 of 1788) PASS: lldb-api :: python_api/process/read-mem-cstring/TestReadMemCString.py (1532 of 1788) PASS: lldb-unit :: Expression/./ExpressionTests/CppModuleConfigurationTest.Sysroot (1533 of 1788) PASS: lldb-unit :: Utility/./UtilityTests/StringListTest.LongestCommonPrefixDuplicateElement (1534 of 1788) PASS: lldb-unit :: Utility/./UtilityTests/StringListTest.InsertStringAtIndexOutOfBounds (1535 of 1788) PASS: lldb-unit :: Utility/./UtilityTests/ReproducerTest.SetCapture (1536 of 1788) PASS: lldb-unit :: Interpreter/./InterpreterTests/CompletionTest.DirCompletionAbsolute (1537 of 1788) PASS: lldb-unit :: Utility/./UtilityTests/ScalarTest.SetValueFromCString (1538 of 1788) PASS: lldb-api :: commands/source/info/TestSourceInfo.py (1539 of 1788) PASS: lldb-unit :: Utility/./UtilityTests/AnsiTerminal.AtStart (1540 of 1788) PASS: lldb-shell :: Watchpoint/SetErrorCases.test (1541 of 1788) PASS: lldb-unit :: Symbol/./SymbolTests/TestClangASTContext.TestGetBasicTypeFromName (1542 of 1788) PASS: lldb-unit :: Utility/./UtilityTests/StringExtractorTest.InitEmpty (1543 of 1788) PASS: lldb-api :: python_api/hello_world/TestHelloWorld.py (1544 of 1788) PASS: lldb-unit :: Target/./TargetTests/PathMappingListTest.AbsoluteTests (1545 of 1788) PASS: lldb-unit :: Process/gdb-remote/./ProcessGdbRemoteTests/GDBRemoteCommunicationClientTest.SaveRestoreRegistersNoSuffix (1546 of 1788) PASS: lldb-unit :: Symbol/./SymbolTests/DWARFCallFrameInfoTest.Basic_eh (1547 of 1788) PASS: lldb-shell :: Minidump/fb-dump.test (1548 of 1788) PASS: lldb-unit :: Utility/./UtilityTests/StreamTest.ShiftOperatorUInts (1549 of 1788) PASS: lldb-unit :: Process/gdb-remote/./ProcessGdbRemoteTests/GDBRemoteCommunicationClientTest.WriteRegisterNoSuffix (1550 of 1788) PASS: lldb-unit :: Utility/./UtilityTests/StringListTest.ShiftMove (1551 of 1788) PASS: lldb-unit :: Utility/./UtilityTests/StringListTest.Clear (1552 of 1788) PASS: lldb-api :: python_api/function_symbol/TestDisasmAPI.py (1553 of 1788) PASS: lldb-api :: commands/watchpoints/watchpoint_commands/command/TestWatchpointCommandLLDB.py (1554 of 1788) PASS: lldb-api :: api/listeners/TestListener.py (1555 of 1788) PASS: lldb-unit :: Process/minidump/./LLDBMinidumpTests/MinidumpParserTest.GetThreadContext_x86_32_wow64 (1556 of 1788) PASS: lldb-unit :: Utility/./UtilityTests/StreamTest.PutHex16ByteOrderBig (1557 of 1788) PASS: lldb-unit :: Utility/./UtilityTests/Flags.AnyClear (1558 of 1788) PASS: lldb-unit :: Utility/./UtilityTests/StringListTest.CopyList (1559 of 1788) PASS: lldb-unit :: Utility/./UtilityTests/FileSpecTest.PrependPathComponent (1560 of 1788) PASS: lldb-unit :: Host/./HostTests/TaskPoolTest.TaskMap (1561 of 1788) PASS: lldb-api :: functionalities/postmortem/elf-core/TestLinuxCore.py (1562 of 1788) PASS: lldb-unit :: Utility/./UtilityTests/ArgsTest.ReplaceArgumentAtIndexLonger (1563 of 1788) PASS: lldb-api :: python_api/lldbutil/frame/TestFrameUtils.py (1564 of 1788) UNSUPPORTED: lldb-api :: linux/add-symbols/TestTargetSymbolsAddCommand.py (1565 of 1788) PASS: lldb-unit :: Utility/./UtilityTests/ArgsTest.GetQuotedCommandString (1566 of 1788) PASS: lldb-unit :: UnwindAssembly/x86/./UnwindAssemblyx86Tests/Testx86AssemblyInspectionEngine.TestSubRSP (1567 of 1788) PASS: lldb-shell :: ObjectFile/ELF/PT_LOAD-empty.yaml (1568 of 1788) PASS: lldb-shell :: Register/x86-64-read.test (1569 of 1788) PASS: lldb-unit :: Utility/./UtilityTests/VMRange.IsValid (1570 of 1788) PASS: lldb-unit :: Utility/./UtilityTests/SerializationRountripTest.SerializeDeserializePodReferences (1571 of 1788) PASS: lldb-api :: lang/cpp/unique-types/TestUniqueTypes.py (1572 of 1788) PASS: lldb-unit :: Utility/./UtilityTests/LogChannelTest.EnableOptions (1573 of 1788) PASS: lldb-api :: lang/objc/global_ptrs/TestGlobalObjects.py (1574 of 1788) PASS: lldb-unit :: Utility/./UtilityTests/StringExtractorTest.GetHexBytes_FullString (1575 of 1788) PASS: lldb-unit :: Host/./HostTests/SocketTest.DomainListenConnectAccept (1576 of 1788) PASS: lldb-api :: lang/objc/hidden-ivars/TestHiddenIvars.py (1577 of 1788) PASS: lldb-api :: functionalities/float-display/TestFloatDisplay.py (1578 of 1788) PASS: lldb-unit :: Utility/./UtilityTests/StreamTest.ShiftOperatorInts (1579 of 1788) PASS: lldb-shell :: Quit/TestQuitExitCodeNonInt.test (1580 of 1788) PASS: lldb-unit :: Utility/./UtilityTests/FileSpecTest.GetNormalizedPath (1581 of 1788) PASS: lldb-unit :: Utility/./UtilityTests/ArgsTest.TestQuotedTrailingBackslash (1582 of 1788) PASS: lldb-unit :: Utility/./UtilityTests/FileSpecTest.EqualSeparator (1583 of 1788) PASS: lldb-unit :: Utility/./UtilityTests/LogChannelEnabledTest.LLDB_LOG_ERROR (1584 of 1788) PASS: lldb-api :: functionalities/breakpoint/move_nearest/TestMoveNearest.py (1585 of 1788) PASS: lldb-api :: commands/expression/fixits/TestFixIts.py (1586 of 1788) PASS: lldb-unit :: ScriptInterpreter/Python/./ScriptInterpreterPythonTests/PythonDataObjectsTest.TestCallable (1587 of 1788) PASS: lldb-unit :: ScriptInterpreter/Python/./ScriptInterpreterPythonTests/PythonDataObjectsTest.TestPythonFile (1588 of 1788) PASS: lldb-shell :: Driver/TestRepl.test (1589 of 1788) PASS: lldb-unit :: Utility/./UtilityTests/StringExtractorTest.DecodeHexU8_InvalidHex2 (1590 of 1788) UNSUPPORTED: lldb-api :: commands/watchpoints/hello_watchlocation/TestWatchLocation.py (1591 of 1788) PASS: lldb-api :: lang/cpp/offsetof/TestOffsetofCpp.py (1592 of 1788) PASS: lldb-api :: commands/help/TestHelp.py (1593 of 1788) PASS: lldb-api :: commands/expression/test/TestExprs2.py (1594 of 1788) PASS: lldb-api :: functionalities/thread/concurrent_events/TestConcurrentCrashWithBreak.py (1595 of 1788) PASS: lldb-unit :: Utility/./UtilityTests/Flags.Test (1596 of 1788) PASS: lldb-unit :: Utility/./UtilityTests/StreamTeeTest.GetStreamAtIndexOutOfBounds (1597 of 1788) PASS: lldb-api :: python_api/class_members/TestSBTypeClassMembers.py (1598 of 1788) PASS: lldb-unit :: Utility/./UtilityTests/UriParserTest.LongPath (1599 of 1788) PASS: lldb-unit :: Utility/./UtilityTests/StringExtractorTest.DecodeHexU8_Underflow (1600 of 1788) PASS: lldb-unit :: Process/gdb-remote/./ProcessGdbRemoteTests/GDBRemoteCommunicationServerTest.SendErrorResponse_UnimplementedError (1601 of 1788) PASS: lldb-unit :: Interpreter/./InterpreterTests/CompletionTest.FileCompletionAbsolute (1602 of 1788) PASS: lldb-api :: lang/objcxx/objcxx-ivar-vector/TestIvarVector.py (1603 of 1788) UNSUPPORTED: lldb-api :: tools/lldb-vscode/variables/TestVSCode_variables.py (1604 of 1788) PASS: lldb-unit :: Signals/./SignalsTests/UnixSignalsTest.VersionChange (1605 of 1788) PASS: lldb-unit :: Utility/./UtilityTests/BinaryStreamTest.PutSLEB128ThreeBytes (1606 of 1788) PASS: lldb-unit :: UnwindAssembly/x86/./UnwindAssemblyx86Tests/Testx86AssemblyInspectionEngine.TestPushRBX (1607 of 1788) UNSUPPORTED: lldb-api :: functionalities/longjmp/TestLongjmp.py (1608 of 1788) PASS: lldb-api :: lang/objc/objc-property/TestObjCProperty.py (1609 of 1788) PASS: lldb-api :: functionalities/load_using_paths/TestLoadUsingPaths.py (1610 of 1788) PASS: lldb-api :: lang/cpp/breakpoint-commands/TestCPPBreakpointCommands.py (1611 of 1788) PASS: lldb-unit :: Utility/./UtilityTests/TimeoutTest.Construction (1612 of 1788) PASS: lldb-api :: lang/objc/modules-incomplete/TestIncompleteModules.py (1613 of 1788) PASS: lldb-api :: python_api/section/TestSectionAPI.py (1614 of 1788) PASS: lldb-unit :: UnwindAssembly/x86/./UnwindAssemblyx86Tests/Testx86AssemblyInspectionEngine.TestPopR13 (1615 of 1788) PASS: lldb-api :: commands/command/script/import/rdar-12586188/TestRdar12586188.py (1616 of 1788) PASS: lldb-api :: commands/watchpoints/watchpoint_commands/command/TestWatchpointCommandPython.py (1617 of 1788) UNSUPPORTED: lldb-shell :: SymbolFile/PDB/ast-restore.test (1618 of 1788) PASS: lldb-unit :: Expression/./ExpressionTests/DiagnosticManagerTest.GetStringBasic (1619 of 1788) PASS: lldb-unit :: Symbol/./SymbolTests/TestClangASTContext.TestConvertAccessTypeToAccessSpecifier (1620 of 1788) PASS: lldb-api :: lang/objc/print-obj/TestPrintObj.py (1621 of 1788) PASS: lldb-shell :: SymbolFile/DWARF/forward-declarations.s (1622 of 1788) UNSUPPORTED: lldb-api :: tools/lldb-vscode/breakpoint/TestVSCode_setExceptionBreakpoints.py (1623 of 1788) PASS: lldb-unit :: Utility/./UtilityTests/DataExtractorTest.GetMaxU64_unchecked (1624 of 1788) PASS: lldb-api :: lang/c/vla/TestVLA.py (1625 of 1788) PASS: lldb-api :: functionalities/gdb_remote_client/TestWriteMemory.py (1626 of 1788) PASS: lldb-api :: functionalities/fat_archives/TestFatArchives.py (1627 of 1788) PASS: lldb-api :: python_api/sbtype_typeclass/TestSBTypeTypeClass.py (1628 of 1788) PASS: lldb-api :: functionalities/data-formatter/summary-string-onfail/Test-rdar-9974002.py (1629 of 1788) PASS: lldb-unit :: Utility/./UtilityTests/ArchSpecTest.OperatorBool (1630 of 1788) PASS: lldb-unit :: Process/gdb-remote/./ProcessGdbRemoteTests/GDBRemoteCommunicationClientTest.GetModulesInfo_UUID20 (1631 of 1788) PASS: lldb-unit :: Utility/./UtilityTests/ArchSpecTest.TestParseMachCPUDashSubtypeTripleExtra (1632 of 1788) PASS: lldb-unit :: SymbolFile/NativePDB/./SymbolFileNativePDBTests/PDBFPOProgramToDWARFExpressionTests.InvalidOpBinary (1633 of 1788) UNSUPPORTED: lldb-api :: commands/expression/completion-crash2/TestCompletionCrash2.py (1634 of 1788) PASS: lldb-api :: python_api/breakpoint/TestBreakpointAPI.py (1635 of 1788) PASS: lldb-shell :: ObjectFile/Breakpad/sections-trailing-func.test (1636 of 1788) PASS: lldb-api :: lang/objc/objc-foundation-dictionary-empty/TestNSDictionary0.py (1637 of 1788) PASS: lldb-unit :: Utility/./UtilityTests/CompletionRequest.TryCompleteCurrentArgMode (1638 of 1788) PASS: lldb-api :: commands/expression/persistent_ptr_update/TestPersistentPtrUpdate.py (1639 of 1788) PASS: lldb-api :: lang/cpp/llvm-style/TestLLVMStyle.py (1640 of 1788) UNSUPPORTED: lldb-shell :: SymbolFile/PDB/expressions.test (1641 of 1788) PASS: lldb-api :: commands/expression/unicode-in-variable/TestUnicodeInVariable.py (1642 of 1788) PASS: lldb-unit :: Utility/./UtilityTests/ScalarTest.CastOperations (1643 of 1788) PASS: lldb-api :: functionalities/data-formatter/setvaluefromcstring/TestSetValueFromCString.py (1644 of 1788) PASS: lldb-api :: functionalities/data-formatter/dump_dynamic/TestDumpDynamic.py (1645 of 1788) PASS: lldb-api :: functionalities/gdb_remote_client/TestNoWatchpointSupportInfo.py (1646 of 1788) PASS: lldb-api :: python_api/signals/TestSignalsAPI.py (1647 of 1788) PASS: lldb-api :: functionalities/avoids-fd-leak/TestFdLeak.py (1648 of 1788) PASS: lldb-unit :: Host/./HostTests/File.GetWaitableHandleFileno (1649 of 1788) PASS: lldb-unit :: UnwindAssembly/x86/./UnwindAssemblyx86Tests/Testx86AssemblyInspectionEngine.TestSimple64bitFrameFunction (1650 of 1788) PASS: lldb-unit :: Host/./HostTests/SocketTest.TCPListen0GetPort (1651 of 1788) PASS: lldb-api :: functionalities/multidebugger_commands/TestMultipleDebuggersCommands.py (1652 of 1788) UNSUPPORTED: lldb-api :: commands/register/register/intel_xtended_registers/mpx_bound_violation/TestBoundViolation.py (1653 of 1788) UNSUPPORTED: lldb-shell :: SymbolFile/target-symbols-add-unwind.test (1654 of 1788) PASS: lldb-api :: functionalities/data-formatter/data-formatter-objc/TestDataFormatterObjCExpr.py (1655 of 1788) PASS: lldb-unit :: Process/gdb-remote/./ProcessGdbRemoteTests/GDBRemoteCommunicationClientTest.ReadRegister (1656 of 1788) PASS: lldb-api :: functionalities/thread/concurrent_events/TestConcurrentSignalWatchBreak.py (1657 of 1788) UNSUPPORTED: lldb-api :: linux/sepdebugsymlink/TestTargetSymbolsSepDebugSymlink.py (1658 of 1788) PASS: lldb-shell :: SymbolFile/NativePDB/ast-functions.cpp (1659 of 1788) PASS: lldb-unit :: Symbol/./SymbolTests/TestClangASTContext.TestRecordHasFields (1660 of 1788) PASS: lldb-unit :: Utility/./UtilityTests/ScalarTest.Scalar_512 (1661 of 1788) UNSUPPORTED: lldb-shell :: SymbolFile/PDB/compilands.test (1662 of 1788) PASS: lldb-unit :: Utility/./UtilityTests/StringExtractorTest.GetHexBytesAvail_OddPair (1663 of 1788) PASS: lldb-api :: functionalities/breakpoint/debugbreak/TestDebugBreak.py (1664 of 1788) PASS: lldb-unit :: Host/./HostTests/FileSystemTest.FileAndDirectoryComponents (1665 of 1788) PASS: lldb-shell :: SymbolFile/DWARF/dwarf5_locations.s (1666 of 1788) PASS: lldb-api :: functionalities/source-map/TestTargetSourceMap.py (1667 of 1788) PASS: lldb-api :: lang/c/offsetof/TestOffsetof.py (1668 of 1788) PASS: lldb-unit :: Target/./TargetTests/ModuleCacheTest.GetAndPut (1669 of 1788) PASS: lldb-api :: lang/objc/ivar-IMP/TestObjCiVarIMP.py (1670 of 1788) PASS: lldb-api :: functionalities/mtc/simple/TestMTCSimple.py (1671 of 1788) PASS: lldb-unit :: Host/./HostTests/SocketTest.DecodeHostAndPort (1672 of 1788) PASS: lldb-api :: functionalities/breakpoint/breakpoint_command/TestBreakpointCommand.py (1673 of 1788) PASS: lldb-unit :: Utility/./UtilityTests/Predicate.WaitForValueEqualTo (1674 of 1788) PASS: lldb-api :: commands/expression/import-std-module/conflicts/TestStdModuleWithConflicts.py (1675 of 1788) PASS: lldb-api :: python_api/watchpoint/TestSetWatchpoint.py (1676 of 1788) PASS: lldb-api :: lang/objc/ptr_refs/TestPtrRefsObjC.py (1677 of 1788) PASS: lldb-api :: lang/objc/foundation/TestRuntimeTypes.py (1678 of 1788) PASS: lldb-api :: functionalities/conditional_break/TestConditionalBreak.py (1679 of 1788) PASS: lldb-unit :: Utility/./UtilityTests/RangeTest.ClearWithStarAddress (1680 of 1788) PASS: lldb-api :: commands/register/register/register_command/TestRegisters.py (1681 of 1788) PASS: lldb-unit :: Host/./HostTests/HostInfoTest.GetHostname (1682 of 1788) PASS: lldb-api :: functionalities/return-value/TestReturnValue.py (1683 of 1788) PASS: lldb-api :: commands/frame/diagnose/inheritance/TestDiagnoseInheritance.py (1684 of 1788) PASS: lldb-api :: functionalities/non-overlapping-index-variable-i/TestIndexVariable.py (1685 of 1788) PASS: lldb-api :: lang/cpp/class_types/TestClassTypesDisassembly.py (1686 of 1788) PASS: lldb-shell :: ObjectFile/PECOFF/export-dllfunc.yaml (1687 of 1788) PASS: lldb-api :: lang/c/strings/TestCStrings.py (1688 of 1788) PASS: lldb-api :: functionalities/data-formatter/language_category_updates/TestDataFormatterLanguageCategoryUpdates.py (1689 of 1788) PASS: lldb-api :: commands/frame/diagnose/local-variable/TestLocalVariable.py (1690 of 1788) PASS: lldb-api :: lang/c/find_struct_type/TestFindStructTypes.py (1691 of 1788) PASS: lldb-unit :: Utility/./UtilityTests/UriParserTest.MinimalPort (1692 of 1788) PASS: lldb-unit :: Utility/./UtilityTests/RangeTest.ContainsEndInclusiveInvalid (1693 of 1788) PASS: lldb-api :: lang/objc/modules-cache/TestClangModulesCache.py (1694 of 1788) PASS: lldb-unit :: Process/gdb-remote/./ProcessGdbRemoteTests/GDBRemoteCommunicationClientTest.GetModulesInfo (1695 of 1788) PASS: lldb-unit :: Utility/./UtilityTests/OptionsWithRawTest.EmptyArgsOnlySuffix (1696 of 1788) PASS: lldb-api :: functionalities/postmortem/netbsd-core/TestNetBSDCore.py (1697 of 1788) PASS: lldb-unit :: Utility/./UtilityTests/StringExtractorTest.GetHexU8_InvalidHex_NoEof (1698 of 1788) PASS: lldb-shell :: Quit/TestQuitExitCode0.test (1699 of 1788) PASS: lldb-unit :: Utility/./UtilityTests/ArgsTest.TestUnknownEscape (1700 of 1788) PASS: lldb-api :: commands/expression/import-std-module/weak_ptr-dbg-info-content/TestDbgInfoContentWeakPtr.py (1701 of 1788) PASS: lldb-unit :: Expression/./ExpressionTests/ClangHostTest.ComputeClangResourceDirectory (1702 of 1788) PASS: lldb-api :: tools/lldb-server/TestGdbRemoteRegisterState.py (1703 of 1788) XFAIL: lldb-shell :: Unwind/prefer-debug-over-eh-frame.test (1704 of 1788) PASS: lldb-shell :: Driver/TestSingleQuote.test (1705 of 1788) PASS: lldb-api :: lang/cpp/operators/TestCppOperators.py (1706 of 1788) PASS: lldb-api :: lang/c/forward/TestForwardDeclaration.py (1707 of 1788) PASS: lldb-api :: commands/expression/formatters/TestFormatters.py (1708 of 1788) PASS: lldb-shell :: Expr/TestMultilineExpr.test (1709 of 1788) PASS: lldb-shell :: Quit/TestQuitExitCode30.test (1710 of 1788) PASS: lldb-api :: functionalities/data-formatter/data-formatter-stl/libcxx/unordered/TestDataFormatterUnordered.py (1711 of 1788) PASS: lldb-unit :: Utility/./UtilityTests/GeneratorTest.Create (1712 of 1788) PASS: lldb-api :: functionalities/breakpoint/breakpoint_command/TestBreakpointCommandsFromPython.py (1713 of 1788) PASS: lldb-shell :: SymbolFile/Breakpad/line-table-mixed-path-styles.test (1714 of 1788) PASS: lldb-api :: functionalities/target_var/TestTargetVar.py (1715 of 1788) PASS: lldb-api :: functionalities/thread/thread_specific_break/TestThreadSpecificBreakpoint.py (1716 of 1788) PASS: lldb-api :: python_api/target/TestTargetAPI.py (1717 of 1788) PASS: lldb-api :: functionalities/thread/step_out/TestThreadStepOut.py (1718 of 1788) PASS: lldb-unit :: Utility/./UtilityTests/ArgsTest.TestSingleQuotedArgWithSpace (1719 of 1788) PASS: lldb-api :: commands/settings/quoting/TestQuoting.py (1720 of 1788) PASS: lldb-unit :: UnwindAssembly/x86/./UnwindAssemblyx86Tests/Testx86AssemblyInspectionEngine.TestPushImm (1721 of 1788) PASS: lldb-api :: commands/expression/import-std-module/unique_ptr-dbg-info-content/TestUniquePtrDbgInfoContent.py (1722 of 1788) PASS: lldb-api :: lang/cpp/nsimport/TestCppNsImport.py (1723 of 1788) PASS: lldb-api :: macosx/load-kext/TestLoadKext.py (1724 of 1788) PASS: lldb-unit :: UnwindAssembly/x86/./UnwindAssemblyx86Tests/Testx86AssemblyInspectionEngine.Test32BitOnlyInstruction (1725 of 1788) PASS: lldb-shell :: Reproducer/TestWorkingDir.test (1726 of 1788) PASS: lldb-unit :: SymbolFile/DWARF/./SymbolFileDWARFTests/SymbolFileDWARFTests.TestAbbrevMissingTerminator (1727 of 1788) PASS: lldb-api :: functionalities/stats_api/TestStatisticsAPI.py (1728 of 1788) PASS: lldb-unit :: Utility/./UtilityTests/StringListTest.InsertStringAtIndexEnd (1729 of 1788) PASS: lldb-unit :: Utility/./UtilityTests/BinaryStreamTest.PutULEB128SixBytes (1730 of 1788) PASS: lldb-unit :: Symbol/./SymbolTests/TestClangASTContext.TestGetBasicTypeFromEnum (1731 of 1788) PASS: lldb-shell :: SymbolFile/DWARF/split-dwarf-inlining.cpp (1732 of 1788) PASS: lldb-api :: functionalities/data-formatter/data-formatter-objc/TestDataFormatterObjCNSBundle.py (1733 of 1788) PASS: lldb-api :: functionalities/breakpoint/breakpoint_options/TestBreakpointOptions.py (1734 of 1788) UNSUPPORTED: lldb-api :: functionalities/thread/multi_break/TestMultipleBreakpoints.py (1735 of 1788) PASS: lldb-unit :: Host/./HostTests/NativeProcessProtocolTest.SetBreakpointFailRead (1736 of 1788) PASS: lldb-unit :: Editline/./EditlineTests/EditlineTestFixture.EditlineReceivesSingleLineText (1737 of 1788) PASS: lldb-api :: commands/expression/rdar44436068/Test128BitsInteger.py (1738 of 1788) PASS: lldb-unit :: ScriptInterpreter/Python/./ScriptInterpreterPythonTests/PythonDataObjectsTest.TestPythonCallableInvoke (1739 of 1788) PASS: lldb-unit :: Utility/./UtilityTests/StringListTest.GetMaxStringLengthIncreasingSize (1740 of 1788) PASS: lldb-unit :: Language/Highlighting/./HighlighterTests/HighlighterTest.ClangCursorPosBeforeOtherToken (1741 of 1788) PASS: lldb-unit :: Process/gdb-remote/./ProcessGdbRemoteTests/GDBRemoteCommunicationClientTest.GetModulesInfoInvalidResponse (1742 of 1788) PASS: lldb-unit :: ScriptInterpreter/Python/./ScriptInterpreterPythonTests/PythonExceptionStateTest.TestResetSemantics (1743 of 1788) PASS: lldb-unit :: Utility/./UtilityTests/StreamTest.PutCStringWithStringRef (1744 of 1788) PASS: lldb-shell :: Minidump/disassemble-no-module.yaml (1745 of 1788) PASS: lldb-unit :: Expression/./ExpressionTests/CppModuleConfigurationTest.IgnoreLibStdCpp (1746 of 1788) PASS: lldb-unit :: UnwindAssembly/x86/./UnwindAssemblyx86Tests/Testx86AssemblyInspectionEngine.TestPopR12 (1747 of 1788) PASS: lldb-unit :: ObjectFile/Breakpad/./ObjectFileBreakpadTests/InfoRecord.parse (1748 of 1788) PASS: lldb-shell :: ObjectFile/PECOFF/basic-info-arm64.yaml (1749 of 1788) PASS: lldb-api :: lang/objc/real-definition/TestRealDefinition.py (1750 of 1788) PASS: lldb-api :: functionalities/jitloader_gdb/TestJITLoaderGDB.py (1751 of 1788) PASS: lldb-api :: functionalities/data-formatter/data-formatter-stl/libcxx/forward_list/TestDataFormatterLibcxxForwardList.py (1752 of 1788) UNSUPPORTED: lldb-shell :: Register/arm-gp-read.test (1753 of 1788) PASS: lldb-api :: functionalities/data-formatter/type_summary_list_arg/TestTypeSummaryListArg.py (1754 of 1788) PASS: lldb-unit :: Utility/./UtilityTests/CompletionRequest.TryCompleteCurrentArgBad (1755 of 1788) PASS: lldb-api :: commands/expression/class_template_specialization_empty_pack/TestClassTemplateSpecializationParametersHandling.py (1756 of 1788) PASS: lldb-unit :: UnwindAssembly/x86/./UnwindAssemblyx86Tests/Testx86AssemblyInspectionEngine.TestPopRBX (1757 of 1788) PASS: lldb-api :: lang/cpp/std-function-step-into-callable/TestStdFunctionStepIntoCallable.py (1758 of 1788) PASS: lldb-unit :: Utility/./UtilityTests/ArgsTest.TestTrailingBackslash (1759 of 1788) PASS: lldb-api :: lang/cpp/stl/TestStdCXXDisassembly.py (1760 of 1788) PASS: lldb-unit :: Utility/./UtilityTests/OptionsWithRawTest.MultiWordSuffix (1761 of 1788) UNSUPPORTED: lldb-api :: commands/watchpoints/multi_watchpoint_slots/TestWatchpointMultipleSlots.py (1762 of 1788) PASS: lldb-unit :: Host/./HostTests/SocketTest.TCPGetAddress (1763 of 1788) PASS: lldb-unit :: Utility/./UtilityTests/StringExtractorTest.GetHexU8_Extra_NoEof (1764 of 1788) PASS: lldb-unit :: Utility/./UtilityTests/TildeExpressionResolver.ResolveFullPath (1765 of 1788) PASS: lldb-api :: lang/cpp/scope/TestCppScope.py (1766 of 1788) UNSUPPORTED: lldb-shell :: Register/aarch64-fp-read.test (1767 of 1788) PASS: lldb-unit :: Target/./TargetTests/ExecutionContextTest.GetByteOrder (1768 of 1788) UNSUPPORTED: lldb-shell :: SymbolFile/dissassemble-entry-point.s (1769 of 1788) PASS: lldb-unit :: ObjectFile/Breakpad/./ObjectFileBreakpadTests/FileRecord.parse (1770 of 1788) PASS: lldb-unit :: Utility/./UtilityTests/ScalarTest.Comparison (1771 of 1788) PASS: lldb-api :: functionalities/data-formatter/parray/TestPrintArray.py (1772 of 1788) PASS: lldb-api :: commands/platform/process/TestProcessList.py (1773 of 1788) PASS: lldb-api :: tools/lldb-server/TestGdbRemoteExpeditedRegisters.py (1774 of 1788) PASS: lldb-api :: functionalities/inline-stepping/TestInlineStepping.py (1775 of 1788) PASS: lldb-api :: lang/objcxx/class-name-clash/TestNameClash.py (1776 of 1788) PASS: lldb-api :: commands/expression/weak_symbols/TestWeakSymbols.py (1777 of 1788) PASS: lldb-api :: functionalities/tail_call_frames/disambiguate_call_site/TestDisambiguateCallSite.py (1778 of 1788) PASS: lldb-api :: commands/expression/save_jit_objects/TestSaveJITObjects.py (1779 of 1788) PASS: lldb-api :: functionalities/breakpoint/breakpoint_ignore_count/TestBreakpointIgnoreCount.py (1780 of 1788) PASS: lldb-api :: functionalities/ptr_refs/TestPtrRefs.py (1781 of 1788) PASS: lldb-api :: commands/expression/import-std-module/vector-dbg-info-content/TestDbgInfoContentVector.py (1782 of 1788) PASS: lldb-api :: functionalities/data-formatter/data-formatter-stl/libcxx/iterator/TestDataFormatterLibccIterator.py (1783 of 1788) PASS: lldb-api :: functionalities/data-formatter/data-formatter-stl/libcxx/map/TestDataFormatterLibccMap.py (1784 of 1788) UNSUPPORTED: lldb-api :: lang/objc/bitfield_ivars/TestBitfieldIvars.py (1785 of 1788) PASS: lldb-api :: commands/expression/import-std-module/vector-basic/TestBasicVector.py (1786 of 1788) PASS: lldb-api :: tools/lldb-server/TestLldbGdbServer.py (1787 of 1788) PASS: lldb-api :: lang/objc/foundation/TestFoundationDisassembly.py (1788 of 1788) Testing Time: 1913.10s ******************** Failing Tests (1): lldb-api :: tools/lldb-server/commandline/TestStubSetSID.py

Hide Details

Hide Details

Slowest Tests: -------------------------------------------------------------------------- 124.52s: lldb-api :: lang/objc/objc-struct-return/TestObjCStructReturn.py 125.29s: lldb-api :: api/check_public_api_headers/TestPublicAPIHeaders.py 127.04s: lldb-api :: functionalities/inferior-crashing/TestInferiorCrashingStep.py 127.36s: lldb-api :: functionalities/inferior-crashing/recursive-inferior/TestRecursiveInferiorStep.py 141.10s: lldb-api :: lang/objc/objc-new-syntax/TestObjCNewSyntaxArray.py 144.19s: lldb-api :: functionalities/recursion/TestValueObjectRecursion.py 147.25s: lldb-api :: lang/objc/objc-new-syntax/TestObjCNewSyntaxDictionary.py 169.79s: lldb-api :: tools/lldb-server/TestLldbGdbServer.py 176.62s: lldb-api :: lang/objc/exceptions/TestObjCExceptions.py 188.78s: lldb-api :: functionalities/return-value/TestReturnValue.py 189.59s: lldb-api :: lang/cpp/namespace/TestNamespaceLookup.py 192.13s: lldb-api :: lang/objc/objc-new-syntax/TestObjCNewSyntaxLiteral.py 193.22s: lldb-api :: functionalities/load_unload/TestLoadUnload.py 198.44s: lldb-api :: lang/objc/foundation/TestObjCMethods.py 213.93s: lldb-api :: lang/cpp/enum_types/TestCPP11EnumTypes.py 241.09s: lldb-api :: lang/objc/hidden-ivars/TestHiddenIvars.py 245.40s: lldb-api :: api/multithreaded/TestMultithreaded.py 413.81s: lldb-api :: types/TestIntegerTypes.py 418.86s: lldb-api :: lang/objc/foundation/TestFoundationDisassembly.py 556.84s: lldb-api :: types/TestIntegerTypesExpr.py

Hide Details

Tests Times: -------------------------------------------------------------------------- [ Range ] :: [ Percentage ] :: [ Count ] -------------------------------------------------------------------------- [ 0s, 50s) :: [************************************ ] :: [1637/1788] [ 50s,100s) :: [** ] :: [ 120/1788] [100s,150s) :: [ ] :: [ 15/1788] [150s,200s) :: [ ] :: [ 5/1788] [200s,250s) :: [ ] :: [ 6/1788] [250s,300s) :: [ ] :: [ 2/1788] [300s,350s) :: [ ] :: [ 0/1788] [350s,400s) :: [ ] :: [ 0/1788] [400s,450s) :: [ ] :: [ 1/1788] [450s,500s) :: [ ] :: [ 1/1788] [500s,550s) :: [ ] :: [ 0/1788] [550s,600s) :: [ ] :: [ 1/1788] Expected Passes : 1637 Expected Failures : 6 Unsupported Tests : 144 Unexpected Failures: 1 FAILED: tools/lldb/test/CMakeFiles/check-lldb-lit cd /Users/buildslave/jenkins/workspace/lldb-cmake-sanitized/lldb-build/tools/lldb/test && /usr/bin/python /Users/buildslave/jenkins/workspace/lldb-cmake-sanitized/lldb-build/./bin/llvm-lit -v --time-tests --shuffle --xunit-xml-output=/Users/buildslave/jenkins/workspace/lldb-cmake-sanitized/test/results.xml -v --timeout 1200 /Users/buildslave/jenkins/workspace/lldb-cmake-sanitized/lldb-build/tools/lldb/test ninja: build stopped: subcommand failed. Command failed Command: ['/usr/bin/env', 'TERM=vt100', '/usr/local/bin/ninja', '-v', 'check-lldb'] [Pipeline] } [Pipeline] // timeout [Pipeline] } [Pipeline] // stage [Pipeline] stage [Pipeline] { (Declarative: Post Actions) [Pipeline] scanForIssues No credentials specified [Clang (LLVM based)] Sleeping for 5 seconds due to JENKINS-32191... [Clang (LLVM based)] Parsing console log (workspace: '/Users/buildslave/jenkins/workspace/lldb-cmake-sanitized') [Pipeline] junit Recording test results [Pipeline] } [Pipeline] // stage [Pipeline] } [Pipeline] // withEnv [Pipeline] } [Pipeline] // node [Pipeline] End of Pipeline [BFA] Scanning build for known causes... [BFA] Found failure cause(s): [BFA] Ninja target failed from category Compile [BFA] Regression test failed from category Test [BFA] Done. 1s ERROR: script returned exit code 1 Finished: FAILURE