FailedConsole Output

Skipping 7,703 KB.. Full Log
s/StreamTest.PutSLEB128 (700 of 1807)
UNSUPPORTED: lldb-shell :: SymbolFile/DWARF/debug-types-expressions.test (701 of 1807)
PASS: lldb-unit :: Utility/./UtilityTests/ConstStringTest.CompareStringRef (702 of 1807)
PASS: lldb-unit :: Expression/./ExpressionTests/DWARFExpression.DW_OP_pick (703 of 1807)
PASS: lldb-unit :: Utility/./UtilityTests/StreamTest.PutHex16ByteOrderLittle (704 of 1807)
PASS: lldb-unit :: ScriptInterpreter/Python/./ScriptInterpreterPythonTests/PythonDataObjectsTest.TestScript (705 of 1807)
PASS: lldb-unit :: Utility/./UtilityTests/RangeTest.Union (706 of 1807)
PASS: lldb-unit :: Utility/./UtilityTests/UriParserTest.BracketedHostnamePort (707 of 1807)
PASS: lldb-api :: lang/c/step-target/TestStepTarget.py (708 of 1807)
PASS: lldb-unit :: Utility/./UtilityTests/VASprintfTest.BufferResize (709 of 1807)
PASS: lldb-unit :: Utility/./UtilityTests/StringExtractorTest.DecodeHexU8_Extra (710 of 1807)
PASS: lldb-api :: functionalities/data-formatter/data-formatter-stl/libcxx/optional/TestDataFormatterLibcxxOptional.py (711 of 1807)
PASS: lldb-unit :: Host/./HostTests/FileSystemTest.OpenErrno (712 of 1807)
PASS: lldb-api :: functionalities/breakpoint/breakpoint_command/TestBreakpointCommandsFromPython.py (713 of 1807)
PASS: lldb-api :: lang/cpp/operators/TestCppOperators.py (714 of 1807)
PASS: lldb-unit :: Symbol/./SymbolTests/TestClangASTContext.TestGetBasicTypeFromName (715 of 1807)
PASS: lldb-shell :: SymbolFile/DWARF/find-qualified-variable.cpp (716 of 1807)
PASS: lldb-unit :: Utility/./UtilityTests/SerializationRountripTest.SerializeDeserializePodPointers (717 of 1807)
PASS: lldb-unit :: Utility/./UtilityTests/OptionsWithRawTest.UnterminatedQuote (718 of 1807)
PASS: lldb-unit :: Utility/./UtilityTests/RangeTest.Clear (719 of 1807)
PASS: lldb-api :: commands/watchpoints/watchpoint_on_vectors/TestValueOfVectorVariable.py (720 of 1807)
PASS: lldb-unit :: UnwindAssembly/x86/./UnwindAssemblyx86Tests/Testx86AssemblyInspectionEngine.TestLEAVE (721 of 1807)
PASS: lldb-unit :: Symbol/./SymbolTests/Type.CompilerContextPattern (722 of 1807)
PASS: lldb-unit :: Utility/./UtilityTests/UriParserTest.SchemeHostSeparator3 (723 of 1807)
PASS: lldb-shell :: SymbolFile/DWARF/childless-compile-unit.s (724 of 1807)
PASS: lldb-unit :: ScriptInterpreter/Python/./ScriptInterpreterPythonTests/PythonDataObjectsTest.TestBorrowedReferences (725 of 1807)
PASS: lldb-api :: functionalities/thread/concurrent_events/TestConcurrentBreakpointOneDelayBreakpointThreads.py (726 of 1807)
PASS: lldb-api :: macosx/version_zero/TestGetVersionZeroVersion.py (727 of 1807)
PASS: lldb-shell :: Driver/TestFile.test (728 of 1807)
PASS: lldb-unit :: SymbolFile/NativePDB/./SymbolFileNativePDBTests/PDBFPOProgramToDWARFExpressionTests.UnsupportedRASearch (729 of 1807)
PASS: lldb-api :: commands/expression/rdar44436068/Test128BitsInteger.py (730 of 1807)
PASS: lldb-api :: lang/objc/objc-checker/TestObjCCheckers.py (731 of 1807)
PASS: lldb-api :: commands/process/launch-with-shellexpand/TestLaunchWithShellExpand.py (732 of 1807)
PASS: lldb-api :: functionalities/breakpoint/breakpoint_names/TestBreakpointNames.py (733 of 1807)
PASS: lldb-api :: functionalities/signal/handle-abrt/TestHandleAbort.py (734 of 1807)
PASS: lldb-shell :: ObjectFile/MachO/lc_build_version_notools.yaml (735 of 1807)
PASS: lldb-api :: commands/frame/var/TestFrameVar.py (736 of 1807)
PASS: lldb-unit :: Utility/./UtilityTests/RangeTest.SetRangeBase (737 of 1807)
PASS: lldb-unit :: Host/./HostTests/NativeProcessProtocolTest.ReadCStringFromMemory (738 of 1807)
UNSUPPORTED: lldb-shell :: Unwind/unwind-plan-dwarf-dump.test (739 of 1807)
PASS: lldb-api :: functionalities/deleted-executable/TestDeletedExecutable.py (740 of 1807)
PASS: lldb-api :: commands/expression/import-std-module/no-std-module/TestMissingStdModule.py (741 of 1807)
PASS: lldb-unit :: Utility/./UtilityTests/AnsiTerminal.Empty (742 of 1807)
PASS: lldb-unit :: Utility/./UtilityTests/BinaryStreamTest.PutSLEB128SixBytes (743 of 1807)
PASS: lldb-api :: functionalities/data-formatter/data-formatter-stl/libcxx/forward_list/TestDataFormatterLibcxxForwardList.py (744 of 1807)
UNSUPPORTED: lldb-api :: commands/register/register/intel_xtended_registers/mpx_bound_violation/TestBoundViolation.py (745 of 1807)
PASS: lldb-api :: functionalities/data-formatter/data-formatter-stl/libcxx/atomic/TestLibCxxAtomic.py (746 of 1807)
PASS: lldb-shell :: BuildScript/script-args.test (747 of 1807)
PASS: lldb-api :: lang/c/enum_types/TestEnumTypes.py (748 of 1807)
PASS: lldb-unit :: Interpreter/./InterpreterTests/CompletionTest.DirCompletionUsername (749 of 1807)
PASS: lldb-api :: functionalities/breakpoint/dummy_target_breakpoints/TestBreakpointsWithNoTargets.py (750 of 1807)
PASS: lldb-api :: commands/expression/import-std-module/empty-module/TestEmptyStdModule.py (751 of 1807)
UNSUPPORTED: lldb-shell :: Register/x86-gp-write.test (752 of 1807)
PASS: lldb-unit :: Expression/./ExpressionTests/DiagnosticManagerTest.AppendMessageAttachToLastDiag (753 of 1807)
PASS: lldb-unit :: Process/gdb-remote/./ProcessGdbRemoteTests/GDBRemoteCommunicationClientTest.SyncThreadState (754 of 1807)
PASS: lldb-api :: functionalities/data-formatter/ostypeformatting/TestFormattersOsType.py (755 of 1807)
PASS: lldb-unit :: SymbolFile/NativePDB/./SymbolFileNativePDBTests/PDBFPOProgramToDWARFExpressionTests.MultipleIndependentAssignments (756 of 1807)
UNSUPPORTED: lldb-shell :: SymbolFile/PDB/ast-restore.test (757 of 1807)
UNSUPPORTED: lldb-api :: lang/cpp/printf/TestPrintf.py (758 of 1807)
PASS: lldb-shell :: SymbolFile/NativePDB/globals-fundamental.cpp (759 of 1807)
PASS: lldb-shell :: SymbolFile/NativePDB/ast-methods.cpp (760 of 1807)
PASS: lldb-api :: functionalities/type_completion/TestTypeCompletion.py (761 of 1807)
PASS: lldb-unit :: Utility/./UtilityTests/BinaryStreamTest.PutULEB128TwoBytes (762 of 1807)
PASS: lldb-api :: macosx/universal/TestUniversal.py (763 of 1807)
PASS: lldb-unit :: Interpreter/./InterpreterTests/OptionArgParserTest.toChar (764 of 1807)
PASS: lldb-unit :: Language/Highlighting/./HighlighterTests/HighlighterTest.FallbackHighlighter (765 of 1807)
PASS: lldb-api :: lang/objc/foundation/TestObjCMethodsString.py (766 of 1807)
PASS: lldb-api :: sanity/TestModuleCacheSanity.py (767 of 1807)
PASS: lldb-api :: commands/apropos/with-process/TestAproposWithProcess.py (768 of 1807)
PASS: lldb-api :: lang/objc/unicode-string/TestUnicodeString.py (769 of 1807)
PASS: lldb-shell :: Minidump/disassemble-no-module.yaml (770 of 1807)
PASS: lldb-api :: functionalities/tail_call_frames/ambiguous_tail_call_seq2/TestAmbiguousTailCallSeq2.py (771 of 1807)
UNSUPPORTED: lldb-api :: benchmarks/stepping/TestSteppingSpeed.py (772 of 1807)
PASS: lldb-api :: commands/expression/radar_9531204/TestPrintfAfterUp.py (773 of 1807)
UNSUPPORTED: lldb-shell :: SymbolFile/PDB/function-nested-block.test (774 of 1807)
PASS: lldb-shell :: Breakpoint/jitbp_elf.test (775 of 1807)
PASS: lldb-unit :: Utility/./UtilityTests/UriParserTest.MinimalPortPath (776 of 1807)
UNSUPPORTED: lldb-shell :: Register/x86-64-ymm16-write.test (777 of 1807)
UNSUPPORTED: lldb-shell :: SymbolFile/PDB/class-layout.test (778 of 1807)
PASS: lldb-unit :: SymbolFile/DWARF/./SymbolFileDWARFTests/SymbolFileDWARFTests.TestAbbrevNullAttrValidForm (779 of 1807)
UNSUPPORTED: lldb-api :: functionalities/tsan/multiple/TestTsanMultiple.py (780 of 1807)
UNSUPPORTED: lldb-api :: functionalities/darwin_log/filter/exact_match/activity-chain/TestDarwinLogFilterMatchActivityChain.py (781 of 1807)
PASS: lldb-unit :: Utility/./UtilityTests/ScalarTest.CastOperations (782 of 1807)
PASS: lldb-api :: functionalities/load_using_paths/TestLoadUsingPaths.py (783 of 1807)
PASS: lldb-api :: commands/expression/unwind_expression/TestUnwindExpression.py (784 of 1807)
PASS: lldb-unit :: Process/minidump/./LLDBMinidumpTests/MinidumpParserTest.MinidumpDuplicateModuleMinAddress (785 of 1807)
PASS: lldb-unit :: Utility/./UtilityTests/OptionsWithRawTest.EmptySuffixSingleWhitespace (786 of 1807)
PASS: lldb-api :: functionalities/breakpoint/scripted_bkpt/TestScriptedResolver.py (787 of 1807)
PASS: lldb-api :: lang/c/offsetof/TestOffsetof.py (788 of 1807)
UNSUPPORTED: lldb-api :: functionalities/thread/state/TestThreadStates.py (789 of 1807)
PASS: lldb-unit :: Utility/./UtilityTests/ArgsTest.TestOverwriteArgs (790 of 1807)
PASS: lldb-api :: functionalities/data-formatter/data-formatter-objc/TestDataFormatterObjNSException.py (791 of 1807)
PASS: lldb-api :: functionalities/data-formatter/data-formatter-stl/libcxx/vbool/TestDataFormatterLibcxxVBool.py (792 of 1807)
PASS: lldb-shell :: Reproducer/TestReuseDirectory.test (793 of 1807)
PASS: lldb-unit :: SymbolFile/NativePDB/./SymbolFileNativePDBTests/PDBFPOProgramToDWARFExpressionTests.UnresolvedRegisterAssignmentReference (794 of 1807)
PASS: lldb-unit :: Interpreter/./InterpreterTests/OptionArgParserTest.toBoolean (795 of 1807)
PASS: lldb-unit :: Target/./TargetTests/ExecutionContextTest.GetByteOrderProcess (796 of 1807)
PASS: lldb-api :: commands/process/attach-resume/TestAttachResume.py (797 of 1807)
PASS: lldb-unit :: Expression/./ExpressionTests/DiagnosticManagerTest.GetStringMultiline (798 of 1807)
PASS: lldb-unit :: Utility/./UtilityTests/RangeDataVector.FindEntryThatContains (799 of 1807)
PASS: lldb-unit :: UnwindAssembly/x86/./UnwindAssemblyx86Tests/Testx86AssemblyInspectionEngine.TestSpillRegToStackViaMOVx86_64 (800 of 1807)
PASS: lldb-api :: commands/disassemble/basic/TestFrameDisassemble.py (801 of 1807)
PASS: lldb-api :: lang/c/local_types/TestUseClosestType.py (802 of 1807)
PASS: lldb-api :: tools/lldb-server/TestLldbGdbServer.py (803 of 1807)
PASS: lldb-unit :: Utility/./UtilityTests/StringListTest.Clear (804 of 1807)
PASS: lldb-api :: functionalities/data-formatter/data-formatter-stl/libcxx/vector/TestDataFormatterLibcxxVector.py (805 of 1807)
UNSUPPORTED: lldb-shell :: ObjectFile/ELF/minidebuginfo-no-lzma.yaml (806 of 1807)
PASS: lldb-api :: functionalities/step_scripted/TestStepScripted.py (807 of 1807)
UNSUPPORTED: lldb-api :: functionalities/thread/multi_break/TestMultipleBreakpoints.py (808 of 1807)
PASS: lldb-unit :: Utility/./UtilityTests/LogTest.Unregister (809 of 1807)
PASS: lldb-shell :: Settings/TestSettingsSet.test (810 of 1807)
PASS: lldb-unit :: UnwindAssembly/x86/./UnwindAssemblyx86Tests/Testx86AssemblyInspectionEngine.TestPushR12 (811 of 1807)
PASS: lldb-unit :: UnwindAssembly/x86/./UnwindAssemblyx86Tests/Testx86AssemblyInspectionEngine.Test32bitFramelessSmallStackFrame (812 of 1807)
PASS: lldb-api :: commands/expression/import-std-module/deque-dbg-info-content/TestDbgInfoContentDeque.py (813 of 1807)
PASS: lldb-unit :: Utility/./UtilityTests/AnsiTerminal.Unknown (814 of 1807)
UNSUPPORTED: lldb-api :: api/multiple-debuggers/TestMultipleDebuggers.py (815 of 1807)
PASS: lldb-unit :: Utility/./UtilityTests/StateTest.Formatv (816 of 1807)
PASS: lldb-unit :: Utility/./UtilityTests/StringListTest.GetMaxStringLengthMixed (817 of 1807)
PASS: lldb-api :: functionalities/data-formatter/hexcaps/TestDataFormatterHexCaps.py (818 of 1807)
PASS: lldb-api :: commands/target/dump-symtab-demangle/TestDumpSymtabDemangle.py (819 of 1807)
PASS: lldb-api :: commands/expression/import-std-module/weak_ptr/TestWeakPtr.py (820 of 1807)
PASS: lldb-api :: python_api/findvalue_duplist/TestSBFrameFindValue.py (821 of 1807)
PASS: lldb-unit :: UnwindAssembly/x86/./UnwindAssemblyx86Tests/Testx86AssemblyInspectionEngine.TestSimplex86_64Augmented (822 of 1807)
PASS: lldb-unit :: Utility/./UtilityTests/RecordReplayTest.InstrumentedBar (823 of 1807)
PASS: lldb-unit :: Utility/./UtilityTests/StreamTeeTest.Constructor1Stream (824 of 1807)
PASS: lldb-api :: commands/frame/diagnose/dereference-argument/TestDiagnoseDereferenceArgument.py (825 of 1807)
PASS: lldb-shell :: Breakpoint/debug_rnglistx_rlex.test (826 of 1807)
PASS: lldb-api :: functionalities/abbreviation/TestCommonShortSpellings.py (827 of 1807)
PASS: lldb-api :: functionalities/breakpoint/debugbreak/TestDebugBreak.py (828 of 1807)
PASS: lldb-shell :: SymbolFile/NativePDB/ast-types.cpp (829 of 1807)
UNSUPPORTED: lldb-api :: macosx/macabi/TestMacABImacOSFramework.py (830 of 1807)
PASS: lldb-api :: functionalities/thread/concurrent_events/TestConcurrentSignalBreak.py (831 of 1807)
PASS: lldb-unit :: Language/Highlighting/./HighlighterTests/HighlighterTest.ClangComments (832 of 1807)
PASS: lldb-api :: commands/expression/entry-bp/TestExprEntryBP.py (833 of 1807)
PASS: lldb-unit :: Target/./TargetTests/ModuleCacheTest.GetAndPutStrangeHostname (834 of 1807)
PASS: lldb-unit :: ScriptInterpreter/Python/./ScriptInterpreterPythonTests/PythonDataObjectsTest.TestExceptions (835 of 1807)
PASS: lldb-unit :: Utility/./UtilityTests/OptionsWithRawTest.QuotedSuffix (836 of 1807)
PASS: lldb-unit :: Utility/./UtilityTests/BinaryStreamTest.PutSLEB128TwoBytes (837 of 1807)
PASS: lldb-unit :: Host/./HostTests/HostInfoTest.GetHostname (838 of 1807)
PASS: lldb-api :: functionalities/breakpoint/breakpoint_command/TestRegexpBreakCommand.py (839 of 1807)
PASS: lldb-unit :: UnwindAssembly/x86/./UnwindAssemblyx86Tests/Testx86AssemblyInspectionEngine.TestPushRBP (840 of 1807)
PASS: lldb-unit :: Utility/./UtilityTests/ArchSpecTest.TestSetTriple (841 of 1807)
PASS: lldb-api :: functionalities/thread/step_until/TestStepUntil.py (842 of 1807)
PASS: lldb-api :: lang/cpp/accelerator-table/TestCPPAccelerator.py (843 of 1807)
PASS: lldb-unit :: UnwindAssembly/x86/./UnwindAssemblyx86Tests/Testx86AssemblyInspectionEngine.TestPushESI (844 of 1807)
PASS: lldb-unit :: ScriptInterpreter/Python/./ScriptInterpreterPythonTests/PythonDataObjectsTest.TestPythonTupleValues (845 of 1807)
PASS: lldb-unit :: Target/./TargetTests/PathMappingListTest.RemapRoot (846 of 1807)
PASS: lldb-unit :: Utility/./UtilityTests/ScalarTest.Equality (847 of 1807)
UNSUPPORTED: lldb-api :: commands/expression/completion-crash1/TestCompletionCrash1.py (848 of 1807)
PASS: lldb-unit :: Language/Highlighting/./HighlighterTests/HighlighterTest.DefaultHighlighter (849 of 1807)
PASS: lldb-unit :: Utility/./UtilityTests/VMRange.Reset (850 of 1807)
PASS: lldb-unit :: UnwindAssembly/x86/./UnwindAssemblyx86Tests/Testx86AssemblyInspectionEngine.TestAddRSP (851 of 1807)
PASS: lldb-api :: commands/expression/import-std-module/vector-dbg-info-content/TestDbgInfoContentVector.py (852 of 1807)
UNSUPPORTED: lldb-shell :: SymbolFile/NativePDB/ast-functions-msvc.cpp (853 of 1807)
PASS: lldb-unit :: Language/Highlighting/./HighlighterTests/HighlighterTest.ClangBraces (854 of 1807)
PASS: lldb-unit :: Utility/./UtilityTests/NameMatchesTest.RegularExpression (855 of 1807)
PASS: lldb-unit :: Process/minidump/./LLDBMinidumpTests/RegisterContextMinidump.CheckRegisterContextMinidump_ARM (856 of 1807)
PASS: lldb-api :: functionalities/data-formatter/data-formatter-globals/TestDataFormatterGlobals.py (857 of 1807)
PASS: lldb-api :: commands/statistics/basic/TestStats.py (858 of 1807)
PASS: lldb-unit :: Utility/./UtilityTests/NameMatchesTest.EndsWith (859 of 1807)
PASS: lldb-unit :: Host/./HostTests/ConnectionFileDescriptorTest.TCPGetURIv6 (860 of 1807)
PASS: lldb-unit :: Utility/./UtilityTests/RangeTest.Equal (861 of 1807)
PASS: lldb-unit :: SymbolFile/NativePDB/./SymbolFileNativePDBTests/PDBFPOProgramToDWARFExpressionTests.DependencyChain (862 of 1807)
PASS: lldb-api :: functionalities/data-formatter/varscript_formatting/TestDataFormatterVarScriptFormatting.py (863 of 1807)
PASS: lldb-api :: sample_test/TestSampleInlineTest.py (864 of 1807)
PASS: lldb-api :: python_api/process/read-mem-cstring/TestReadMemCString.py (865 of 1807)
PASS: lldb-unit :: Utility/./UtilityTests/BinaryStreamTest.PutULEB128Zero (866 of 1807)
PASS: lldb-api :: commands/settings/TestSettings.py (867 of 1807)
PASS: lldb-unit :: debugserver/./debugserverTests/RNBSocket.LoopBackConnectIPv6 (868 of 1807)
PASS: lldb-unit :: Utility/./UtilityTests/UriParserTest.MinimalPath (869 of 1807)
PASS: lldb-api :: functionalities/data-formatter/var-in-aggregate-misuse/TestVarInAggregateMisuse.py (870 of 1807)
PASS: lldb-shell :: SymbolFile/DWARF/find-method.cpp (871 of 1807)
PASS: lldb-unit :: Utility/./UtilityTests/NameMatchesTest.Contains (872 of 1807)
PASS: lldb-api :: functionalities/show_location/TestShowLocationDwarf5.py (873 of 1807)
PASS: lldb-unit :: Utility/./UtilityTests/LogChannelEnabledTest.LLDB_LOG_ERROR (874 of 1807)
PASS: lldb-api :: functionalities/tail_call_frames/inlining_and_tail_calls/TestInliningAndTailCalls.py (875 of 1807)
PASS: lldb-unit :: Process/gdb-remote/./ProcessGdbRemoteTests/GDBRemoteCommunicationClientTest.SendStopTracePacket (876 of 1807)
PASS: lldb-unit :: Utility/./UtilityTests/FileSpecTest.GuessPathStyle (877 of 1807)
PASS: lldb-shell :: ExecControl/StopHook/stop-hook.test (878 of 1807)
PASS: lldb-unit :: Expression/./ExpressionTests/CppModuleConfigurationTest.AmbiguousLibCpp (879 of 1807)
PASS: lldb-unit :: ObjectFile/PECOFF/./ObjectFilePECOFFTests/PECallFrameInfoTest.Chained_eh (880 of 1807)
PASS: lldb-shell :: Driver/LocalLLDBInit.test (881 of 1807)
PASS: lldb-api :: commands/platform/basic/TestPlatformCommand.py (882 of 1807)
PASS: lldb-unit :: Utility/./UtilityTests/RangeTest.ContainsRange (883 of 1807)
PASS: lldb-unit :: Utility/./UtilityTests/LogChannelTest.EnableOptions (884 of 1807)
PASS: lldb-api :: macosx/order/TestOrderFile.py (885 of 1807)
PASS: lldb-unit :: Utility/./UtilityTests/RegularExpression.Valid (886 of 1807)
PASS: lldb-shell :: Commands/command-backtrace.test (887 of 1807)
PASS: lldb-shell :: Settings/TestSettingsWrite.test (888 of 1807)
PASS: lldb-api :: lang/objc/single-entry-dictionary/TestObjCSingleEntryDictionary.py (889 of 1807)
PASS: lldb-unit :: UnwindAssembly/x86/./UnwindAssemblyx86Tests/Testx86AssemblyInspectionEngine.TestReturnDetect (890 of 1807)
PASS: lldb-api :: tools/lldb-server/inferior-crash/TestGdbRemoteAbort.py (891 of 1807)
PASS: lldb-unit :: ScriptInterpreter/Python/./ScriptInterpreterPythonTests/PythonDataObjectsTest.TestCallable (892 of 1807)
UNSUPPORTED: lldb-api :: functionalities/tsan/basic/TestTsanBasic.py (893 of 1807)
PASS: lldb-unit :: Utility/./UtilityTests/OptionsWithRawTest.EmptyArgsOnlySuffix (894 of 1807)
PASS: lldb-unit :: Utility/./UtilityTests/StreamTeeTest.GetStreamAtIndexOutOfBounds (895 of 1807)
PASS: lldb-api :: commands/expression/import-std-module/weak_ptr-dbg-info-content/TestDbgInfoContentWeakPtr.py (896 of 1807)
PASS: lldb-api :: lang/cpp/trivial_abi/TestTrivialABI.py (897 of 1807)
PASS: lldb-unit :: Expression/./ExpressionTests/CppModuleConfigurationTest.IgnoreLibStdCpp (898 of 1807)
UNSUPPORTED: lldb-api :: functionalities/data-formatter/data-formatter-stl/libstdcpp/list/TestDataFormatterStdList.py (899 of 1807)
PASS: lldb-unit :: Process/gdb-remote/./ProcessGdbRemoteTests/GDBRemoteCommunicationClientTest.TestPacketSpeedJSON (900 of 1807)
PASS: lldb-api :: python_api/thread/TestThreadAPI.py (901 of 1807)
PASS: lldb-unit :: Utility/./UtilityTests/ArgsTest.DoubleQuotedItem (902 of 1807)
UNSUPPORTED: lldb-api :: tools/lldb-server/platform-process-connect/TestPlatformProcessConnect.py (903 of 1807)
PASS: lldb-unit :: Host/./HostTests/MainLoopTest.Signal (904 of 1807)
PASS: lldb-api :: functionalities/data-formatter/compactvectors/TestCompactVectors.py (905 of 1807)
PASS: lldb-unit :: Utility/./UtilityTests/StringLexerTest.NextIf (906 of 1807)
PASS: lldb-api :: commands/watchpoints/watchpoint_events/TestWatchpointEvents.py (907 of 1807)
UNSUPPORTED: lldb-api :: functionalities/exec/TestExec.py (908 of 1807)
PASS: lldb-api :: lang/cpp/diamond/TestDiamond.py (909 of 1807)
PASS: lldb-shell :: SymbolFile/DWARF/debug-types-line-tables.s (910 of 1807)
UNSUPPORTED: lldb-api :: benchmarks/expression/TestRepeatedExprs.py (911 of 1807)
PASS: lldb-unit :: UnwindAssembly/x86/./UnwindAssemblyx86Tests/Testx86AssemblyInspectionEngine.TestDisassemblyMidFunctionEpilogues (912 of 1807)
PASS: lldb-unit :: Utility/./UtilityTests/VMRange.ContainsAddr (913 of 1807)
PASS: lldb-unit :: UnwindAssembly/x86/./UnwindAssemblyx86Tests/Testx86AssemblyInspectionEngine.TestPushR15 (914 of 1807)
PASS: lldb-api :: commands/process/attach/attach_denied/TestAttachDenied.py (915 of 1807)
PASS: lldb-unit :: Utility/./UtilityTests/StringExtractorTest.DecodeHexU8_Exact (916 of 1807)
PASS: lldb-unit :: Utility/./UtilityTests/VMRange.Ordering (917 of 1807)
PASS: lldb-unit :: Utility/./UtilityTests/StringExtractorTest.GetNameColonValueSuccess (918 of 1807)
PASS: lldb-shell :: ObjectFile/ELF/PT_LOAD-overlap-PT_TLS.yaml (919 of 1807)
PASS: lldb-shell :: SymbolFile/DWARF/debug-line-basic.s (920 of 1807)
PASS: lldb-unit :: Utility/./UtilityTests/ScalarTest.Division (921 of 1807)
PASS: lldb-unit :: UnwindAssembly/x86/./UnwindAssemblyx86Tests/Testx86AssemblyInspectionEngine.TestDisassemblyJunkBytes (922 of 1807)
PASS: lldb-api :: functionalities/modern-type-lookup/libcxx/TestLibCxxModernTypeLookup.py (923 of 1807)
PASS: lldb-unit :: Utility/./UtilityTests/StreamTest.PutHex16ByteOrderBig (924 of 1807)
PASS: lldb-unit :: Process/minidump/./LLDBMinidumpTests/MinidumpParserTest.GetThreadContext_x86_32_wow64 (925 of 1807)
PASS: lldb-api :: lang/cpp/incomplete-types/TestCppIncompleteTypes.py (926 of 1807)
PASS: lldb-shell :: Minidump/Windows/broken-unwind.test (927 of 1807)
PASS: lldb-unit :: Utility/./UtilityTests/ArchSpecTest.TripleComponentsWereSpecified (928 of 1807)
PASS: lldb-unit :: Utility/./UtilityTests/StreamTest.QuotedCString (929 of 1807)
PASS: lldb-unit :: UnwindAssembly/x86/./UnwindAssemblyx86Tests/Testx86AssemblyInspectionEngine.Testi386IgnoredRegisters (930 of 1807)
UNSUPPORTED: lldb-api :: tools/lldb-server/TestGdbRemoteModuleInfo.py (931 of 1807)
PASS: lldb-api :: lang/cpp/chained-calls/TestCppChainedCalls.py (932 of 1807)
PASS: lldb-unit :: Utility/./UtilityTests/StringExtractorTest.GetNameColonValueContainsColon (933 of 1807)
PASS: lldb-unit :: ScriptInterpreter/Python/./ScriptInterpreterPythonTests/PythonDataObjectsTest.TestPythonListValueEquality (934 of 1807)
PASS: lldb-api :: lang/cpp/this/TestCPPThis.py (935 of 1807)
PASS: lldb-api :: commands/source/info/TestSourceInfo.py (936 of 1807)
PASS: lldb-unit :: Utility/./UtilityTests/StringListTest.SplitIntoLinesEmpty (937 of 1807)
PASS: lldb-unit :: ScriptInterpreter/Python/./ScriptInterpreterPythonTests/PythonDataObjectsTest.TestPythonBoolean (938 of 1807)
PASS: lldb-api :: functionalities/fat_archives/TestFatArchives.py (939 of 1807)
UNSUPPORTED: lldb-api :: tools/lldb-server/thread-name/TestGdbRemoteThreadName.py (940 of 1807)
PASS: lldb-unit :: Expression/./ExpressionTests/ClangHostTest.MacOSX (941 of 1807)
PASS: lldb-shell :: Commands/command-source.test (942 of 1807)
UNSUPPORTED: lldb-api :: commands/expression/completion-crash-incomplete-record/TestCompletionCrashIncompleteRecord.py (943 of 1807)
PASS: lldb-api :: functionalities/data-formatter/data-formatter-objc/nsindexpath/TestDataFormatterNSIndexPath.py (944 of 1807)
PASS: lldb-shell :: Minidump/Windows/Sigsegv/sigsegv.test (945 of 1807)
PASS: lldb-api :: macosx/load-kext/TestLoadKext.py (946 of 1807)
PASS: lldb-unit :: Host/./HostTests/FileSystemTest.Exists (947 of 1807)
PASS: lldb-api :: lang/c/conflicting-symbol/TestConflictingSymbol.py (948 of 1807)
PASS: lldb-api :: lang/cpp/inlines/TestInlines.py (949 of 1807)
PASS: lldb-shell :: Unwind/eh-frame-dwarf-unwind.test (950 of 1807)
PASS: lldb-unit :: Host/./HostTests/FileSystemTest.EnumerateDirectory (951 of 1807)
PASS: lldb-unit :: Expression/./ExpressionTests/DiagnosticManagerTest.GetStringSeverityLabels (952 of 1807)
PASS: lldb-api :: lang/cpp/type_lookup/TestCppTypeLookup.py (953 of 1807)
PASS: lldb-unit :: Utility/./UtilityTests/UserIDResolver.GetUserName (954 of 1807)
PASS: lldb-api :: tools/lldb-server/TestAppleSimulatorOSType.py (955 of 1807)
PASS: lldb-unit :: Process/gdb-remote/./ProcessGdbRemoteTests/GDBRemoteClientBaseTest.SendContinueDelegateInterface (956 of 1807)
PASS: lldb-api :: commands/expression/namespace_local_var_same_name_cpp_and_c/TestNamespaceLocalVarSameNameCppAndC.py (957 of 1807)
PASS: lldb-unit :: Utility/./UtilityTests/AnsiTerminal.AtStart (958 of 1807)
PASS: lldb-unit :: Utility/./UtilityTests/StructuredDataTest.StringDump (959 of 1807)
PASS: lldb-api :: functionalities/breakpoint/address_breakpoints/TestAddressBreakpoints.py (960 of 1807)
UNSUPPORTED: lldb-api :: functionalities/data-formatter/data-formatter-stl/libstdcpp/map/TestDataFormatterStdMap.py (961 of 1807)
PASS: lldb-api :: lang/cpp/rvalue-references/TestRvalueReferences.py (962 of 1807)
PASS: lldb-api :: python_api/breakpoint/TestBreakpointAPI.py (963 of 1807)
PASS: lldb-unit :: Utility/./UtilityTests/RegularExpression.Match (964 of 1807)
PASS: lldb-unit :: Utility/./UtilityTests/StringExtractorTest.DecodeHexU8_Underflow2 (965 of 1807)
PASS: lldb-api :: commands/command/script/import/TestImport.py (966 of 1807)
PASS: lldb-unit :: Utility/./UtilityTests/GeneratorTest.Get (967 of 1807)
PASS: lldb-shell :: SymbolFile/DWARF/parallel-indexing-stress.s (968 of 1807)
PASS: lldb-unit :: UnwindAssembly/x86/./UnwindAssemblyx86Tests/Testx86AssemblyInspectionEngine.TestMovRSPtoRBP (969 of 1807)
PASS: lldb-shell :: Settings/TestFrameFormatColor.test (970 of 1807)
PASS: lldb-unit :: ObjectFile/PECOFF/./ObjectFilePECOFFTests/PECallFrameInfoTest.Frame_reg_eh (971 of 1807)
PASS: lldb-api :: functionalities/multidebugger_commands/TestMultipleDebuggersCommands.py (972 of 1807)
UNSUPPORTED: lldb-api :: linux/add-symbols/TestTargetSymbolsAddCommand.py (973 of 1807)
UNSUPPORTED: lldb-api :: tools/lldb-server/libraries-svr4/TestGdbRemoteLibrariesSvr4Support.py (974 of 1807)
PASS: lldb-api :: lang/cpp/class_types/TestClassTypes.py (975 of 1807)
PASS: lldb-unit :: Utility/./UtilityTests/DataExtractorTest.GetMaxU64_unchecked (976 of 1807)
PASS: lldb-api :: python_api/sbtype_typeclass/TestSBTypeTypeClass.py (977 of 1807)
PASS: lldb-unit :: Utility/./UtilityTests/RegisterValueTest.GetSet8 (978 of 1807)
PASS: lldb-shell :: SymbolFile/NativePDB/nested-types.cpp (979 of 1807)
UNSUPPORTED: lldb-api :: arm/breakpoint-it/TestBreakpointIt.py (980 of 1807)
PASS: lldb-unit :: UnwindAssembly/x86/./UnwindAssemblyx86Tests/Testx86AssemblyInspectionEngine.TestPushEDX (981 of 1807)
PASS: lldb-api :: tools/lldb-server/TestGdbRemoteHostInfo.py (982 of 1807)
PASS: lldb-api :: functionalities/target-new-solib-notifications/TestModuleLoadedNotifys.py (983 of 1807)
PASS: lldb-api :: functionalities/return-value/TestReturnValue.py (984 of 1807)
XFAIL: lldb-shell :: SymbolFile/DWARF/find-type-in-function.cpp (985 of 1807)
PASS: lldb-api :: tools/lldb-server/inferior-crash/TestGdbRemoteSegFault.py (986 of 1807)
PASS: lldb-unit :: ObjectFile/Breakpad/./ObjectFileBreakpadTests/ModuleRecord.parse (987 of 1807)
PASS: lldb-api :: lang/objc/objc++/TestObjCXX.py (988 of 1807)
PASS: lldb-api :: python_api/debugger/TestDebuggerAPI.py (989 of 1807)
UNSUPPORTED: lldb-shell :: SymbolFile/PDB/compilands.test (990 of 1807)
PASS: lldb-api :: api/multiple-targets/TestMultipleTargets.py (991 of 1807)
PASS: lldb-unit :: Signals/./SignalsTests/UnixSignalsTest.Iteration (992 of 1807)
PASS: lldb-api :: commands/frame/diagnose/array/TestArray.py (993 of 1807)
PASS: lldb-shell :: SymbolFile/DWARF/find-method-local-struct.cpp (994 of 1807)
PASS: lldb-api :: functionalities/history/TestHistoryRecall.py (995 of 1807)
PASS: lldb-api :: commands/quit/TestQuit.py (996 of 1807)
PASS: lldb-shell :: ObjectFile/ELF/section-permissions.yaml (997 of 1807)
PASS: lldb-unit :: SymbolFile/DWARF/./SymbolFileDWARFTests/SymbolFileDWARFTests.TestAbbrevValidAttrNullForm (998 of 1807)
PASS: lldb-unit :: Process/minidump/./LLDBMinidumpTests/MinidumpParserTest.GetExceptionStream (999 of 1807)
PASS: lldb-unit :: Process/minidump/./LLDBMinidumpTests/MinidumpParserTest.GetArchitecture (1000 of 1807)
PASS: lldb-unit :: UnwindAssembly/x86/./UnwindAssemblyx86Tests/Testx86AssemblyInspectionEngine.TestSimple32bitFrameFunction (1001 of 1807)
PASS: lldb-unit :: ScriptInterpreter/Python/./ScriptInterpreterPythonTests/PythonDataObjectsTest.TestPythonDictionaryToStructuredDictionary (1002 of 1807)
PASS: lldb-unit :: Process/gdb-remote/./ProcessGdbRemoteTests/GDBRemoteClientBaseTest.SendContinueAndLateInterrupt (1003 of 1807)
UNSUPPORTED: lldb-shell :: ExecControl/StopHook/stop-hook-threads.test (1004 of 1807)
PASS: lldb-unit :: Utility/./UtilityTests/Flags.AnySet (1005 of 1807)
PASS: lldb-shell :: SymbolFile/NativePDB/function-types-classes.cpp (1006 of 1807)
PASS: lldb-api :: functionalities/gdb_remote_client/TestNestedRegDefinitions.py (1007 of 1807)
PASS: lldb-unit :: ScriptInterpreter/Python/./ScriptInterpreterPythonTests/PythonDataObjectsTest.TestPythonListToStructuredList (1008 of 1807)
PASS: lldb-unit :: Utility/./UtilityTests/RangeTest.Slide (1009 of 1807)
PASS: lldb-unit :: Utility/./UtilityTests/ScalarTest.Promotion (1010 of 1807)
PASS: lldb-shell :: SymbolFile/DWARF/find-basic-namespace.cpp (1011 of 1807)
PASS: lldb-api :: lang/cpp/member-and-local-vars-with-same-name/TestMembersAndLocalsWithSameName.py (1012 of 1807)
UNSUPPORTED: lldb-api :: functionalities/unwind/standard/TestStandardUnwind.py (1013 of 1807)
UNSUPPORTED: lldb-api :: functionalities/breakpoint/breakpoint_in_delayslot/TestAvoidBreakpointInDelaySlot.py (1014 of 1807)
PASS: lldb-unit :: Utility/./UtilityTests/ArgsTest.TestUnknownEscape (1015 of 1807)
PASS: lldb-unit :: Utility/./UtilityTests/RangeTest.ContainsAddrInvalid (1016 of 1807)
PASS: lldb-unit :: Utility/./UtilityTests/StringListTest.JoinThree (1017 of 1807)
PASS: lldb-unit :: Host/./HostTests/TaskPoolTest.AddTask (1018 of 1807)
PASS: lldb-unit :: Process/minidump/./LLDBMinidumpTests/MinidumpParserTest.MinidumpModuleOrder (1019 of 1807)
PASS: lldb-unit :: Utility/./UtilityTests/SerializationRountripTest.SerializeDeserializeCString (1020 of 1807)
PASS: lldb-api :: commands/add-dsym/uuid/TestAddDsymCommand.py (1021 of 1807)
PASS: lldb-api :: functionalities/multiword-commands/TestMultiWordCommands.py (1022 of 1807)
PASS: lldb-unit :: Expression/./ExpressionTests/DiagnosticManagerTest.PutStringMultiple (1023 of 1807)
PASS: lldb-api :: python_api/disassemble-raw-data/TestDisassembleRawData.py (1024 of 1807)
PASS: lldb-unit :: Language/Highlighting/./HighlighterTests/HighlighterTest.ClangTrailingBackslashWithWhitespace (1025 of 1807)
PASS: lldb-unit :: Utility/./UtilityTests/ArgsTest.ReplaceArgumentAtIndexLonger (1026 of 1807)
PASS: lldb-unit :: Utility/./UtilityTests/UriParserTest.BadPort2 (1027 of 1807)
UNSUPPORTED: lldb-api :: lang/objc/bitfield_ivars/TestBitfieldIvars.py (1028 of 1807)
PASS: lldb-unit :: Utility/./UtilityTests/ScalarTest.RightShiftOperator (1029 of 1807)
UNSUPPORTED: lldb-api :: functionalities/darwin_log/source/debug/TestDarwinLogSourceDebug.py (1030 of 1807)
PASS: lldb-unit :: Utility/./UtilityTests/BinaryStreamTest.PutSLEB128SevenBytes (1031 of 1807)
UNSUPPORTED: lldb-api :: benchmarks/frame_variable/TestFrameVariableResponse.py (1032 of 1807)
UNSUPPORTED: lldb-shell :: Register/x86-64-xmm16-read.test (1033 of 1807)
PASS: lldb-api :: lang/cpp/template-function/TestTemplateFunctions.py (1034 of 1807)
PASS: lldb-api :: commands/help/TestHelp.py (1035 of 1807)
PASS: lldb-shell :: ObjectFile/PECOFF/export-dllfunc.yaml (1036 of 1807)
PASS: lldb-unit :: UnwindAssembly/x86/./UnwindAssemblyx86Tests/Testx86AssemblyInspectionEngine.TestPopR12 (1037 of 1807)
PASS: lldb-unit :: Utility/./UtilityTests/VASprintfTest.EncodingError (1038 of 1807)
PASS: lldb-unit :: Process/gdb-remote/./ProcessGdbRemoteTests/GDBRemoteCommunicationClientTest.SendStartTracePacket (1039 of 1807)
PASS: lldb-unit :: Utility/./UtilityTests/AnsiTerminal.KnownPrefix (1040 of 1807)
UNSUPPORTED: lldb-api :: functionalities/tsan/cpp_global_location/TestTsanCPPGlobalLocation.py (1041 of 1807)
PASS: lldb-api :: functionalities/data-formatter/pyobjsynthprovider/TestPyObjSynthProvider.py (1042 of 1807)
PASS: lldb-api :: commands/expression/two-files/TestObjCTypeQueryFromOtherCompileUnit.py (1043 of 1807)
PASS: lldb-api :: functionalities/gdb_remote_client/TestStopPCs.py (1044 of 1807)
PASS: lldb-unit :: Process/minidump/./LLDBMinidumpTests/MinidumpParserTest.GetLinuxProcStatus_no_stream (1045 of 1807)
PASS: lldb-shell :: ObjectFile/PECOFF/invalid-export-table.yaml (1046 of 1807)
PASS: lldb-api :: functionalities/breakpoint/breakpoint_set_restart/TestBreakpointSetRestart.py (1047 of 1807)
PASS: lldb-unit :: Utility/./UtilityTests/OptionsWithRawTest.LeadingSpaceArgs (1048 of 1807)
PASS: lldb-shell :: Breakpoint/debug_rnglist_rlestartend.test (1049 of 1807)
PASS: lldb-api :: functionalities/data-formatter/data-formatter-smart-array/TestDataFormatterSmartArray.py (1050 of 1807)
PASS: lldb-api :: commands/expression/top-level/TestTopLevelExprs.py (1051 of 1807)
PASS: lldb-unit :: SymbolFile/NativePDB/./SymbolFileNativePDBTests/PDBFPOProgramToDWARFExpressionTests.InvalidAssignmentSingle (1052 of 1807)
PASS: lldb-shell :: ObjectFile/ELF/PT_TLS-overlap-PT_LOAD.yaml (1053 of 1807)
PASS: lldb-api :: functionalities/data-formatter/data-formatter-stl/libcxx/set/TestDataFormatterLibcxxSet.py (1054 of 1807)
PASS: lldb-unit :: Utility/./UtilityTests/ArchSpecTest.OperatorBool (1055 of 1807)
PASS: lldb-unit :: Utility/./UtilityTests/StringListTest.PopBack (1056 of 1807)
UNSUPPORTED: lldb-api :: functionalities/darwin_log/filter/regex/message/TestDarwinLogFilterRegexMessage.py (1057 of 1807)
PASS: lldb-api :: functionalities/tail_call_frames/disambiguate_call_site/TestDisambiguateCallSite.py (1058 of 1807)
PASS: lldb-api :: lang/objc/objc-static-method-stripped/TestObjCStaticMethodStripped.py (1059 of 1807)
PASS: lldb-unit :: Process/gdb-remote/./ProcessGdbRemoteTests/GDBRemoteCommunicationClientTest.GetMemoryRegionInfo (1060 of 1807)
PASS: lldb-api :: lang/cpp/breakpoint-commands/TestCPPBreakpointCommands.py (1061 of 1807)
PASS: lldb-api :: commands/expression/dollar-in-variable/TestDollarInVariable.py (1062 of 1807)
PASS: lldb-api :: lang/cpp/bool/TestCPPBool.py (1063 of 1807)
PASS: lldb-unit :: ScriptInterpreter/Python/./ScriptInterpreterPythonTests/PythonDataObjectsTest.TestDictionaryResolutionWithDot (1064 of 1807)
PASS: lldb-unit :: Utility/./UtilityTests/StreamTeeTest.Write (1065 of 1807)
PASS: lldb-unit :: debugserver/./debugserverTests/RNBSocket.AnyListen (1066 of 1807)
PASS: lldb-unit :: UnwindAssembly/x86/./UnwindAssemblyx86Tests/Testx86AssemblyInspectionEngine.TestPopEBX (1067 of 1807)
PASS: lldb-unit :: Utility/./UtilityTests/StatusTest.Formatv (1068 of 1807)
PASS: lldb-unit :: Host/./HostTests/SocketTest.TCPGetAddress (1069 of 1807)
PASS: lldb-api :: functionalities/data-formatter/data-formatter-stl/libcxx/tuple/TestDataFormatterLibcxxTuple.py (1070 of 1807)
PASS: lldb-api :: lang/objc/variadic_methods/TestVariadicMethods.py (1071 of 1807)
PASS: lldb-unit :: Host/./HostTests/NativeProcessProtocolTest.SetBreakpointFailWrite (1072 of 1807)
PASS: lldb-api :: functionalities/breakpoint/breakpoint_ids/TestBreakpointIDs.py (1073 of 1807)
PASS: lldb-unit :: Utility/./UtilityTests/EnvironmentTest.EnvpConversion (1074 of 1807)
PASS: lldb-unit :: Utility/./UtilityTests/ArchSpecTest.Compatibility (1075 of 1807)
PASS: lldb-unit :: Utility/./UtilityTests/StringListTest.LongestCommonPrefixSingleElement (1076 of 1807)
PASS: lldb-api :: commands/expression/call-function/TestCallUserDefinedFunction.py (1077 of 1807)
PASS: lldb-unit :: ScriptInterpreter/Python/./ScriptInterpreterPythonTests/PythonDataObjectsTest.TestPythonCallableInvoke (1078 of 1807)
UNSUPPORTED: lldb-api :: commands/expression/multiline-completion/TestMultilineCompletion.py (1079 of 1807)
PASS: lldb-unit :: SymbolFile/DWARF/./SymbolFileDWARFTests/SymbolFileDWARFTests.TestAbbrevOutOfOrder (1080 of 1807)
PASS: lldb-api :: lang/cpp/char8_t/TestCxxChar8_t.py (1081 of 1807)
PASS: lldb-shell :: SymbolFile/DWARF/debug_ranges.s (1082 of 1807)
PASS: lldb-unit :: Utility/./UtilityTests/StringListTest.SplitIntoLinesSingleTrailingCR (1083 of 1807)
PASS: lldb-unit :: UnwindAssembly/x86/./UnwindAssemblyx86Tests/Testx86AssemblyInspectionEngine.TestStackRealign32BitDisp_x86_64 (1084 of 1807)
UNSUPPORTED: lldb-shell :: Breakpoint/ppc64-localentry.test (1085 of 1807)
PASS: lldb-unit :: Utility/./UtilityTests/StreamTest.PutRawBytesToLittleEndian (1086 of 1807)
PASS: lldb-unit :: Utility/./UtilityTests/VMRange.ContainsRange (1087 of 1807)
UNSUPPORTED: lldb-api :: functionalities/tsan/thread_numbers/TestTsanThreadNumbers.py (1088 of 1807)
PASS: lldb-shell :: Process/TestEnvironment.test (1089 of 1807)
PASS: lldb-unit :: Symbol/./SymbolTests/TestClangASTContext.TestUnifyAccessSpecifiers (1090 of 1807)
PASS: lldb-api :: tools/lldb-vscode/stackTrace/TestVSCode_stackTrace.py (1091 of 1807)
PASS: lldb-unit :: Process/minidump/./LLDBMinidumpTests/MinidumpParserTest.GetMiscInfoWindows (1092 of 1807)
PASS: lldb-api :: python_api/file_handle/TestFileHandle.py (1093 of 1807)
UNSUPPORTED: lldb-shell :: SymbolFile/PDB/typedefs.test (1094 of 1807)
PASS: lldb-unit :: Host/./HostTests/Host.GetEnvironment (1095 of 1807)
PASS: lldb-unit :: Utility/./UtilityTests/UserIDResolver.GetGroupName (1096 of 1807)
PASS: lldb-unit :: Utility/./UtilityTests/ProcessInstanceInfoMatch.Name (1097 of 1807)
UNSUPPORTED: lldb-api :: functionalities/thread/break_after_join/TestBreakAfterJoin.py (1098 of 1807)
PASS: lldb-unit :: Language/Highlighting/./HighlighterTests/HighlighterTest.ClangUnterminatedString (1099 of 1807)
PASS: lldb-shell :: SymbolFile/Breakpad/line-table-missing-file.test (1100 of 1807)
PASS: lldb-api :: lang/c/stepping/TestThreadStepping.py (1101 of 1807)
PASS: lldb-api :: lang/cpp/llvm-style/TestLLVMStyle.py (1102 of 1807)
FAIL: lldb-api :: tools/lldb-server/TestGdbRemoteProcessInfo.py (1103 of 1807)
******************** TEST 'lldb-api :: tools/lldb-server/TestGdbRemoteProcessInfo.py' FAILED ********************
lldb version 10.0.99 (http://labmaster3.local/git/llvm-project.git revision 2916489c54a303971bc546f287b71532d49ddd33)
  clang revision c9276fbfdf0c7caf1576b2db562286d7cec7e53b
  llvm revision c9276fbfdf0c7caf1576b2db562286d7cec7e53b
LLDB library dir: /Users/buildslave/jenkins/workspace/lldb-cmake-sanitized/lldb-build/bin
LLDB import library dir: /Users/buildslave/jenkins/workspace/lldb-cmake-sanitized/lldb-build/bin
libstdcxx tests will not be run because: Don't know how to build with libstdcxx on macosx
Skipping following debug info categories: ['dwo']

Hide Details

Session logs for test failures/errors/unexpected successes will go into directory '/Users/buildslave/jenkins/workspace/lldb-cmake-sanitized/test/logs' Command invoked: /Users/buildslave/jenkins/workspace/lldb-cmake-sanitized/llvm-project/lldb/test/API/dotest.py --arch=x86_64 -s /Users/buildslave/jenkins/workspace/lldb-cmake-sanitized/lldb-build/lldb-test-traces -S nm -u CXXFLAGS -u CFLAGS --executable /Users/buildslave/jenkins/workspace/lldb-cmake-sanitized/lldb-build/./bin/lldb --compiler /Users/buildslave/jenkins/workspace/lldb-cmake-sanitized/lldb-build/./bin/clang --dsymutil /Users/buildslave/jenkins/workspace/lldb-cmake-sanitized/lldb-build/./bin/dsymutil --filecheck /Users/buildslave/jenkins/workspace/lldb-cmake-sanitized/lldb-build/./bin/FileCheck --codesign-identity lldb_codesign --server /Users/buildslave/jenkins/workspace/lldb-cmake-sanitized/lldb-build/./bin/debugserver --arch x86_64 --build-dir /Users/buildslave/jenkins/workspace/lldb-cmake-sanitized/lldb-build/lldb-test-build.noindex -s=/Users/buildslave/jenkins/workspace/lldb-cmake-sanitized/test/logs -t --env TERM=vt100 --env LLVM_LIBS_DIR=/Users/buildslave/jenkins/workspace/lldb-cmake-sanitized/lldb-build/./lib --build-dir /Users/buildslave/jenkins/workspace/lldb-cmake-sanitized/lldb-build/lldb-test-build.noindex --lldb-module-cache-dir /Users/buildslave/jenkins/workspace/lldb-cmake-sanitized/lldb-build/lldb-test-build.noindex/module-cache-lldb/lldb-api --clang-module-cache-dir /Users/buildslave/jenkins/workspace/lldb-cmake-sanitized/lldb-build/lldb-test-build.noindex/module-cache-clang/lldb-api /Users/buildslave/jenkins/workspace/lldb-cmake-sanitized/llvm-project/lldb/packages/Python/lldbsuite/test/tools/lldb-server -p TestGdbRemoteProcessInfo.py Change dir to: /Users/buildslave/jenkins/workspace/lldb-cmake-sanitized/llvm-project/lldb/packages/Python/lldbsuite/test/tools/lldb-server runCmd: settings set symbols.enable-external-lookup false output:

Hide Details

runCmd: settings set plugin.process.gdb-remote.packet-timeout 60 output:

Hide Details

runCmd: settings set symbols.clang-modules-cache-path "/Users/buildslave/jenkins/workspace/lldb-cmake-sanitized/lldb-build/lldb-test-build.noindex/module-cache-lldb/lldb-api" output:

Hide Details

runCmd: settings set use-color false output:

Hide Details

Adding tearDown hook: def shutdown_named_pipe(): # Close the pipe. try: named_pipe.close() except: print("failed to close named pipe") None

Hide Details

# Delete the pipe. try: os.remove(named_pipe_path) except: print("failed to delete named pipe: {}".format(named_pipe_path)) None

Hide Details

# Delete the temp directory. try: os.rmdir(temp_dir) except: print( "failed to delete temp dir: {}, directory contents: '{}'".format( temp_dir, os.listdir(temp_dir))) None

Hide Details

Hide Details

Adding tearDown hook: def shutdown_process_for_attach(): try: inferior.terminate() except: logger.warning( "failed to terminate inferior process for attach: {}; ignoring".format( sys.exc_info()[0]))

Hide Details

Hide Details

Adding tearDown hook: def cleanupSubprocesses(self): # Ensure any subprocesses are cleaned up for p in self.subprocesses: p.terminate() del p del self.subprocesses[:] # Ensure any forked processes are cleaned up for pid in self.forkedProcessPids: if os.path.exists("/proc/" + str(pid)): os.kill(pid, signal.SIGTERM)

Hide Details

Hide Details

FAIL: LLDB (/Users/buildslave/jenkins/workspace/lldb-cmake-sanitized/lldb-build/bin/clang-10-x86_64) :: test_attach_commandline_qProcessInfo_reports_correct_pid_debugserver (TestGdbRemoteProcessInfo.TestGdbRemoteProcessInfo) Executing tearDown hook: def cleanupSubprocesses(self): # Ensure any subprocesses are cleaned up for p in self.subprocesses: p.terminate() del p del self.subprocesses[:] # Ensure any forked processes are cleaned up for pid in self.forkedProcessPids: if os.path.exists("/proc/" + str(pid)): os.kill(pid, signal.SIGTERM)

Hide Details

Hide Details

Executing tearDown hook: def shutdown_process_for_attach(): try: inferior.terminate() except: logger.warning( "failed to terminate inferior process for attach: {}; ignoring".format( sys.exc_info()[0]))

Hide Details

Hide Details

Executing tearDown hook: def shutdown_named_pipe(): # Close the pipe. try: named_pipe.close() except: print("failed to close named pipe") None

Hide Details

# Delete the pipe. try: os.remove(named_pipe_path) except: print("failed to delete named pipe: {}".format(named_pipe_path)) None

Hide Details

# Delete the temp directory. try: os.rmdir(temp_dir) except: print( "failed to delete temp dir: {}, directory contents: '{}'".format( temp_dir, os.listdir(temp_dir))) None

Hide Details

Hide Details

runCmd: settings set symbols.enable-external-lookup false output:

Hide Details

runCmd: settings set plugin.process.gdb-remote.packet-timeout 60 output:

Hide Details

runCmd: settings set symbols.clang-modules-cache-path "/Users/buildslave/jenkins/workspace/lldb-cmake-sanitized/lldb-build/lldb-test-build.noindex/module-cache-lldb/lldb-api" output:

Hide Details

runCmd: settings set use-color false output:

Hide Details

UNSUPPORTED: LLDB (/Users/buildslave/jenkins/workspace/lldb-cmake-sanitized/lldb-build/bin/clang-10-x86_64) :: test_attach_commandline_qProcessInfo_reports_correct_pid_llgs (TestGdbRemoteProcessInfo.TestGdbRemoteProcessInfo) (llgs tests) runCmd: settings set symbols.enable-external-lookup false output:

Hide Details

runCmd: settings set plugin.process.gdb-remote.packet-timeout 60 output:

Hide Details

runCmd: settings set symbols.clang-modules-cache-path "/Users/buildslave/jenkins/workspace/lldb-cmake-sanitized/lldb-build/lldb-test-build.noindex/module-cache-lldb/lldb-api" output:

Hide Details

runCmd: settings set use-color false output:

Hide Details

Adding tearDown hook: def shutdown_named_pipe(): # Close the pipe. try: named_pipe.close() except: print("failed to close named pipe") None

Hide Details

# Delete the pipe. try: os.remove(named_pipe_path) except: print("failed to delete named pipe: {}".format(named_pipe_path)) None

Hide Details

# Delete the temp directory. try: os.rmdir(temp_dir) except: print( "failed to delete temp dir: {}, directory contents: '{}'".format( temp_dir, os.listdir(temp_dir))) None

Hide Details

Hide Details

Adding tearDown hook: def cleanupSubprocesses(self): # Ensure any subprocesses are cleaned up for p in self.subprocesses: p.terminate() del p del self.subprocesses[:] # Ensure any forked processes are cleaned up for pid in self.forkedProcessPids: if os.path.exists("/proc/" + str(pid)): os.kill(pid, signal.SIGTERM)

Hide Details

Hide Details

Adding tearDown hook: def shutdown_debug_monitor(): try: server.terminate() except: logger.warning( "failed to terminate server for debug monitor: {}; ignoring".format( sys.exc_info()[0]))

Hide Details

Hide Details

Adding tearDown hook: def shutdown_socket(): if sock: try: # send the kill packet so lldb-server shuts down gracefully sock.sendall(GdbRemoteTestCaseBase._GDBREMOTE_KILL_PACKET) except: logger.warning( "failed to send kill packet to debug monitor: {}; ignoring".format( sys.exc_info()[0]))

Hide Details

try: sock.close() except: logger.warning( "failed to close socket to debug monitor: {}; ignoring".format( sys.exc_info()[0]))

Hide Details

Hide Details

Executing tearDown hook: def shutdown_socket(): if sock: try: # send the kill packet so lldb-server shuts down gracefully sock.sendall(GdbRemoteTestCaseBase._GDBREMOTE_KILL_PACKET) except: logger.warning( "failed to send kill packet to debug monitor: {}; ignoring".format( sys.exc_info()[0]))

Hide Details

try: sock.close() except: logger.warning( "failed to close socket to debug monitor: {}; ignoring".format( sys.exc_info()[0]))

Hide Details

Hide Details

2019-11-17 01:43:35,362 WARNING failed to send kill packet to debug monitor: <class 'TypeError'>; ignoring Executing tearDown hook: def shutdown_debug_monitor(): try: server.terminate() except: logger.warning( "failed to terminate server for debug monitor: {}; ignoring".format( sys.exc_info()[0]))

Hide Details

Hide Details

Executing tearDown hook: def cleanupSubprocesses(self): # Ensure any subprocesses are cleaned up for p in self.subprocesses: p.terminate() del p del self.subprocesses[:] # Ensure any forked processes are cleaned up for pid in self.forkedProcessPids: if os.path.exists("/proc/" + str(pid)): os.kill(pid, signal.SIGTERM)

Hide Details

Hide Details

Executing tearDown hook: def shutdown_named_pipe(): # Close the pipe. try: named_pipe.close() except: print("failed to close named pipe") None

Hide Details

# Delete the pipe. try: os.remove(named_pipe_path) except: print("failed to delete named pipe: {}".format(named_pipe_path)) None

Hide Details

# Delete the temp directory. try: os.rmdir(temp_dir) except: print( "failed to delete temp dir: {}, directory contents: '{}'".format( temp_dir, os.listdir(temp_dir))) None

Hide Details

Hide Details

PASS: LLDB (/Users/buildslave/jenkins/workspace/lldb-cmake-sanitized/lldb-build/bin/clang-10-x86_64) :: test_qProcessInfo_contains_cputype_cpusubtype_debugserver_darwin (TestGdbRemoteProcessInfo.TestGdbRemoteProcessInfo) runCmd: settings set symbols.enable-external-lookup false output:

Hide Details

runCmd: settings set plugin.process.gdb-remote.packet-timeout 60 output:

Hide Details

runCmd: settings set symbols.clang-modules-cache-path "/Users/buildslave/jenkins/workspace/lldb-cmake-sanitized/lldb-build/lldb-test-build.noindex/module-cache-lldb/lldb-api" output:

Hide Details

runCmd: settings set use-color false output:

Hide Details

UNSUPPORTED: LLDB (/Users/buildslave/jenkins/workspace/lldb-cmake-sanitized/lldb-build/bin/clang-10-x86_64) :: test_qProcessInfo_contains_cputype_cpusubtype_llgs_darwin (TestGdbRemoteProcessInfo.TestGdbRemoteProcessInfo) (llgs tests) runCmd: settings set symbols.enable-external-lookup false output:

Hide Details

runCmd: settings set plugin.process.gdb-remote.packet-timeout 60 output:

Hide Details

runCmd: settings set symbols.clang-modules-cache-path "/Users/buildslave/jenkins/workspace/lldb-cmake-sanitized/lldb-build/lldb-test-build.noindex/module-cache-lldb/lldb-api" output:

Hide Details

runCmd: settings set use-color false output:

Hide Details

UNSUPPORTED: LLDB (/Users/buildslave/jenkins/workspace/lldb-cmake-sanitized/lldb-build/bin/clang-10-x86_64) :: test_qProcessInfo_contains_triple_ppid_llgs (TestGdbRemoteProcessInfo.TestGdbRemoteProcessInfo) (llgs tests) UNSUPPORTED: LLDB (/Users/buildslave/jenkins/workspace/lldb-cmake-sanitized/lldb-build/bin/clang-10-x86_64) :: test_qProcessInfo_does_not_contain_cputype_cpusubtype_llgs (TestGdbRemoteProcessInfo.TestGdbRemoteProcessInfo) (skip on macosx, darwin, ios, tvos, watchos, bridgeos) runCmd: settings set symbols.enable-external-lookup false output:

Hide Details

runCmd: settings set plugin.process.gdb-remote.packet-timeout 60 output:

Hide Details

runCmd: settings set symbols.clang-modules-cache-path "/Users/buildslave/jenkins/workspace/lldb-cmake-sanitized/lldb-build/lldb-test-build.noindex/module-cache-lldb/lldb-api" output:

Hide Details

runCmd: settings set use-color false output:

Hide Details

Adding tearDown hook: def shutdown_named_pipe(): # Close the pipe. try: named_pipe.close() except: print("failed to close named pipe") None

Hide Details

# Delete the pipe. try: os.remove(named_pipe_path) except: print("failed to delete named pipe: {}".format(named_pipe_path)) None

Hide Details

# Delete the temp directory. try: os.rmdir(temp_dir) except: print( "failed to delete temp dir: {}, directory contents: '{}'".format( temp_dir, os.listdir(temp_dir))) None

Hide Details

Hide Details

Adding tearDown hook: def cleanupSubprocesses(self): # Ensure any subprocesses are cleaned up for p in self.subprocesses: p.terminate() del p del self.subprocesses[:] # Ensure any forked processes are cleaned up for pid in self.forkedProcessPids: if os.path.exists("/proc/" + str(pid)): os.kill(pid, signal.SIGTERM)

Hide Details

Hide Details

Adding tearDown hook: def shutdown_debug_monitor(): try: server.terminate() except: logger.warning( "failed to terminate server for debug monitor: {}; ignoring".format( sys.exc_info()[0]))

Hide Details

Hide Details

Adding tearDown hook: def shutdown_socket(): if sock: try: # send the kill packet so lldb-server shuts down gracefully sock.sendall(GdbRemoteTestCaseBase._GDBREMOTE_KILL_PACKET) except: logger.warning( "failed to send kill packet to debug monitor: {}; ignoring".format( sys.exc_info()[0]))

Hide Details

try: sock.close() except: logger.warning( "failed to close socket to debug monitor: {}; ignoring".format( sys.exc_info()[0]))

Hide Details

Hide Details

Executing tearDown hook: def shutdown_socket(): if sock: try: # send the kill packet so lldb-server shuts down gracefully sock.sendall(GdbRemoteTestCaseBase._GDBREMOTE_KILL_PACKET) except: logger.warning( "failed to send kill packet to debug monitor: {}; ignoring".format( sys.exc_info()[0]))

Hide Details

try: sock.close() except: logger.warning( "failed to close socket to debug monitor: {}; ignoring".format( sys.exc_info()[0]))

Hide Details

Hide Details

2019-11-17 01:44:03,013 WARNING failed to send kill packet to debug monitor: <class 'TypeError'>; ignoring Executing tearDown hook: def shutdown_debug_monitor(): try: server.terminate() except: logger.warning( "failed to terminate server for debug monitor: {}; ignoring".format( sys.exc_info()[0]))

Hide Details

Hide Details

Executing tearDown hook: def cleanupSubprocesses(self): # Ensure any subprocesses are cleaned up for p in self.subprocesses: p.terminate() del p del self.subprocesses[:] # Ensure any forked processes are cleaned up for pid in self.forkedProcessPids: if os.path.exists("/proc/" + str(pid)): os.kill(pid, signal.SIGTERM)

Hide Details

Hide Details

Executing tearDown hook: def shutdown_named_pipe(): # Close the pipe. try: named_pipe.close() except: print("failed to close named pipe") None

Hide Details

# Delete the pipe. try: os.remove(named_pipe_path) except: print("failed to delete named pipe: {}".format(named_pipe_path)) None

Hide Details

# Delete the temp directory. try: os.rmdir(temp_dir) except: print( "failed to delete temp dir: {}, directory contents: '{}'".format( temp_dir, os.listdir(temp_dir))) None

Hide Details

Hide Details

PASS: LLDB (/Users/buildslave/jenkins/workspace/lldb-cmake-sanitized/lldb-build/bin/clang-10-x86_64) :: test_qProcessInfo_does_not_contain_triple_debugserver_darwin (TestGdbRemoteProcessInfo.TestGdbRemoteProcessInfo) runCmd: settings set symbols.enable-external-lookup false output:

Hide Details

runCmd: settings set plugin.process.gdb-remote.packet-timeout 60 output:

Hide Details

runCmd: settings set symbols.clang-modules-cache-path "/Users/buildslave/jenkins/workspace/lldb-cmake-sanitized/lldb-build/lldb-test-build.noindex/module-cache-lldb/lldb-api" output:

Hide Details

runCmd: settings set use-color false output:

Hide Details

UNSUPPORTED: LLDB (/Users/buildslave/jenkins/workspace/lldb-cmake-sanitized/lldb-build/bin/clang-10-x86_64) :: test_qProcessInfo_does_not_contain_triple_llgs_darwin (TestGdbRemoteProcessInfo.TestGdbRemoteProcessInfo) (llgs tests) runCmd: settings set symbols.enable-external-lookup false output:

Hide Details

runCmd: settings set plugin.process.gdb-remote.packet-timeout 60 output:

Hide Details

runCmd: settings set symbols.clang-modules-cache-path "/Users/buildslave/jenkins/workspace/lldb-cmake-sanitized/lldb-build/lldb-test-build.noindex/module-cache-lldb/lldb-api" output:

Hide Details

runCmd: settings set use-color false output:

Hide Details

Adding tearDown hook: def shutdown_named_pipe(): # Close the pipe. try: named_pipe.close() except: print("failed to close named pipe") None

Hide Details

# Delete the pipe. try: os.remove(named_pipe_path) except: print("failed to delete named pipe: {}".format(named_pipe_path)) None

Hide Details

# Delete the temp directory. try: os.rmdir(temp_dir) except: print( "failed to delete temp dir: {}, directory contents: '{}'".format( temp_dir, os.listdir(temp_dir))) None

Hide Details

Hide Details

Adding tearDown hook: def cleanupSubprocesses(self): # Ensure any subprocesses are cleaned up for p in self.subprocesses: p.terminate() del p del self.subprocesses[:] # Ensure any forked processes are cleaned up for pid in self.forkedProcessPids: if os.path.exists("/proc/" + str(pid)): os.kill(pid, signal.SIGTERM)

Hide Details

Hide Details

Adding tearDown hook: def shutdown_debug_monitor(): try: server.terminate() except: logger.warning( "failed to terminate server for debug monitor: {}; ignoring".format( sys.exc_info()[0]))

Hide Details

Hide Details

Adding tearDown hook: def shutdown_socket(): if sock: try: # send the kill packet so lldb-server shuts down gracefully sock.sendall(GdbRemoteTestCaseBase._GDBREMOTE_KILL_PACKET) except: logger.warning( "failed to send kill packet to debug monitor: {}; ignoring".format( sys.exc_info()[0]))

Hide Details

try: sock.close() except: logger.warning( "failed to close socket to debug monitor: {}; ignoring".format( sys.exc_info()[0]))

Hide Details

Hide Details

Executing tearDown hook: def shutdown_socket(): if sock: try: # send the kill packet so lldb-server shuts down gracefully sock.sendall(GdbRemoteTestCaseBase._GDBREMOTE_KILL_PACKET) except: logger.warning( "failed to send kill packet to debug monitor: {}; ignoring".format( sys.exc_info()[0]))

Hide Details

try: sock.close() except: logger.warning( "failed to close socket to debug monitor: {}; ignoring".format( sys.exc_info()[0]))

Hide Details

Hide Details

2019-11-17 01:44:29,416 WARNING failed to send kill packet to debug monitor: <class 'TypeError'>; ignoring Executing tearDown hook: def shutdown_debug_monitor(): try: server.terminate() except: logger.warning( "failed to terminate server for debug monitor: {}; ignoring".format( sys.exc_info()[0]))

Hide Details

Hide Details

Executing tearDown hook: def cleanupSubprocesses(self): # Ensure any subprocesses are cleaned up for p in self.subprocesses: p.terminate() del p del self.subprocesses[:] # Ensure any forked processes are cleaned up for pid in self.forkedProcessPids: if os.path.exists("/proc/" + str(pid)): os.kill(pid, signal.SIGTERM)

Hide Details

Hide Details

Executing tearDown hook: def shutdown_named_pipe(): # Close the pipe. try: named_pipe.close() except: print("failed to close named pipe") None

Hide Details

# Delete the pipe. try: os.remove(named_pipe_path) except: print("failed to delete named pipe: {}".format(named_pipe_path)) None

Hide Details

# Delete the temp directory. try: os.rmdir(temp_dir) except: print( "failed to delete temp dir: {}, directory contents: '{}'".format( temp_dir, os.listdir(temp_dir))) None

Hide Details

Hide Details

PASS: LLDB (/Users/buildslave/jenkins/workspace/lldb-cmake-sanitized/lldb-build/bin/clang-10-x86_64) :: test_qProcessInfo_reports_valid_endian_debugserver (TestGdbRemoteProcessInfo.TestGdbRemoteProcessInfo) runCmd: settings set symbols.enable-external-lookup false output:

Hide Details

runCmd: settings set plugin.process.gdb-remote.packet-timeout 60 output:

Hide Details

runCmd: settings set symbols.clang-modules-cache-path "/Users/buildslave/jenkins/workspace/lldb-cmake-sanitized/lldb-build/lldb-test-build.noindex/module-cache-lldb/lldb-api" output:

Hide Details

runCmd: settings set use-color false output:

Hide Details

UNSUPPORTED: LLDB (/Users/buildslave/jenkins/workspace/lldb-cmake-sanitized/lldb-build/bin/clang-10-x86_64) :: test_qProcessInfo_reports_valid_endian_llgs (TestGdbRemoteProcessInfo.TestGdbRemoteProcessInfo) (llgs tests) runCmd: settings set symbols.enable-external-lookup false output:

Hide Details

runCmd: settings set plugin.process.gdb-remote.packet-timeout 60 output:

Hide Details

runCmd: settings set symbols.clang-modules-cache-path "/Users/buildslave/jenkins/workspace/lldb-cmake-sanitized/lldb-build/lldb-test-build.noindex/module-cache-lldb/lldb-api" output:

Hide Details

runCmd: settings set use-color false output:

Hide Details

Adding tearDown hook: def shutdown_named_pipe(): # Close the pipe. try: named_pipe.close() except: print("failed to close named pipe") None

Hide Details

# Delete the pipe. try: os.remove(named_pipe_path) except: print("failed to delete named pipe: {}".format(named_pipe_path)) None

Hide Details

# Delete the temp directory. try: os.rmdir(temp_dir) except: print( "failed to delete temp dir: {}, directory contents: '{}'".format( temp_dir, os.listdir(temp_dir))) None

Hide Details

Hide Details

Adding tearDown hook: def cleanupSubprocesses(self): # Ensure any subprocesses are cleaned up for p in self.subprocesses: p.terminate() del p del self.subprocesses[:] # Ensure any forked processes are cleaned up for pid in self.forkedProcessPids: if os.path.exists("/proc/" + str(pid)): os.kill(pid, signal.SIGTERM)

Hide Details

Hide Details

Adding tearDown hook: def shutdown_debug_monitor(): try: server.terminate() except: logger.warning( "failed to terminate server for debug monitor: {}; ignoring".format( sys.exc_info()[0]))

Hide Details

Hide Details

Adding tearDown hook: def shutdown_socket(): if sock: try: # send the kill packet so lldb-server shuts down gracefully sock.sendall(GdbRemoteTestCaseBase._GDBREMOTE_KILL_PACKET) except: logger.warning( "failed to send kill packet to debug monitor: {}; ignoring".format( sys.exc_info()[0]))

Hide Details

try: sock.close() except: logger.warning( "failed to close socket to debug monitor: {}; ignoring".format( sys.exc_info()[0]))

Hide Details

Hide Details

Executing tearDown hook: def shutdown_socket(): if sock: try: # send the kill packet so lldb-server shuts down gracefully sock.sendall(GdbRemoteTestCaseBase._GDBREMOTE_KILL_PACKET) except: logger.warning( "failed to send kill packet to debug monitor: {}; ignoring".format( sys.exc_info()[0]))

Hide Details

try: sock.close() except: logger.warning( "failed to close socket to debug monitor: {}; ignoring".format( sys.exc_info()[0]))

Hide Details

Hide Details

2019-11-17 01:44:58,992 WARNING failed to send kill packet to debug monitor: <class 'TypeError'>; ignoring Executing tearDown hook: def shutdown_debug_monitor(): try: server.terminate() except: logger.warning( "failed to terminate server for debug monitor: {}; ignoring".format( sys.exc_info()[0]))

Hide Details

Hide Details

Executing tearDown hook: def cleanupSubprocesses(self): # Ensure any subprocesses are cleaned up for p in self.subprocesses: p.terminate() del p del self.subprocesses[:] # Ensure any forked processes are cleaned up for pid in self.forkedProcessPids: if os.path.exists("/proc/" + str(pid)): os.kill(pid, signal.SIGTERM)

Hide Details

Hide Details

Executing tearDown hook: def shutdown_named_pipe(): # Close the pipe. try: named_pipe.close() except: print("failed to close named pipe") None

Hide Details

# Delete the pipe. try: os.remove(named_pipe_path) except: print("failed to delete named pipe: {}".format(named_pipe_path)) None

Hide Details

# Delete the temp directory. try: os.rmdir(temp_dir) except: print( "failed to delete temp dir: {}, directory contents: '{}'".format( temp_dir, os.listdir(temp_dir))) None

Hide Details

Hide Details

PASS: LLDB (/Users/buildslave/jenkins/workspace/lldb-cmake-sanitized/lldb-build/bin/clang-10-x86_64) :: test_qProcessInfo_returns_running_process_debugserver (TestGdbRemoteProcessInfo.TestGdbRemoteProcessInfo) runCmd: settings set symbols.enable-external-lookup false output:

Hide Details

runCmd: settings set plugin.process.gdb-remote.packet-timeout 60 output:

Hide Details

runCmd: settings set symbols.clang-modules-cache-path "/Users/buildslave/jenkins/workspace/lldb-cmake-sanitized/lldb-build/lldb-test-build.noindex/module-cache-lldb/lldb-api" output:

Hide Details

runCmd: settings set use-color false output:

Hide Details

UNSUPPORTED: LLDB (/Users/buildslave/jenkins/workspace/lldb-cmake-sanitized/lldb-build/bin/clang-10-x86_64) :: test_qProcessInfo_returns_running_process_llgs (TestGdbRemoteProcessInfo.TestGdbRemoteProcessInfo) (llgs tests) Restore dir to: /Users/buildslave/jenkins/workspace/lldb-cmake-sanitized/lldb-build/tools/lldb/test ====================================================================== FAIL: test_attach_commandline_qProcessInfo_reports_correct_pid_debugserver (TestGdbRemoteProcessInfo.TestGdbRemoteProcessInfo) ---------------------------------------------------------------------- Traceback (most recent call last): File "/Users/buildslave/jenkins/workspace/lldb-cmake-sanitized/llvm-project/lldb/packages/Python/lldbsuite/test/decorators.py", line 141, in wrapper func(*args, **kwargs) File "/Users/buildslave/jenkins/workspace/lldb-cmake-sanitized/llvm-project/lldb/packages/Python/lldbsuite/test/tools/lldb-server/TestGdbRemoteProcessInfo.py", line 76, in test_attach_commandline_qProcessInfo_reports_correct_pid_debugserver self.attach_commandline_qProcessInfo_reports_correct_pid() File "/Users/buildslave/jenkins/workspace/lldb-cmake-sanitized/llvm-project/lldb/packages/Python/lldbsuite/test/tools/lldb-server/TestGdbRemoteProcessInfo.py", line 51, in attach_commandline_qProcessInfo_reports_correct_pid procs = self.prep_debug_monitor_and_inferior() File "/Users/buildslave/jenkins/workspace/lldb-cmake-sanitized/llvm-project/lldb/packages/Python/lldbsuite/test/tools/lldb-server/gdbremote_testcase.py", line 584, in prep_debug_monitor_and_inferior server = self.connect_to_debug_monitor(attach_pid=attach_pid) File "/Users/buildslave/jenkins/workspace/lldb-cmake-sanitized/llvm-project/lldb/packages/Python/lldbsuite/test/tools/lldb-server/gdbremote_testcase.py", line 418, in connect_to_debug_monitor server = self.launch_debug_monitor(attach_pid=attach_pid) File "/Users/buildslave/jenkins/workspace/lldb-cmake-sanitized/llvm-project/lldb/packages/Python/lldbsuite/test/tools/lldb-server/gdbremote_testcase.py", line 411, in launch_debug_monitor self.port = self.get_stub_port_from_named_socket(self._READ_TIMEOUT) File "/Users/buildslave/jenkins/workspace/lldb-cmake-sanitized/llvm-project/lldb/packages/Python/lldbsuite/test/tools/lldb-server/gdbremote_testcase.py", line 217, in get_stub_port_from_named_socket "write side of pipe has not written anything - stub isn't writing to pipe.") AssertionError: 0 == 0 : write side of pipe has not written anything - stub isn't writing to pipe. Config=x86_64-/Users/buildslave/jenkins/workspace/lldb-cmake-sanitized/lldb-build/bin/clang-10 ---------------------------------------------------------------------- Ran 12 tests in 186.541s

Hide Details

RESULT: FAILED (4 passes, 1 failures, 0 errors, 7 skipped, 0 expected failures, 0 unexpected successes)

Hide Details

******************** PASS: lldb-api :: python_api/function_symbol/TestDisasmAPI.py (1104 of 1807) PASS: lldb-unit :: Expression/./ExpressionTests/DiagnosticManagerTest.GetStringPreserveOrder (1105 of 1807) PASS: lldb-unit :: Utility/./UtilityTests/BinaryStreamTest.PutULEB128FiveBytes (1106 of 1807) PASS: lldb-api :: functionalities/memory/find/TestMemoryFind.py (1107 of 1807) PASS: lldb-api :: functionalities/postmortem/elf-core/TestLinuxCore.py (1108 of 1807) PASS: lldb-unit :: Host/./HostTests/File.GetStreamFromDescriptor (1109 of 1807) UNSUPPORTED: lldb-shell :: SymbolFile/NativePDB/typedefs.cpp (1110 of 1807) PASS: lldb-api :: commands/expression/call-throws/TestCallThatThrows.py (1111 of 1807) PASS: lldb-api :: lang/objc/objc-dyn-sbtype/TestObjCDynamicSBType.py (1112 of 1807) PASS: lldb-unit :: Utility/./UtilityTests/StreamTest.PutBytesAsRawHex8ToLittleEndian (1113 of 1807) PASS: lldb-unit :: Utility/./UtilityTests/StreamTest.ShiftOperatorInts (1114 of 1807) PASS: lldb-shell :: Commands/CommandScriptImmediateOutput/CommandScriptImmediateOutputFile.test (1115 of 1807) PASS: lldb-unit :: Process/gdb-remote/./ProcessGdbRemoteTests/GDBRemoteClientBaseTest.InterruptNoResponse (1116 of 1807) PASS: lldb-unit :: Utility/./UtilityTests/ConstStringTest.CompareConstString (1117 of 1807) PASS: lldb-shell :: ObjectFile/ELF/compressed-sections.yaml (1118 of 1807) PASS: lldb-api :: lang/objc/objc-ivar-protocols/TestIvarProtocols.py (1119 of 1807) PASS: lldb-unit :: Utility/./UtilityTests/StreamTeeTest.SetStreamAtIndexOutOfBounds (1120 of 1807) PASS: lldb-unit :: UnwindAssembly/x86/./UnwindAssemblyx86Tests/Testx86AssemblyInspectionEngine.TestPopESI (1121 of 1807) PASS: lldb-unit :: Utility/./UtilityTests/BinaryStreamTest.PutULEB128SixBytes (1122 of 1807) PASS: lldb-api :: macosx/lc-note/kern-ver-str/TestKernVerStrLCNOTE.py (1123 of 1807) PASS: lldb-api :: functionalities/thread/concurrent_events/TestConcurrentTwoBreakpointsOneWatchpoint.py (1124 of 1807) PASS: lldb-unit :: Utility/./UtilityTests/OptionsWithRawTest.TerminatedQuote (1125 of 1807) PASS: lldb-api :: functionalities/data-formatter/synthcapping/TestSyntheticCapping.py (1126 of 1807) PASS: lldb-api :: tools/lldb-vscode/variables/TestVSCode_variables.py (1127 of 1807) PASS: lldb-unit :: Utility/./UtilityTests/ArgsTest.GetQuotedCommandString (1128 of 1807) PASS: lldb-unit :: Utility/./UtilityTests/OptionsWithRawTest.WhitespaceInput (1129 of 1807) PASS: lldb-unit :: Utility/./UtilityTests/BinaryStreamTest.PutSLEB128MaxValue (1130 of 1807) PASS: lldb-api :: lang/cpp/virtual-overload/TestVirtualOverload.py (1131 of 1807) PASS: lldb-api :: commands/frame/diagnose/bad-reference/TestBadReference.py (1132 of 1807) PASS: lldb-unit :: Utility/./UtilityTests/AnsiTerminal.Basic (1133 of 1807) UNSUPPORTED: lldb-api :: benchmarks/expression/TestExpressionCmd.py (1134 of 1807) PASS: lldb-api :: functionalities/breakpoint/breakpoint_conditions/TestBreakpointConditions.py (1135 of 1807) PASS: lldb-unit :: Utility/./UtilityTests/RangeTest.SizeTypes (1136 of 1807) PASS: lldb-api :: commands/expression/import-std-module/forward_list-basic/TestBasicForwardList.py (1137 of 1807) PASS: lldb-unit :: Process/gdb-remote/./ProcessGdbRemoteTests/GDBRemoteCommunicationClientTest.SendGetDataPacket (1138 of 1807) PASS: lldb-unit :: Utility/./UtilityTests/Flags.AllClear (1139 of 1807) PASS: lldb-unit :: Target/./TargetTests/ModuleCacheTest.GetAndPutUuidExists (1140 of 1807) PASS: lldb-unit :: Process/gdb-remote/./ProcessGdbRemoteTests/GDBRemoteCommunicationClientTest.WriteRegisterNoSuffix (1141 of 1807) PASS: lldb-unit :: Utility/./UtilityTests/ArgsTest.TestQuotedTrailingBackslash (1142 of 1807) PASS: lldb-unit :: UnwindAssembly/x86/./UnwindAssemblyx86Tests/Testx86AssemblyInspectionEngine.TestSubRSP (1143 of 1807) PASS: lldb-unit :: Core/./LLDBCoreTests/StreamCallbackTest.Callback (1144 of 1807) PASS: lldb-unit :: Core/./LLDBCoreTests/MangledTest.ResultForValidName (1145 of 1807) PASS: lldb-api :: functionalities/target_var/TestTargetVar.py (1146 of 1807) PASS: lldb-unit :: Utility/./UtilityTests/StringListTest.SplitIntoLines (1147 of 1807) PASS: lldb-api :: functionalities/abbreviation/TestAbbreviations.py (1148 of 1807) UNSUPPORTED: lldb-api :: commands/gui/basic/TestGuiBasic.py (1149 of 1807) UNSUPPORTED: lldb-api :: python_api/disassemble-raw-data/TestDisassemble_VST1_64.py (1150 of 1807) TIMEOUT: lldb-api :: types/TestIntegerTypesExpr.py (1151 of 1807) ******************** TEST 'lldb-api :: types/TestIntegerTypesExpr.py' FAILED ******************** Reached timeout of 1200 seconds ******************** PASS: lldb-shell :: SymbolFile/Breakpad/line-table-discontinuous-file-ids.test (1152 of 1807) PASS: lldb-api :: functionalities/data-formatter/nsdictionarysynth/TestNSDictionarySynthetic.py (1153 of 1807) PASS: lldb-api :: tools/lldb-vscode/breakpoint/TestVSCode_setFunctionBreakpoints.py (1154 of 1807) PASS: lldb-unit :: Host/./HostTests/ConnectionFileDescriptorTest.TCPGetURIv4 (1155 of 1807) PASS: lldb-unit :: Utility/./UtilityTests/ArgsTest.TestQuotedUnknownEscape (1156 of 1807) PASS: lldb-unit :: Utility/./UtilityTests/CompletionRequest.TestCompletionOwnership (1157 of 1807) PASS: lldb-unit :: Utility/./UtilityTests/NameMatchesTest.StartsWith (1158 of 1807) PASS: lldb-api :: functionalities/data-formatter/data-formatter-stl/libstdcpp/unique_ptr/invalid/TestDataFormatterInvalidStdUniquePtr.py (1159 of 1807) PASS: lldb-api :: functionalities/tail_call_frames/thread_step_out_message/TestArtificialFrameStepOutMessage.py (1160 of 1807) PASS: lldb-unit :: Process/minidump/./LLDBMinidumpTests/MinidumpParserTest.GetPid (1161 of 1807) PASS: lldb-unit :: UnwindAssembly/x86/./UnwindAssemblyx86Tests/Testx86AssemblyInspectionEngine.TestPopEBP (1162 of 1807) PASS: lldb-api :: commands/expression/diagnostics/TestExprDiagnostics.py (1163 of 1807) PASS: lldb-api :: macosx/find-dsym/bundle-with-dot-in-filename/TestBundleWithDotInFilename.py (1164 of 1807) PASS: lldb-api :: functionalities/data-formatter/data-formatter-stl/libcxx/list/loop/TestDataFormatterLibcxxListLoop.py (1165 of 1807) PASS: lldb-api :: functionalities/rerun/TestRerun.py (1166 of 1807) PASS: lldb-api :: functionalities/tail_call_frames/disambiguate_tail_call_seq/TestDisambiguateTailCallSeq.py (1167 of 1807) UNSUPPORTED: lldb-api :: functionalities/darwin_log/filter/regex/activity/TestDarwinLogFilterRegexActivity.py (1168 of 1807) PASS: lldb-api :: lang/cpp/breakpoint_in_member_func_w_non_primitive_params/TestBreakpointInMemberFuncWNonPrimitiveParams.py (1169 of 1807) PASS: lldb-unit :: Utility/./UtilityTests/StringExtractorTest.GetHexU8_Exact_NoEof (1170 of 1807) PASS: lldb-unit :: Utility/./UtilityTests/ProcessInstanceInfo.DumpTable (1171 of 1807) PASS: lldb-api :: functionalities/thread/concurrent_events/TestConcurrentDelaySignalBreak.py (1172 of 1807) PASS: lldb-api :: lang/objc/modules-inline-functions/TestModulesInlineFunctions.py (1173 of 1807) PASS: lldb-shell :: SymbolFile/Breakpad/symtab.test (1174 of 1807) PASS: lldb-api :: commands/expression/import-std-module/deque-basic/TestBasicDeque.py (1175 of 1807) PASS: lldb-shell :: Driver/TestRepl.test (1176 of 1807) PASS: lldb-api :: functionalities/data-formatter/data-formatter-objc/nsstring/TestDataFormatterNSString.py (1177 of 1807) PASS: lldb-unit :: Utility/./UtilityTests/OptionsWithRawTest.ArgsButNoDelimiter (1178 of 1807) PASS: lldb-unit :: ScriptInterpreter/Python/./ScriptInterpreterPythonTests/PythonDataObjectsTest.TestPythonListManipulation (1179 of 1807) PASS: lldb-unit :: debugserver/./debugserverTests/RNBSocket.LoopBackListenIPv4 (1180 of 1807) PASS: lldb-unit :: Process/gdb-remote/./ProcessGdbRemoteTests/GDBRemoteClientBaseTest.SendContinueAndAsyncPacket (1181 of 1807) PASS: lldb-api :: functionalities/testid/TestTestId.py (1182 of 1807) PASS: lldb-shell :: SymbolFile/DWARF/dir-separator-no-comp-dir.s (1183 of 1807) PASS: lldb-api :: python_api/watchpoint/TestWatchpointIter.py (1184 of 1807) PASS: lldb-unit :: Utility/./UtilityTests/StreamTeeTest.Constructor2Streams (1185 of 1807) PASS: lldb-unit :: ScriptInterpreter/Python/./ScriptInterpreterPythonTests/PythonDataObjectsTest.TestPythonTupleInitializerList2 (1186 of 1807) PASS: lldb-api :: lang/objc/objc-super/TestObjCSuper.py (1187 of 1807) PASS: lldb-api :: functionalities/data-formatter/data-formatter-script/TestDataFormatterScript.py (1188 of 1807) PASS: lldb-api :: functionalities/data-formatter/data-formatter-objc/TestDataFormatterObjCNSContainer.py (1189 of 1807) PASS: lldb-shell :: SymbolFile/DWARF/gnu-style-compression.cpp (1190 of 1807) PASS: lldb-unit :: Symbol/./SymbolTests/SymbolsTest.LocateExecutableSymbolFileForUnknownExecutableAndMissingSymbolFile (1191 of 1807) PASS: lldb-unit :: Process/gdb-remote/./ProcessGdbRemoteTests/GDBRemoteClientBaseTest.SendContinueDelegateStructuredDataReceipt (1192 of 1807) PASS: lldb-unit :: Utility/./UtilityTests/StringListTest.GetMaxStringLengthDecreasingSize (1193 of 1807) UNSUPPORTED: lldb-shell :: SymbolFile/PDB/enums-layout.test (1194 of 1807) PASS: lldb-unit :: Utility/./UtilityTests/OptionsWithRawTest.ArgsButNoLeadingDash (1195 of 1807) PASS: lldb-api :: functionalities/postmortem/wow64_minidump/TestWow64MiniDump.py (1196 of 1807) PASS: lldb-api :: functionalities/thread/thread_exit/TestThreadExit.py (1197 of 1807) PASS: lldb-shell :: Unwind/trap_frame_sym_ctx.test (1198 of 1807) PASS: lldb-api :: functionalities/dynamic_value_child_count/TestDynamicValueChildCount.py (1199 of 1807) PASS: lldb-unit :: Symbol/./SymbolTests/PostfixExpression.ParseFPOProgram (1200 of 1807) UNSUPPORTED: lldb-shell :: SymbolFile/dissassemble-entry-point.s (1201 of 1807) PASS: lldb-unit :: UnwindAssembly/x86/./UnwindAssemblyx86Tests/Testx86AssemblyInspectionEngine.TestPushRBX (1202 of 1807) PASS: lldb-api :: commands/log/basic/TestLogging.py (1203 of 1807) PASS: lldb-api :: functionalities/gdb_remote_client/TestThreadSelectionBug.py (1204 of 1807) PASS: lldb-unit :: Utility/./UtilityTests/StringListTest.InsertStringAtIndexStart (1205 of 1807) PASS: lldb-shell :: SymbolFile/DWARF/find-basic-type.cpp (1206 of 1807) PASS: lldb-api :: functionalities/tail_call_frames/sbapi_support/TestTailCallFrameSBAPI.py (1207 of 1807) PASS: lldb-shell :: SymbolFile/DWARF/find-function-regex.cpp (1208 of 1807) PASS: lldb-api :: functionalities/gdb_remote_client/TestRecognizeBreakpoint.py (1209 of 1807) PASS: lldb-api :: functionalities/data-formatter/data-formatter-objc/TestDataFormatterObjCCF.py (1210 of 1807) PASS: lldb-unit :: UnwindAssembly/x86/./UnwindAssemblyx86Tests/Testx86AssemblyInspectionEngine.TestSpArithx86_64Augmented (1211 of 1807) PASS: lldb-api :: functionalities/mtc/simple/TestMTCSimple.py (1212 of 1807) PASS: lldb-api :: commands/expression/completion-in-lambda-and-unnnamed-class/TestCompletionInLambdaAndUnnamedClass.py (1213 of 1807) PASS: lldb-unit :: Utility/./UtilityTests/StringListTest.AppendListCStringArray (1214 of 1807) PASS: lldb-unit :: Utility/./UtilityTests/RangeTest.LessThan (1215 of 1807) PASS: lldb-api :: commands/command/history/TestCommandHistory.py (1216 of 1807) PASS: lldb-shell :: SymbolFile/DWARF/debug-types-signature-loop.s (1217 of 1807) PASS: lldb-unit :: Utility/./UtilityTests/StreamTest.PutRawBytesToBigEndian (1218 of 1807) PASS: lldb-unit :: UnwindAssembly/x86/./UnwindAssemblyx86Tests/Testx86AssemblyInspectionEngine.TestPopRBP (1219 of 1807) PASS: lldb-unit :: Host/./HostTests/FileActionTest.Open (1220 of 1807) PASS: lldb-unit :: Utility/./UtilityTests/LogChannelTest.Disable (1221 of 1807) PASS: lldb-api :: lang/objc/conflicting-definition/TestConflictingDefinition.py (1222 of 1807) PASS: lldb-api :: lang/c/array_types/TestArrayTypes.py (1223 of 1807) PASS: lldb-api :: tools/lldb-vscode/breakpoint/TestVSCode_setExceptionBreakpoints.py (1224 of 1807) PASS: lldb-shell :: SymbolFile/Breakpad/symtab-macho.test (1225 of 1807) PASS: lldb-unit :: Utility/./UtilityTests/Flags.AnyClear (1226 of 1807) PASS: lldb-shell :: SymbolFile/DWARF/dwarf5-partial-index.cpp (1227 of 1807) PASS: lldb-unit :: Language/Highlighting/./HighlighterTests/HighlighterTest.ClangOperators (1228 of 1807) PASS: lldb-unit :: Utility/./UtilityTests/SerializationRountripTest.SerializeDeserializeObjectPointer (1229 of 1807) PASS: lldb-unit :: Utility/./UtilityTests/ProcessInstanceInfo.Dump (1230 of 1807) PASS: lldb-api :: functionalities/unwind/noreturn/TestNoreturnUnwind.py (1231 of 1807) PASS: lldb-shell :: ObjectFile/PECOFF/sections.yaml (1232 of 1807) PASS: lldb-unit :: Expression/./ExpressionTests/CppModuleConfigurationTest.Xcode (1233 of 1807) PASS: lldb-api :: commands/expression/unicode-in-variable/TestUnicodeInVariable.py (1234 of 1807) PASS: lldb-api :: functionalities/postmortem/minidump-new/TestMiniDumpNew.py (1235 of 1807) PASS: lldb-unit :: Utility/./UtilityTests/StringExtractorTest.GetHexU8_Extra (1236 of 1807) PASS: lldb-unit :: Process/gdb-remote/./ProcessGdbRemoteTests/GDBRemoteCommunicationServerTest.SendErrorResponse_UnimplementedError (1237 of 1807) PASS: lldb-api :: tools/lldb-server/TestGdbRemoteSingleStep.py (1238 of 1807) PASS: lldb-shell :: SymbolFile/DWARF/dwarf5_locations.s (1239 of 1807) PASS: lldb-api :: lang/cpp/namespace/TestNamespaceLookup.py (1240 of 1807) PASS: lldb-api :: functionalities/load_unload/TestLoadUnload.py (1241 of 1807) PASS: lldb-unit :: Host/./HostTests/SocketTest.DecodeHostAndPort (1242 of 1807) PASS: lldb-unit :: Utility/./UtilityTests/StreamTest.PutRawBytesToMixedEndian (1243 of 1807) PASS: lldb-unit :: Target/./TargetTests/ModuleCacheTest.GetAndPut (1244 of 1807) PASS: lldb-unit :: ScriptInterpreter/Python/./ScriptInterpreterPythonTests/PythonDataObjectsTest.TestPythonBytes (1245 of 1807) PASS: lldb-api :: functionalities/recursion/TestValueObjectRecursion.py (1246 of 1807) PASS: lldb-api :: functionalities/modern-type-lookup/objc-modules/TestObjModulesModernTypeLookup.py (1247 of 1807) PASS: lldb-unit :: UnwindAssembly/x86/./UnwindAssemblyx86Tests/Testx86AssemblyInspectionEngine.TestPopEDI (1248 of 1807) PASS: lldb-api :: macosx/queues/TestQueues.py (1249 of 1807) PASS: lldb-shell :: SymbolFile/DWARF/debug-types-missing-signature.test (1250 of 1807) PASS: lldb-api :: commands/expression/timeout/TestCallWithTimeout.py (1251 of 1807) UNSUPPORTED: lldb-shell :: SymbolFile/PDB/pointers.test (1252 of 1807) PASS: lldb-unit :: Utility/./UtilityTests/UriParserTest.LongPath (1253 of 1807) PASS: lldb-unit :: Utility/./UtilityTests/StringExtractorTest.GetHexU8_Underflow (1254 of 1807) PASS: lldb-unit :: Utility/./UtilityTests/StreamTest.PutCString (1255 of 1807) PASS: lldb-shell :: Python/crashlog.test (1256 of 1807) PASS: lldb-api :: commands/expression/persistent_ptr_update/TestPersistentPtrUpdate.py (1257 of 1807) PASS: lldb-api :: lang/cpp/thread_local/TestThreadLocal.py (1258 of 1807) PASS: lldb-api :: functionalities/thread/concurrent_events/TestConcurrentCrashWithWatchpointBreakpointSignal.py (1259 of 1807) PASS: lldb-unit :: Utility/./UtilityTests/EnvironmentTest.EnvpConstruction (1260 of 1807) PASS: lldb-shell :: ObjectFile/Breakpad/sections.test (1261 of 1807) PASS: lldb-unit :: Utility/./UtilityTests/StreamTest.PutHex32ByteOrderBig (1262 of 1807) PASS: lldb-api :: functionalities/data-formatter/data-formatter-synthval/TestDataFormatterSynthVal.py (1263 of 1807) PASS: lldb-api :: commands/target/basic/TestTargetCommand.py (1264 of 1807) PASS: lldb-unit :: Expression/./ExpressionTests/CppModuleConfigurationTest.LibCppV2 (1265 of 1807) PASS: lldb-unit :: Core/./LLDBCoreTests/RichManglingContextTest.IPDRealloc (1266 of 1807) PASS: lldb-api :: python_api/name_lookup/TestNameLookup.py (1267 of 1807) PASS: lldb-unit :: Utility/./UtilityTests/OptionsWithRawTest.WhitespaceSuffix (1268 of 1807) PASS: lldb-unit :: Core/./LLDBCoreTests/RichManglingContextTest.SwitchProvider (1269 of 1807) PASS: lldb-unit :: Utility/./UtilityTests/LogChannelEnabledTest.LogVerboseThread (1270 of 1807) PASS: lldb-api :: lang/objcxx/hide-runtime-values/TestObjCXXHideRuntimeValues.py (1271 of 1807) PASS: lldb-api :: python_api/interpreter/TestCommandInterpreterAPI.py (1272 of 1807) PASS: lldb-unit :: Utility/./UtilityTests/UUIDTest.SetFromStringRef (1273 of 1807) PASS: lldb-api :: functionalities/thread/jump/TestThreadJump.py (1274 of 1807) PASS: lldb-api :: lang/cpp/lambdas/TestLambdas.py (1275 of 1807) PASS: lldb-api :: functionalities/gdb_remote_client/TestGDBRemoteLoad.py (1276 of 1807) PASS: lldb-api :: commands/expression/save_jit_objects/TestSaveJITObjects.py (1277 of 1807) PASS: lldb-api :: lang/cpp/unsigned_types/TestUnsignedTypes.py (1278 of 1807) PASS: lldb-shell :: SymbolFile/DWARF/debug-types-dwarf5.s (1279 of 1807) PASS: lldb-api :: lang/objc/foundation/TestObjCMethodsNSArray.py (1280 of 1807) PASS: lldb-api :: commands/disassemble/basic/TestDisassembleBreakpoint.py (1281 of 1807) PASS: lldb-api :: lang/cpp/extern_c/TestExternCSymbols.py (1282 of 1807) PASS: lldb-unit :: Utility/./UtilityTests/BinaryStreamTest.PutSLEB128OneByte (1283 of 1807) PASS: lldb-unit :: Utility/./UtilityTests/StringExtractorTest.GetHexU8_Extra_NoEof (1284 of 1807) PASS: lldb-api :: functionalities/thread/concurrent_events/TestConcurrentTwoBreakpointsOneDelaySignal.py (1285 of 1807) PASS: lldb-api :: functionalities/thread/concurrent_events/TestConcurrentDelayWatchBreak.py (1286 of 1807) PASS: lldb-api :: commands/expression/formatters/TestFormatters.py (1287 of 1807) PASS: lldb-api :: functionalities/tail_call_frames/disambiguate_paths_to_common_sink/TestDisambiguatePathsToCommonSink.py (1288 of 1807) PASS: lldb-unit :: Utility/./UtilityTests/ArgsTest.TestSingleArg (1289 of 1807) PASS: lldb-api :: functionalities/process_group/TestChangeProcessGroup.py (1290 of 1807) PASS: lldb-unit :: Utility/./UtilityTests/BroadcasterTest.BroadcastEvent (1291 of 1807) PASS: lldb-shell :: SymbolFile/Breakpad/unwind-via-raSearch.test (1292 of 1807) PASS: lldb-unit :: Process/gdb-remote/./ProcessGdbRemoteTests/GDBRemoteCommunicationClientTest.GetMemoryRegionInfoInvalidResponse (1293 of 1807) PASS: lldb-shell :: Commands/command-regex-delete.test (1294 of 1807) PASS: lldb-api :: commands/expression/inline-namespace/TestInlineNamespace.py (1295 of 1807) PASS: lldb-api :: lang/c/local_variables/TestLocalVariables.py (1296 of 1807) UNSUPPORTED: lldb-shell :: SymbolFile/PDB/type-quals.test (1297 of 1807) PASS: lldb-api :: lang/cpp/stl/TestStdCXXDisassembly.py (1298 of 1807) PASS: lldb-unit :: Host/./HostTests/SocketTest.TCPListen0GetPort (1299 of 1807) PASS: lldb-api :: lang/cpp/namespace/TestNamespace.py (1300 of 1807) PASS: lldb-api :: functionalities/data-formatter/synthupdate/TestSyntheticFilterRecompute.py (1301 of 1807) PASS: lldb-unit :: Utility/./UtilityTests/StreamTeeTest.GetStreamAtIndexOutOfBoundsEmpty (1302 of 1807) PASS: lldb-unit :: Utility/./UtilityTests/BinaryStreamTest.PutSLEB128EightBytes (1303 of 1807) UNSUPPORTED: lldb-api :: lang/objc/rdar-12408181/TestRdar12408181.py (1304 of 1807) PASS: lldb-api :: python_api/watchpoint/TestSetWatchpoint.py (1305 of 1807) PASS: lldb-api :: commands/log/invalid-args/TestInvalidArgsLog.py (1306 of 1807) PASS: lldb-api :: lang/cpp/call-function/TestCallCPPFunction.py (1307 of 1807) PASS: lldb-shell :: Expr/TestTypeOfDeclTypeExpr.test (1308 of 1807) PASS: lldb-unit :: Symbol/./SymbolTests/DWARFCallFrameInfoTest.Basic_dwarf4 (1309 of 1807) PASS: lldb-unit :: Utility/./UtilityTests/TimerTest.CategoryTimesStats (1310 of 1807) PASS: lldb-api :: functionalities/thread/concurrent_events/TestConcurrentWatchpointDelayWatchpointOneBreakpoint.py (1311 of 1807) PASS: lldb-api :: lang/c/blocks/TestBlocks.py (1312 of 1807) PASS: lldb-unit :: Utility/./UtilityTests/RangeTest.NotEqual (1313 of 1807) PASS: lldb-unit :: ObjectFile/Breakpad/./ObjectFileBreakpadTests/Record.classify (1314 of 1807) PASS: lldb-api :: commands/command/source/TestCommandSource.py (1315 of 1807) PASS: lldb-api :: commands/expression/namespace_local_var_same_name_obj_c/TestNamespaceLocalVarSameNameObjC.py (1316 of 1807) PASS: lldb-unit :: ObjectFile/PECOFF/./ObjectFilePECOFFTests/PECallFrameInfoTest.Basic_eh (1317 of 1807) PASS: lldb-unit :: Language/Highlighting/./HighlighterTests/HighlighterTest.ClangTrailingBackslashBeforeNewline (1318 of 1807) PASS: lldb-unit :: Utility/./UtilityTests/FileSpecTest.EqualSeparator (1319 of 1807) PASS: lldb-api :: commands/expression/import_builtin_fileid/TestImportBuiltinFileID.py (1320 of 1807) PASS: lldb-unit :: Utility/./UtilityTests/StringListTest.GetMaxStringLengthIncreasingSize (1321 of 1807) PASS: lldb-api :: lang/cpp/frame-var-anon-unions/TestFrameVariableAnonymousUnions.py (1322 of 1807) PASS: lldb-unit :: Symbol/./SymbolTests/PostfixExpression.ToDWARF (1323 of 1807) PASS: lldb-shell :: Minidump/dump-all.test (1324 of 1807) PASS: lldb-unit :: Process/minidump/./LLDBMinidumpTests/MinidumpParserTest.GetArchitectureWindows (1325 of 1807) UNSUPPORTED: lldb-api :: commands/expression/macros/TestMacros.py (1326 of 1807) PASS: lldb-api :: functionalities/data-formatter/data-formatter-stl/libcxx/function/TestLibCxxFunction.py (1327 of 1807) PASS: lldb-unit :: ScriptInterpreter/Python/./ScriptInterpreterPythonTests/PythonDataObjectsTest.TestRun (1328 of 1807) PASS: lldb-api :: functionalities/data-formatter/type_summary_list_script/TestTypeSummaryListScript.py (1329 of 1807) PASS: lldb-unit :: Utility/./UtilityTests/SerializationRountripTest.SerializeDeserializePod (1330 of 1807) PASS: lldb-unit :: ScriptInterpreter/Python/./ScriptInterpreterPythonTests/PythonDataObjectsTest.TestPythonCallableCheck (1331 of 1807) PASS: lldb-api :: commands/expression/call-function/TestCallStopAndContinue.py (1332 of 1807) PASS: lldb-unit :: Utility/./UtilityTests/RangeTest.ClearWithStarAddress (1333 of 1807) PASS: lldb-unit :: Host/./HostTests/HostInfoTest.GetAugmentedArchSpec (1334 of 1807) PASS: lldb-unit :: Utility/./UtilityTests/StringListTest.GetMaxStringLengthEmpty (1335 of 1807) PASS: lldb-unit :: Language/CPlusPlus/./LanguageCPlusPlusTests/CPlusPlusLanguage.MethodNameParsing (1336 of 1807) PASS: lldb-api :: functionalities/data-formatter/language_category_updates/TestDataFormatterLanguageCategoryUpdates.py (1337 of 1807) PASS: lldb-api :: commands/expression/anonymous-struct/TestCallUserAnonTypedef.py (1338 of 1807) PASS: lldb-unit :: Utility/./UtilityTests/BinaryStreamTest.PutULEB128OneByte (1339 of 1807) PASS: lldb-unit :: Host/./HostTests/NativeProcessProtocolTest.ReadCStringFromMemory_MaxSize (1340 of 1807) UNSUPPORTED: lldb-shell :: Register/arm-fp-read.test (1341 of 1807) UNSUPPORTED: lldb-shell :: SymbolFile/PDB/calling-conventions.test (1342 of 1807) PASS: lldb-unit :: Utility/./UtilityTests/StringExtractorTest.GetHexU8_Underflow_NoEof (1343 of 1807) UNSUPPORTED: lldb-api :: tools/lldb-server/TestGdbRemoteAuxvSupport.py (1344 of 1807) PASS: lldb-api :: functionalities/inline-stepping/TestInlineStepping.py (1345 of 1807) PASS: lldb-shell :: Reproducer/TestGDBRemoteRepro.test (1346 of 1807) PASS: lldb-shell :: Settings/TestStopCommandSourceOnError.test (1347 of 1807) PASS: lldb-unit :: Utility/./UtilityTests/AnsiTerminal.WhiteSpace (1348 of 1807) PASS: lldb-unit :: Expression/./ExpressionTests/CppModuleConfigurationTest.AmbiguousCLib (1349 of 1807) PASS: lldb-api :: python_api/formatters/TestFormattersSBAPI.py (1350 of 1807) PASS: lldb-unit :: Utility/./UtilityTests/LogChannelTest.Enable (1351 of 1807) PASS: lldb-shell :: SymbolFile/DWARF/debug_loc.s (1352 of 1807) PASS: lldb-shell :: SymbolFile/Breakpad/unwind-via-stack-cfi.test (1353 of 1807) PASS: lldb-shell :: SymbolFile/NativePDB/break-by-function.cpp (1354 of 1807) PASS: lldb-unit :: Process/minidump/./LLDBMinidumpTests/MinidumpParserTest.GetLinuxProcStatus (1355 of 1807) PASS: lldb-unit :: Utility/./UtilityTests/UriParserTest.PortOverflow (1356 of 1807) PASS: lldb-api :: lang/objc/objc-class-method/TestObjCClassMethod.py (1357 of 1807) PASS: lldb-api :: commands/frame/diagnose/dereference-this/TestDiagnoseDereferenceThis.py (1358 of 1807) PASS: lldb-api :: functionalities/data-formatter/data-formatter-objc/TestDataFormatterObjCExpr.py (1359 of 1807) PASS: lldb-api :: tools/lldb-vscode/breakpoint/TestVSCode_setBreakpoints.py (1360 of 1807) PASS: lldb-api :: python_api/sbstructureddata/TestStructuredDataAPI.py (1361 of 1807) PASS: lldb-api :: functionalities/thread/concurrent_events/TestConcurrentTwoWatchpointsOneBreakpoint.py (1362 of 1807) PASS: lldb-api :: tools/lldb-vscode/step/TestVSCode_step.py (1363 of 1807) PASS: lldb-unit :: Host/./HostTests/SocketTest.UDPConnect (1364 of 1807) PASS: lldb-unit :: ObjectFile/ELF/./ObjectFileELFTests/ObjectFileELFTest.SectionsResolveConsistently (1365 of 1807) UNSUPPORTED: lldb-api :: commands/expression/call-restarts/TestCallThatRestarts.py (1366 of 1807) UNSUPPORTED: lldb-api :: linux/thread/create_during_instruction_step/TestCreateDuringInstructionStep.py (1367 of 1807) PASS: lldb-api :: functionalities/inferior-crashing/TestInferiorCrashing.py (1368 of 1807) UNSUPPORTED: lldb-api :: commands/watchpoints/hello_watchlocation/TestWatchLocation.py (1369 of 1807) PASS: lldb-api :: python_api/target/TestTargetAPI.py (1370 of 1807) PASS: lldb-api :: tools/lldb-server/TestGdbRemoteKill.py (1371 of 1807) PASS: lldb-api :: commands/command/delete/TestCommandDelete.py (1372 of 1807) PASS: lldb-shell :: Quit/TestQuitExitCodeNonInt.test (1373 of 1807) PASS: lldb-shell :: SymbolFile/DWARF/find-inline-method.s (1374 of 1807) PASS: lldb-unit :: Utility/./UtilityTests/StreamTest.PutPtr (1375 of 1807) PASS: lldb-shell :: ObjectFile/ELF/PT_LOAD-overlap-section.yaml (1376 of 1807) PASS: lldb-api :: functionalities/thread/concurrent_events/TestConcurrentTwoWatchpointThreads.py (1377 of 1807) PASS: lldb-api :: functionalities/breakpoint/breakpoint_language/TestBreakpointLanguage.py (1378 of 1807) PASS: lldb-api :: commands/expression/import-std-module/unique_ptr-dbg-info-content/TestUniquePtrDbgInfoContent.py (1379 of 1807) PASS: lldb-api :: lang/cpp/stl/TestSTL.py (1380 of 1807) PASS: lldb-unit :: Host/./HostTests/Host.WaitStatusFormat (1381 of 1807) UNSUPPORTED: lldb-api :: functionalities/thread/concurrent_events/TestConcurrentManySignals.py (1382 of 1807) PASS: lldb-api :: macosx/find-dsym/deep-bundle/TestDeepBundle.py (1383 of 1807) PASS: lldb-api :: functionalities/data-formatter/data-formatter-disabling/TestDataFormatterDisabling.py (1384 of 1807) PASS: lldb-api :: functionalities/breakpoint/breakpoint_ignore_count/TestBreakpointIgnoreCount.py (1385 of 1807) UNSUPPORTED: lldb-api :: commands/register/register/intel_xtended_registers/TestMPXRegisters.py (1386 of 1807) PASS: lldb-unit :: Utility/./UtilityTests/StreamTest.ShiftOperatorStrings (1387 of 1807) PASS: lldb-api :: functionalities/data-formatter/data-formatter-skip-summary/TestDataFormatterSkipSummary.py (1388 of 1807) PASS: lldb-api :: lang/c/tls_globals/TestTlsGlobals.py (1389 of 1807) PASS: lldb-unit :: Utility/./UtilityTests/StreamTest.ShiftOperatorChars (1390 of 1807) PASS: lldb-unit :: Utility/./UtilityTests/RangeTest.ContainsEndInclusive (1391 of 1807) PASS: lldb-shell :: ObjectFile/ELF/section-overlap.yaml (1392 of 1807) UNSUPPORTED: lldb-api :: functionalities/darwin_log/source/info/TestDarwinLogSourceInfo.py (1393 of 1807) PASS: lldb-api :: functionalities/thread/backtrace_all/TestBacktraceAll.py (1394 of 1807) PASS: lldb-unit :: Utility/./UtilityTests/GeneratorTest.Create (1395 of 1807) PASS: lldb-shell :: Reproducer/TestSynchronous.test (1396 of 1807) PASS: lldb-unit :: Utility/./UtilityTests/StreamTest.ChangingByteOrder (1397 of 1807) PASS: lldb-unit :: Utility/./UtilityTests/StringListTest.AppendList (1398 of 1807) UNSUPPORTED: lldb-api :: functionalities/asan/TestReportData.py (1399 of 1807) UNSUPPORTED: lldb-api :: benchmarks/libcxxlist/TestBenchmarkLibcxxList.py (1400 of 1807) UNSUPPORTED: lldb-api :: android/platform/TestDefaultCacheLineSize.py (1401 of 1807) PASS: lldb-api :: commands/expression/import-std-module/basic/TestImportStdModule.py (1402 of 1807) PASS: lldb-unit :: Utility/./UtilityTests/StringExtractorTest.GetU32BigEndian (1403 of 1807) PASS: lldb-unit :: Process/minidump/./LLDBMinidumpTests/MinidumpParserTest.GetThreadContext_x86_64 (1404 of 1807) PASS: lldb-unit :: UnwindAssembly/x86/./UnwindAssemblyx86Tests/Testx86AssemblyInspectionEngine.TestPushImm (1405 of 1807) PASS: lldb-unit :: Utility/./UtilityTests/DataExtractorTest.GetCStrAtEnd (1406 of 1807) PASS: lldb-unit :: ObjectFile/ELF/./ObjectFileELFTests/ObjectFileELFTest.GetSymtab_NoSymEntryPointArmAddressClass (1407 of 1807) PASS: lldb-unit :: Utility/./UtilityTests/StringExtractorTest.DecodeHexU8_Underflow (1408 of 1807) UNSUPPORTED: lldb-api :: functionalities/tsan/global_location/TestTsanGlobalLocation.py (1409 of 1807) PASS: lldb-shell :: SymbolFile/DWARF/find-variable-dwo.cpp (1410 of 1807) PASS: lldb-api :: commands/frame/language/TestGuessLanguage.py (1411 of 1807) PASS: lldb-shell :: SymbolFile/DWARF/debug-types-basic.test (1412 of 1807) PASS: lldb-api :: functionalities/data-formatter/data-formatter-stl/libcxx/queue/TestDataFormatterLibcxxQueue.py (1413 of 1807) PASS: lldb-api :: tools/lldb-server/register-reading/TestGdbRemoteGPacket.py (1414 of 1807) UNSUPPORTED: lldb-api :: functionalities/unwind/ehframe/TestEhFrameUnwind.py (1415 of 1807) PASS: lldb-api :: lang/objc/blocks/TestObjCIvarsInBlocks.py (1416 of 1807) PASS: lldb-shell :: Reproducer/TestDriverOptions.test (1417 of 1807) PASS: lldb-api :: lang/objc/real-definition/TestRealDefinition.py (1418 of 1807) PASS: lldb-shell :: Settings/TestFrameFormatNoColor.test (1419 of 1807) UNSUPPORTED: lldb-api :: functionalities/tty/TestTerminal.py (1420 of 1807) PASS: lldb-api :: functionalities/tail_call_frames/thread_step_out_or_return/TestSteppingOutWithArtificialFrames.py (1421 of 1807) PASS: lldb-unit :: Utility/./UtilityTests/ArgsTest.TestAppendArg (1422 of 1807) PASS: lldb-unit :: UnwindAssembly/x86/./UnwindAssemblyx86Tests/Testx86AssemblyInspectionEngine.TestPushEAX (1423 of 1807) PASS: lldb-unit :: Language/Highlighting/./HighlighterTests/HighlighterTest.HighlighterSelectionType (1424 of 1807) UNSUPPORTED: lldb-shell :: Register/x86-64-zmm-write.test (1425 of 1807) PASS: lldb-api :: commands/expression/argument_passing_restrictions/TestArgumentPassingRestrictions.py (1426 of 1807) PASS: lldb-api :: lang/cpp/dynamic-value-same-basename/TestDynamicValueSameBase.py (1427 of 1807) PASS: lldb-unit :: Language/Highlighting/./HighlighterTests/HighlighterTest.ClangSquareBrackets (1428 of 1807) PASS: lldb-unit :: Utility/./UtilityTests/RangeDataVector.FindEntryThatContains_Overlap (1429 of 1807) PASS: lldb-shell :: Commands/command-script-import.test (1430 of 1807) PASS: lldb-unit :: Utility/./UtilityTests/UriParserTest.Minimal (1431 of 1807) PASS: lldb-api :: lang/c/find_struct_type/TestFindStructTypes.py (1432 of 1807) PASS: lldb-api :: lang/c/bitfields/TestBitfields.py (1433 of 1807) PASS: lldb-unit :: Utility/./UtilityTests/ArchSpecTest.TestParseMachCPUDashSubtypeTripleExtra (1434 of 1807) PASS: lldb-shell :: ObjectFile/ELF/base-address.yaml (1435 of 1807) PASS: lldb-api :: source-manager/TestSourceManager.py (1436 of 1807) PASS: lldb-api :: functionalities/breakpoint/address_breakpoints/TestBadAddressBreakpoints.py (1437 of 1807) PASS: lldb-unit :: Utility/./UtilityTests/ArgsTest.TestTrailingBackslash (1438 of 1807) PASS: lldb-unit :: Utility/./UtilityTests/ArchSpecTest.TestParseMachCPUDashSubtypeTripleSimple (1439 of 1807) PASS: lldb-api :: lang/objc/objc-ivar-stripped/TestObjCIvarStripped.py (1440 of 1807) PASS: lldb-unit :: Platform/./LLDBPlatformTests/PlatformDarwinTest.TestParseVersionBuildDir (1441 of 1807) PASS: lldb-unit :: Utility/./UtilityTests/StreamTest.PutHex8 (1442 of 1807) PASS: lldb-api :: functionalities/breakpoint/move_nearest/TestMoveNearest.py (1443 of 1807) PASS: lldb-api :: functionalities/data-formatter/data-formatter-stl/libcxx/map/TestDataFormatterLibccMap.py (1444 of 1807) PASS: lldb-unit :: Utility/./UtilityTests/StreamTest.PutMaxHex64ByteOrderBig (1445 of 1807) PASS: lldb-api :: lang/objc/print-obj/TestPrintObj.py (1446 of 1807) PASS: lldb-unit :: Utility/./UtilityTests/StringListTest.JoinSingle (1447 of 1807) PASS: lldb-shell :: Driver/TestProcessAttach.test (1448 of 1807) PASS: lldb-unit :: Expression/./ExpressionTests/CppModuleConfigurationTest.MissingLibCpp (1449 of 1807) PASS: lldb-shell :: ObjectFile/Breakpad/sections-trailing-func.test (1450 of 1807) PASS: lldb-unit :: Utility/./UtilityTests/ScalarTest.ComparisonFloat (1451 of 1807) PASS: lldb-api :: commands/expression/import-std-module/vector-basic/TestBasicVector.py (1452 of 1807) PASS: lldb-api :: python_api/symbol-context/TestSymbolContext.py (1453 of 1807) PASS: lldb-api :: functionalities/postmortem/elf-core/gcore/TestGCore.py (1454 of 1807) PASS: lldb-api :: functionalities/breakpoint/comp_dir_symlink/TestCompDirSymLink.py (1455 of 1807) PASS: lldb-unit :: Host/./HostTests/NativeProcessProtocolTest.SetBreakpointFailVerify (1456 of 1807) PASS: lldb-api :: functionalities/data-formatter/poarray/TestPrintObjectArray.py (1457 of 1807) PASS: lldb-api :: functionalities/thread/concurrent_events/TestConcurrentWatchpointWithDelayWatchpointThreads.py (1458 of 1807) PASS: lldb-api :: commands/expression/scoped_enums/TestScopedEnumType.py (1459 of 1807) PASS: lldb-shell :: SymbolFile/NativePDB/function-types-builtins.cpp (1460 of 1807) PASS: lldb-unit :: Process/minidump/./LLDBMinidumpTests/MinidumpParserTest.GetMemoryRegionInfoLinuxMaps (1461 of 1807) PASS: lldb-unit :: UnwindAssembly/x86/./UnwindAssemblyx86Tests/Testx86AssemblyInspectionEngine.TestPushEDI (1462 of 1807) PASS: lldb-unit :: Utility/./UtilityTests/OptionsWithRawTest.MultiWordSuffix (1463 of 1807) PASS: lldb-unit :: Target/./TargetTests/ExecutionContextTest.GetByteOrder (1464 of 1807) PASS: lldb-shell :: ObjectFile/ELF/netbsd-core-amd64.test (1465 of 1807) PASS: lldb-api :: lang/objc/objc-optimized/TestObjcOptimized.py (1466 of 1807) PASS: lldb-unit :: SymbolFile/NativePDB/./SymbolFileNativePDBTests/PDBFPOProgramToDWARFExpressionTests.InvalidAssignmentMultiple (1467 of 1807) PASS: lldb-unit :: Expression/./ExpressionTests/DiagnosticManagerTest.AppendMessageSubsequentDiags (1468 of 1807) PASS: lldb-api :: lang/objcxx/cxx-bridged-po/TestObjCXXBridgedPO.py (1469 of 1807) PASS: lldb-unit :: Utility/./UtilityTests/TimerTest.CategoryTimesNested (1470 of 1807) PASS: lldb-api :: python_api/value/linked_list/TestValueAPILinkedList.py (1471 of 1807) PASS: lldb-api :: lang/objc/objc-baseclass-sbtype/TestObjCBaseClassSBType.py (1472 of 1807) PASS: lldb-api :: functionalities/data-formatter/vector-types/TestVectorTypesFormatting.py (1473 of 1807) PASS: lldb-api :: python_api/rdar-12481949/Test-rdar-12481949.py (1474 of 1807) PASS: lldb-unit :: Process/minidump/./LLDBMinidumpTests/MinidumpParserTest.GetFilteredModuleList (1475 of 1807) PASS: lldb-unit :: Utility/./UtilityTests/ArgsTest.GetArgumentArrayRef (1476 of 1807) PASS: lldb-unit :: Utility/./UtilityTests/BinaryStreamTest.PutULEB128FourBytes (1477 of 1807) PASS: lldb-shell :: SymbolFile/DWARF/debug-types-dwo-cross-reference.cpp (1478 of 1807) PASS: lldb-api :: functionalities/breakpoint/breakpoint_by_line_and_column/TestBreakpointByLineAndColumn.py (1479 of 1807) PASS: lldb-unit :: Utility/./UtilityTests/StreamTest.PutHex64ByteOrderLittle (1480 of 1807) PASS: lldb-api :: commands/expression/function_template_specialization_temp_args/TestFunctionTemplateSpecializationTempArgs.py (1481 of 1807) UNSUPPORTED: lldb-shell :: SymbolFile/PDB/udt-layout.test (1482 of 1807) UNSUPPORTED: lldb-shell :: SymbolFile/NativePDB/stack_unwinding01.cpp (1483 of 1807) PASS: lldb-shell :: SymbolFile/NativePDB/break-by-line.cpp (1484 of 1807) PASS: lldb-api :: lang/cpp/nsimport/TestCppNsImport.py (1485 of 1807) PASS: lldb-api :: functionalities/object-file/TestImageListMultiArchitecture.py (1486 of 1807) PASS: lldb-unit :: Utility/./UtilityTests/StringExtractorTest.GetHexU8_InvalidHex (1487 of 1807) PASS: lldb-unit :: Utility/./UtilityTests/UriParserTest.SchemeHostSeparator (1488 of 1807) PASS: lldb-api :: tools/lldb-server/TestGdbRemote_qThreadStopInfo.py (1489 of 1807) PASS: lldb-shell :: ObjectFile/ELF/minidebuginfo-find-symbols.yaml (1490 of 1807) PASS: lldb-unit :: Utility/./UtilityTests/StringExtractorTest.GetNameColonValueNoSemicolon (1491 of 1807) UNSUPPORTED: lldb-api :: functionalities/breakpoint/hardware_breakpoints/hardware_breakpoint_on_multiple_threads/TestHWBreakMultiThread.py (1492 of 1807) PASS: lldb-unit :: Symbol/./SymbolTests/TestClangASTContext.TestRecordHasFields (1493 of 1807) PASS: lldb-api :: lang/cpp/class-template-parameter-pack/TestClassTemplateParameterPack.py (1494 of 1807) PASS: lldb-shell :: ObjectFile/PECOFF/sections-names.yaml (1495 of 1807) PASS: lldb-api :: functionalities/inferior-assert/TestInferiorAssert.py (1496 of 1807) PASS: lldb-api :: tools/lldb-server/TestGdbRemoteAttach.py (1497 of 1807) UNSUPPORTED: lldb-api :: lang/cpp/static_members/TestCPPStaticMembers.py (1498 of 1807) UNSUPPORTED: lldb-api :: functionalities/darwin_log/basic/TestDarwinLogBasic.py (1499 of 1807) PASS: lldb-api :: commands/frame/diagnose/virtual-method-call/TestDiagnoseDereferenceVirtualMethodCall.py (1500 of 1807) PASS: lldb-api :: python_api/watchpoint/watchlocation/TestTargetWatchAddress.py (1501 of 1807) PASS: lldb-unit :: Process/gdb-remote/./ProcessGdbRemoteTests/GDBRemoteClientBaseTest.SendContinueAndWait (1502 of 1807) PASS: lldb-unit :: ScriptInterpreter/Python/./ScriptInterpreterPythonTests/PythonDataObjectsTest.TestPythonStringToStr (1503 of 1807) PASS: lldb-unit :: Utility/./UtilityTests/RangeTest.Constructor (1504 of 1807) PASS: lldb-unit :: ScriptInterpreter/Python/./ScriptInterpreterPythonTests/PythonDataObjectsTest.TestModuleNameResolutionNoDot (1505 of 1807) PASS: lldb-unit :: Expression/./ExpressionTests/CppModuleConfigurationTest.Sysroot (1506 of 1807) PASS: lldb-unit :: Utility/./UtilityTests/StringListTest.Assignment (1507 of 1807) PASS: lldb-api :: python_api/class_members/TestSBTypeClassMembers.py (1508 of 1807) PASS: lldb-unit :: ScriptInterpreter/Python/./ScriptInterpreterPythonTests/PythonDataObjectsTest.TestTypeNameResolutionNoDot (1509 of 1807) PASS: lldb-unit :: Editline/./EditlineTests/EditlineTestFixture.EditlineReceivesMultiLineText (1510 of 1807) PASS: lldb-unit :: ScriptInterpreter/Python/./ScriptInterpreterPythonTests/PythonDataObjectsTest.TestResetting (1511 of 1807) PASS: lldb-unit :: Utility/./UtilityTests/StringListTest.AppendStringCString (1512 of 1807) PASS: lldb-unit :: Host/./HostTests/FileSystemTest.FileAndDirectoryComponents (1513 of 1807) PASS: lldb-api :: functionalities/thread/step_out/TestThreadStepOut.py (1514 of 1807) PASS: lldb-api :: functionalities/data-formatter/data-formatter-stl/libcxx/unordered/TestDataFormatterUnordered.py (1515 of 1807) PASS: lldb-unit :: Process/minidump/./LLDBMinidumpTests/MinidumpParserTest.GetThreadContext_x86_32 (1516 of 1807) PASS: lldb-unit :: Utility/./UtilityTests/NameMatchesTest.Equals (1517 of 1807) PASS: lldb-unit :: Interpreter/./InterpreterTests/CompletionTest.FileCompletionAbsolute (1518 of 1807) PASS: lldb-unit :: tools/lldb-server/tests/./LLDBServerTests/StandardStartupTest.TestStopReplyContainsThreadPcs (1519 of 1807) PASS: lldb-unit :: Utility/./UtilityTests/Flags.GetBitSize (1520 of 1807) PASS: lldb-api :: functionalities/data-formatter/nsarraysynth/TestNSArraySynthetic.py (1521 of 1807) PASS: lldb-unit :: Signals/./SignalsTests/UnixSignalsTest.GetFilteredSignals (1522 of 1807) PASS: lldb-unit :: Utility/./UtilityTests/ProcessInstanceInfo.DumpTable_invalidUID (1523 of 1807) PASS: lldb-unit :: Utility/./UtilityTests/FileSpecTest.GetNormalizedPath (1524 of 1807) PASS: lldb-unit :: Utility/./UtilityTests/StringListTest.ForRangeEmpty (1525 of 1807) PASS: lldb-unit :: Process/gdb-remote/./ProcessGdbRemoteTests/GDBRemoteCommunicationClientTest.SendGetMetaDataPacket (1526 of 1807) PASS: lldb-unit :: Host/./HostTests/FileSystemTest.GetByteSize (1527 of 1807) PASS: lldb-api :: lang/objc/objc-builtin-types/TestObjCBuiltinTypes.py (1528 of 1807) PASS: lldb-shell :: ObjectFile/MachO/symtab.yaml (1529 of 1807) PASS: lldb-api :: functionalities/plugins/python_os_plugin/TestPythonOSPlugin.py (1530 of 1807) PASS: lldb-shell :: ObjectFile/ELF/duplicate-section.yaml (1531 of 1807) PASS: lldb-api :: lang/c/unicode/TestUnicodeSymbols.py (1532 of 1807) PASS: lldb-unit :: Utility/./UtilityTests/StreamTest.PutMaxHex64ByteOrderLittle (1533 of 1807) PASS: lldb-unit :: Utility/./UtilityTests/UriParserTest.Empty (1534 of 1807) PASS: lldb-unit :: Utility/./UtilityTests/StringListTest.CopyListSingle (1535 of 1807) UNSUPPORTED: lldb-api :: commands/watchpoints/multi_watchpoint_slots/TestWatchpointMultipleSlots.py (1536 of 1807) PASS: lldb-unit :: Expression/./ExpressionTests/CppModuleConfigurationTest.MissingUsrInclude (1537 of 1807) UNSUPPORTED: lldb-api :: functionalities/darwin_log/filter/regex/category/TestDarwinLogFilterRegexCategory.py (1538 of 1807) PASS: lldb-unit :: Utility/./UtilityTests/FileSpecTest.RemoveLastPathComponent (1539 of 1807) PASS: lldb-shell :: ObjectFile/ELF/netbsd-exec-8.99.30-amd64.yaml (1540 of 1807) PASS: lldb-unit :: SymbolFile/NativePDB/./SymbolFileNativePDBTests/PDBFPOProgramToDWARFExpressionTests.InvalidOpUnary (1541 of 1807) PASS: lldb-api :: lang/c/shared_lib/TestSharedLib.py (1542 of 1807) PASS: lldb-unit :: Language/Highlighting/./HighlighterTests/HighlighterTest.ClangCommas (1543 of 1807) PASS: lldb-api :: commands/frame/diagnose/complicated-expression/TestComplicatedExpression.py (1544 of 1807) PASS: lldb-shell :: Settings/TestModuleCacheSanity.test (1545 of 1807) PASS: lldb-unit :: Language/Highlighting/./HighlighterTests/HighlighterTest.Keywords (1546 of 1807) PASS: lldb-unit :: Utility/./UtilityTests/BinaryStreamTest.PutULEB128ThreeBytes (1547 of 1807) PASS: lldb-unit :: Utility/./UtilityTests/OptionsWithRawTest.SingleWhitespaceInput (1548 of 1807) PASS: lldb-api :: functionalities/breakpoint/breakpoint_options/TestBreakpointOptions.py (1549 of 1807) PASS: lldb-api :: python_api/lldbutil/process/TestPrintStackTraces.py (1550 of 1807) PASS: lldb-unit :: Utility/./UtilityTests/DataExtractorTest.GetMaxS64 (1551 of 1807) PASS: lldb-unit :: UnwindAssembly/x86/./UnwindAssemblyx86Tests/Testx86AssemblyInspectionEngine.TestPushR13 (1552 of 1807) PASS: lldb-unit :: ScriptInterpreter/Python/./ScriptInterpreterPythonTests/PythonDataObjectsTest.TestPythonStringToStructuredString (1553 of 1807) PASS: lldb-unit :: Language/Highlighting/./HighlighterTests/HighlighterTest.ClangIdentifiers (1554 of 1807) PASS: lldb-unit :: Process/gdb-remote/./ProcessGdbRemoteTests/GDBRemoteClientBaseTest.SendContinueAndInterrupt (1555 of 1807) UNSUPPORTED: lldb-shell :: ObjectFile/ELF/minidebuginfo-set-and-hit-breakpoint.test (1556 of 1807) PASS: lldb-api :: lang/objc/modules-hash-mismatch/TestClangModulesHashMismatch.py (1557 of 1807) PASS: lldb-unit :: Host/./HostTests/NativeProcessProtocolTest.ReadCStringFromMemory_CrossPageBoundary (1558 of 1807) PASS: lldb-shell :: ObjectFile/ELF/many-sections.s (1559 of 1807) PASS: lldb-unit :: Utility/./UtilityTests/StringExtractorTest.DecodeHexU8_InvalidHex (1560 of 1807) PASS: lldb-api :: functionalities/breakpoint/source_regexp/TestSourceRegexBreakpoints.py (1561 of 1807) PASS: lldb-api :: commands/platform/process/TestProcessList.py (1562 of 1807) XFAIL: lldb-shell :: Register/x86-mm-xmm-write.test (1563 of 1807) PASS: lldb-unit :: Signals/./SignalsTests/UnixSignalsTest.VersionChange (1564 of 1807) PASS: lldb-shell :: SymbolFile/DWARF/compilercontext.ll (1565 of 1807) PASS: lldb-shell :: Minidump/fb-dump.test (1566 of 1807) PASS: lldb-api :: tools/lldb-server/TestGdbRemoteThreadsInStopReply.py (1567 of 1807) UNSUPPORTED: lldb-shell :: SymbolFile/PDB/func-symbols.test (1568 of 1807) PASS: lldb-unit :: Utility/./UtilityTests/OptionsWithRawTest.SingleWordSuffix (1569 of 1807) PASS: lldb-api :: lang/c/register_variables/TestRegisterVariables.py (1570 of 1807) PASS: lldb-unit :: Utility/./UtilityTests/StreamTest.ShiftOperatorPtr (1571 of 1807) PASS: lldb-api :: python_api/function_symbol/TestSymbolAPI.py (1572 of 1807) PASS: lldb-unit :: Utility/./UtilityTests/DataExtractorTest.GetBitfield (1573 of 1807) PASS: lldb-shell :: Quit/TestQuitExitCodeTooManyArgs.test (1574 of 1807) PASS: lldb-unit :: UnwindAssembly/x86/./UnwindAssemblyx86Tests/Testx86AssemblyInspectionEngine.TestPush0 (1575 of 1807) PASS: lldb-unit :: Utility/./UtilityTests/StringLexerTest.NextIfList (1576 of 1807) PASS: lldb-api :: functionalities/thread/concurrent_events/TestConcurrentCrashWithSignal.py (1577 of 1807) PASS: lldb-unit :: UnwindAssembly/x86/./UnwindAssemblyx86Tests/Testx86AssemblyInspectionEngine.TestSubESP (1578 of 1807) PASS: lldb-api :: commands/expression/call-function/TestCallBuiltinFunction.py (1579 of 1807) PASS: lldb-unit :: UnwindAssembly/x86/./UnwindAssemblyx86Tests/Testx86AssemblyInspectionEngine.Test32BitOnlyInstruction (1580 of 1807) PASS: lldb-unit :: Utility/./UtilityTests/StringExtractorTest.GetNameColonValueNoColon (1581 of 1807) PASS: lldb-shell :: Driver/TestTarget.test (1582 of 1807) PASS: lldb-unit :: Utility/./UtilityTests/StringListTest.SetSize (1583 of 1807) PASS: lldb-shell :: Commands/command-regex-unalias.test (1584 of 1807) PASS: lldb-shell :: Quit/TestQuitExitCodeHexA.test (1585 of 1807) PASS: lldb-api :: lang/cpp/overloaded-functions/TestOverloadedFunctions.py (1586 of 1807) PASS: lldb-unit :: Host/./HostTests/SocketTest.DomainListenConnectAccept (1587 of 1807) PASS: lldb-api :: lang/c/struct_types/TestStructTypes.py (1588 of 1807) PASS: lldb-api :: commands/frame/select/TestFrameSelect.py (1589 of 1807) PASS: lldb-api :: functionalities/breakpoint/auto_continue/TestBreakpointAutoContinue.py (1590 of 1807) PASS: lldb-unit :: Utility/./UtilityTests/StringExtractorTest.GetHexU8_InvalidHex_NoEof (1591 of 1807) PASS: lldb-shell :: Expr/TestIRMemoryMap.test (1592 of 1807) PASS: lldb-shell :: Breakpoint/debug_rnglist_basic.test (1593 of 1807) PASS: lldb-api :: lang/cpp/auto/TestCPPAuto.py (1594 of 1807) PASS: lldb-shell :: Driver/TestCore.test (1595 of 1807) PASS: lldb-unit :: Utility/./UtilityTests/ArgsTest.TestSingleQuotedArgWithSpace (1596 of 1807) PASS: lldb-api :: lang/c/inlines/TestRedefinitionsInInlines.py (1597 of 1807) PASS: lldb-unit :: Language/Highlighting/./HighlighterTests/HighlighterTest.ClangStringLiterals (1598 of 1807) PASS: lldb-api :: python_api/lldbutil/frame/TestFrameUtils.py (1599 of 1807) PASS: lldb-unit :: ObjectFile/Breakpad/./ObjectFileBreakpadTests/FileRecord.parse (1600 of 1807) PASS: lldb-unit :: Utility/./UtilityTests/CompletionRequest.FakeLastArg (1601 of 1807) PASS: lldb-unit :: Process/minidump/./LLDBMinidumpTests/MinidumpParserTest.FindMemoryRange (1602 of 1807) PASS: lldb-shell :: BuildScript/compiler-full-path.test (1603 of 1807) PASS: lldb-unit :: Utility/./UtilityTests/RangeTest.ContainsRangeStartingFromZero (1604 of 1807) PASS: lldb-shell :: SymbolFile/DWARF/find-variable-file.cpp (1605 of 1807) PASS: lldb-api :: functionalities/data-formatter/dump_dynamic/TestDumpDynamic.py (1606 of 1807) PASS: lldb-unit :: Utility/./UtilityTests/StringListTest.AppendStringStdString (1607 of 1807) PASS: lldb-unit :: Utility/./UtilityTests/StringExtractorTest.GetHexBytes (1608 of 1807) PASS: lldb-unit :: Utility/./UtilityTests/LogChannelTest.List (1609 of 1807) PASS: lldb-unit :: Utility/./UtilityTests/StringExtractorTest.InitEmpty (1610 of 1807) PASS: lldb-shell :: SymbolFile/DWARF/dir-separator-windows.s (1611 of 1807) PASS: lldb-unit :: Utility/./UtilityTests/BroadcasterTest.EventTypeHasListeners (1612 of 1807) PASS: lldb-api :: lang/cpp/function_refs/TestFunctionRefs.py (1613 of 1807) PASS: lldb-unit :: Utility/./UtilityTests/ArgsTest.ReplaceArgumentAtIndexOutOfRange (1614 of 1807) PASS: lldb-api :: functionalities/data-formatter/data-formatter-objc/TestDataFormatterObjCNSBundle.py (1615 of 1807) PASS: lldb-api :: functionalities/data-formatter/type_summary_list_arg/TestTypeSummaryListArg.py (1616 of 1807) PASS: lldb-unit :: Host/./HostTests/SocketTest.TCPGetConnectURI (1617 of 1807) PASS: lldb-unit :: Expression/./ExpressionTests/ClangHostTest.ComputeClangResourceDirectory (1618 of 1807) PASS: lldb-unit :: Host/./HostTests/SocketAddressTest.GetAddressInfo (1619 of 1807) PASS: lldb-unit :: UnwindAssembly/x86/./UnwindAssemblyx86Tests/Testx86AssemblyInspectionEngine.TestPushECX (1620 of 1807) PASS: lldb-shell :: Reproducer/TestDump.test (1621 of 1807) PASS: lldb-api :: lang/c/unions/TestUnionMembers.py (1622 of 1807) PASS: lldb-shell :: Breakpoint/single-file-split-dwarf.test (1623 of 1807) UNSUPPORTED: lldb-api :: benchmarks/continue/TestBenchmarkContinue.py (1624 of 1807) UNSUPPORTED: lldb-api :: benchmarks/startup/TestStartupDelays.py (1625 of 1807) PASS: lldb-api :: macosx/duplicate-archive-members/TestDuplicateMembers.py (1626 of 1807) PASS: lldb-unit :: Expression/./ExpressionTests/CppModuleConfigurationTest.LinuxLocalLibCpp (1627 of 1807) PASS: lldb-api :: commands/expression/cast_int_to_anonymous_enum/TestCastIntToAnonymousEnum.py (1628 of 1807) PASS: lldb-api :: types/TestIntegerTypes.py (1629 of 1807) PASS: lldb-api :: commands/expression/import-std-module/vector-bool/TestBoolVector.py (1630 of 1807) PASS: lldb-unit :: Utility/./UtilityTests/CompletionRequest.DuplicateFiltering (1631 of 1807) PASS: lldb-unit :: Utility/./UtilityTests/FileSpecTest.CopyByAppendingPathComponent (1632 of 1807) PASS: lldb-unit :: Core/./LLDBCoreTests/RichManglingContextTest.FromCxxMethodName (1633 of 1807) PASS: lldb-unit :: Utility/./UtilityTests/StreamTeeTest.AppendStream (1634 of 1807) PASS: lldb-unit :: Utility/./UtilityTests/ScalarTest.SetValueFromCString (1635 of 1807) PASS: lldb-unit :: Utility/./UtilityTests/ScalarTest.GetBytes (1636 of 1807) UNSUPPORTED: lldb-api :: functionalities/ubsan/basic/TestUbsanBasic.py (1637 of 1807) PASS: lldb-unit :: Utility/./UtilityTests/TildeExpressionResolver.ResolveFullPath (1638 of 1807) XFAIL: lldb-shell :: Register/x86-64-write.test (1639 of 1807) PASS: lldb-api :: tools/lldb-server/TestGdbRemoteExitCode.py (1640 of 1807) PASS: lldb-api :: functionalities/tail_call_frames/ambiguous_tail_call_seq1/TestAmbiguousTailCallSeq1.py (1641 of 1807) PASS: lldb-api :: functionalities/paths/TestPaths.py (1642 of 1807) PASS: lldb-api :: functionalities/thread/num_threads/TestNumThreads.py (1643 of 1807) PASS: lldb-unit :: UnwindAssembly/x86/./UnwindAssemblyx86Tests/Testx86AssemblyInspectionEngine.TestPushRBPWithREX (1644 of 1807) PASS: lldb-unit :: Utility/./UtilityTests/AnsiTerminal.AtEnd (1645 of 1807) PASS: lldb-api :: functionalities/source-map/TestTargetSourceMap.py (1646 of 1807) PASS: lldb-unit :: Utility/./UtilityTests/CompletionRequest.TryCompleteCurrentArgMode (1647 of 1807) PASS: lldb-unit :: SymbolFile/DWARF/./SymbolFileDWARFTests/SymbolFileDWARFTests.TestAbbrevOrder1Start5 (1648 of 1807) PASS: lldb-api :: functionalities/data-formatter/data-formatter-stl/libcxx/multiset/TestDataFormatterLibcxxMultiSet.py (1649 of 1807) UNSUPPORTED: lldb-api :: functionalities/data-formatter/data-formatter-stl/libstdcpp/tuple/TestDataFormatterStdTuple.py (1650 of 1807) PASS: lldb-unit :: SymbolFile/DWARF/./SymbolFileDWARFTests/SymbolFileDWARFTests.TestAbilitiesForDWARF (1651 of 1807) PASS: lldb-unit :: Host/./HostTests/SocketAddressTest.Set (1652 of 1807) XFAIL: lldb-shell :: Register/x86-mm-xmm-read.test (1653 of 1807) PASS: lldb-api :: lang/cpp/dynamic-value/TestCppValueCast.py (1654 of 1807) PASS: lldb-unit :: Utility/./UtilityTests/Flags.Test (1655 of 1807) PASS: lldb-api :: commands/expression/xvalue/TestXValuePrinting.py (1656 of 1807) PASS: lldb-api :: commands/process/launch/TestProcessLaunch.py (1657 of 1807) PASS: lldb-shell :: SymbolFile/NativePDB/bitfields.cpp (1658 of 1807) PASS: lldb-api :: lang/objc/objc-struct-return/TestObjCStructReturn.py (1659 of 1807) PASS: lldb-unit :: UnwindAssembly/x86/./UnwindAssemblyx86Tests/Testx86AssemblyInspectionEngine.TestPushEBP (1660 of 1807) PASS: lldb-unit :: SymbolFile/NativePDB/./SymbolFileNativePDBTests/PDBFPOProgramToDWARFExpressionTests.SingleAssignmentRegisterRef (1661 of 1807) PASS: lldb-unit :: Utility/./UtilityTests/Predicate.WaitForValueNotEqualTo (1662 of 1807) PASS: lldb-unit :: Utility/./UtilityTests/ScalarTest.Comparison (1663 of 1807) PASS: lldb-api :: commands/settings/quoting/TestQuoting.py (1664 of 1807) PASS: lldb-api :: tools/lldb-server/TestGdbRemoteRegisterState.py (1665 of 1807) PASS: lldb-api :: commands/expression/char/TestExprsChar.py (1666 of 1807) PASS: lldb-api :: functionalities/thread/concurrent_events/TestConcurrentDelayedCrashWithBreakpointSignal.py (1667 of 1807) PASS: lldb-shell :: SymbolFile/Breakpad/line-table-edgecases.test (1668 of 1807) PASS: lldb-shell :: Quit/TestQuitExitCodeImplicit0.test (1669 of 1807) PASS: lldb-unit :: Utility/./UtilityTests/BinaryStreamTest.PutULEB128EightBytes (1670 of 1807) PASS: lldb-unit :: Utility/./UtilityTests/VMRange.IsValid (1671 of 1807) PASS: lldb-shell :: ObjectFile/ELF/section-types.yaml (1672 of 1807) PASS: lldb-unit :: Host/./HostTests/SocketTest.TCPListen0ConnectAccept (1673 of 1807) PASS: lldb-api :: commands/watchpoints/watchpoint_disable/TestWatchpointDisable.py (1674 of 1807) PASS: lldb-unit :: Utility/./UtilityTests/ScalarTest.ExtractBitfield (1675 of 1807) UNSUPPORTED: lldb-api :: lang/c/typedef/Testtypedef.py (1676 of 1807) PASS: lldb-api :: lang/objc/foundation/TestObjCMethodsNSError.py (1677 of 1807) PASS: lldb-api :: python_api/signals/TestSignalsAPI.py (1678 of 1807) PASS: lldb-api :: functionalities/gdb_remote_client/TestNoWatchpointSupportInfo.py (1679 of 1807) PASS: lldb-api :: tools/lldb-server/commandline/TestStubSetSID.py (1680 of 1807) PASS: lldb-shell :: ObjectFile/PECOFF/symbol.yaml (1681 of 1807) PASS: lldb-api :: lang/c/anonymous/TestAnonymous.py (1682 of 1807) PASS: lldb-shell :: Expr/TestMultilineExpr.test (1683 of 1807) PASS: lldb-unit :: Utility/./UtilityTests/VMRange.Comparison (1684 of 1807) PASS: lldb-unit :: Process/gdb-remote/./ProcessGdbRemoteTests/GDBRemoteCommunicationClientTest.WriteRegister (1685 of 1807) PASS: lldb-unit :: Process/gdb-remote/./ProcessGdbRemoteTests/GDBRemoteCommunicationClientTest.GetModulesInfoInvalidResponse (1686 of 1807) PASS: lldb-shell :: Breakpoint/case-sensitive.test (1687 of 1807) PASS: lldb-shell :: SymbolFile/DWARF/debug-types-address-ranges.s (1688 of 1807) PASS: lldb-unit :: Utility/./UtilityTests/AnsiTerminal.Twice (1689 of 1807) PASS: lldb-api :: lang/c/forward/TestForwardDeclaration.py (1690 of 1807) PASS: lldb-shell :: Driver/TestCommands.test (1691 of 1807) PASS: lldb-unit :: Utility/./UtilityTests/StringExtractorTest.GetU64BigEndian (1692 of 1807) PASS: lldb-unit :: Host/./HostTests/MainLoopTest.DetectsEOF (1693 of 1807) PASS: lldb-api :: functionalities/modern-type-lookup/basic/TestBasicModernTypeLookup.py (1694 of 1807) PASS: lldb-api :: lang/objc/foundation/TestObjCMethods2.py (1695 of 1807) PASS: lldb-api :: lang/objc/modules-cache/TestClangModulesCache.py (1696 of 1807) PASS: lldb-api :: functionalities/breakpoint/breakpoint_hit_count/TestBreakpointHitCount.py (1697 of 1807) PASS: lldb-api :: lang/objc/objc-stepping/TestObjCStepping.py (1698 of 1807) PASS: lldb-unit :: Process/gdb-remote/./ProcessGdbRemoteTests/GDBRemoteCommunicationClientTest.ReadRegister (1699 of 1807) PASS: lldb-unit :: Utility/./UtilityTests/StreamTest.PutCharWhitespace (1700 of 1807) UNSUPPORTED: lldb-shell :: Expr/TestIRMemoryMapWindows.test (1701 of 1807) PASS: lldb-unit :: Utility/./UtilityTests/StringListTest.RemoveBlankLines (1702 of 1807) PASS: lldb-api :: functionalities/data-formatter/data-formatter-objc/TestDataFormatterObjCNSError.py (1703 of 1807) PASS: lldb-unit :: Utility/./UtilityTests/StreamTeeTest.SetStreamAtIndexOverwrite (1704 of 1807) PASS: lldb-api :: python_api/sbdata/TestSBData.py (1705 of 1807) PASS: lldb-api :: functionalities/memory/cache/TestMemoryCache.py (1706 of 1807) PASS: lldb-api :: python_api/sblaunchinfo/TestSBLaunchInfo.py (1707 of 1807) PASS: lldb-api :: functionalities/thread/create_after_attach/TestCreateAfterAttach.py (1708 of 1807) PASS: lldb-unit :: Breakpoint/./LLDBBreakpointTests/BreakpointIDTest.StringIsBreakpointName (1709 of 1807) PASS: lldb-api :: commands/expression/ignore-artificial-constructors/TestIgnoreArtificialConstructors.py (1710 of 1807) PASS: lldb-api :: functionalities/data-formatter/data-formatter-synth/TestDataFormatterSynth.py (1711 of 1807) PASS: lldb-api :: python_api/default-constructor/TestDefaultConstructorForAPIObjects.py (1712 of 1807) PASS: lldb-api :: macosx/DBGSourcePathRemapping/TestDSYMSourcePathRemapping.py (1713 of 1807) PASS: lldb-api :: types/TestDoubleTypes.py (1714 of 1807) PASS: lldb-api :: types/TestFloatTypesExpr.py (1715 of 1807) PASS: lldb-shell :: Reproducer/TestWorkingDir.test (1716 of 1807) PASS: lldb-shell :: SymbolFile/DWARF/split-dwarf-multiple-cu.ll (1717 of 1807) PASS: lldb-api :: functionalities/gdb_remote_client/TestGDBRemoteClient.py (1718 of 1807) PASS: lldb-api :: lang/objc/objc-ivar-offsets/TestObjCIvarOffsets.py (1719 of 1807) PASS: lldb-shell :: SymbolFile/DWARF/DW_OP_piece-struct.s (1720 of 1807) PASS: lldb-unit :: Utility/./UtilityTests/ScalarTest.GetValue (1721 of 1807) PASS: lldb-api :: lang/cpp/scope/TestCppScope.py (1722 of 1807) PASS: lldb-unit :: Utility/./UtilityTests/FileSpecTest.AppendPathComponent (1723 of 1807) PASS: lldb-api :: functionalities/ptr_refs/TestPtrRefs.py (1724 of 1807) PASS: lldb-api :: python_api/value/empty_class/TestValueAPIEmptyClass.py (1725 of 1807) PASS: lldb-api :: functionalities/data-formatter/data-formatter-stl/libcxx/string/TestDataFormatterLibcxxString.py (1726 of 1807) PASS: lldb-api :: sample_test/TestSampleTest.py (1727 of 1807) UNSUPPORTED: lldb-api :: functionalities/darwin_log/filter/exact_match/message/TestDarwinLogFilterMatchMessage.py (1728 of 1807) PASS: lldb-shell :: SymbolFile/DWARF/debug_ranges_and_rnglists.test (1729 of 1807) PASS: lldb-api :: python_api/frame/get-variables/TestGetVariables.py (1730 of 1807) PASS: lldb-unit :: Expression/./ExpressionTests/DiagnosticManagerTest.GetStringBasic (1731 of 1807) PASS: lldb-unit :: Target/./TargetTests/PathMappingListTest.AbsoluteTests (1732 of 1807) PASS: lldb-api :: functionalities/breakpoint/objc/TestObjCBreakpoints.py (1733 of 1807) PASS: lldb-unit :: Utility/./UtilityTests/VMRange.Clear (1734 of 1807) PASS: lldb-api :: lang/c/stepping/TestStepAndBreakpoints.py (1735 of 1807) PASS: lldb-unit :: Utility/./UtilityTests/TimerTest.CategoryTimes (1736 of 1807) UNSUPPORTED: lldb-api :: functionalities/thread/thread_specific_break_plus_condition/TestThreadSpecificBpPlusCondition.py (1737 of 1807) UNSUPPORTED: lldb-shell :: Unwind/eh-frame-small-fde.test (1738 of 1807) PASS: lldb-unit :: Process/gdb-remote/./ProcessGdbRemoteTests/GDBRemoteCommunicationServerTest.SendErrorResponse_StringError (1739 of 1807) PASS: lldb-api :: lang/cpp/class_static/TestStaticVariables.py (1740 of 1807) PASS: lldb-unit :: Utility/./UtilityTests/BinaryStreamTest.PutSLEB128Zero (1741 of 1807) PASS: lldb-api :: functionalities/data-formatter/data-formatter-enum-format/TestDataFormatterEnumFormat.py (1742 of 1807) PASS: lldb-api :: functionalities/thread/concurrent_events/TestConcurrentSignalDelayWatch.py (1743 of 1807) PASS: lldb-unit :: Expression/./ExpressionTests/DiagnosticManagerTest.AppendMessageNoDiag (1744 of 1807) PASS: lldb-api :: functionalities/thread/concurrent_events/TestConcurrentManyCrash.py (1745 of 1807) PASS: lldb-api :: functionalities/data-formatter/typedef_array/TestTypedefArray.py (1746 of 1807) PASS: lldb-api :: types/TestDoubleTypesExpr.py (1747 of 1807) PASS: lldb-api :: functionalities/data-formatter/parray/TestPrintArray.py (1748 of 1807) PASS: lldb-api :: commands/expression/rdar42038760/TestScalarURem.py (1749 of 1807) PASS: lldb-api :: commands/expression/import-std-module/list-dbg-info-content/TestDbgInfoContentList.py (1750 of 1807) PASS: lldb-api :: functionalities/data-formatter/data-formatter-proper-plurals/TestFormattersOneIsSingular.py (1751 of 1807) PASS: lldb-shell :: ObjectFile/ELF/PT_LOAD.yaml (1752 of 1807) PASS: lldb-api :: types/TestFloatTypes.py (1753 of 1807) PASS: lldb-api :: functionalities/postmortem/minidump/TestMiniDump.py (1754 of 1807) PASS: lldb-unit :: Target/./TargetTests/MemoryRegionInfoTest.Formatv (1755 of 1807) PASS: lldb-unit :: Expression/./ExpressionTests/DiagnosticManagerTest.HasFixits (1756 of 1807) PASS: lldb-shell :: Minidump/Windows/find-module.test (1757 of 1807) PASS: lldb-api :: python_api/watchpoint/condition/TestWatchpointConditionAPI.py (1758 of 1807) PASS: lldb-api :: functionalities/gdb_remote_client/TestTargetXMLArch.py (1759 of 1807) PASS: lldb-api :: lang/cpp/offsetof/TestOffsetofCpp.py (1760 of 1807) UNSUPPORTED: lldb-shell :: SymbolFile/PDB/vbases.test (1761 of 1807) PASS: lldb-api :: lang/cpp/nested-class-other-compilation-unit/TestNestedClassWithParentInAnotherCU.py (1762 of 1807) PASS: lldb-api :: functionalities/data-formatter/data-formatter-objc/TestDataFormatterObjCPlain.py (1763 of 1807) PASS: lldb-shell :: Breakpoint/debug_rnglist_offset_pair.test (1764 of 1807) PASS: lldb-api :: functionalities/data-formatter/setvaluefromcstring/TestSetValueFromCString.py (1765 of 1807) PASS: lldb-unit :: Host/./HostTests/MainLoopTest.UnmonitoredSignal (1766 of 1807) UNSUPPORTED: lldb-shell :: SymbolFile/PDB/variables.test (1767 of 1807) PASS: lldb-unit :: Utility/./UtilityTests/StringLexerTest.AdvanceIf (1768 of 1807) PASS: lldb-api :: functionalities/breakpoint/step_over_breakpoint/TestStepOverBreakpoint.py (1769 of 1807) UNSUPPORTED: lldb-shell :: Register/x86-ymm-read.test (1770 of 1807) FAIL: lldb-api :: terminal/TestEditline.py (1771 of 1807) ******************** TEST 'lldb-api :: terminal/TestEditline.py' FAILED ******************** lldb version 10.0.99 (http://labmaster3.local/git/llvm-project.git revision 2916489c54a303971bc546f287b71532d49ddd33) clang revision c9276fbfdf0c7caf1576b2db562286d7cec7e53b llvm revision c9276fbfdf0c7caf1576b2db562286d7cec7e53b (lldb) settings set symbols.enable-external-lookup false (lldb) settings set plugin.process.gdb-remote.packet-timeout 60 (lldb) settings set symbols.clang-modules-cache-path "/Users/buildslave/jenkins/workspace/lldb-cmake-sanitized/lldb-build/lldb-test-build.noindex/module-cache-lldb/lldb-api" (lldb) settings set use-color false (lldb) el rintphp el rintprinthel printelp print Evaluate an expression on the current thread. Displays any returned value with LLDB's default formatting. Expects 'raw' input (see 'help raw-input'.)

Hide Details

Syntax: print <expr>

Hide Details

Command Options Usage: print <expr>

Hide Details

Hide Details

'print' is an abbreviation for 'expression --' (lldb) el tepshp el tepstephel stepelp step Source level single step, stepping into calls. Defaults to current thread unless specified.

Hide Details

Syntax: step <cmd-options> [<thread-id>]

Hide Details

Command Options Usage: step [-c <count>] [-e <linenum>] [-m <run-mode>] [-a <boolean>] [-t <function-name>] [-A <boolean>] [-r <regular-expression>] [<thread-id>]

Hide Details

-A <boolean> ( --step-out-avoids-no-debug <boolean> ) A boolean value, if true stepping out of functions will continue to step out till it hits a function with debug information.

Hide Details

-a <boolean> ( --step-in-avoids-no-debug <boolean> ) A boolean value that sets whether stepping into functions will step over functions with no debug information.

Hide Details

-c <count> ( --count <count> ) How many times to perform the stepping operation - currently only supported for step-inst and next-inst.

Hide Details

-e <linenum> ( --end-linenumber <linenum> ) The line at which to stop stepping - defaults to the next line and only supported for step-in and step-over. You can also pass the string 'block' to step to the end of the current block. This is particularly use in conjunction with --step-target to step through a complex calling sequence.

Hide Details

-m <run-mode> ( --run-mode <run-mode> ) Determine how to run other threads while stepping the current thread. Values: this-thread | all-threads | while-stepping

Hide Details

-r <regular-expression> ( --step-over-regexp <regular-expression> ) A regular expression that definesfunction names to not to stop at when stepping in.

Hide Details

-t <function-name> ( --step-in-target <function-name> ) The name of the directly called function step in should stop at when stepping into.

Hide Details

This command takes options and free-form arguments. If your arguments resemble option specifiers (i.e., they start with a - or --), you must use ' -- ' between the end of the command options and the beginning of the arguments.

Hide Details

'step' is an abbreviation for 'thread step-in' (lldb) el xitehp el xitexithel exitelp exit Quit the LLDB debugger.

Hide Details

Syntax: exit

Hide Details

'exit' is an abbreviation for 'quit' (lldb) settings set interpreter.prompt-on-quit false LLDB library dir: /Users/buildslave/jenkins/workspace/lldb-cmake-sanitized/lldb-build/bin LLDB import library dir: /Users/buildslave/jenkins/workspace/lldb-cmake-sanitized/lldb-build/bin libstdcxx tests will not be run because: Don't know how to build with libstdcxx on macosx Skipping following debug info categories: ['dwo']

Hide Details

Session logs for test failures/errors/unexpected successes will go into directory '/Users/buildslave/jenkins/workspace/lldb-cmake-sanitized/test/logs' Command invoked: /Users/buildslave/jenkins/workspace/lldb-cmake-sanitized/llvm-project/lldb/test/API/dotest.py --arch=x86_64 -s /Users/buildslave/jenkins/workspace/lldb-cmake-sanitized/lldb-build/lldb-test-traces -S nm -u CXXFLAGS -u CFLAGS --executable /Users/buildslave/jenkins/workspace/lldb-cmake-sanitized/lldb-build/./bin/lldb --compiler /Users/buildslave/jenkins/workspace/lldb-cmake-sanitized/lldb-build/./bin/clang --dsymutil /Users/buildslave/jenkins/workspace/lldb-cmake-sanitized/lldb-build/./bin/dsymutil --filecheck /Users/buildslave/jenkins/workspace/lldb-cmake-sanitized/lldb-build/./bin/FileCheck --codesign-identity lldb_codesign --server /Users/buildslave/jenkins/workspace/lldb-cmake-sanitized/lldb-build/./bin/debugserver --arch x86_64 --build-dir /Users/buildslave/jenkins/workspace/lldb-cmake-sanitized/lldb-build/lldb-test-build.noindex -s=/Users/buildslave/jenkins/workspace/lldb-cmake-sanitized/test/logs -t --env TERM=vt100 --env LLVM_LIBS_DIR=/Users/buildslave/jenkins/workspace/lldb-cmake-sanitized/lldb-build/./lib --build-dir /Users/buildslave/jenkins/workspace/lldb-cmake-sanitized/lldb-build/lldb-test-build.noindex --lldb-module-cache-dir /Users/buildslave/jenkins/workspace/lldb-cmake-sanitized/lldb-build/lldb-test-build.noindex/module-cache-lldb/lldb-api --clang-module-cache-dir /Users/buildslave/jenkins/workspace/lldb-cmake-sanitized/lldb-build/lldb-test-build.noindex/module-cache-clang/lldb-api /Users/buildslave/jenkins/workspace/lldb-cmake-sanitized/llvm-project/lldb/packages/Python/lldbsuite/test/terminal -p TestEditline.py Change dir to: /Users/buildslave/jenkins/workspace/lldb-cmake-sanitized/llvm-project/lldb/packages/Python/lldbsuite/test/terminal runCmd: settings set symbols.enable-external-lookup false output:

Hide Details

runCmd: settings set plugin.process.gdb-remote.packet-timeout 60 output:

Hide Details

runCmd: settings set symbols.clang-modules-cache-path "/Users/buildslave/jenkins/workspace/lldb-cmake-sanitized/lldb-build/lldb-test-build.noindex/module-cache-lldb/lldb-api" output:

Hide Details

runCmd: settings set use-color false output:

Hide Details

FAIL: LLDB (/Users/buildslave/jenkins/workspace/lldb-cmake-sanitized/lldb-build/bin/clang-10-x86_64) :: test_left_right_arrow (TestEditline.EditlineTest) tearing down the child process....

Hide Details

CLEANUP ERROR: LLDB (/Users/buildslave/jenkins/workspace/lldb-cmake-sanitized/lldb-build/bin/clang-10-x86_64) :: test_left_right_arrow (TestEditline.EditlineTest) Restore dir to: /Users/buildslave/jenkins/workspace/lldb-cmake-sanitized/lldb-build/tools/lldb/test ====================================================================== ERROR: test_left_right_arrow (TestEditline.EditlineTest) Test that ctrl+left/right arrow navigates words correctly. ---------------------------------------------------------------------- Traceback (most recent call last): File "/Users/buildslave/jenkins/workspace/lldb-cmake-sanitized/llvm-project/lldb/third_party/Python/module/pexpect-4.6/pexpect/pty_spawn.py", line 23, in _wrap_ptyprocess_err yield File "/Users/buildslave/jenkins/workspace/lldb-cmake-sanitized/llvm-project/lldb/third_party/Python/module/pexpect-4.6/pexpect/pty_spawn.py", line 327, in close self.ptyproc.close(force=force) File "/Users/buildslave/jenkins/workspace/lldb-cmake-sanitized/llvm-project/lldb/third_party/Python/module/ptyprocess-0.6.0/ptyprocess/ptyprocess.py", line 400, in close raise PtyProcessError('Could not terminate the child.') ptyprocess.util.PtyProcessError: Could not terminate the child.

Hide Details

During handling of the above exception, another exception occurred:

Hide Details

Traceback (most recent call last): File "/Users/buildslave/jenkins/workspace/lldb-cmake-sanitized/llvm-project/lldb/packages/Python/lldbsuite/test/terminal/TestEditline.py", line 49, in test_left_right_arrow self.quit() File "/Users/buildslave/jenkins/workspace/lldb-cmake-sanitized/llvm-project/lldb/packages/Python/lldbsuite/test/lldbpexpect.py", line 61, in quit self.child.close(force=not gracefully) File "/Users/buildslave/jenkins/workspace/lldb-cmake-sanitized/llvm-project/lldb/third_party/Python/module/pexpect-4.6/pexpect/pty_spawn.py", line 327, in close self.ptyproc.close(force=force) File "/usr/local/Cellar/python/3.7.0/Frameworks/Python.framework/Versions/3.7/lib/python3.7/contextlib.py", line 130, in __exit__ self.gen.throw(type, value, traceback) File "/Users/buildslave/jenkins/workspace/lldb-cmake-sanitized/llvm-project/lldb/third_party/Python/module/pexpect-4.6/pexpect/pty_spawn.py", line 25, in _wrap_ptyprocess_err raise ExceptionPexpect(*e.args) pexpect.exceptions.ExceptionPexpect: Could not terminate the child. Config=x86_64-/Users/buildslave/jenkins/workspace/lldb-cmake-sanitized/lldb-build/bin/clang-10 ---------------------------------------------------------------------- Ran 1 test in 2.498s

Hide Details

RESULT: FAILED (0 passes, 0 failures, 1 errors, 0 skipped, 0 expected failures, 0 unexpected successes)

Hide Details

******************** PASS: lldb-unit :: Utility/./UtilityTests/RegularExpression.CopyAssignment (1772 of 1807) PASS: lldb-api :: functionalities/data-formatter/data-formatter-stl/libcxx/variant/TestDataFormatterLibcxxVariant.py (1773 of 1807) PASS: lldb-unit :: Utility/./UtilityTests/StreamTest.PutHex32ByteOrderLittle (1774 of 1807) PASS: lldb-api :: python_api/sbvalue_persist/TestSBValuePersist.py (1775 of 1807) PASS: lldb-unit :: Core/./LLDBCoreTests/MangledTest.ResultForBlockInvocation (1776 of 1807) PASS: lldb-api :: python_api/lldbutil/iter/TestRegistersIterator.py (1777 of 1807) PASS: lldb-api :: commands/expression/import-std-module/vector-of-vectors/TestVectorOfVectors.py (1778 of 1807) UNSUPPORTED: lldb-shell :: BuildScript/toolchain-msvc.test (1779 of 1807) PASS: lldb-api :: lang/cpp/limit-debug-info/TestWithLimitDebugInfo.py (1780 of 1807) PASS: lldb-unit :: debugserver/./debugserverTests/RNBSocket.LoopBackListenIPv6 (1781 of 1807) PASS: lldb-api :: commands/expression/ir-interpreter-phi-nodes/TestIRInterpreterPHINodes.py (1782 of 1807) PASS: lldb-api :: lang/cpp/std-function-step-into-callable/TestStdFunctionStepIntoCallable.py (1783 of 1807) PASS: lldb-shell :: SymbolFile/DWARF/debug_ranges-missing-section.s (1784 of 1807) PASS: lldb-unit :: UnwindAssembly/x86/./UnwindAssemblyx86Tests/Testx86AssemblyInspectionEngine.TestStackRealignMSVC_i386 (1785 of 1807) PASS: lldb-unit :: Utility/./UtilityTests/ReproducerTest.SetReplay (1786 of 1807) PASS: lldb-unit :: Utility/./UtilityTests/StatusTest.ErrorConversion (1787 of 1807) PASS: lldb-unit :: UnwindAssembly/x86/./UnwindAssemblyx86Tests/Testx86AssemblyInspectionEngine.TestPushExtended (1788 of 1807) PASS: lldb-unit :: Utility/./UtilityTests/BinaryStreamTest.PutSLEB128NineBytes (1789 of 1807) PASS: lldb-shell :: SymbolFile/DWARF/dir-separator-no-comp-dir-relative-name.s (1790 of 1807) PASS: lldb-api :: lang/c/vla/TestVLA.py (1791 of 1807) PASS: lldb-api :: commands/expression/po_verbosity/TestPoVerbosity.py (1792 of 1807) UNSUPPORTED: lldb-api :: functionalities/darwin_log/filter/exact_match/category/TestDarwinLogFilterMatchCategory.py (1793 of 1807) PASS: lldb-api :: macosx/function-starts/TestFunctionStarts.py (1794 of 1807) PASS: lldb-api :: functionalities/thread/concurrent_events/TestConcurrentTwoWatchpointsOneSignal.py (1795 of 1807) PASS: lldb-api :: lang/objc/objc-foundation-dictionary-empty/TestNSDictionary0.py (1796 of 1807) PASS: lldb-api :: commands/watchpoints/watchpoint_set_command/TestWatchLocationWithWatchSet.py (1797 of 1807) PASS: lldb-api :: functionalities/thread/concurrent_events/TestConcurrentCrashWithWatchpoint.py (1798 of 1807) PASS: lldb-api :: python_api/section/TestSectionAPI.py (1799 of 1807) PASS: lldb-api :: python_api/frame/TestFrames.py (1800 of 1807) PASS: lldb-api :: api/check_public_api_headers/TestPublicAPIHeaders.py (1801 of 1807) UNSUPPORTED: lldb-api :: lang/objc/objc-dynamic-value/TestObjCDynamicValue.py (1802 of 1807) PASS: lldb-api :: lang/objc/hidden-ivars/TestHiddenIvars.py (1803 of 1807) PASS: lldb-api :: lang/cpp/enum_types/TestCPP11EnumTypes.py (1804 of 1807) PASS: lldb-api :: tools/lldb-server/TestGdbRemote_vCont.py (1805 of 1807) PASS: lldb-api :: commands/expression/import-std-module/queue/TestQueue.py (1806 of 1807) PASS: lldb-api :: lang/objc/objc-new-syntax/TestObjCNewSyntaxLiteral.py (1807 of 1807)

Hide Details

Testing Time: 4082.46s ******************** Failing Tests (2): lldb-api :: tools/lldb-server/TestGdbRemoteProcessInfo.py lldb-api :: terminal/TestEditline.py

Hide Details

******************** Timed Out Tests (1): lldb-api :: types/TestIntegerTypesExpr.py

Hide Details

Hide Details

Slowest Tests: -------------------------------------------------------------------------- 298.00s: lldb-api :: lang/objc/foundation/TestObjCMethodsNSError.py 300.83s: lldb-api :: lang/objc/foundation/TestObjCMethodsString.py 308.77s: lldb-api :: lang/objc/exceptions/TestObjCExceptions.py 338.78s: lldb-api :: lang/c/anonymous/TestAnonymous.py 346.06s: lldb-api :: tools/lldb-server/TestGdbRemoteThreadsInStopReply.py 382.04s: lldb-api :: lang/objc/real-definition/TestRealDefinition.py 389.78s: lldb-api :: python_api/target/TestTargetAPI.py 449.24s: lldb-api :: commands/target/basic/TestTargetCommand.py 473.22s: lldb-api :: lang/cpp/namespace/TestNamespace.py 519.41s: lldb-api :: lang/objc/hidden-ivars/TestHiddenIvars.py 533.53s: lldb-api :: functionalities/return-value/TestReturnValue.py 540.09s: lldb-api :: lang/objc/foundation/TestObjCMethods.py 546.21s: lldb-api :: api/multithreaded/TestMultithreaded.py 564.98s: lldb-api :: functionalities/load_unload/TestLoadUnload.py 694.14s: lldb-api :: lang/cpp/enum_types/TestCPP11EnumTypes.py 716.77s: lldb-api :: lang/objc/foundation/TestFoundationDisassembly.py 828.86s: lldb-api :: tools/lldb-server/TestLldbGdbServer.py 1030.78s: lldb-api :: types/TestIntegerTypes.py 1035.09s: lldb-api :: lang/cpp/namespace/TestNamespaceLookup.py 1202.28s: lldb-api :: types/TestIntegerTypesExpr.py

Hide Details

Tests Times: -------------------------------------------------------------------------- [ Range ] :: [ Percentage ] :: [ Count ] -------------------------------------------------------------------------- [ 0s, 100s) :: [*********************************** ] :: [1611/1807] [ 100s, 200s) :: [*** ] :: [ 153/1807] [ 200s, 300s) :: [ ] :: [ 23/1807] [ 300s, 400s) :: [ ] :: [ 5/1807] [ 400s, 500s) :: [ ] :: [ 3/1807] [ 500s, 600s) :: [ ] :: [ 5/1807] [ 600s, 700s) :: [ ] :: [ 1/1807] [ 700s, 800s) :: [ ] :: [ 2/1807] [ 800s, 900s) :: [ ] :: [ 1/1807] [ 900s,1000s) :: [ ] :: [ 0/1807] [1000s,1100s) :: [ ] :: [ 0/1807] [1100s,1200s) :: [ ] :: [ 2/1807] [1200s,1300s) :: [ ] :: [ 1/1807] Expected Passes : 1651 Expected Failures : 6 Unsupported Tests : 147 Unexpected Failures: 2 Individual Timeouts: 1 FAILED: tools/lldb/test/CMakeFiles/check-lldb-lit cd /Users/buildslave/jenkins/workspace/lldb-cmake-sanitized/lldb-build/tools/lldb/test && /usr/local/bin/python /Users/buildslave/jenkins/workspace/lldb-cmake-sanitized/lldb-build/./bin/llvm-lit -v --time-tests --shuffle --xunit-xml-output=/Users/buildslave/jenkins/workspace/lldb-cmake-sanitized/test/results.xml -v --timeout 1200 /Users/buildslave/jenkins/workspace/lldb-cmake-sanitized/lldb-build/tools/lldb/test ninja: build stopped: subcommand failed. Command failed: Command '['/usr/bin/env', 'TERM=vt100', '/usr/local/bin/ninja', '-v', 'check-lldb']' returned non-zero exit status 1. Command: ['/usr/bin/env', 'TERM=vt100', '/usr/local/bin/ninja', '-v', 'check-lldb'] [Pipeline] } [Pipeline] // timeout [Pipeline] } [Pipeline] // stage [Pipeline] stage [Pipeline] { (Declarative: Post Actions) [Pipeline] scanForIssues No credentials specified [Clang (LLVM based)] Sleeping for 5 seconds due to JENKINS-32191... [Clang (LLVM based)] Parsing console log (workspace: '/Users/buildslave/jenkins/workspace/lldb-cmake-sanitized') [Pipeline] junit Recording test results [Pipeline] } [Pipeline] // stage [Pipeline] } [Pipeline] // withEnv [Pipeline] } [Pipeline] // node [Pipeline] End of Pipeline [BFA] Scanning build for known causes... [BFA] Found failure cause(s): [BFA] Ninja target failed from category Compile [BFA] Regression test failed from category Test [BFA] Done. 1s ERROR: script returned exit code 1 Finished: FAILURE