FailedConsole Output

Skipping 8,342 KB.. Full Log
901a6
  llvm revision c1b13a1b17719aebace1b3be7a6ac7f90b1901a6
LLDB library dir: /Users/buildslave/jenkins/workspace/lldb-cmake-sanitized/lldb-build/bin
LLDB import library dir: /Users/buildslave/jenkins/workspace/lldb-cmake-sanitized/lldb-build/bin
libstdcxx tests will not be run because: Don't know how to build with libstdcxx on macosx
Skipping following debug info categories: ['dwo']
AddressSanitizer report breakpoint hit. Use 'thread info -s' to get extended information about the report.
AddressSanitizer report breakpoint hit. Use 'thread info -s' to get extended information about the report.
AddressSanitizer report breakpoint hit. Use 'thread info -s' to get extended information about the report.

Hide Details

Session logs for test failures/errors/unexpected successes will go into directory '/Users/buildslave/jenkins/workspace/lldb-cmake-sanitized/test/logs' Command invoked: /Users/buildslave/jenkins/workspace/lldb-cmake-sanitized/llvm-project/lldb/test/API/dotest.py --arch x86_64 -s /Users/buildslave/jenkins/workspace/lldb-cmake-sanitized/lldb-build/lldb-test-traces -S nm -u CXXFLAGS -u CFLAGS --codesign-identity lldb_codesign --server /Users/buildslave/jenkins/workspace/lldb-cmake-sanitized/lldb-build/./bin/debugserver --arch x86_64 --build-dir /Users/buildslave/jenkins/workspace/lldb-cmake-sanitized/lldb-build/lldb-test-build.noindex -s=/Users/buildslave/jenkins/workspace/lldb-cmake-sanitized/test/logs -t --env TERM=vt100 --env LLVM_LIBS_DIR=/Users/buildslave/jenkins/workspace/lldb-cmake-sanitized/lldb-build/./lib --inferior-env ASAN_OPTIONS=detect_stack_use_after_return=1 --inferior-env DYLD_INSERT_LIBRARIES=/Users/buildslave/jenkins/workspace/lldb-cmake-sanitized/host-compiler/lib/clang/10.0.0/lib/darwin/libclang_rt.asan_osx_dynamic.dylib --build-dir /Users/buildslave/jenkins/workspace/lldb-cmake-sanitized/lldb-build/lldb-test-build.noindex --lldb-module-cache-dir /Users/buildslave/jenkins/workspace/lldb-cmake-sanitized/lldb-build/lldb-test-build.noindex/module-cache-lldb/lldb-api --clang-module-cache-dir /Users/buildslave/jenkins/workspace/lldb-cmake-sanitized/lldb-build/lldb-test-build.noindex/module-cache-clang/lldb-api --executable /Users/buildslave/jenkins/workspace/lldb-cmake-sanitized/lldb-build/./bin/lldb --compiler /Users/buildslave/jenkins/workspace/lldb-cmake-sanitized/lldb-build/./bin/clang --dsymutil /Users/buildslave/jenkins/workspace/lldb-cmake-sanitized/lldb-build/./bin/dsymutil --filecheck /Users/buildslave/jenkins/workspace/lldb-cmake-sanitized/lldb-build/./bin/FileCheck /Users/buildslave/jenkins/workspace/lldb-cmake-sanitized/llvm-project/lldb/packages/Python/lldbsuite/test/functionalities/data-formatter/data-formatter-objc -p TestDataFormatterObjCNSError.py Change dir to: /Users/buildslave/jenkins/workspace/lldb-cmake-sanitized/llvm-project/lldb/packages/Python/lldbsuite/test/functionalities/data-formatter/data-formatter-objc runCmd: settings set symbols.enable-external-lookup false output:

Hide Details

runCmd: settings set plugin.process.gdb-remote.packet-timeout 60 output:

Hide Details

runCmd: settings set symbols.clang-modules-cache-path "/Users/buildslave/jenkins/workspace/lldb-cmake-sanitized/lldb-build/lldb-test-build.noindex/module-cache-lldb/lldb-api" output:

Hide Details

runCmd: settings set use-color false output:

Hide Details

runCmd: settings set target.env-vars ASAN_OPTIONS=detect_stack_use_after_return=1 DYLD_INSERT_LIBRARIES=/Users/buildslave/jenkins/workspace/lldb-cmake-sanitized/host-compiler/lib/clang/10.0.0/lib/darwin/libclang_rt.asan_osx_dynamic.dylib output:

Hide Details

runCmd: settings set target.env-vars ASAN_OPTIONS=detect_stack_use_after_return=1 DYLD_INSERT_LIBRARIES=/Users/buildslave/jenkins/workspace/lldb-cmake-sanitized/host-compiler/lib/clang/10.0.0/lib/darwin/libclang_rt.asan_osx_dynamic.dylib output:

Hide Details

FAIL: LLDB (/Users/buildslave/jenkins/workspace/lldb-cmake-sanitized/lldb-build/bin/clang-10-x86_64) :: test_nserror_with_run_command_dsym (TestDataFormatterObjCNSError.ObjCDataFormatterNSError) <bound method SBProcess.Kill of <lldb.SBProcess; proxy of <Swig Object of type 'lldb::SBProcess *' at 0x1235fd090> >>: success

Hide Details

runCmd: settings set symbols.enable-external-lookup false output:

Hide Details

runCmd: settings set plugin.process.gdb-remote.packet-timeout 60 output:

Hide Details

runCmd: settings set symbols.clang-modules-cache-path "/Users/buildslave/jenkins/workspace/lldb-cmake-sanitized/lldb-build/lldb-test-build.noindex/module-cache-lldb/lldb-api" output:

Hide Details

runCmd: settings set use-color false output:

Hide Details

runCmd: settings set target.env-vars ASAN_OPTIONS=detect_stack_use_after_return=1 DYLD_INSERT_LIBRARIES=/Users/buildslave/jenkins/workspace/lldb-cmake-sanitized/host-compiler/lib/clang/10.0.0/lib/darwin/libclang_rt.asan_osx_dynamic.dylib output:

Hide Details

runCmd: settings set target.env-vars ASAN_OPTIONS=detect_stack_use_after_return=1 DYLD_INSERT_LIBRARIES=/Users/buildslave/jenkins/workspace/lldb-cmake-sanitized/host-compiler/lib/clang/10.0.0/lib/darwin/libclang_rt.asan_osx_dynamic.dylib output:

Hide Details

FAIL: LLDB (/Users/buildslave/jenkins/workspace/lldb-cmake-sanitized/lldb-build/bin/clang-10-x86_64) :: test_nserror_with_run_command_dwarf (TestDataFormatterObjCNSError.ObjCDataFormatterNSError) <bound method SBProcess.Kill of <lldb.SBProcess; proxy of <Swig Object of type 'lldb::SBProcess *' at 0x10aefa630> >>: success

Hide Details

UNSUPPORTED: LLDB (/Users/buildslave/jenkins/workspace/lldb-cmake-sanitized/lldb-build/bin/clang-10-x86_64) :: test_nserror_with_run_command_dwo (TestDataFormatterObjCNSError.ObjCDataFormatterNSError) (test case does not fall in any category of interest for this run) runCmd: settings set symbols.enable-external-lookup false output:

Hide Details

runCmd: settings set plugin.process.gdb-remote.packet-timeout 60 output:

Hide Details

runCmd: settings set symbols.clang-modules-cache-path "/Users/buildslave/jenkins/workspace/lldb-cmake-sanitized/lldb-build/lldb-test-build.noindex/module-cache-lldb/lldb-api" output:

Hide Details

runCmd: settings set use-color false output:

Hide Details

runCmd: settings set target.env-vars ASAN_OPTIONS=detect_stack_use_after_return=1 DYLD_INSERT_LIBRARIES=/Users/buildslave/jenkins/workspace/lldb-cmake-sanitized/host-compiler/lib/clang/10.0.0/lib/darwin/libclang_rt.asan_osx_dynamic.dylib output:

Hide Details

runCmd: settings set target.env-vars ASAN_OPTIONS=detect_stack_use_after_return=1 DYLD_INSERT_LIBRARIES=/Users/buildslave/jenkins/workspace/lldb-cmake-sanitized/host-compiler/lib/clang/10.0.0/lib/darwin/libclang_rt.asan_osx_dynamic.dylib output:

Hide Details

FAIL: LLDB (/Users/buildslave/jenkins/workspace/lldb-cmake-sanitized/lldb-build/bin/clang-10-x86_64) :: test_nserror_with_run_command_gmodules (TestDataFormatterObjCNSError.ObjCDataFormatterNSError) <bound method SBProcess.Kill of <lldb.SBProcess; proxy of <Swig Object of type 'lldb::SBProcess *' at 0x1235fd210> >>: success

Hide Details

Restore dir to: /Users/buildslave/jenkins/workspace/lldb-cmake-sanitized/lldb-build/tools/lldb/test ====================================================================== FAIL: test_nserror_with_run_command_dsym (TestDataFormatterObjCNSError.ObjCDataFormatterNSError) Test formatters for NSError. ---------------------------------------------------------------------- Traceback (most recent call last): File "/Users/buildslave/jenkins/workspace/lldb-cmake-sanitized/llvm-project/lldb/packages/Python/lldbsuite/test/lldbtest.py", line 1732, in test_method return attrvalue(self) File "/Users/buildslave/jenkins/workspace/lldb-cmake-sanitized/llvm-project/lldb/packages/Python/lldbsuite/test/functionalities/data-formatter/data-formatter-objc/TestDataFormatterObjCNSError.py", line 20, in test_nserror_with_run_command self.appkit_tester_impl(self.nserror_data_formatter_commands) File "/Users/buildslave/jenkins/workspace/lldb-cmake-sanitized/llvm-project/lldb/packages/Python/lldbsuite/test/functionalities/data-formatter/data-formatter-objc/ObjCDataFormatterTestCase.py", line 19, in appkit_tester_impl self.appkit_common_data_formatters_command() File "/Users/buildslave/jenkins/workspace/lldb-cmake-sanitized/llvm-project/lldb/packages/Python/lldbsuite/test/functionalities/data-formatter/data-formatter-objc/ObjCDataFormatterTestCase.py", line 26, in appkit_common_data_formatters_command lldb.SBFileSpec('main.m', False)) File "/Users/buildslave/jenkins/workspace/lldb-cmake-sanitized/llvm-project/lldb/packages/Python/lldbsuite/test/lldbutil.py", line 868, in run_to_source_breakpoint only_one_thread, extra_images) File "/Users/buildslave/jenkins/workspace/lldb-cmake-sanitized/llvm-project/lldb/packages/Python/lldbsuite/test/lldbutil.py", line 797, in run_to_breakpoint_do_run test.assertEqual(num_threads, 1, "Expected 1 thread to stop at breakpoint, %d did."%(num_threads)) AssertionError: 0 != 1 : Expected 1 thread to stop at breakpoint, 0 did. Config=x86_64-/Users/buildslave/jenkins/workspace/lldb-cmake-sanitized/lldb-build/bin/clang-10 ====================================================================== FAIL: test_nserror_with_run_command_dwarf (TestDataFormatterObjCNSError.ObjCDataFormatterNSError) Test formatters for NSError. ---------------------------------------------------------------------- Traceback (most recent call last): File "/Users/buildslave/jenkins/workspace/lldb-cmake-sanitized/llvm-project/lldb/packages/Python/lldbsuite/test/lldbtest.py", line 1732, in test_method return attrvalue(self) File "/Users/buildslave/jenkins/workspace/lldb-cmake-sanitized/llvm-project/lldb/packages/Python/lldbsuite/test/functionalities/data-formatter/data-formatter-objc/TestDataFormatterObjCNSError.py", line 20, in test_nserror_with_run_command self.appkit_tester_impl(self.nserror_data_formatter_commands) File "/Users/buildslave/jenkins/workspace/lldb-cmake-sanitized/llvm-project/lldb/packages/Python/lldbsuite/test/functionalities/data-formatter/data-formatter-objc/ObjCDataFormatterTestCase.py", line 19, in appkit_tester_impl self.appkit_common_data_formatters_command() File "/Users/buildslave/jenkins/workspace/lldb-cmake-sanitized/llvm-project/lldb/packages/Python/lldbsuite/test/functionalities/data-formatter/data-formatter-objc/ObjCDataFormatterTestCase.py", line 26, in appkit_common_data_formatters_command lldb.SBFileSpec('main.m', False)) File "/Users/buildslave/jenkins/workspace/lldb-cmake-sanitized/llvm-project/lldb/packages/Python/lldbsuite/test/lldbutil.py", line 868, in run_to_source_breakpoint only_one_thread, extra_images) File "/Users/buildslave/jenkins/workspace/lldb-cmake-sanitized/llvm-project/lldb/packages/Python/lldbsuite/test/lldbutil.py", line 797, in run_to_breakpoint_do_run test.assertEqual(num_threads, 1, "Expected 1 thread to stop at breakpoint, %d did."%(num_threads)) AssertionError: 0 != 1 : Expected 1 thread to stop at breakpoint, 0 did. Config=x86_64-/Users/buildslave/jenkins/workspace/lldb-cmake-sanitized/lldb-build/bin/clang-10 ====================================================================== FAIL: test_nserror_with_run_command_gmodules (TestDataFormatterObjCNSError.ObjCDataFormatterNSError) Test formatters for NSError. ---------------------------------------------------------------------- Traceback (most recent call last): File "/Users/buildslave/jenkins/workspace/lldb-cmake-sanitized/llvm-project/lldb/packages/Python/lldbsuite/test/lldbtest.py", line 1732, in test_method return attrvalue(self) File "/Users/buildslave/jenkins/workspace/lldb-cmake-sanitized/llvm-project/lldb/packages/Python/lldbsuite/test/functionalities/data-formatter/data-formatter-objc/TestDataFormatterObjCNSError.py", line 20, in test_nserror_with_run_command self.appkit_tester_impl(self.nserror_data_formatter_commands) File "/Users/buildslave/jenkins/workspace/lldb-cmake-sanitized/llvm-project/lldb/packages/Python/lldbsuite/test/functionalities/data-formatter/data-formatter-objc/ObjCDataFormatterTestCase.py", line 19, in appkit_tester_impl self.appkit_common_data_formatters_command() File "/Users/buildslave/jenkins/workspace/lldb-cmake-sanitized/llvm-project/lldb/packages/Python/lldbsuite/test/functionalities/data-formatter/data-formatter-objc/ObjCDataFormatterTestCase.py", line 26, in appkit_common_data_formatters_command lldb.SBFileSpec('main.m', False)) File "/Users/buildslave/jenkins/workspace/lldb-cmake-sanitized/llvm-project/lldb/packages/Python/lldbsuite/test/lldbutil.py", line 868, in run_to_source_breakpoint only_one_thread, extra_images) File "/Users/buildslave/jenkins/workspace/lldb-cmake-sanitized/llvm-project/lldb/packages/Python/lldbsuite/test/lldbutil.py", line 797, in run_to_breakpoint_do_run test.assertEqual(num_threads, 1, "Expected 1 thread to stop at breakpoint, %d did."%(num_threads)) AssertionError: 0 != 1 : Expected 1 thread to stop at breakpoint, 0 did. Config=x86_64-/Users/buildslave/jenkins/workspace/lldb-cmake-sanitized/lldb-build/bin/clang-10 ---------------------------------------------------------------------- Ran 4 tests in 147.799s

Hide Details

RESULT: FAILED (0 passes, 3 failures, 0 errors, 1 skipped, 0 expected failures, 0 unexpected successes)

Hide Details

******************** PASS: lldb-api :: python_api/interpreter/TestCommandInterpreterAPI.py (1154 of 1892) PASS: lldb-unit :: Process/gdb-remote/./ProcessGdbRemoteTests/GDBRemoteClientBaseTest.SendContinueDelegateStructuredDataReceipt (1155 of 1892) PASS: lldb-unit :: Expression/./ExpressionTests/DiagnosticManagerTest.GetStringPreserveOrder (1156 of 1892) PASS: lldb-api :: commands/command/history/TestCommandHistory.py (1157 of 1892) PASS: lldb-unit :: Utility/./UtilityTests/BinaryStreamTest.PutULEB128ThreeBytes (1158 of 1892) PASS: lldb-api :: functionalities/thread/thread_specific_break/TestThreadSpecificBreakpoint.py (1159 of 1892) PASS: lldb-unit :: Utility/./UtilityTests/Flags.Test (1160 of 1892) PASS: lldb-api :: lang/objc/single-entry-dictionary/TestObjCSingleEntryDictionary.py (1161 of 1892) PASS: lldb-unit :: SymbolFile/NativePDB/./SymbolFileNativePDBTests/PDBFPOProgramToDWARFExpressionTests.UnresolvedCyclicRegisterAssignmentReference (1162 of 1892) PASS: lldb-unit :: Process/gdb-remote/./ProcessGdbRemoteTests/GDBRemoteClientBaseTest.SendContinueAndAsyncSignal (1163 of 1892) PASS: lldb-api :: functionalities/thread/concurrent_events/TestConcurrentBreakpointOneDelayBreakpointThreads.py (1164 of 1892) PASS: lldb-api :: lang/cpp/unicode-literals/TestUnicodeLiterals.py (1165 of 1892) PASS: lldb-unit :: Utility/./UtilityTests/StreamTest.PutULEB128 (1166 of 1892) UNSUPPORTED: lldb-shell :: Register/x86-64-xmm16-write.test (1167 of 1892) PASS: lldb-unit :: Process/minidump/./LLDBMinidumpTests/MinidumpParserTest.MinidumpDuplicateModuleMinAddress (1168 of 1892) PASS: lldb-api :: python_api/sbdata/TestSBData.py (1169 of 1892) PASS: lldb-unit :: Utility/./UtilityTests/StringExtractorTest.GetHexU8_Exact (1170 of 1892) PASS: lldb-unit :: UnwindAssembly/x86/./UnwindAssemblyx86Tests/Testx86AssemblyInspectionEngine.TestSubRSP (1171 of 1892) PASS: lldb-api :: functionalities/multiword-commands/TestMultiWordCommands.py (1172 of 1892) PASS: lldb-api :: functionalities/thread/concurrent_events/TestConcurrentDelayedCrashWithBreakpointSignal.py (1173 of 1892) UNSUPPORTED: lldb-api :: functionalities/darwin_log/basic/TestDarwinLogBasic.py (1174 of 1892) PASS: lldb-api :: tools/lldb-vscode/variables/TestVSCode_variables.py (1175 of 1892) PASS: lldb-unit :: Utility/./UtilityTests/RangeTest.ContainsEndInclusiveInvalid (1176 of 1892) PASS: lldb-unit :: Utility/./UtilityTests/LogChannelTest.EnableOptions (1177 of 1892) PASS: lldb-shell :: SymbolFile/DWARF/debug-names-compressed.cpp (1178 of 1892) PASS: lldb-api :: python_api/value/change_values/TestChangeValueAPI.py (1179 of 1892) PASS: lldb-api :: commands/expression/regression-access-function-template-in-record/TestRegressionAccessFunctionTemplateInRecord.py (1180 of 1892) PASS: lldb-unit :: Utility/./UtilityTests/AnsiTerminal.Empty (1181 of 1892) PASS: lldb-unit :: debugserver/./debugserverTests/RNBSocket.AnyListen (1182 of 1892) PASS: lldb-shell :: SymbolFile/DWARF/debug-types-signature-loop.s (1183 of 1892) PASS: lldb-unit :: UnwindAssembly/x86/./UnwindAssemblyx86Tests/Testx86AssemblyInspectionEngine.TestSimple64bitFrameFunction (1184 of 1892) PASS: lldb-api :: lang/objc/objc-class-method/TestObjCClassMethod.py (1185 of 1892) PASS: lldb-api :: lang/c/strings/TestCStrings.py (1186 of 1892) PASS: lldb-unit :: Utility/./UtilityTests/BinaryStreamTest.PutSLEB128NineBytes (1187 of 1892) PASS: lldb-unit :: Utility/./UtilityTests/RecordReplayTest.InstrumentedFooSameThis (1188 of 1892) PASS: lldb-unit :: ScriptInterpreter/Python/./ScriptInterpreterPythonTests/PythonDataObjectsTest.TestPythonCallableCheck (1189 of 1892) PASS: lldb-unit :: Expression/./ExpressionTests/ClangExpressionDeclMapTest.TestPersistentDeclLookup (1190 of 1892) PASS: lldb-api :: commands/expression/fixits/TestFixIts.py (1191 of 1892) PASS: lldb-api :: commands/expression/import-std-module/unique_ptr-dbg-info-content/TestUniquePtrDbgInfoContent.py (1192 of 1892) PASS: lldb-unit :: Process/gdb-remote/./ProcessGdbRemoteTests/GDBRemoteClientBaseTest.SendContinueAndLateInterrupt (1193 of 1892) PASS: lldb-shell :: Driver/TestRepl.test (1194 of 1892) UNSUPPORTED: lldb-shell :: SymbolFile/PDB/pointers.test (1195 of 1892) PASS: lldb-unit :: Utility/./UtilityTests/StringListTest.ShiftMove (1196 of 1892) PASS: lldb-unit :: ScriptInterpreter/Python/./ScriptInterpreterPythonTests/PythonDataObjectsTest.TestDictionaryResolutionWithDot (1197 of 1892) PASS: lldb-unit :: Language/Highlighting/./HighlighterTests/HighlighterTest.DefaultHighlighterWithCursor (1198 of 1892) PASS: lldb-api :: commands/watchpoints/watchpoint_size/TestWatchpointSizes.py (1199 of 1892) PASS: lldb-unit :: UnwindAssembly/x86/./UnwindAssemblyx86Tests/Testx86AssemblyInspectionEngine.TestPopR15 (1200 of 1892) PASS: lldb-api :: lang/cpp/overloaded-functions/TestOverloadedFunctions.py (1201 of 1892) PASS: lldb-unit :: UnwindAssembly/x86/./UnwindAssemblyx86Tests/Testx86AssemblyInspectionEngine.TestPushRBP (1202 of 1892) PASS: lldb-unit :: Utility/./UtilityTests/FileSpecTest.PrependPathComponent (1203 of 1892) PASS: lldb-api :: functionalities/tail_call_frames/ambiguous_tail_call_seq1/TestAmbiguousTailCallSeq1.py (1204 of 1892) PASS: lldb-unit :: Utility/./UtilityTests/StringListTest.JoinEmpty (1205 of 1892) PASS: lldb-api :: lang/objc/modules-cache/TestClangModulesCache.py (1206 of 1892) PASS: lldb-api :: commands/frame/diagnose/virtual-method-call/TestDiagnoseDereferenceVirtualMethodCall.py (1207 of 1892) PASS: lldb-api :: functionalities/signal/handle-abrt/TestHandleAbort.py (1208 of 1892) PASS: lldb-unit :: UnwindAssembly/x86/./UnwindAssemblyx86Tests/Testx86AssemblyInspectionEngine.TestCALLNextInsn (1209 of 1892) PASS: lldb-unit :: Language/Highlighting/./HighlighterTests/HighlighterTest.ClangCursorPosBeforeOtherToken (1210 of 1892) PASS: lldb-api :: commands/frame/select/TestFrameSelect.py (1211 of 1892) PASS: lldb-shell :: SymbolFile/Breakpad/unwind-via-raSearch.test (1212 of 1892) PASS: lldb-api :: commands/expression/call-overridden-method/TestCallOverriddenMethod.py (1213 of 1892) PASS: lldb-api :: functionalities/data-formatter/data-formatter-stl/libcxx/function/TestLibCxxFunction.py (1214 of 1892) PASS: lldb-api :: commands/expression/completion-in-lambda-and-unnamed-class/TestCompletionInLambdaAndUnnamedClass.py (1215 of 1892) PASS: lldb-shell :: SymbolFile/DWARF/debug_rnglists.s (1216 of 1892) PASS: lldb-unit :: Utility/./UtilityTests/StringExtractorTest.GetU64BigEndian (1217 of 1892) PASS: lldb-api :: functionalities/data-formatter/data-formatter-synth/TestDataFormatterSynth.py (1218 of 1892) PASS: lldb-unit :: Utility/./UtilityTests/StringExtractorTest.GetHexBytes_FullString (1219 of 1892) PASS: lldb-api :: lang/cpp/diamond/TestDiamond.py (1220 of 1892) PASS: lldb-api :: functionalities/thread/concurrent_events/TestConcurrentCrashWithSignal.py (1221 of 1892) PASS: lldb-unit :: Utility/./UtilityTests/OptionsWithRawTest.EmptySuffixSingleWhitespace (1222 of 1892) PASS: lldb-shell :: SymbolFile/DWARF/clang-ast-from-dwarf-objc-property.m (1223 of 1892) PASS: lldb-api :: commands/watchpoints/watchpoint_disable/TestWatchpointDisable.py (1224 of 1892) PASS: lldb-unit :: ObjectFile/ELF/./ObjectFileELFTests/ObjectFileELFTest.GetSymtab_NoSymEntryPointArmAddressClass (1225 of 1892) PASS: lldb-api :: functionalities/breakpoint/move_nearest/TestMoveNearest.py (1226 of 1892) PASS: lldb-unit :: ScriptInterpreter/Python/./ScriptInterpreterPythonTests/PythonDataObjectsTest.TestPythonDictionaryManipulation (1227 of 1892) PASS: lldb-api :: lang/objc/objc-super/TestObjCSuper.py (1228 of 1892) PASS: lldb-unit :: Utility/./UtilityTests/StringLexerTest.Next (1229 of 1892) PASS: lldb-api :: tools/lldb-vscode/breakpoint/TestVSCode_setBreakpoints.py (1230 of 1892) PASS: lldb-shell :: Reproducer/Functionalities/TestStepping.test (1231 of 1892) PASS: lldb-shell :: SymbolFile/DWARF/clang-ast-from-dwarf-unamed-and-anon-structs.cpp (1232 of 1892) PASS: lldb-unit :: Utility/./UtilityTests/StreamTest.PutHex8 (1233 of 1892) PASS: lldb-api :: functionalities/data-formatter/data-formatter-stl/libcxx/bitset/TestDataFormatterLibcxxBitset.py (1234 of 1892) PASS: lldb-api :: lang/objc/objc-runtime-ivars/TestRuntimeIvars.py (1235 of 1892) PASS: lldb-api :: commands/expression/anonymous-struct/TestCallUserAnonTypedef.py (1236 of 1892) UNSUPPORTED: lldb-api :: lang/objc/rdar-12408181/TestRdar12408181.py (1237 of 1892) PASS: lldb-api :: functionalities/gdb_remote_client/TestGDBRemoteLoad.py (1238 of 1892) PASS: lldb-unit :: Utility/./UtilityTests/UriParserTest.SchemeHostSeparator4 (1239 of 1892) PASS: lldb-unit :: Symbol/./SymbolTests/TestClangASTImporter.ImportInvalidType (1240 of 1892) PASS: lldb-unit :: Target/./TargetTests/ModuleCacheTest.GetAndPutStrangeHostname (1241 of 1892) PASS: lldb-shell :: SymbolFile/DWARF/find-inline-method.s (1242 of 1892) PASS: lldb-api :: commands/expression/calculator_mode/TestCalculatorMode.py (1243 of 1892) PASS: lldb-unit :: Utility/./UtilityTests/ProcessInstanceInfo.DumpTable (1244 of 1892) PASS: lldb-unit :: Host/./HostTests/ProcessLaunchInfoTest.Constructor (1245 of 1892) PASS: lldb-api :: commands/expression/test/TestExprs.py (1246 of 1892) PASS: lldb-api :: commands/expression/save_jit_objects/TestSaveJITObjects.py (1247 of 1892) PASS: lldb-api :: lang/c/step-target/TestStepTarget.py (1248 of 1892) PASS: lldb-api :: functionalities/data-formatter/data-formatter-stl/libcxx/iterator/TestDataFormatterLibccIterator.py (1249 of 1892) UNSUPPORTED: lldb-api :: linux/sepdebugsymlink/TestTargetSymbolsSepDebugSymlink.py (1250 of 1892) PASS: lldb-api :: macosx/find-app-in-bundle/TestFindAppInBundle.py (1251 of 1892) PASS: lldb-unit :: Utility/./UtilityTests/FileSpecTest.EqualDotsPosix (1252 of 1892) PASS: lldb-shell :: SymbolFile/NativePDB/source-list.cpp (1253 of 1892) PASS: lldb-unit :: Process/minidump/./LLDBMinidumpTests/MinidumpParserTest.FindMemoryRange (1254 of 1892) PASS: lldb-api :: functionalities/gdb_remote_client/TestStopPCs.py (1255 of 1892) PASS: lldb-api :: lang/cpp/incomplete-types/TestCppIncompleteTypes.py (1256 of 1892) PASS: lldb-unit :: SymbolFile/DWARF/./SymbolFileDWARFTests/SymbolFileDWARFTests.TestAbbrevInvalidNULLTag (1257 of 1892) UNSUPPORTED: lldb-shell :: ScriptInterpreter/Lua/lua.test (1258 of 1892) PASS: lldb-unit :: Utility/./UtilityTests/StringListTest.SetSize (1259 of 1892) FAIL: lldb-api :: functionalities/data-formatter/data-formatter-objc/TestDataFormatterObjCPlain.py (1260 of 1892) ******************** TEST 'lldb-api :: functionalities/data-formatter/data-formatter-objc/TestDataFormatterObjCPlain.py' FAILED ******************** lldb version 10.0.99 (http://labmaster3.local/git/llvm-project.git revision c1b13a1b17719aebace1b3be7a6ac7f90b1901a6) clang revision c1b13a1b17719aebace1b3be7a6ac7f90b1901a6 llvm revision c1b13a1b17719aebace1b3be7a6ac7f90b1901a6 LLDB library dir: /Users/buildslave/jenkins/workspace/lldb-cmake-sanitized/lldb-build/bin LLDB import library dir: /Users/buildslave/jenkins/workspace/lldb-cmake-sanitized/lldb-build/bin libstdcxx tests will not be run because: Don't know how to build with libstdcxx on macosx Skipping following debug info categories: ['dwo'] AddressSanitizer report breakpoint hit. Use 'thread info -s' to get extended information about the report. AddressSanitizer report breakpoint hit. Use 'thread info -s' to get extended information about the report. AddressSanitizer report breakpoint hit. Use 'thread info -s' to get extended information about the report.

Hide Details

Session logs for test failures/errors/unexpected successes will go into directory '/Users/buildslave/jenkins/workspace/lldb-cmake-sanitized/test/logs' Command invoked: /Users/buildslave/jenkins/workspace/lldb-cmake-sanitized/llvm-project/lldb/test/API/dotest.py --arch x86_64 -s /Users/buildslave/jenkins/workspace/lldb-cmake-sanitized/lldb-build/lldb-test-traces -S nm -u CXXFLAGS -u CFLAGS --codesign-identity lldb_codesign --server /Users/buildslave/jenkins/workspace/lldb-cmake-sanitized/lldb-build/./bin/debugserver --arch x86_64 --build-dir /Users/buildslave/jenkins/workspace/lldb-cmake-sanitized/lldb-build/lldb-test-build.noindex -s=/Users/buildslave/jenkins/workspace/lldb-cmake-sanitized/test/logs -t --env TERM=vt100 --env LLVM_LIBS_DIR=/Users/buildslave/jenkins/workspace/lldb-cmake-sanitized/lldb-build/./lib --inferior-env ASAN_OPTIONS=detect_stack_use_after_return=1 --inferior-env DYLD_INSERT_LIBRARIES=/Users/buildslave/jenkins/workspace/lldb-cmake-sanitized/host-compiler/lib/clang/10.0.0/lib/darwin/libclang_rt.asan_osx_dynamic.dylib --build-dir /Users/buildslave/jenkins/workspace/lldb-cmake-sanitized/lldb-build/lldb-test-build.noindex --lldb-module-cache-dir /Users/buildslave/jenkins/workspace/lldb-cmake-sanitized/lldb-build/lldb-test-build.noindex/module-cache-lldb/lldb-api --clang-module-cache-dir /Users/buildslave/jenkins/workspace/lldb-cmake-sanitized/lldb-build/lldb-test-build.noindex/module-cache-clang/lldb-api --executable /Users/buildslave/jenkins/workspace/lldb-cmake-sanitized/lldb-build/./bin/lldb --compiler /Users/buildslave/jenkins/workspace/lldb-cmake-sanitized/lldb-build/./bin/clang --dsymutil /Users/buildslave/jenkins/workspace/lldb-cmake-sanitized/lldb-build/./bin/dsymutil --filecheck /Users/buildslave/jenkins/workspace/lldb-cmake-sanitized/lldb-build/./bin/FileCheck /Users/buildslave/jenkins/workspace/lldb-cmake-sanitized/llvm-project/lldb/packages/Python/lldbsuite/test/functionalities/data-formatter/data-formatter-objc -p TestDataFormatterObjCPlain.py Change dir to: /Users/buildslave/jenkins/workspace/lldb-cmake-sanitized/llvm-project/lldb/packages/Python/lldbsuite/test/functionalities/data-formatter/data-formatter-objc runCmd: settings set symbols.enable-external-lookup false output:

Hide Details

runCmd: settings set plugin.process.gdb-remote.packet-timeout 60 output:

Hide Details

runCmd: settings set symbols.clang-modules-cache-path "/Users/buildslave/jenkins/workspace/lldb-cmake-sanitized/lldb-build/lldb-test-build.noindex/module-cache-lldb/lldb-api" output:

Hide Details

runCmd: settings set use-color false output:

Hide Details

runCmd: settings set target.env-vars ASAN_OPTIONS=detect_stack_use_after_return=1 DYLD_INSERT_LIBRARIES=/Users/buildslave/jenkins/workspace/lldb-cmake-sanitized/host-compiler/lib/clang/10.0.0/lib/darwin/libclang_rt.asan_osx_dynamic.dylib output:

Hide Details

runCmd: settings set target.env-vars ASAN_OPTIONS=detect_stack_use_after_return=1 DYLD_INSERT_LIBRARIES=/Users/buildslave/jenkins/workspace/lldb-cmake-sanitized/host-compiler/lib/clang/10.0.0/lib/darwin/libclang_rt.asan_osx_dynamic.dylib output:

Hide Details

FAIL: LLDB (/Users/buildslave/jenkins/workspace/lldb-cmake-sanitized/lldb-build/bin/clang-10-x86_64) :: test_plain_objc_with_run_command_dsym (TestDataFormatterObjCPlain.ObjCDataFormatterNSPlain) <bound method SBProcess.Kill of <lldb.SBProcess; proxy of <Swig Object of type 'lldb::SBProcess *' at 0x105dfd240> >>: success

Hide Details

runCmd: settings set symbols.enable-external-lookup false output:

Hide Details

runCmd: settings set plugin.process.gdb-remote.packet-timeout 60 output:

Hide Details

runCmd: settings set symbols.clang-modules-cache-path "/Users/buildslave/jenkins/workspace/lldb-cmake-sanitized/lldb-build/lldb-test-build.noindex/module-cache-lldb/lldb-api" output:

Hide Details

runCmd: settings set use-color false output:

Hide Details

runCmd: settings set target.env-vars ASAN_OPTIONS=detect_stack_use_after_return=1 DYLD_INSERT_LIBRARIES=/Users/buildslave/jenkins/workspace/lldb-cmake-sanitized/host-compiler/lib/clang/10.0.0/lib/darwin/libclang_rt.asan_osx_dynamic.dylib output:

Hide Details

runCmd: settings set target.env-vars ASAN_OPTIONS=detect_stack_use_after_return=1 DYLD_INSERT_LIBRARIES=/Users/buildslave/jenkins/workspace/lldb-cmake-sanitized/host-compiler/lib/clang/10.0.0/lib/darwin/libclang_rt.asan_osx_dynamic.dylib output:

Hide Details

FAIL: LLDB (/Users/buildslave/jenkins/workspace/lldb-cmake-sanitized/lldb-build/bin/clang-10-x86_64) :: test_plain_objc_with_run_command_dwarf (TestDataFormatterObjCPlain.ObjCDataFormatterNSPlain) <bound method SBProcess.Kill of <lldb.SBProcess; proxy of <Swig Object of type 'lldb::SBProcess *' at 0x105829630> >>: success

Hide Details

UNSUPPORTED: LLDB (/Users/buildslave/jenkins/workspace/lldb-cmake-sanitized/lldb-build/bin/clang-10-x86_64) :: test_plain_objc_with_run_command_dwo (TestDataFormatterObjCPlain.ObjCDataFormatterNSPlain) (test case does not fall in any category of interest for this run) runCmd: settings set symbols.enable-external-lookup false output:

Hide Details

runCmd: settings set plugin.process.gdb-remote.packet-timeout 60 output:

Hide Details

runCmd: settings set symbols.clang-modules-cache-path "/Users/buildslave/jenkins/workspace/lldb-cmake-sanitized/lldb-build/lldb-test-build.noindex/module-cache-lldb/lldb-api" output:

Hide Details

runCmd: settings set use-color false output:

Hide Details

runCmd: settings set target.env-vars ASAN_OPTIONS=detect_stack_use_after_return=1 DYLD_INSERT_LIBRARIES=/Users/buildslave/jenkins/workspace/lldb-cmake-sanitized/host-compiler/lib/clang/10.0.0/lib/darwin/libclang_rt.asan_osx_dynamic.dylib output:

Hide Details

runCmd: settings set target.env-vars ASAN_OPTIONS=detect_stack_use_after_return=1 DYLD_INSERT_LIBRARIES=/Users/buildslave/jenkins/workspace/lldb-cmake-sanitized/host-compiler/lib/clang/10.0.0/lib/darwin/libclang_rt.asan_osx_dynamic.dylib output:

Hide Details

FAIL: LLDB (/Users/buildslave/jenkins/workspace/lldb-cmake-sanitized/lldb-build/bin/clang-10-x86_64) :: test_plain_objc_with_run_command_gmodules (TestDataFormatterObjCPlain.ObjCDataFormatterNSPlain) <bound method SBProcess.Kill of <lldb.SBProcess; proxy of <Swig Object of type 'lldb::SBProcess *' at 0x105dfd090> >>: success

Hide Details

Restore dir to: /Users/buildslave/jenkins/workspace/lldb-cmake-sanitized/lldb-build/tools/lldb/test ====================================================================== FAIL: test_plain_objc_with_run_command_dsym (TestDataFormatterObjCPlain.ObjCDataFormatterNSPlain) Test basic ObjC formatting behavior. ---------------------------------------------------------------------- Traceback (most recent call last): File "/Users/buildslave/jenkins/workspace/lldb-cmake-sanitized/llvm-project/lldb/packages/Python/lldbsuite/test/lldbtest.py", line 1732, in test_method return attrvalue(self) File "/Users/buildslave/jenkins/workspace/lldb-cmake-sanitized/llvm-project/lldb/packages/Python/lldbsuite/test/functionalities/data-formatter/data-formatter-objc/TestDataFormatterObjCPlain.py", line 23, in test_plain_objc_with_run_command lldb.SBFileSpec('main.m', False)) File "/Users/buildslave/jenkins/workspace/lldb-cmake-sanitized/llvm-project/lldb/packages/Python/lldbsuite/test/lldbutil.py", line 868, in run_to_source_breakpoint only_one_thread, extra_images) File "/Users/buildslave/jenkins/workspace/lldb-cmake-sanitized/llvm-project/lldb/packages/Python/lldbsuite/test/lldbutil.py", line 797, in run_to_breakpoint_do_run test.assertEqual(num_threads, 1, "Expected 1 thread to stop at breakpoint, %d did."%(num_threads)) AssertionError: 0 != 1 : Expected 1 thread to stop at breakpoint, 0 did. Config=x86_64-/Users/buildslave/jenkins/workspace/lldb-cmake-sanitized/lldb-build/bin/clang-10 ====================================================================== FAIL: test_plain_objc_with_run_command_dwarf (TestDataFormatterObjCPlain.ObjCDataFormatterNSPlain) Test basic ObjC formatting behavior. ---------------------------------------------------------------------- Traceback (most recent call last): File "/Users/buildslave/jenkins/workspace/lldb-cmake-sanitized/llvm-project/lldb/packages/Python/lldbsuite/test/lldbtest.py", line 1732, in test_method return attrvalue(self) File "/Users/buildslave/jenkins/workspace/lldb-cmake-sanitized/llvm-project/lldb/packages/Python/lldbsuite/test/functionalities/data-formatter/data-formatter-objc/TestDataFormatterObjCPlain.py", line 23, in test_plain_objc_with_run_command lldb.SBFileSpec('main.m', False)) File "/Users/buildslave/jenkins/workspace/lldb-cmake-sanitized/llvm-project/lldb/packages/Python/lldbsuite/test/lldbutil.py", line 868, in run_to_source_breakpoint only_one_thread, extra_images) File "/Users/buildslave/jenkins/workspace/lldb-cmake-sanitized/llvm-project/lldb/packages/Python/lldbsuite/test/lldbutil.py", line 797, in run_to_breakpoint_do_run test.assertEqual(num_threads, 1, "Expected 1 thread to stop at breakpoint, %d did."%(num_threads)) AssertionError: 0 != 1 : Expected 1 thread to stop at breakpoint, 0 did. Config=x86_64-/Users/buildslave/jenkins/workspace/lldb-cmake-sanitized/lldb-build/bin/clang-10 ====================================================================== FAIL: test_plain_objc_with_run_command_gmodules (TestDataFormatterObjCPlain.ObjCDataFormatterNSPlain) Test basic ObjC formatting behavior. ---------------------------------------------------------------------- Traceback (most recent call last): File "/Users/buildslave/jenkins/workspace/lldb-cmake-sanitized/llvm-project/lldb/packages/Python/lldbsuite/test/lldbtest.py", line 1732, in test_method return attrvalue(self) File "/Users/buildslave/jenkins/workspace/lldb-cmake-sanitized/llvm-project/lldb/packages/Python/lldbsuite/test/functionalities/data-formatter/data-formatter-objc/TestDataFormatterObjCPlain.py", line 23, in test_plain_objc_with_run_command lldb.SBFileSpec('main.m', False)) File "/Users/buildslave/jenkins/workspace/lldb-cmake-sanitized/llvm-project/lldb/packages/Python/lldbsuite/test/lldbutil.py", line 868, in run_to_source_breakpoint only_one_thread, extra_images) File "/Users/buildslave/jenkins/workspace/lldb-cmake-sanitized/llvm-project/lldb/packages/Python/lldbsuite/test/lldbutil.py", line 797, in run_to_breakpoint_do_run test.assertEqual(num_threads, 1, "Expected 1 thread to stop at breakpoint, %d did."%(num_threads)) AssertionError: 0 != 1 : Expected 1 thread to stop at breakpoint, 0 did. Config=x86_64-/Users/buildslave/jenkins/workspace/lldb-cmake-sanitized/lldb-build/bin/clang-10 ---------------------------------------------------------------------- Ran 4 tests in 140.322s

Hide Details

RESULT: FAILED (0 passes, 3 failures, 0 errors, 1 skipped, 0 expected failures, 0 unexpected successes)

Hide Details

******************** PASS: lldb-unit :: Utility/./UtilityTests/StreamTest.PutMaxHex64ByteOrderLittle (1261 of 1892) UNSUPPORTED: lldb-api :: iohandler/completion/TestIOHandlerCompletion.py (1262 of 1892) PASS: lldb-unit :: SymbolFile/DWARF/./SymbolFileDWARFTests/SymbolFileDWARFTests.TestAbbrevOrder1Start1 (1263 of 1892) PASS: lldb-shell :: Expr/TestIRMemoryMap.test (1264 of 1892) PASS: lldb-unit :: Utility/./UtilityTests/AnsiTerminal.Incomplete (1265 of 1892) UNSUPPORTED: lldb-api :: functionalities/tty/TestTerminal.py (1266 of 1892) PASS: lldb-unit :: ScriptInterpreter/Python/./ScriptInterpreterPythonTests/PythonDataObjectsTest.TestPythonTupleInitializerList2 (1267 of 1892) PASS: lldb-api :: lang/objc/objc-new-syntax/TestObjCNewSyntaxLiteral.py (1268 of 1892) PASS: lldb-unit :: Host/./HostTests/NativeProcessProtocolTest.ReadCStringFromMemory_CrossPageBoundary (1269 of 1892) UNSUPPORTED: lldb-api :: functionalities/darwin_log/filter/exact_match/message/TestDarwinLogFilterMatchMessage.py (1270 of 1892) PASS: lldb-api :: functionalities/breakpoint/breakpoint_ids/TestBreakpointIDs.py (1271 of 1892) UNSUPPORTED: lldb-api :: lang/cpp/function-template-parameter-pack/TestFunctionTemplateParameterPack.py (1272 of 1892) PASS: lldb-unit :: Utility/./UtilityTests/ConstStringTest.MangledCounterpart (1273 of 1892) PASS: lldb-unit :: Utility/./UtilityTests/StringExtractorTest.DecodeHexU8_Underflow (1274 of 1892) PASS: lldb-api :: python_api/exprpath_synthetic/TestExprPathSynthetic.py (1275 of 1892) PASS: lldb-unit :: Utility/./UtilityTests/StringListTest.DefaultConstructor (1276 of 1892) PASS: lldb-api :: functionalities/load_using_paths/TestLoadUsingPaths.py (1277 of 1892) PASS: lldb-api :: functionalities/data-formatter/data-formatter-stl/libcxx/queue/TestDataFormatterLibcxxQueue.py (1278 of 1892) PASS: lldb-shell :: SymbolFile/DWARF/anon_class_w_and_wo_export_symbols.ll (1279 of 1892) PASS: lldb-shell :: Settings/TestSettingsSet.test (1280 of 1892) PASS: lldb-unit :: Utility/./UtilityTests/RangeTest.NotEqualInvalid (1281 of 1892) PASS: lldb-unit :: Language/Highlighting/./HighlighterTests/HighlighterTest.ClangBraces (1282 of 1892) PASS: lldb-unit :: SymbolFile/DWARF/./SymbolFileDWARFTests/DWARFASTParserClangTests.EnsureAllDIEsInDeclContextHaveBeenParsedParsesOnlyMatchingEntries (1283 of 1892) PASS: lldb-shell :: SymbolFile/DWARF/find-method.cpp (1284 of 1892) PASS: lldb-api :: lang/cpp/stl/TestStdCXXDisassembly.py (1285 of 1892) UNSUPPORTED: lldb-shell :: ExecControl/StopHook/stop-hook-threads.test (1286 of 1892) PASS: lldb-unit :: Language/Highlighting/./HighlighterTests/HighlighterTest.ClangSquareBrackets (1287 of 1892) UNSUPPORTED: lldb-api :: functionalities/thread/create_during_step/TestCreateDuringStep.py (1288 of 1892) UNSUPPORTED: lldb-api :: benchmarks/libcxxmap/TestBenchmarkLibcxxMap.py (1289 of 1892) PASS: lldb-api :: commands/expression/codegen-crash-typedefdecl-not-in_declcontext/TestCodegenCrashTypedefDeclNotInDeclContext.py (1290 of 1892) PASS: lldb-unit :: Process/gdb-remote/./ProcessGdbRemoteTests/GDBRemoteCommunicationServerTest.SendErrorResponse_ErrorList (1291 of 1892) PASS: lldb-shell :: Breakpoint/debug_rnglist_basic.test (1292 of 1892) PASS: lldb-unit :: Utility/./UtilityTests/FileSpecTest.GetPath (1293 of 1892) PASS: lldb-unit :: Language/Highlighting/./HighlighterTests/HighlighterTest.ClangStringLiterals (1294 of 1892) PASS: lldb-api :: macosx/queues/TestQueues.py (1295 of 1892) PASS: lldb-api :: lang/objc/objc-ivar-protocols/TestIvarProtocols.py (1296 of 1892) PASS: lldb-shell :: ObjectFile/ELF/PT_LOAD-overlap.yaml (1297 of 1892) PASS: lldb-unit :: Utility/./UtilityTests/StatusTest.ErrorConversion (1298 of 1892) PASS: lldb-unit :: Language/Highlighting/./HighlighterTests/HighlighterTest.ClangComments (1299 of 1892) PASS: lldb-api :: functionalities/breakpoint/breakpoint_ignore_count/TestBreakpointIgnoreCount.py (1300 of 1892) PASS: lldb-api :: api/log/TestAPILog.py (1301 of 1892) PASS: lldb-unit :: Utility/./UtilityTests/StringExtractorTest.GetU32BigEndian (1302 of 1892) PASS: lldb-unit :: Utility/./UtilityTests/StreamTest.ShiftOperatorChars (1303 of 1892) PASS: lldb-api :: lang/c/local_types/TestUseClosestType.py (1304 of 1892) PASS: lldb-shell :: SymbolFile/NativePDB/break-by-function.cpp (1305 of 1892) PASS: lldb-api :: types/TestFloatTypes.py (1306 of 1892) UNSUPPORTED: lldb-shell :: SymbolFile/NativePDB/ast-functions-msvc.cpp (1307 of 1892) PASS: lldb-api :: functionalities/data-formatter/ostypeformatting/TestFormattersOsType.py (1308 of 1892) PASS: lldb-unit :: Language/Highlighting/./HighlighterTests/HighlighterTest.ClangScalarLiterals (1309 of 1892) PASS: lldb-api :: functionalities/thread/concurrent_events/TestConcurrentTwoWatchpointThreads.py (1310 of 1892) PASS: lldb-unit :: Utility/./UtilityTests/RangeTest.DoesAdjoinOrIntersect (1311 of 1892) PASS: lldb-api :: commands/expression/vector_of_enums/TestVectorOfEnums.py (1312 of 1892) PASS: lldb-unit :: Language/Highlighting/./HighlighterTests/HighlighterTest.ClangIdentifiers (1313 of 1892) PASS: lldb-api :: python_api/watchpoint/condition/TestWatchpointConditionAPI.py (1314 of 1892) PASS: lldb-api :: tools/lldb-server/TestGdbRemoteThreadsInStopReply.py (1315 of 1892) PASS: lldb-api :: functionalities/data-formatter/parray/TestPrintArray.py (1316 of 1892) PASS: lldb-unit :: Utility/./UtilityTests/ArgsTest.TestOverwriteArgs (1317 of 1892) PASS: lldb-api :: api/multiple-targets/TestMultipleTargets.py (1318 of 1892) PASS: lldb-shell :: Heap/heap-cstr.test (1319 of 1892) UNSUPPORTED: lldb-shell :: SymbolFile/NativePDB/typedefs.cpp (1320 of 1892) PASS: lldb-unit :: Expression/./ExpressionTests/DiagnosticManagerTest.AppendMessageAttachToLastDiag (1321 of 1892) PASS: lldb-unit :: ScriptInterpreter/Python/./ScriptInterpreterPythonTests/PythonDataObjectsTest.TestPythonDictionaryToStructuredDictionary (1322 of 1892) PASS: lldb-unit :: Utility/./UtilityTests/StreamTest.PutNHex8 (1323 of 1892) PASS: lldb-api :: functionalities/postmortem/elf-core/thread_crash/TestLinuxCoreThreads.py (1324 of 1892) PASS: lldb-unit :: Utility/./UtilityTests/GeneratorTest.GetOrCreate (1325 of 1892) PASS: lldb-unit :: Utility/./UtilityTests/LogChannelEnabledTest.LLDB_LOG_ERROR (1326 of 1892) PASS: lldb-unit :: Symbol/./SymbolTests/TestClangASTContext.TestIsClangType (1327 of 1892) PASS: lldb-api :: functionalities/thread/concurrent_events/TestConcurrentSignalWatchBreak.py (1328 of 1892) PASS: lldb-unit :: Utility/./UtilityTests/StreamTeeTest.GetStreamAtIndexOutOfBoundsEmpty (1329 of 1892) PASS: lldb-unit :: Utility/./UtilityTests/RangeTest.ContainsAddrInvalid (1330 of 1892) PASS: lldb-shell :: ObjectFile/ELF/PT_LOAD-empty.yaml (1331 of 1892) PASS: lldb-api :: commands/expression/import-std-module/conflicts/TestStdModuleWithConflicts.py (1332 of 1892) PASS: lldb-shell :: Driver/LocalLLDBInit.test (1333 of 1892) PASS: lldb-api :: lang/cpp/class_types/TestClassTypes.py (1334 of 1892) PASS: lldb-shell :: Settings/TestFrameFormatNoColor.test (1335 of 1892) PASS: lldb-unit :: Utility/./UtilityTests/StringListTest.LongestCommonPrefixDuplicateElement (1336 of 1892) PASS: lldb-unit :: ObjectFile/ELF/./ObjectFileELFTests/ObjectFileELFTest.GetModuleSpecifications_EarlySectionHeaders (1337 of 1892) PASS: lldb-api :: functionalities/stats_api/TestStatisticsAPI.py (1338 of 1892) PASS: lldb-unit :: Utility/./UtilityTests/StringExtractorTest.GetHexU8_Exact_NoEof (1339 of 1892) PASS: lldb-api :: lang/objc/rdar-11355592/TestRdar11355592.py (1340 of 1892) PASS: lldb-unit :: Process/minidump/./LLDBMinidumpTests/MinidumpParserTest.GetExceptionStream (1341 of 1892) UNSUPPORTED: lldb-shell :: Unwind/unwind-plan-dwarf-dump.test (1342 of 1892) PASS: lldb-unit :: Utility/./UtilityTests/ProcessInstanceInfoMatch.Name (1343 of 1892) PASS: lldb-unit :: Utility/./UtilityTests/RegularExpression.Match (1344 of 1892) PASS: lldb-unit :: UnwindAssembly/x86/./UnwindAssemblyx86Tests/Testx86AssemblyInspectionEngine.TestPopRBP (1345 of 1892) PASS: lldb-unit :: Utility/./UtilityTests/StreamTest.PutPtr (1346 of 1892) PASS: lldb-api :: macosx/duplicate-archive-members/TestDuplicateMembers.py (1347 of 1892) PASS: lldb-unit :: Utility/./UtilityTests/RecordReplayTest.InstrumentedFoo (1348 of 1892) PASS: lldb-unit :: Utility/./UtilityTests/UriParserTest.MinimalPortPath (1349 of 1892) PASS: lldb-api :: functionalities/data-formatter/synthcapping/TestSyntheticCapping.py (1350 of 1892) PASS: lldb-api :: python_api/value/linked_list/TestValueAPILinkedList.py (1351 of 1892) PASS: lldb-unit :: UnwindAssembly/x86/./UnwindAssemblyx86Tests/Testx86AssemblyInspectionEngine.TestSimplex86_64Augmented (1352 of 1892) PASS: lldb-api :: lang/cpp/offsetof/TestOffsetofCpp.py (1353 of 1892) PASS: lldb-unit :: ObjectFile/Breakpad/./ObjectFileBreakpadTests/FuncRecord.parse (1354 of 1892) PASS: lldb-unit :: Utility/./UtilityTests/StreamTest.AddressEmptyPrefix (1355 of 1892) PASS: lldb-api :: lang/cpp/wchar_t/TestCxxWCharT.py (1356 of 1892) PASS: lldb-unit :: Utility/./UtilityTests/RangeTest.Union (1357 of 1892) PASS: lldb-shell :: Reproducer/TestRelativePath.test (1358 of 1892) PASS: lldb-unit :: Utility/./UtilityTests/ScalarTest.APIntConstructor (1359 of 1892) PASS: lldb-unit :: Expression/./ExpressionTests/ClangHostTest.ComputeClangResourceDirectory (1360 of 1892) PASS: lldb-shell :: Driver/TestFile.test (1361 of 1892) PASS: lldb-api :: commands/expression/invalid-args/TestInvalidArgsExpression.py (1362 of 1892) PASS: lldb-shell :: SymbolFile/Breakpad/stack-cfi-parsing.test (1363 of 1892) PASS: lldb-unit :: UnwindAssembly/x86/./UnwindAssemblyx86Tests/Testx86AssemblyInspectionEngine.TestPushRBPWithREX (1364 of 1892) PASS: lldb-shell :: SymbolFile/DWARF/dir-separator-no-comp-dir.s (1365 of 1892) PASS: lldb-unit :: Symbol/./SymbolTests/TestClangASTContext.TestRemoveFastQualifiers (1366 of 1892) PASS: lldb-api :: functionalities/data-formatter/data-formatter-stl/libcxx/multiset/TestDataFormatterLibcxxMultiSet.py (1367 of 1892) PASS: lldb-api :: commands/target/create-deps/TestTargetCreateDeps.py (1368 of 1892) PASS: lldb-api :: commands/expression/completion/TestExprCompletion.py (1369 of 1892) PASS: lldb-api :: commands/apropos/with-process/TestAproposWithProcess.py (1370 of 1892) PASS: lldb-shell :: ObjectFile/ELF/PT_LOAD-overlap-PT_TLS.yaml (1371 of 1892) PASS: lldb-unit :: Utility/./UtilityTests/StringLexerTest.NextIfList (1372 of 1892) PASS: lldb-shell :: SymbolFile/DWARF/dir-separator-windows.s (1373 of 1892) PASS: lldb-api :: lang/cpp/template/TestTemplateArgs.py (1374 of 1892) PASS: lldb-unit :: Utility/./UtilityTests/StreamTest.PutBytesAsRawHex8ToBigEndian (1375 of 1892) PASS: lldb-api :: functionalities/data-formatter/varscript_formatting/TestDataFormatterVarScriptFormatting.py (1376 of 1892) PASS: lldb-api :: python_api/hello_world/TestHelloWorld.py (1377 of 1892) PASS: lldb-api :: macosx/load-kext/TestLoadKext.py (1378 of 1892) PASS: lldb-unit :: Utility/./UtilityTests/StringListTest.AppendStringMove (1379 of 1892) PASS: lldb-api :: functionalities/step_scripted/TestStepScripted.py (1380 of 1892) PASS: lldb-api :: functionalities/backticks/TestBackticksWithoutATarget.py (1381 of 1892) PASS: lldb-api :: commands/expression/formatters/TestFormatters.py (1382 of 1892) PASS: lldb-shell :: SymbolFile/Breakpad/line-table-discontinuous-file-ids.test (1383 of 1892) PASS: lldb-api :: commands/expression/cast_int_to_anonymous_enum/TestCastIntToAnonymousEnum.py (1384 of 1892) PASS: lldb-shell :: Commands/command-regex-unalias.test (1385 of 1892) UNSUPPORTED: lldb-shell :: BuildScript/toolchain-msvc.test (1386 of 1892) PASS: lldb-api :: lang/objc/modules-auto-import/TestModulesAutoImport.py (1387 of 1892) PASS: lldb-unit :: ScriptInterpreter/Python/./ScriptInterpreterPythonTests/PythonDataObjectsTest.TestPythonTupleToStructuredList (1388 of 1892) PASS: lldb-api :: functionalities/float-display/TestFloatDisplay.py (1389 of 1892) PASS: lldb-unit :: Process/gdb-remote/./ProcessGdbRemoteTests/GDBRemoteClientBaseTest.SendContinueAndWait (1390 of 1892) PASS: lldb-api :: functionalities/postmortem/elf-core/TestLinuxCore.py (1391 of 1892) PASS: lldb-unit :: Interpreter/./InterpreterTests/CompletionTest.DirCompletionAbsolute (1392 of 1892) PASS: lldb-unit :: Utility/./UtilityTests/TimerTest.CategoryTimes2 (1393 of 1892) PASS: lldb-unit :: Utility/./UtilityTests/StreamTest.PutCharNull (1394 of 1892) PASS: lldb-unit :: SymbolFile/NativePDB/./SymbolFileNativePDBTests/PDBFPOProgramToDWARFExpressionTests.MissingTargetRegister (1395 of 1892) PASS: lldb-unit :: Utility/./UtilityTests/StringLexerTest.GetUnlexed (1396 of 1892) PASS: lldb-unit :: Utility/./UtilityTests/RecordReplayTest.InstrumentedBar (1397 of 1892) PASS: lldb-api :: functionalities/data-formatter/data-formatter-named-summaries/TestDataFormatterNamedSummaries.py (1398 of 1892) PASS: lldb-unit :: Expression/./ExpressionTests/DiagnosticManagerTest.AddDiagnostic (1399 of 1892) PASS: lldb-unit :: Utility/./UtilityTests/LogChannelEnabledTest.LogVerboseThread (1400 of 1892) UNSUPPORTED: lldb-shell :: ScriptInterpreter/Lua/independent_state.test (1401 of 1892) PASS: lldb-unit :: ObjectFile/Breakpad/./ObjectFileBreakpadTests/StackCFIRecord.parse (1402 of 1892) UNSUPPORTED: lldb-api :: functionalities/tsan/basic/TestTsanBasic.py (1403 of 1892) PASS: lldb-api :: api/check_public_api_headers/TestPublicAPIHeaders.py (1404 of 1892) PASS: lldb-shell :: Reproducer/TestFileRepro.test (1405 of 1892) PASS: lldb-api :: lang/cpp/auto/TestCPPAuto.py (1406 of 1892) PASS: lldb-unit :: ScriptInterpreter/Python/./ScriptInterpreterPythonTests/PythonDataObjectsTest.TestPythonIntegerToStr (1407 of 1892) PASS: lldb-api :: functionalities/plugins/python_os_plugin/TestPythonOSPlugin.py (1408 of 1892) PASS: lldb-shell :: SymbolFile/DWARF/dir-separator-posix.s (1409 of 1892) UNSUPPORTED: lldb-shell :: Register/x86-zmm-read.test (1410 of 1892) PASS: lldb-unit :: Utility/./UtilityTests/StreamTest.PutHex64ByteOrderLittle (1411 of 1892) PASS: lldb-unit :: Utility/./UtilityTests/StringExtractorTest.GetHexU8_InvalidHex_NoEof (1412 of 1892) PASS: lldb-unit :: UnwindAssembly/x86/./UnwindAssemblyx86Tests/Testx86AssemblyInspectionEngine.Test32bitFramelessBigStackFrame (1413 of 1892) UNSUPPORTED: lldb-api :: benchmarks/libcxxlist/TestBenchmarkLibcxxList.py (1414 of 1892) PASS: lldb-unit :: ScriptInterpreter/Python/./ScriptInterpreterPythonTests/PythonDataObjectsTest.TestPythonListValueEquality (1415 of 1892) PASS: lldb-unit :: debugserver/./debugserverTests/RNBSocket.LoopBackConnectIPv6 (1416 of 1892) PASS: lldb-api :: functionalities/gdb_remote_client/TestNoGPacketSupported.py (1417 of 1892) PASS: lldb-api :: tools/lldb-vscode/step/TestVSCode_step.py (1418 of 1892) PASS: lldb-unit :: Utility/./UtilityTests/CompletionRequest.Constructor (1419 of 1892) PASS: lldb-api :: tools/lldb-server/TestGdbRemoteExpeditedRegisters.py (1420 of 1892) PASS: lldb-api :: functionalities/data-formatter/data-formatter-stl/libcxx/vector/TestDataFormatterLibcxxVector.py (1421 of 1892) PASS: lldb-unit :: Utility/./UtilityTests/StringExtractorTest.GetHexBytes (1422 of 1892) PASS: lldb-api :: functionalities/breakpoint/inlined_breakpoints/TestInlinedBreakpoints.py (1423 of 1892) PASS: lldb-api :: commands/expression/import-std-module/sysroot/TestStdModuleSysroot.py (1424 of 1892) PASS: lldb-shell :: Reproducer/TestDriverOptions.test (1425 of 1892) PASS: lldb-api :: lang/c/function_types/TestFunctionTypes.py (1426 of 1892) PASS: lldb-api :: functionalities/gdb_remote_client/TestTargetXMLArch.py (1427 of 1892) PASS: lldb-unit :: Utility/./UtilityTests/AnsiTerminal.AtEnd (1428 of 1892) PASS: lldb-shell :: Settings/TestFrameFormatMangling.test (1429 of 1892) PASS: lldb-shell :: ObjectFile/PECOFF/invalid-export-table.yaml (1430 of 1892) PASS: lldb-api :: tools/lldb-server/TestGdbRemoteKill.py (1431 of 1892) PASS: lldb-api :: functionalities/type_completion/TestTypeCompletion.py (1432 of 1892) PASS: lldb-shell :: SymbolFile/DWARF/debug-types-line-tables.s (1433 of 1892) UNSUPPORTED: lldb-api :: functionalities/asan/TestReportData.py (1434 of 1892) PASS: lldb-api :: commands/expression/import-std-module/forward_list-basic/TestBasicForwardList.py (1435 of 1892) UNSUPPORTED: lldb-shell :: ScriptInterpreter/Lua/watchpoint_callback.test (1436 of 1892) PASS: lldb-api :: commands/expression/call-function/TestCallStopAndContinue.py (1437 of 1892) PASS: lldb-unit :: Host/./HostTests/FileSystemTest.Resolve (1438 of 1892) PASS: lldb-api :: commands/process/attach/TestProcessAttach.py (1439 of 1892) PASS: lldb-api :: commands/expression/no-deadlock/TestExprDoesntBlock.py (1440 of 1892) PASS: lldb-unit :: Utility/./UtilityTests/ArgsTest.TestAppendArg (1441 of 1892) PASS: lldb-api :: python_api/watchpoint/TestSetWatchpoint.py (1442 of 1892) PASS: lldb-api :: tools/lldb-server/TestGdbRemote_qThreadStopInfo.py (1443 of 1892) PASS: lldb-unit :: SymbolFile/DWARF/./SymbolFileDWARFTests/SymbolFileDWARFTests.TestAbbrevNullAttrValidForm (1444 of 1892) PASS: lldb-unit :: Process/gdb-remote/./ProcessGdbRemoteTests/GDBRemoteClientBaseTest.InterruptNoResponse (1445 of 1892) UNSUPPORTED: lldb-shell :: SymbolFile/PDB/udt-layout.test (1446 of 1892) PASS: lldb-api :: tools/lldb-server/commandline/TestStubReverseConnect.py (1447 of 1892) UNSUPPORTED: lldb-api :: commands/register/register/intel_xtended_registers/mpx_bound_violation/TestBoundViolation.py (1448 of 1892) PASS: lldb-unit :: Utility/./UtilityTests/FileSpecTest.Equal (1449 of 1892) PASS: lldb-api :: commands/frame/diagnose/dereference-argument/TestDiagnoseDereferenceArgument.py (1450 of 1892) PASS: lldb-api :: functionalities/signal/raise/TestRaise.py (1451 of 1892) PASS: lldb-unit :: Utility/./UtilityTests/OptionsWithRawTest.MultiWordSuffix (1452 of 1892) PASS: lldb-api :: commands/frame/diagnose/array/TestArray.py (1453 of 1892) PASS: lldb-unit :: Utility/./UtilityTests/UUIDTest.Validity (1454 of 1892) UNSUPPORTED: lldb-api :: functionalities/darwin_log/format/TestDarwinLogMessageFormat.py (1455 of 1892) PASS: lldb-api :: lang/cpp/thread_local/TestThreadLocal.py (1456 of 1892) PASS: lldb-api :: functionalities/data-formatter/stringprinter/TestStringPrinter.py (1457 of 1892) PASS: lldb-api :: functionalities/thread/backtrace_limit/TestBacktraceLimit.py (1458 of 1892) UNSUPPORTED: lldb-api :: tools/lldb-server/TestGdbRemoteAuxvSupport.py (1459 of 1892) PASS: lldb-api :: commands/expression/import-std-module/queue/TestQueue.py (1460 of 1892) PASS: lldb-unit :: UnwindAssembly/x86/./UnwindAssemblyx86Tests/Testx86AssemblyInspectionEngine.TestSpillRegToStackViaMOVi386 (1461 of 1892) PASS: lldb-unit :: Utility/./UtilityTests/ArchSpecTest.OperatorBool (1462 of 1892) PASS: lldb-unit :: SymbolFile/NativePDB/./SymbolFileNativePDBTests/PDBFPOProgramToDWARFExpressionTests.UnresolvedRegisterAssignmentReference (1463 of 1892) PASS: lldb-unit :: Utility/./UtilityTests/ScalarTest.Equality (1464 of 1892) PASS: lldb-api :: functionalities/wrong_commands/TestWrongCommands.py (1465 of 1892) PASS: lldb-api :: functionalities/data-formatter/refpointer-recursion/TestDataFormatterRefPtrRecursion.py (1466 of 1892) PASS: lldb-api :: macosx/safe-to-func-call/TestSafeFuncCalls.py (1467 of 1892) PASS: lldb-unit :: Language/Highlighting/./HighlighterTests/HighlighterTest.ClangCursorPosEndOfLine (1468 of 1892) PASS: lldb-api :: python_api/sbstructureddata/TestStructuredDataAPI.py (1469 of 1892) PASS: lldb-unit :: Utility/./UtilityTests/BroadcasterTest.BroadcastEvent (1470 of 1892) PASS: lldb-api :: functionalities/tail_call_frames/inlining_and_tail_calls/TestInliningAndTailCalls.py (1471 of 1892) PASS: lldb-unit :: Process/minidump/./LLDBMinidumpTests/MinidumpParserTest.GetMiscInfoWindows (1472 of 1892) UNSUPPORTED: lldb-api :: terminal/TestEditline.py (1473 of 1892) UNSUPPORTED: lldb-shell :: SymbolFile/PDB/class-layout.test (1474 of 1892) PASS: lldb-api :: commands/watchpoints/watchpoint_commands/command/TestWatchpointCommandLLDB.py (1475 of 1892) PASS: lldb-shell :: Breakpoint/debug_rnglist_rlestartend.test (1476 of 1892) PASS: lldb-unit :: Utility/./UtilityTests/StreamTeeTest.Write (1477 of 1892) PASS: lldb-unit :: Utility/./UtilityTests/FileSpecTest.FormatFileSpec (1478 of 1892) PASS: lldb-shell :: SymbolFile/DWARF/DW_OP_piece-struct.s (1479 of 1892) PASS: lldb-shell :: Quit/TestQuitExitCode30.test (1480 of 1892) FAIL: lldb-api :: functionalities/data-formatter/data-formatter-objc/TestDataFormatterObjCNSBundle.py (1481 of 1892) ******************** TEST 'lldb-api :: functionalities/data-formatter/data-formatter-objc/TestDataFormatterObjCNSBundle.py' FAILED ******************** lldb version 10.0.99 (http://labmaster3.local/git/llvm-project.git revision c1b13a1b17719aebace1b3be7a6ac7f90b1901a6) clang revision c1b13a1b17719aebace1b3be7a6ac7f90b1901a6 llvm revision c1b13a1b17719aebace1b3be7a6ac7f90b1901a6 LLDB library dir: /Users/buildslave/jenkins/workspace/lldb-cmake-sanitized/lldb-build/bin LLDB import library dir: /Users/buildslave/jenkins/workspace/lldb-cmake-sanitized/lldb-build/bin libstdcxx tests will not be run because: Don't know how to build with libstdcxx on macosx Skipping following debug info categories: ['dwo'] AddressSanitizer report breakpoint hit. Use 'thread info -s' to get extended information about the report. AddressSanitizer report breakpoint hit. Use 'thread info -s' to get extended information about the report. AddressSanitizer report breakpoint hit. Use 'thread info -s' to get extended information about the report.

Hide Details

Session logs for test failures/errors/unexpected successes will go into directory '/Users/buildslave/jenkins/workspace/lldb-cmake-sanitized/test/logs' Command invoked: /Users/buildslave/jenkins/workspace/lldb-cmake-sanitized/llvm-project/lldb/test/API/dotest.py --arch x86_64 -s /Users/buildslave/jenkins/workspace/lldb-cmake-sanitized/lldb-build/lldb-test-traces -S nm -u CXXFLAGS -u CFLAGS --codesign-identity lldb_codesign --server /Users/buildslave/jenkins/workspace/lldb-cmake-sanitized/lldb-build/./bin/debugserver --arch x86_64 --build-dir /Users/buildslave/jenkins/workspace/lldb-cmake-sanitized/lldb-build/lldb-test-build.noindex -s=/Users/buildslave/jenkins/workspace/lldb-cmake-sanitized/test/logs -t --env TERM=vt100 --env LLVM_LIBS_DIR=/Users/buildslave/jenkins/workspace/lldb-cmake-sanitized/lldb-build/./lib --inferior-env ASAN_OPTIONS=detect_stack_use_after_return=1 --inferior-env DYLD_INSERT_LIBRARIES=/Users/buildslave/jenkins/workspace/lldb-cmake-sanitized/host-compiler/lib/clang/10.0.0/lib/darwin/libclang_rt.asan_osx_dynamic.dylib --build-dir /Users/buildslave/jenkins/workspace/lldb-cmake-sanitized/lldb-build/lldb-test-build.noindex --lldb-module-cache-dir /Users/buildslave/jenkins/workspace/lldb-cmake-sanitized/lldb-build/lldb-test-build.noindex/module-cache-lldb/lldb-api --clang-module-cache-dir /Users/buildslave/jenkins/workspace/lldb-cmake-sanitized/lldb-build/lldb-test-build.noindex/module-cache-clang/lldb-api --executable /Users/buildslave/jenkins/workspace/lldb-cmake-sanitized/lldb-build/./bin/lldb --compiler /Users/buildslave/jenkins/workspace/lldb-cmake-sanitized/lldb-build/./bin/clang --dsymutil /Users/buildslave/jenkins/workspace/lldb-cmake-sanitized/lldb-build/./bin/dsymutil --filecheck /Users/buildslave/jenkins/workspace/lldb-cmake-sanitized/lldb-build/./bin/FileCheck /Users/buildslave/jenkins/workspace/lldb-cmake-sanitized/llvm-project/lldb/packages/Python/lldbsuite/test/functionalities/data-formatter/data-formatter-objc -p TestDataFormatterObjCNSBundle.py Change dir to: /Users/buildslave/jenkins/workspace/lldb-cmake-sanitized/llvm-project/lldb/packages/Python/lldbsuite/test/functionalities/data-formatter/data-formatter-objc runCmd: settings set symbols.enable-external-lookup false output:

Hide Details

runCmd: settings set plugin.process.gdb-remote.packet-timeout 60 output:

Hide Details

runCmd: settings set symbols.clang-modules-cache-path "/Users/buildslave/jenkins/workspace/lldb-cmake-sanitized/lldb-build/lldb-test-build.noindex/module-cache-lldb/lldb-api" output:

Hide Details

runCmd: settings set use-color false output:

Hide Details

runCmd: settings set target.env-vars ASAN_OPTIONS=detect_stack_use_after_return=1 DYLD_INSERT_LIBRARIES=/Users/buildslave/jenkins/workspace/lldb-cmake-sanitized/host-compiler/lib/clang/10.0.0/lib/darwin/libclang_rt.asan_osx_dynamic.dylib output:

Hide Details

runCmd: settings set target.env-vars ASAN_OPTIONS=detect_stack_use_after_return=1 DYLD_INSERT_LIBRARIES=/Users/buildslave/jenkins/workspace/lldb-cmake-sanitized/host-compiler/lib/clang/10.0.0/lib/darwin/libclang_rt.asan_osx_dynamic.dylib output:

Hide Details

FAIL: LLDB (/Users/buildslave/jenkins/workspace/lldb-cmake-sanitized/lldb-build/bin/clang-10-x86_64) :: test_nsbundle_with_run_command_dsym (TestDataFormatterObjCNSBundle.ObjCDataFormatterNSBundle) <bound method SBProcess.Kill of <lldb.SBProcess; proxy of <Swig Object of type 'lldb::SBProcess *' at 0x113813090> >>: success

Hide Details

runCmd: settings set symbols.enable-external-lookup false output:

Hide Details

runCmd: settings set plugin.process.gdb-remote.packet-timeout 60 output:

Hide Details

runCmd: settings set symbols.clang-modules-cache-path "/Users/buildslave/jenkins/workspace/lldb-cmake-sanitized/lldb-build/lldb-test-build.noindex/module-cache-lldb/lldb-api" output:

Hide Details

runCmd: settings set use-color false output:

Hide Details

runCmd: settings set target.env-vars ASAN_OPTIONS=detect_stack_use_after_return=1 DYLD_INSERT_LIBRARIES=/Users/buildslave/jenkins/workspace/lldb-cmake-sanitized/host-compiler/lib/clang/10.0.0/lib/darwin/libclang_rt.asan_osx_dynamic.dylib output:

Hide Details

runCmd: settings set target.env-vars ASAN_OPTIONS=detect_stack_use_after_return=1 DYLD_INSERT_LIBRARIES=/Users/buildslave/jenkins/workspace/lldb-cmake-sanitized/host-compiler/lib/clang/10.0.0/lib/darwin/libclang_rt.asan_osx_dynamic.dylib output:

Hide Details

FAIL: LLDB (/Users/buildslave/jenkins/workspace/lldb-cmake-sanitized/lldb-build/bin/clang-10-x86_64) :: test_nsbundle_with_run_command_dwarf (TestDataFormatterObjCNSBundle.ObjCDataFormatterNSBundle) <bound method SBProcess.Kill of <lldb.SBProcess; proxy of <Swig Object of type 'lldb::SBProcess *' at 0x113240630> >>: success

Hide Details

UNSUPPORTED: LLDB (/Users/buildslave/jenkins/workspace/lldb-cmake-sanitized/lldb-build/bin/clang-10-x86_64) :: test_nsbundle_with_run_command_dwo (TestDataFormatterObjCNSBundle.ObjCDataFormatterNSBundle) (test case does not fall in any category of interest for this run) runCmd: settings set symbols.enable-external-lookup false output:

Hide Details

runCmd: settings set plugin.process.gdb-remote.packet-timeout 60 output:

Hide Details

runCmd: settings set symbols.clang-modules-cache-path "/Users/buildslave/jenkins/workspace/lldb-cmake-sanitized/lldb-build/lldb-test-build.noindex/module-cache-lldb/lldb-api" output:

Hide Details

runCmd: settings set use-color false output:

Hide Details

runCmd: settings set target.env-vars ASAN_OPTIONS=detect_stack_use_after_return=1 DYLD_INSERT_LIBRARIES=/Users/buildslave/jenkins/workspace/lldb-cmake-sanitized/host-compiler/lib/clang/10.0.0/lib/darwin/libclang_rt.asan_osx_dynamic.dylib output:

Hide Details

runCmd: settings set target.env-vars ASAN_OPTIONS=detect_stack_use_after_return=1 DYLD_INSERT_LIBRARIES=/Users/buildslave/jenkins/workspace/lldb-cmake-sanitized/host-compiler/lib/clang/10.0.0/lib/darwin/libclang_rt.asan_osx_dynamic.dylib output:

Hide Details

FAIL: LLDB (/Users/buildslave/jenkins/workspace/lldb-cmake-sanitized/lldb-build/bin/clang-10-x86_64) :: test_nsbundle_with_run_command_gmodules (TestDataFormatterObjCNSBundle.ObjCDataFormatterNSBundle) <bound method SBProcess.Kill of <lldb.SBProcess; proxy of <Swig Object of type 'lldb::SBProcess *' at 0x113813210> >>: success

Hide Details

Restore dir to: /Users/buildslave/jenkins/workspace/lldb-cmake-sanitized/lldb-build/tools/lldb/test ====================================================================== FAIL: test_nsbundle_with_run_command_dsym (TestDataFormatterObjCNSBundle.ObjCDataFormatterNSBundle) Test formatters for NSBundle. ---------------------------------------------------------------------- Traceback (most recent call last): File "/Users/buildslave/jenkins/workspace/lldb-cmake-sanitized/llvm-project/lldb/packages/Python/lldbsuite/test/lldbtest.py", line 1732, in test_method return attrvalue(self) File "/Users/buildslave/jenkins/workspace/lldb-cmake-sanitized/llvm-project/lldb/packages/Python/lldbsuite/test/functionalities/data-formatter/data-formatter-objc/TestDataFormatterObjCNSBundle.py", line 20, in test_nsbundle_with_run_command self.appkit_tester_impl(self.nsbundle_data_formatter_commands) File "/Users/buildslave/jenkins/workspace/lldb-cmake-sanitized/llvm-project/lldb/packages/Python/lldbsuite/test/functionalities/data-formatter/data-formatter-objc/ObjCDataFormatterTestCase.py", line 19, in appkit_tester_impl self.appkit_common_data_formatters_command() File "/Users/buildslave/jenkins/workspace/lldb-cmake-sanitized/llvm-project/lldb/packages/Python/lldbsuite/test/functionalities/data-formatter/data-formatter-objc/ObjCDataFormatterTestCase.py", line 26, in appkit_common_data_formatters_command lldb.SBFileSpec('main.m', False)) File "/Users/buildslave/jenkins/workspace/lldb-cmake-sanitized/llvm-project/lldb/packages/Python/lldbsuite/test/lldbutil.py", line 868, in run_to_source_breakpoint only_one_thread, extra_images) File "/Users/buildslave/jenkins/workspace/lldb-cmake-sanitized/llvm-project/lldb/packages/Python/lldbsuite/test/lldbutil.py", line 797, in run_to_breakpoint_do_run test.assertEqual(num_threads, 1, "Expected 1 thread to stop at breakpoint, %d did."%(num_threads)) AssertionError: 0 != 1 : Expected 1 thread to stop at breakpoint, 0 did. Config=x86_64-/Users/buildslave/jenkins/workspace/lldb-cmake-sanitized/lldb-build/bin/clang-10 ====================================================================== FAIL: test_nsbundle_with_run_command_dwarf (TestDataFormatterObjCNSBundle.ObjCDataFormatterNSBundle) Test formatters for NSBundle. ---------------------------------------------------------------------- Traceback (most recent call last): File "/Users/buildslave/jenkins/workspace/lldb-cmake-sanitized/llvm-project/lldb/packages/Python/lldbsuite/test/lldbtest.py", line 1732, in test_method return attrvalue(self) File "/Users/buildslave/jenkins/workspace/lldb-cmake-sanitized/llvm-project/lldb/packages/Python/lldbsuite/test/functionalities/data-formatter/data-formatter-objc/TestDataFormatterObjCNSBundle.py", line 20, in test_nsbundle_with_run_command self.appkit_tester_impl(self.nsbundle_data_formatter_commands) File "/Users/buildslave/jenkins/workspace/lldb-cmake-sanitized/llvm-project/lldb/packages/Python/lldbsuite/test/functionalities/data-formatter/data-formatter-objc/ObjCDataFormatterTestCase.py", line 19, in appkit_tester_impl self.appkit_common_data_formatters_command() File "/Users/buildslave/jenkins/workspace/lldb-cmake-sanitized/llvm-project/lldb/packages/Python/lldbsuite/test/functionalities/data-formatter/data-formatter-objc/ObjCDataFormatterTestCase.py", line 26, in appkit_common_data_formatters_command lldb.SBFileSpec('main.m', False)) File "/Users/buildslave/jenkins/workspace/lldb-cmake-sanitized/llvm-project/lldb/packages/Python/lldbsuite/test/lldbutil.py", line 868, in run_to_source_breakpoint only_one_thread, extra_images) File "/Users/buildslave/jenkins/workspace/lldb-cmake-sanitized/llvm-project/lldb/packages/Python/lldbsuite/test/lldbutil.py", line 797, in run_to_breakpoint_do_run test.assertEqual(num_threads, 1, "Expected 1 thread to stop at breakpoint, %d did."%(num_threads)) AssertionError: 0 != 1 : Expected 1 thread to stop at breakpoint, 0 did. Config=x86_64-/Users/buildslave/jenkins/workspace/lldb-cmake-sanitized/lldb-build/bin/clang-10 ====================================================================== FAIL: test_nsbundle_with_run_command_gmodules (TestDataFormatterObjCNSBundle.ObjCDataFormatterNSBundle) Test formatters for NSBundle. ---------------------------------------------------------------------- Traceback (most recent call last): File "/Users/buildslave/jenkins/workspace/lldb-cmake-sanitized/llvm-project/lldb/packages/Python/lldbsuite/test/lldbtest.py", line 1732, in test_method return attrvalue(self) File "/Users/buildslave/jenkins/workspace/lldb-cmake-sanitized/llvm-project/lldb/packages/Python/lldbsuite/test/functionalities/data-formatter/data-formatter-objc/TestDataFormatterObjCNSBundle.py", line 20, in test_nsbundle_with_run_command self.appkit_tester_impl(self.nsbundle_data_formatter_commands) File "/Users/buildslave/jenkins/workspace/lldb-cmake-sanitized/llvm-project/lldb/packages/Python/lldbsuite/test/functionalities/data-formatter/data-formatter-objc/ObjCDataFormatterTestCase.py", line 19, in appkit_tester_impl self.appkit_common_data_formatters_command() File "/Users/buildslave/jenkins/workspace/lldb-cmake-sanitized/llvm-project/lldb/packages/Python/lldbsuite/test/functionalities/data-formatter/data-formatter-objc/ObjCDataFormatterTestCase.py", line 26, in appkit_common_data_formatters_command lldb.SBFileSpec('main.m', False)) File "/Users/buildslave/jenkins/workspace/lldb-cmake-sanitized/llvm-project/lldb/packages/Python/lldbsuite/test/lldbutil.py", line 868, in run_to_source_breakpoint only_one_thread, extra_images) File "/Users/buildslave/jenkins/workspace/lldb-cmake-sanitized/llvm-project/lldb/packages/Python/lldbsuite/test/lldbutil.py", line 797, in run_to_breakpoint_do_run test.assertEqual(num_threads, 1, "Expected 1 thread to stop at breakpoint, %d did."%(num_threads)) AssertionError: 0 != 1 : Expected 1 thread to stop at breakpoint, 0 did. Config=x86_64-/Users/buildslave/jenkins/workspace/lldb-cmake-sanitized/lldb-build/bin/clang-10 ---------------------------------------------------------------------- Ran 4 tests in 142.316s

Hide Details

RESULT: FAILED (0 passes, 3 failures, 0 errors, 1 skipped, 0 expected failures, 0 unexpected successes)

Hide Details

******************** PASS: lldb-api :: functionalities/avoids-fd-leak/TestFdLeak.py (1482 of 1892) PASS: lldb-api :: lang/cpp/global_operators/TestCppGlobalOperators.py (1483 of 1892) PASS: lldb-unit :: Utility/./UtilityTests/LogChannelEnabledTest.LogGetLogThread (1484 of 1892) PASS: lldb-unit :: Process/gdb-remote/./ProcessGdbRemoteTests/GDBRemoteClientBaseTest.SendContinueAndInterrupt2PacketBug (1485 of 1892) UNSUPPORTED: lldb-api :: commands/register/register/intel_xtended_registers/mpx_offset_intersection/TestMPXOffsetIntersection.py (1486 of 1892) PASS: lldb-shell :: Reproducer/TestCrash.test (1487 of 1892) PASS: lldb-shell :: SymbolFile/DWARF/debug-types-dwarf5.s (1488 of 1892) PASS: lldb-api :: python_api/objc_type/TestObjCType.py (1489 of 1892) PASS: lldb-api :: commands/expression/import-std-module/unique_ptr/TestUniquePtr.py (1490 of 1892) PASS: lldb-api :: functionalities/conditional_break/TestConditionalBreak.py (1491 of 1892) PASS: lldb-unit :: Host/./HostTests/SocketTest.TCPListen0ConnectAccept (1492 of 1892) PASS: lldb-unit :: Host/./HostTests/File.GetWaitableHandleFileno (1493 of 1892) PASS: lldb-api :: functionalities/thread/exit_during_step/TestExitDuringStep.py (1494 of 1892) PASS: lldb-shell :: ScriptInterpreter/Python/scripted_breakpoint.test (1495 of 1892) PASS: lldb-unit :: Utility/./UtilityTests/RangeTest.DefaultConstructor (1496 of 1892) PASS: lldb-unit :: Utility/./UtilityTests/SerializationRountripTest.SerializeDeserializeObjectPointer (1497 of 1892) PASS: lldb-api :: tools/lldb-server/TestGdbRemoteAttach.py (1498 of 1892) PASS: lldb-api :: python_api/interpreter/TestRunCommandInterpreterAPI.py (1499 of 1892) PASS: lldb-unit :: UnwindAssembly/x86/./UnwindAssemblyx86Tests/Testx86AssemblyInspectionEngine.TestPopRBX (1500 of 1892) PASS: lldb-api :: functionalities/data-formatter/data-formatter-stl/libcxx/forward_list/TestDataFormatterLibcxxForwardList.py (1501 of 1892) UNSUPPORTED: lldb-shell :: SymbolFile/PDB/expressions.test (1502 of 1892) PASS: lldb-api :: python_api/frame/inlines/TestInlinedFrame.py (1503 of 1892) PASS: lldb-unit :: Utility/./UtilityTests/StreamTeeTest.Constructor2Streams (1504 of 1892) PASS: lldb-unit :: Utility/./UtilityTests/StructuredDataTest.StringDump (1505 of 1892) PASS: lldb-shell :: SymbolFile/DWARF/debug_loc_and_loclists.s (1506 of 1892) PASS: lldb-unit :: ScriptInterpreter/Python/./ScriptInterpreterPythonTests/PythonDataObjectsTest.TestResetting (1507 of 1892) PASS: lldb-unit :: Host/./HostTests/FileSystemTest.OpenErrno (1508 of 1892) PASS: lldb-unit :: Utility/./UtilityTests/ConstStringTest.CompareStringRef (1509 of 1892) PASS: lldb-api :: lang/objcxx/hide-runtime-values/TestObjCXXHideRuntimeValues.py (1510 of 1892) PASS: lldb-api :: commands/frame/diagnose/dereference-function-return/TestDiagnoseDereferenceFunctionReturn.py (1511 of 1892) PASS: lldb-unit :: Host/./HostTests/SocketAddressTest.GetAddressInfo (1512 of 1892) PASS: lldb-unit :: Utility/./UtilityTests/RangeTest.SlideZero (1513 of 1892) PASS: lldb-unit :: Utility/./UtilityTests/RangeDataVector.FindEntryThatContains_Overlap (1514 of 1892) PASS: lldb-shell :: SymbolFile/DWARF/array-sizes.s (1515 of 1892) PASS: lldb-shell :: SymbolFile/NativePDB/s_constant.cpp (1516 of 1892) PASS: lldb-unit :: UnwindAssembly/x86/./UnwindAssemblyx86Tests/Testx86AssemblyInspectionEngine.TestPopR14 (1517 of 1892) PASS: lldb-api :: commands/expression/import-std-module/stack/TestStack.py (1518 of 1892) PASS: lldb-shell :: Register/x86-64-ymm-read.test (1519 of 1892) PASS: lldb-shell :: ObjectFile/Breakpad/discontiguous-sections.test (1520 of 1892) PASS: lldb-unit :: ScriptInterpreter/Python/./ScriptInterpreterPythonTests/PythonDataObjectsTest.TestExceptions (1521 of 1892) PASS: lldb-unit :: Utility/./UtilityTests/StringListTest.InsertStringAtIndexStart (1522 of 1892) PASS: lldb-unit :: Language/Highlighting/./HighlighterTests/HighlighterTest.ClangTrailingBackslashMissingNewLine (1523 of 1892) UNSUPPORTED: lldb-api :: benchmarks/frame_variable/TestFrameVariableResponse.py (1524 of 1892) PASS: lldb-shell :: Unwind/trap_frame_sym_ctx.test (1525 of 1892) PASS: lldb-api :: commands/expression/import-std-module/basic/TestImportStdModule.py (1526 of 1892) PASS: lldb-unit :: Utility/./UtilityTests/UriParserTest.BadPort2 (1527 of 1892) PASS: lldb-unit :: Utility/./UtilityTests/OptionsWithRawTest.LeadingSpaceArgs (1528 of 1892) PASS: lldb-unit :: Host/./HostTests/NativeProcessProtocolTest.ReadCStringFromMemory_MaxSize (1529 of 1892) PASS: lldb-unit :: Utility/./UtilityTests/DataExtractorTest.GetCStrEmpty (1530 of 1892) PASS: lldb-unit :: Utility/./UtilityTests/StreamTeeTest.Flush (1531 of 1892) PASS: lldb-unit :: Utility/./UtilityTests/StringListTest.AppendListCStringArray (1532 of 1892) PASS: lldb-unit :: Language/CPlusPlus/./LanguageCPlusPlusTests/CPlusPlusLanguage.ExtractContextAndIdentifier (1533 of 1892) PASS: lldb-shell :: ObjectFile/Breakpad/uuid-matching-mac.test (1534 of 1892) PASS: lldb-api :: python_api/lldbutil/iter/TestLLDBIterator.py (1535 of 1892) PASS: lldb-api :: functionalities/data-formatter/data-formatter-stl/libcxx/string/TestDataFormatterLibcxxString.py (1536 of 1892) PASS: lldb-unit :: Utility/./UtilityTests/BinaryStreamTest.PutSLEB128One (1537 of 1892) PASS: lldb-shell :: ObjectFile/ELF/build-id-case.yaml (1538 of 1892) PASS: lldb-unit :: Utility/./UtilityTests/ScalarTest.Promotion (1539 of 1892) PASS: lldb-api :: commands/source/info/TestSourceInfo.py (1540 of 1892) PASS: lldb-shell :: SymbolFile/DWARF/apple-index-is-used.cpp (1541 of 1892) PASS: lldb-unit :: Utility/./UtilityTests/ScalarTest.ComparisonFloat (1542 of 1892) PASS: lldb-api :: functionalities/gdb_remote_client/TestArmRegisterDefinition.py (1543 of 1892) PASS: lldb-unit :: Utility/./UtilityTests/StreamTest.PutBytesAsRawHex8ToMixedEndian (1544 of 1892) PASS: lldb-api :: functionalities/memory/read/TestMemoryRead.py (1545 of 1892) PASS: lldb-api :: commands/watchpoints/hello_watchpoint/TestMyFirstWatchpoint.py (1546 of 1892) PASS: lldb-api :: lang/cpp/gmodules-templates/TestGModules.py (1547 of 1892) PASS: lldb-api :: commands/expression/import-std-module/weak_ptr-dbg-info-content/TestDbgInfoContentWeakPtr.py (1548 of 1892) PASS: lldb-unit :: Utility/./UtilityTests/DataExtractorTest.GetBitfield (1549 of 1892) PASS: lldb-shell :: ObjectFile/ELF/minidebuginfo-find-symbols.yaml (1550 of 1892) PASS: lldb-shell :: Reproducer/Functionalities/TestImageList.test (1551 of 1892) PASS: lldb-unit :: Utility/./UtilityTests/TildeExpressionResolver.ResolveFullPath (1552 of 1892) UNSUPPORTED: lldb-shell :: SymbolFile/PDB/function-level-linking.test (1553 of 1892) PASS: lldb-shell :: ObjectFile/PECOFF/uuid.yaml (1554 of 1892) PASS: lldb-shell :: Unwind/thread-step-out-ret-addr-check.test (1555 of 1892) PASS: lldb-api :: types/TestIntegerTypeExpr.py (1556 of 1892) PASS: lldb-unit :: Utility/./UtilityTests/GeneratorTest.Get (1557 of 1892) PASS: lldb-api :: functionalities/breakpoint/breakpoint_locations/TestBreakpointLocations.py (1558 of 1892) PASS: lldb-api :: lang/objc/orderedset/TestOrderedSet.py (1559 of 1892) PASS: lldb-api :: functionalities/postmortem/netbsd-core/TestNetBSDCore.py (1560 of 1892) PASS: lldb-unit :: Utility/./UtilityTests/ArgsTest.TestTrailingBackslash (1561 of 1892) UNSUPPORTED: lldb-api :: functionalities/darwin_log/filter/regex/subsystem/TestDarwinLogFilterRegexSubsystem.py (1562 of 1892) PASS: lldb-unit :: Utility/./UtilityTests/StringListTest.InsertStringAtIndexOutOfBounds (1563 of 1892) PASS: lldb-shell :: SymbolFile/DWARF/parallel-indexing-stress.s (1564 of 1892) PASS: lldb-unit :: Process/minidump/./LLDBMinidumpTests/MinidumpParserTest.GetThreadsAndGetThreadContext (1565 of 1892) PASS: lldb-shell :: Breakpoint/case-sensitive.test (1566 of 1892) PASS: lldb-unit :: Interpreter/./InterpreterTests/CompletionTest.DirCompletionUsername (1567 of 1892) PASS: lldb-api :: commands/expression/import-std-module/deque-dbg-info-content/TestDbgInfoContentDeque.py (1568 of 1892) PASS: lldb-unit :: Language/Highlighting/./HighlighterTests/HighlighterTest.ClangCommas (1569 of 1892) PASS: lldb-api :: functionalities/postmortem/minidump-new/TestMiniDumpUUID.py (1570 of 1892) PASS: lldb-api :: commands/frame/diagnose/complicated-expression/TestComplicatedExpression.py (1571 of 1892) PASS: lldb-api :: tools/lldb-vscode/stackTrace/TestVSCode_stackTrace.py (1572 of 1892) PASS: lldb-unit :: Core/./LLDBCoreTests/MangledTest.EmptyForInvalidName (1573 of 1892) PASS: lldb-unit :: Utility/./UtilityTests/UriParserTest.Minimal (1574 of 1892) PASS: lldb-api :: lang/objc/foundation/TestObjCMethods.py (1575 of 1892) PASS: lldb-api :: commands/expression/static-initializers/TestStaticInitializers.py (1576 of 1892) FAIL: lldb-api :: functionalities/data-formatter/data-formatter-objc/TestDataFormatterObjCCF.py (1577 of 1892) ******************** TEST 'lldb-api :: functionalities/data-formatter/data-formatter-objc/TestDataFormatterObjCCF.py' FAILED ******************** lldb version 10.0.99 (http://labmaster3.local/git/llvm-project.git revision c1b13a1b17719aebace1b3be7a6ac7f90b1901a6) clang revision c1b13a1b17719aebace1b3be7a6ac7f90b1901a6 llvm revision c1b13a1b17719aebace1b3be7a6ac7f90b1901a6 LLDB library dir: /Users/buildslave/jenkins/workspace/lldb-cmake-sanitized/lldb-build/bin LLDB import library dir: /Users/buildslave/jenkins/workspace/lldb-cmake-sanitized/lldb-build/bin libstdcxx tests will not be run because: Don't know how to build with libstdcxx on macosx Skipping following debug info categories: ['dwo'] AddressSanitizer report breakpoint hit. Use 'thread info -s' to get extended information about the report. AddressSanitizer report breakpoint hit. Use 'thread info -s' to get extended information about the report. AddressSanitizer report breakpoint hit. Use 'thread info -s' to get extended information about the report.

Hide Details

Session logs for test failures/errors/unexpected successes will go into directory '/Users/buildslave/jenkins/workspace/lldb-cmake-sanitized/test/logs' Command invoked: /Users/buildslave/jenkins/workspace/lldb-cmake-sanitized/llvm-project/lldb/test/API/dotest.py --arch x86_64 -s /Users/buildslave/jenkins/workspace/lldb-cmake-sanitized/lldb-build/lldb-test-traces -S nm -u CXXFLAGS -u CFLAGS --codesign-identity lldb_codesign --server /Users/buildslave/jenkins/workspace/lldb-cmake-sanitized/lldb-build/./bin/debugserver --arch x86_64 --build-dir /Users/buildslave/jenkins/workspace/lldb-cmake-sanitized/lldb-build/lldb-test-build.noindex -s=/Users/buildslave/jenkins/workspace/lldb-cmake-sanitized/test/logs -t --env TERM=vt100 --env LLVM_LIBS_DIR=/Users/buildslave/jenkins/workspace/lldb-cmake-sanitized/lldb-build/./lib --inferior-env ASAN_OPTIONS=detect_stack_use_after_return=1 --inferior-env DYLD_INSERT_LIBRARIES=/Users/buildslave/jenkins/workspace/lldb-cmake-sanitized/host-compiler/lib/clang/10.0.0/lib/darwin/libclang_rt.asan_osx_dynamic.dylib --build-dir /Users/buildslave/jenkins/workspace/lldb-cmake-sanitized/lldb-build/lldb-test-build.noindex --lldb-module-cache-dir /Users/buildslave/jenkins/workspace/lldb-cmake-sanitized/lldb-build/lldb-test-build.noindex/module-cache-lldb/lldb-api --clang-module-cache-dir /Users/buildslave/jenkins/workspace/lldb-cmake-sanitized/lldb-build/lldb-test-build.noindex/module-cache-clang/lldb-api --executable /Users/buildslave/jenkins/workspace/lldb-cmake-sanitized/lldb-build/./bin/lldb --compiler /Users/buildslave/jenkins/workspace/lldb-cmake-sanitized/lldb-build/./bin/clang --dsymutil /Users/buildslave/jenkins/workspace/lldb-cmake-sanitized/lldb-build/./bin/dsymutil --filecheck /Users/buildslave/jenkins/workspace/lldb-cmake-sanitized/lldb-build/./bin/FileCheck /Users/buildslave/jenkins/workspace/lldb-cmake-sanitized/llvm-project/lldb/packages/Python/lldbsuite/test/functionalities/data-formatter/data-formatter-objc -p TestDataFormatterObjCCF.py Change dir to: /Users/buildslave/jenkins/workspace/lldb-cmake-sanitized/llvm-project/lldb/packages/Python/lldbsuite/test/functionalities/data-formatter/data-formatter-objc runCmd: settings set symbols.enable-external-lookup false output:

Hide Details

runCmd: settings set plugin.process.gdb-remote.packet-timeout 60 output:

Hide Details

runCmd: settings set symbols.clang-modules-cache-path "/Users/buildslave/jenkins/workspace/lldb-cmake-sanitized/lldb-build/lldb-test-build.noindex/module-cache-lldb/lldb-api" output:

Hide Details

runCmd: settings set use-color false output:

Hide Details

runCmd: settings set target.env-vars ASAN_OPTIONS=detect_stack_use_after_return=1 DYLD_INSERT_LIBRARIES=/Users/buildslave/jenkins/workspace/lldb-cmake-sanitized/host-compiler/lib/clang/10.0.0/lib/darwin/libclang_rt.asan_osx_dynamic.dylib output:

Hide Details

runCmd: settings set target.env-vars ASAN_OPTIONS=detect_stack_use_after_return=1 DYLD_INSERT_LIBRARIES=/Users/buildslave/jenkins/workspace/lldb-cmake-sanitized/host-compiler/lib/clang/10.0.0/lib/darwin/libclang_rt.asan_osx_dynamic.dylib output:

Hide Details

FAIL: LLDB (/Users/buildslave/jenkins/workspace/lldb-cmake-sanitized/lldb-build/bin/clang-10-x86_64) :: test_coreframeworks_and_run_command_dsym (TestDataFormatterObjCCF.ObjCDataFormatterCF) <bound method SBProcess.Kill of <lldb.SBProcess; proxy of <Swig Object of type 'lldb::SBProcess *' at 0x11142db10> >>: success

Hide Details

runCmd: settings set symbols.enable-external-lookup false output:

Hide Details

runCmd: settings set plugin.process.gdb-remote.packet-timeout 60 output:

Hide Details

runCmd: settings set symbols.clang-modules-cache-path "/Users/buildslave/jenkins/workspace/lldb-cmake-sanitized/lldb-build/lldb-test-build.noindex/module-cache-lldb/lldb-api" output:

Hide Details

runCmd: settings set use-color false output:

Hide Details

runCmd: settings set target.env-vars ASAN_OPTIONS=detect_stack_use_after_return=1 DYLD_INSERT_LIBRARIES=/Users/buildslave/jenkins/workspace/lldb-cmake-sanitized/host-compiler/lib/clang/10.0.0/lib/darwin/libclang_rt.asan_osx_dynamic.dylib output:

Hide Details

runCmd: settings set target.env-vars ASAN_OPTIONS=detect_stack_use_after_return=1 DYLD_INSERT_LIBRARIES=/Users/buildslave/jenkins/workspace/lldb-cmake-sanitized/host-compiler/lib/clang/10.0.0/lib/darwin/libclang_rt.asan_osx_dynamic.dylib output:

Hide Details

FAIL: LLDB (/Users/buildslave/jenkins/workspace/lldb-cmake-sanitized/lldb-build/bin/clang-10-x86_64) :: test_coreframeworks_and_run_command_dwarf (TestDataFormatterObjCCF.ObjCDataFormatterCF) <bound method SBProcess.Kill of <lldb.SBProcess; proxy of <Swig Object of type 'lldb::SBProcess *' at 0x110852630> >>: success

Hide Details

UNSUPPORTED: LLDB (/Users/buildslave/jenkins/workspace/lldb-cmake-sanitized/lldb-build/bin/clang-10-x86_64) :: test_coreframeworks_and_run_command_dwo (TestDataFormatterObjCCF.ObjCDataFormatterCF) (test case does not fall in any category of interest for this run) runCmd: settings set symbols.enable-external-lookup false output:

Hide Details

runCmd: settings set plugin.process.gdb-remote.packet-timeout 60 output:

Hide Details

runCmd: settings set symbols.clang-modules-cache-path "/Users/buildslave/jenkins/workspace/lldb-cmake-sanitized/lldb-build/lldb-test-build.noindex/module-cache-lldb/lldb-api" output:

Hide Details

runCmd: settings set use-color false output:

Hide Details

runCmd: settings set target.env-vars ASAN_OPTIONS=detect_stack_use_after_return=1 DYLD_INSERT_LIBRARIES=/Users/buildslave/jenkins/workspace/lldb-cmake-sanitized/host-compiler/lib/clang/10.0.0/lib/darwin/libclang_rt.asan_osx_dynamic.dylib output:

Hide Details

runCmd: settings set target.env-vars ASAN_OPTIONS=detect_stack_use_after_return=1 DYLD_INSERT_LIBRARIES=/Users/buildslave/jenkins/workspace/lldb-cmake-sanitized/host-compiler/lib/clang/10.0.0/lib/darwin/libclang_rt.asan_osx_dynamic.dylib output:

Hide Details

FAIL: LLDB (/Users/buildslave/jenkins/workspace/lldb-cmake-sanitized/lldb-build/bin/clang-10-x86_64) :: test_coreframeworks_and_run_command_gmodules (TestDataFormatterObjCCF.ObjCDataFormatterCF) <bound method SBProcess.Kill of <lldb.SBProcess; proxy of <Swig Object of type 'lldb::SBProcess *' at 0x11142db10> >>: success

Hide Details

Restore dir to: /Users/buildslave/jenkins/workspace/lldb-cmake-sanitized/lldb-build/tools/lldb/test ====================================================================== FAIL: test_coreframeworks_and_run_command_dsym (TestDataFormatterObjCCF.ObjCDataFormatterCF) Test formatters for Core OSX frameworks. ---------------------------------------------------------------------- Traceback (most recent call last): File "/Users/buildslave/jenkins/workspace/lldb-cmake-sanitized/llvm-project/lldb/packages/Python/lldbsuite/test/lldbtest.py", line 1732, in test_method return attrvalue(self) File "/Users/buildslave/jenkins/workspace/lldb-cmake-sanitized/llvm-project/lldb/packages/Python/lldbsuite/test/functionalities/data-formatter/data-formatter-objc/TestDataFormatterObjCCF.py", line 23, in test_coreframeworks_and_run_command lldb.SBFileSpec('main.m', False)) File "/Users/buildslave/jenkins/workspace/lldb-cmake-sanitized/llvm-project/lldb/packages/Python/lldbsuite/test/lldbutil.py", line 868, in run_to_source_breakpoint only_one_thread, extra_images) File "/Users/buildslave/jenkins/workspace/lldb-cmake-sanitized/llvm-project/lldb/packages/Python/lldbsuite/test/lldbutil.py", line 797, in run_to_breakpoint_do_run test.assertEqual(num_threads, 1, "Expected 1 thread to stop at breakpoint, %d did."%(num_threads)) AssertionError: 0 != 1 : Expected 1 thread to stop at breakpoint, 0 did. Config=x86_64-/Users/buildslave/jenkins/workspace/lldb-cmake-sanitized/lldb-build/bin/clang-10 ====================================================================== FAIL: test_coreframeworks_and_run_command_dwarf (TestDataFormatterObjCCF.ObjCDataFormatterCF) Test formatters for Core OSX frameworks. ---------------------------------------------------------------------- Traceback (most recent call last): File "/Users/buildslave/jenkins/workspace/lldb-cmake-sanitized/llvm-project/lldb/packages/Python/lldbsuite/test/lldbtest.py", line 1732, in test_method return attrvalue(self) File "/Users/buildslave/jenkins/workspace/lldb-cmake-sanitized/llvm-project/lldb/packages/Python/lldbsuite/test/functionalities/data-formatter/data-formatter-objc/TestDataFormatterObjCCF.py", line 23, in test_coreframeworks_and_run_command lldb.SBFileSpec('main.m', False)) File "/Users/buildslave/jenkins/workspace/lldb-cmake-sanitized/llvm-project/lldb/packages/Python/lldbsuite/test/lldbutil.py", line 868, in run_to_source_breakpoint only_one_thread, extra_images) File "/Users/buildslave/jenkins/workspace/lldb-cmake-sanitized/llvm-project/lldb/packages/Python/lldbsuite/test/lldbutil.py", line 797, in run_to_breakpoint_do_run test.assertEqual(num_threads, 1, "Expected 1 thread to stop at breakpoint, %d did."%(num_threads)) AssertionError: 0 != 1 : Expected 1 thread to stop at breakpoint, 0 did. Config=x86_64-/Users/buildslave/jenkins/workspace/lldb-cmake-sanitized/lldb-build/bin/clang-10 ====================================================================== FAIL: test_coreframeworks_and_run_command_gmodules (TestDataFormatterObjCCF.ObjCDataFormatterCF) Test formatters for Core OSX frameworks. ---------------------------------------------------------------------- Traceback (most recent call last): File "/Users/buildslave/jenkins/workspace/lldb-cmake-sanitized/llvm-project/lldb/packages/Python/lldbsuite/test/lldbtest.py", line 1732, in test_method return attrvalue(self) File "/Users/buildslave/jenkins/workspace/lldb-cmake-sanitized/llvm-project/lldb/packages/Python/lldbsuite/test/functionalities/data-formatter/data-formatter-objc/TestDataFormatterObjCCF.py", line 23, in test_coreframeworks_and_run_command lldb.SBFileSpec('main.m', False)) File "/Users/buildslave/jenkins/workspace/lldb-cmake-sanitized/llvm-project/lldb/packages/Python/lldbsuite/test/lldbutil.py", line 868, in run_to_source_breakpoint only_one_thread, extra_images) File "/Users/buildslave/jenkins/workspace/lldb-cmake-sanitized/llvm-project/lldb/packages/Python/lldbsuite/test/lldbutil.py", line 797, in run_to_breakpoint_do_run test.assertEqual(num_threads, 1, "Expected 1 thread to stop at breakpoint, %d did."%(num_threads)) AssertionError: 0 != 1 : Expected 1 thread to stop at breakpoint, 0 did. Config=x86_64-/Users/buildslave/jenkins/workspace/lldb-cmake-sanitized/lldb-build/bin/clang-10 ---------------------------------------------------------------------- Ran 4 tests in 146.523s

Hide Details

RESULT: FAILED (0 passes, 3 failures, 0 errors, 1 skipped, 0 expected failures, 0 unexpected successes)

Hide Details

******************** PASS: lldb-unit :: Utility/./UtilityTests/CompletionRequest.ShiftArguments (1578 of 1892) PASS: lldb-unit :: Utility/./UtilityTests/FileSpecTest.AppendPathComponent (1579 of 1892) UNSUPPORTED: lldb-api :: functionalities/thread/state/TestThreadStates.py (1580 of 1892) PASS: lldb-shell :: Commands/command-script-import.test (1581 of 1892) PASS: lldb-api :: functionalities/fat_archives/TestFatArchives.py (1582 of 1892) UNSUPPORTED: lldb-api :: functionalities/ubsan/user-expression/TestUbsanUserExpression.py (1583 of 1892) PASS: lldb-api :: api/listeners/TestListener.py (1584 of 1892) PASS: lldb-unit :: Expression/./ExpressionTests/CppModuleConfigurationTest.UnrelatedLibrary (1585 of 1892) PASS: lldb-api :: macosx/find-dsym/deep-bundle/TestDeepBundle.py (1586 of 1892) UNSUPPORTED: lldb-shell :: Register/x86-64-ymm16-read.test (1587 of 1892) PASS: lldb-unit :: SymbolFile/DWARF/./SymbolFileDWARFTests/SymbolFileDWARFTests.TestAbbrevOutOfOrder (1588 of 1892) PASS: lldb-api :: functionalities/data-formatter/data-formatter-caching/TestDataFormatterCaching.py (1589 of 1892) PASS: lldb-api :: functionalities/thread/concurrent_events/TestConcurrentBreakpointsDelayedBreakpointOneWatchpoint.py (1590 of 1892) PASS: lldb-unit :: Utility/./UtilityTests/StringListTest.Assignment (1591 of 1892) PASS: lldb-unit :: Utility/./UtilityTests/NameMatchesTest.Contains (1592 of 1892) UNSUPPORTED: lldb-shell :: ScriptInterpreter/Lua/bindings.test (1593 of 1892) UNSUPPORTED: lldb-api :: functionalities/tsan/thread_leak/TestTsanThreadLeak.py (1594 of 1892) PASS: lldb-api :: commands/expression/import-std-module/forward_list-dbg-info-content/TestDbgInfoContentForwardList.py (1595 of 1892) PASS: lldb-unit :: Utility/./UtilityTests/StreamTeeTest.Constructor1Stream (1596 of 1892) PASS: lldb-api :: lang/objc/forward-decl/TestForwardDecl.py (1597 of 1892) PASS: lldb-unit :: Utility/./UtilityTests/StringExtractorTest.DecodeHexU8_InvalidHex2 (1598 of 1892) UNSUPPORTED: lldb-api :: functionalities/data-formatter/data-formatter-stl/libstdcpp/tuple/TestDataFormatterStdTuple.py (1599 of 1892) PASS: lldb-unit :: Expression/./ExpressionTests/DiagnosticManagerTest.GetStringMultipleDiags (1600 of 1892) PASS: lldb-unit :: Expression/./ExpressionTests/CppModuleConfigurationTest.Sysroot (1601 of 1892) PASS: lldb-api :: functionalities/ptr_refs/TestPtrRefs.py (1602 of 1892) UNSUPPORTED: lldb-api :: benchmarks/stepping/TestSteppingSpeed.py (1603 of 1892) PASS: lldb-shell :: ObjectFile/ELF/gnu-debuglink.yaml (1604 of 1892) PASS: lldb-api :: commands/command/script_alias/TestCommandScriptAlias.py (1605 of 1892) PASS: lldb-unit :: Signals/./SignalsTests/UnixSignalsTest.GetInfo (1606 of 1892) PASS: lldb-unit :: Utility/./UtilityTests/NameMatchesTest.EndsWith (1607 of 1892) PASS: lldb-unit :: Host/./HostTests/HostInfoTest.GetHostname (1608 of 1892) PASS: lldb-api :: commands/expression/radar_9673664/TestExprHelpExamples.py (1609 of 1892) PASS: lldb-api :: functionalities/return-value/TestReturnValue.py (1610 of 1892) PASS: lldb-api :: commands/register/register/register_command/TestRegisters.py (1611 of 1892) PASS: lldb-shell :: ObjectFile/ELF/PT_LOAD-overlap-section.yaml (1612 of 1892) PASS: lldb-unit :: Utility/./UtilityTests/Flags.AnySet (1613 of 1892) PASS: lldb-api :: commands/target/stop-hooks/TestStopHooks.py (1614 of 1892) PASS: lldb-unit :: Utility/./UtilityTests/RangeTest.Copy (1615 of 1892) PASS: lldb-unit :: Utility/./UtilityTests/BinaryStreamTest.PutSLEB128SixBytes (1616 of 1892) UNSUPPORTED: lldb-shell :: SymbolFile/target-symbols-add-unwind.test (1617 of 1892) PASS: lldb-shell :: ObjectFile/ELF/compressed-sections.yaml (1618 of 1892) PASS: lldb-unit :: Interpreter/./InterpreterTests/OptionArgParserTest.toScriptLanguage (1619 of 1892) PASS: lldb-shell :: ObjectFile/ELF/section-types-edgecases.yaml (1620 of 1892) PASS: lldb-unit :: Utility/./UtilityTests/DataExtractorTest.GetCStr (1621 of 1892) PASS: lldb-unit :: Host/./HostTests/FileSystemTest.GetByteSize (1622 of 1892) PASS: lldb-api :: sample_test/TestSampleTest.py (1623 of 1892) PASS: lldb-api :: functionalities/type_lookup/TestTypeLookup.py (1624 of 1892) PASS: lldb-unit :: Utility/./UtilityTests/StringListTest.JoinSingle (1625 of 1892) PASS: lldb-unit :: UnwindAssembly/x86/./UnwindAssemblyx86Tests/Testx86AssemblyInspectionEngine.TestAddESP (1626 of 1892) PASS: lldb-unit :: Symbol/./SymbolTests/TestClangASTContext.TestGetBasicTypeFromEnum (1627 of 1892) PASS: lldb-unit :: Process/gdb-remote/./ProcessGdbRemoteTests/GDBRemoteClientBaseTest.SendContinueAndInterrupt (1628 of 1892) PASS: lldb-unit :: Process/gdb-remote/./ProcessGdbRemoteTests/GDBRemoteCommunicationClientTest.SyncThreadState (1629 of 1892) PASS: lldb-api :: macosx/find-dsym/bundle-with-dot-in-filename/TestBundleWithDotInFilename.py (1630 of 1892) PASS: lldb-api :: functionalities/thread/concurrent_events/TestConcurrentNWatchNBreak.py (1631 of 1892) PASS: lldb-unit :: Utility/./UtilityTests/ConstStringTest.UpdateMangledCounterpart (1632 of 1892) PASS: lldb-unit :: Utility/./UtilityTests/TimerTest.CategoryTimes (1633 of 1892) PASS: lldb-api :: functionalities/breakpoint/source_regexp/TestSourceRegexBreakpoints.py (1634 of 1892) PASS: lldb-shell :: SymbolFile/NativePDB/globals-fundamental.cpp (1635 of 1892) PASS: lldb-unit :: Core/./LLDBCoreTests/UniqueCStringMap.NoDefaultConstructor (1636 of 1892) PASS: lldb-unit :: Symbol/./SymbolTests/TestClangASTImporter.MetadataPropagationAfterCopying (1637 of 1892) PASS: lldb-unit :: Utility/./UtilityTests/RangeTest.ContainsRange (1638 of 1892) PASS: lldb-unit :: Host/./HostTests/NativeProcessProtocolTest.SetBreakpointFailVerify (1639 of 1892) PASS: lldb-unit :: SymbolFile/NativePDB/./SymbolFileNativePDBTests/PDBFPOProgramToDWARFExpressionTests.UnknownOp (1640 of 1892) PASS: lldb-unit :: Utility/./UtilityTests/StreamTest.AddressSize (1641 of 1892) PASS: lldb-api :: functionalities/thread/concurrent_events/TestConcurrentBreakpointDelayBreakpointOneSignal.py (1642 of 1892) UNSUPPORTED: lldb-api :: linux/mix-dwo-and-regular-objects/TestMixedDwarfBinary.py (1643 of 1892) PASS: lldb-api :: functionalities/data-formatter/var-in-aggregate-misuse/TestVarInAggregateMisuse.py (1644 of 1892) PASS: lldb-api :: lang/cpp/operator-overload/TestOperatorOverload.py (1645 of 1892) PASS: lldb-api :: functionalities/inferior-crashing/TestInferiorCrashing.py (1646 of 1892) PASS: lldb-shell :: Breakpoint/split-dwarf5-debug-stroffsets.test (1647 of 1892) PASS: lldb-unit :: ObjectFile/PECOFF/./ObjectFilePECOFFTests/PECallFrameInfoTest.Frame_reg_eh (1648 of 1892) PASS: lldb-unit :: Host/./HostTests/HostInfoTest.GetAugmentedArchSpec (1649 of 1892) PASS: lldb-api :: functionalities/breakpoint/require_hw_breakpoints/TestRequireHWBreakpoints.py (1650 of 1892) PASS: lldb-unit :: Utility/./UtilityTests/ArchSpecTest.MergeFromMachOUnknown (1651 of 1892) PASS: lldb-shell :: SymbolFile/NativePDB/ast-types.cpp (1652 of 1892) PASS: lldb-api :: lang/cpp/template-function/TestTemplateFunctions.py (1653 of 1892) PASS: lldb-unit :: Symbol/./SymbolTests/TestClangASTContext.TestGetTypeClassDeclType (1654 of 1892) PASS: lldb-api :: commands/expression/class_template_specialization_empty_pack/TestClassTemplateSpecializationParametersHandling.py (1655 of 1892) PASS: lldb-unit :: Interpreter/./InterpreterTests/CompletionTest.FileCompletionAbsolute (1656 of 1892) PASS: lldb-api :: functionalities/dead-strip/TestDeadStrip.py (1657 of 1892) PASS: lldb-api :: commands/command/invalid-args/TestInvalidArgsCommand.py (1658 of 1892) PASS: lldb-api :: commands/quit/TestQuit.py (1659 of 1892) PASS: lldb-unit :: Language/Highlighting/./HighlighterTests/HighlighterTest.ClangCursorPosInOtherToken (1660 of 1892) PASS: lldb-api :: lang/cpp/global_variables/TestCPPGlobalVariables.py (1661 of 1892) PASS: lldb-unit :: Utility/./UtilityTests/RangeTest.Clear (1662 of 1892) UNSUPPORTED: lldb-shell :: SymbolFile/dissassemble-entry-point.s (1663 of 1892) PASS: lldb-unit :: Utility/./UtilityTests/LogTest.Unregister (1664 of 1892) PASS: lldb-api :: lang/cpp/gmodules/TestWithModuleDebugging.py (1665 of 1892) PASS: lldb-shell :: SymbolFile/DWARF/debug_loc-aslr.s (1666 of 1892) UNSUPPORTED: lldb-api :: lang/c/typedef/Testtypedef.py (1667 of 1892) PASS: lldb-api :: lang/objc/objc-optimized/TestObjcOptimized.py (1668 of 1892) PASS: lldb-unit :: Utility/./UtilityTests/StreamTeeTest.Assignment (1669 of 1892) PASS: lldb-unit :: Language/Highlighting/./HighlighterTests/HighlighterTest.DefaultHighlighterWithCursorOutOfBounds (1670 of 1892) UNSUPPORTED: lldb-api :: commands/gui/basic/TestGuiBasic.py (1671 of 1892) PASS: lldb-unit :: Process/gdb-remote/./ProcessGdbRemoteTests/GDBRemoteCommunicationClientTest.SendGetDataPacket (1672 of 1892) PASS: lldb-api :: lang/objc/modules-app-update/TestClangModulesAppUpdate.py (1673 of 1892) PASS: lldb-unit :: ScriptInterpreter/Python/./ScriptInterpreterPythonTests/PythonDataObjectsTest.TestPythonIntegerToStructuredInteger (1674 of 1892) PASS: lldb-unit :: ObjectFile/Breakpad/./ObjectFileBreakpadTests/InfoRecord.parse (1675 of 1892) PASS: lldb-unit :: SymbolFile/NativePDB/./SymbolFileNativePDBTests/PDBFPOProgramToDWARFExpressionTests.InvalidAssignmentSingle (1676 of 1892) PASS: lldb-unit :: ObjectFile/Breakpad/./ObjectFileBreakpadTests/StackWinRecord.parse (1677 of 1892) PASS: lldb-unit :: Host/./HostTests/FileSystemTest.GetPermissions (1678 of 1892) UNSUPPORTED: lldb-api :: functionalities/darwin_log/filter/exact_match/category/TestDarwinLogFilterMatchCategory.py (1679 of 1892) PASS: lldb-unit :: ScriptInterpreter/Python/./ScriptInterpreterPythonTests/PythonDataObjectsTest.TestPythonTupleValues (1680 of 1892) PASS: lldb-shell :: SymbolFile/Breakpad/unwind-via-stack-cfi.test (1681 of 1892) PASS: lldb-unit :: Utility/./UtilityTests/ArchSpecTest.TestSetTriple (1682 of 1892) PASS: lldb-api :: functionalities/data-formatter/data-formatter-synthtype/TestDataFormatterSynthType.py (1683 of 1892) PASS: lldb-unit :: Utility/./UtilityTests/StringListTest.AppendList (1684 of 1892) PASS: lldb-api :: lang/c/local_variables/TestLocalVariables.py (1685 of 1892) PASS: lldb-unit :: Core/./LLDBCoreTests/RichManglingContextTest.SwitchProvider (1686 of 1892) PASS: lldb-unit :: UnwindAssembly/x86/./UnwindAssemblyx86Tests/Testx86AssemblyInspectionEngine.TestSimple32bitFrameFunction (1687 of 1892) PASS: lldb-unit :: Utility/./UtilityTests/StringExtractorTest.GetHexBytes_Partial (1688 of 1892) PASS: lldb-unit :: Language/Highlighting/./HighlighterTests/HighlighterTest.ClangUnterminatedString (1689 of 1892) PASS: lldb-api :: functionalities/inline-stepping/TestInlineStepping.py (1690 of 1892) PASS: lldb-shell :: Commands/command-backtrace.test (1691 of 1892) PASS: lldb-shell :: Settings/TestSettingsWrite.test (1692 of 1892) UNSUPPORTED: lldb-shell :: Register/arm-gp-read.test (1693 of 1892) PASS: lldb-unit :: Symbol/./SymbolTests/TestClangASTContext.TestGetTypeClassNested (1694 of 1892) PASS: lldb-shell :: SymbolFile/NativePDB/ast-functions.cpp (1695 of 1892) PASS: lldb-unit :: Utility/./UtilityTests/ListenerTest.GetEventWait (1696 of 1892) PASS: lldb-shell :: ObjectFile/ELF/base-address.yaml (1697 of 1892) PASS: lldb-api :: functionalities/data-formatter/data-formatter-skip-summary/TestDataFormatterSkipSummary.py (1698 of 1892) PASS: lldb-unit :: Process/minidump/./LLDBMinidumpTests/MinidumpParserTest.GetThreadContext_x86_32 (1699 of 1892) PASS: lldb-api :: functionalities/thread/concurrent_events/TestConcurrentManyCrash.py (1700 of 1892) PASS: lldb-unit :: Utility/./UtilityTests/OptionsWithRawTest.EmptyInput (1701 of 1892) PASS: lldb-api :: commands/command/script/import/TestImport.py (1702 of 1892) PASS: lldb-api :: functionalities/data-formatter/data-formatter-stl/libstdcpp/unique_ptr/invalid/TestDataFormatterInvalidStdUniquePtr.py (1703 of 1892) PASS: lldb-unit :: Utility/./UtilityTests/ProcessInfoTest.Constructor (1704 of 1892) UNSUPPORTED: lldb-api :: commands/expression/macros/TestMacros.py (1705 of 1892) PASS: lldb-api :: python_api/sbvalue_const_addrof/TestSBValueConstAddrOf.py (1706 of 1892) PASS: lldb-unit :: Utility/./UtilityTests/ArchSpecTest.TestParseMachCPUDashSubtypeTripleSimple (1707 of 1892) PASS: lldb-unit :: Process/minidump/./LLDBMinidumpTests/RegisterContextMinidump.ConvertMinidumpContext_x86_64 (1708 of 1892) PASS: lldb-shell :: SymbolFile/DWARF/find-function-regex.cpp (1709 of 1892) PASS: lldb-api :: commands/expression/ir-interpreter-phi-nodes/TestIRInterpreterPHINodes.py (1710 of 1892) PASS: lldb-api :: commands/statistics/basic/TestStats.py (1711 of 1892) PASS: lldb-api :: lang/cpp/breakpoint-commands/TestCPPBreakpointCommands.py (1712 of 1892) PASS: lldb-shell :: Minidump/Windows/Sigsegv/sigsegv.test (1713 of 1892) PASS: lldb-api :: commands/expression/options/TestExprOptions.py (1714 of 1892) PASS: lldb-unit :: Utility/./UtilityTests/StringExtractorTest.GetHexBytesAvail_Partial (1715 of 1892) PASS: lldb-unit :: Utility/./UtilityTests/StringExtractorTest.GetHexBytesAvail_OddPair2 (1716 of 1892) PASS: lldb-api :: functionalities/tail_call_frames/thread_step_out_or_return/TestSteppingOutWithArtificialFrames.py (1717 of 1892) PASS: lldb-shell :: SymbolFile/DWARF/childless-compile-unit.s (1718 of 1892) PASS: lldb-unit :: Host/./HostTests/NativeProcessProtocolTest.SetBreakpointFailWrite (1719 of 1892) PASS: lldb-unit :: Utility/./UtilityTests/ArgsTest.GetQuotedCommandString (1720 of 1892) PASS: lldb-shell :: ObjectFile/ELF/PT_LOAD.yaml (1721 of 1892) UNSUPPORTED: lldb-api :: functionalities/darwin_log/filter/exact_match/activity-chain/TestDarwinLogFilterMatchActivityChain.py (1722 of 1892) PASS: lldb-unit :: Host/./HostTests/FileSystemTest.EnumerateDirectory (1723 of 1892) UNSUPPORTED: lldb-api :: lang/cpp/static_members/TestCPPStaticMembers.py (1724 of 1892) PASS: lldb-shell :: ObjectFile/ELF/netbsd-exec-8.99.30-amd64.yaml (1725 of 1892) PASS: lldb-unit :: Utility/./UtilityTests/ArgsTest.TestSingleArg (1726 of 1892) PASS: lldb-unit :: Utility/./UtilityTests/VMRange.Reset (1727 of 1892) PASS: lldb-api :: functionalities/abbreviation/TestAbbreviations.py (1728 of 1892) PASS: lldb-api :: functionalities/thread/step_out/TestThreadStepOut.py (1729 of 1892) PASS: lldb-api :: lang/cpp/lambdas/TestLambdas.py (1730 of 1892) PASS: lldb-api :: commands/watchpoints/multiple_threads/TestWatchpointMultipleThreads.py (1731 of 1892) PASS: lldb-unit :: Expression/./ExpressionTests/DiagnosticManagerTest.HasFixits (1732 of 1892) PASS: lldb-api :: lang/cpp/modules-import/TestCXXModulesImport.py (1733 of 1892) UNSUPPORTED: lldb-api :: functionalities/darwin_log/source/debug/TestDarwinLogSourceDebug.py (1734 of 1892) PASS: lldb-unit :: Target/./TargetTests/ExecutionContextTest.GetByteOrderTarget (1735 of 1892) PASS: lldb-unit :: Process/gdb-remote/./ProcessGdbRemoteTests/GDBRemoteCommunicationServerTest.SendErrorResponse_ErrorNumber (1736 of 1892) PASS: lldb-unit :: Utility/./UtilityTests/ArgsTest.ReplaceArgumentAtIndexFarOutOfRange (1737 of 1892) PASS: lldb-api :: functionalities/breakpoint/consecutive_breakpoints/TestConsecutiveBreakpoints.py (1738 of 1892) PASS: lldb-unit :: Utility/./UtilityTests/BinaryStreamTest.PutSLEB128FiveBytes (1739 of 1892) UNSUPPORTED: lldb-shell :: Register/x86-64-xmm16-read.test (1740 of 1892) PASS: lldb-unit :: Process/gdb-remote/./ProcessGdbRemoteTests/GDBRemoteCommunicationClientTest.SendStartTracePacket (1741 of 1892) PASS: lldb-api :: functionalities/thread/concurrent_events/TestConcurrentSignalDelayWatch.py (1742 of 1892) PASS: lldb-api :: commands/command/nested_alias/TestNestedAlias.py (1743 of 1892) PASS: lldb-api :: commands/expression/scoped_enums/TestScopedEnumType.py (1744 of 1892) PASS: lldb-unit :: Utility/./UtilityTests/StringListTest.ShiftCString (1745 of 1892) PASS: lldb-api :: commands/expression/context-object/TestContextObject.py (1746 of 1892) UNSUPPORTED: lldb-api :: tools/lldb-vscode/completions/TestVSCode_completions.py (1747 of 1892) PASS: lldb-shell :: ObjectFile/ELF/duplicate-section.yaml (1748 of 1892) PASS: lldb-unit :: Utility/./UtilityTests/StringListTest.ForRangeEmpty (1749 of 1892) PASS: lldb-unit :: Utility/./UtilityTests/LogChannelTest.Enable (1750 of 1892) PASS: lldb-api :: commands/expression/import-std-module/no-std-module/TestMissingStdModule.py (1751 of 1892) PASS: lldb-api :: commands/expression/import-std-module/shared_ptr/TestSharedPtr.py (1752 of 1892) PASS: lldb-api :: commands/process/attach/attach_denied/TestAttachDenied.py (1753 of 1892) PASS: lldb-api :: lang/cpp/rvalue-references/TestRvalueReferences.py (1754 of 1892) PASS: lldb-api :: tools/lldb-vscode/attach/TestVSCode_attach.py (1755 of 1892) PASS: lldb-api :: tools/lldb-server/inferior-crash/TestGdbRemoteSegFault.py (1756 of 1892) PASS: lldb-api :: functionalities/thread/concurrent_events/TestConcurrentDelayWatchBreak.py (1757 of 1892) PASS: lldb-unit :: Language/Highlighting/./HighlighterTests/HighlighterTest.ClangOperators (1758 of 1892) PASS: lldb-unit :: Symbol/./SymbolTests/SymbolsTest.LocateExecutableSymbolFileForUnknownExecutableAndMissingSymbolFile (1759 of 1892) PASS: lldb-api :: types/TestDoubleTypes.py (1760 of 1892) PASS: lldb-api :: functionalities/breakpoint/breakpoint_by_line_and_column/TestBreakpointByLineAndColumn.py (1761 of 1892) FAIL: lldb-api :: functionalities/data-formatter/data-formatter-objc/TestDataFormatterObjCKVO.py (1762 of 1892) ******************** TEST 'lldb-api :: functionalities/data-formatter/data-formatter-objc/TestDataFormatterObjCKVO.py' FAILED ******************** lldb version 10.0.99 (http://labmaster3.local/git/llvm-project.git revision c1b13a1b17719aebace1b3be7a6ac7f90b1901a6) clang revision c1b13a1b17719aebace1b3be7a6ac7f90b1901a6 llvm revision c1b13a1b17719aebace1b3be7a6ac7f90b1901a6 LLDB library dir: /Users/buildslave/jenkins/workspace/lldb-cmake-sanitized/lldb-build/bin LLDB import library dir: /Users/buildslave/jenkins/workspace/lldb-cmake-sanitized/lldb-build/bin libstdcxx tests will not be run because: Don't know how to build with libstdcxx on macosx Skipping following debug info categories: ['dwo'] AddressSanitizer report breakpoint hit. Use 'thread info -s' to get extended information about the report. AddressSanitizer report breakpoint hit. Use 'thread info -s' to get extended information about the report. AddressSanitizer report breakpoint hit. Use 'thread info -s' to get extended information about the report.

Hide Details

Session logs for test failures/errors/unexpected successes will go into directory '/Users/buildslave/jenkins/workspace/lldb-cmake-sanitized/test/logs' Command invoked: /Users/buildslave/jenkins/workspace/lldb-cmake-sanitized/llvm-project/lldb/test/API/dotest.py --arch x86_64 -s /Users/buildslave/jenkins/workspace/lldb-cmake-sanitized/lldb-build/lldb-test-traces -S nm -u CXXFLAGS -u CFLAGS --codesign-identity lldb_codesign --server /Users/buildslave/jenkins/workspace/lldb-cmake-sanitized/lldb-build/./bin/debugserver --arch x86_64 --build-dir /Users/buildslave/jenkins/workspace/lldb-cmake-sanitized/lldb-build/lldb-test-build.noindex -s=/Users/buildslave/jenkins/workspace/lldb-cmake-sanitized/test/logs -t --env TERM=vt100 --env LLVM_LIBS_DIR=/Users/buildslave/jenkins/workspace/lldb-cmake-sanitized/lldb-build/./lib --inferior-env ASAN_OPTIONS=detect_stack_use_after_return=1 --inferior-env DYLD_INSERT_LIBRARIES=/Users/buildslave/jenkins/workspace/lldb-cmake-sanitized/host-compiler/lib/clang/10.0.0/lib/darwin/libclang_rt.asan_osx_dynamic.dylib --build-dir /Users/buildslave/jenkins/workspace/lldb-cmake-sanitized/lldb-build/lldb-test-build.noindex --lldb-module-cache-dir /Users/buildslave/jenkins/workspace/lldb-cmake-sanitized/lldb-build/lldb-test-build.noindex/module-cache-lldb/lldb-api --clang-module-cache-dir /Users/buildslave/jenkins/workspace/lldb-cmake-sanitized/lldb-build/lldb-test-build.noindex/module-cache-clang/lldb-api --executable /Users/buildslave/jenkins/workspace/lldb-cmake-sanitized/lldb-build/./bin/lldb --compiler /Users/buildslave/jenkins/workspace/lldb-cmake-sanitized/lldb-build/./bin/clang --dsymutil /Users/buildslave/jenkins/workspace/lldb-cmake-sanitized/lldb-build/./bin/dsymutil --filecheck /Users/buildslave/jenkins/workspace/lldb-cmake-sanitized/lldb-build/./bin/FileCheck /Users/buildslave/jenkins/workspace/lldb-cmake-sanitized/llvm-project/lldb/packages/Python/lldbsuite/test/functionalities/data-formatter/data-formatter-objc -p TestDataFormatterObjCKVO.py Change dir to: /Users/buildslave/jenkins/workspace/lldb-cmake-sanitized/llvm-project/lldb/packages/Python/lldbsuite/test/functionalities/data-formatter/data-formatter-objc runCmd: settings set symbols.enable-external-lookup false output:

Hide Details

runCmd: settings set plugin.process.gdb-remote.packet-timeout 60 output:

Hide Details

runCmd: settings set symbols.clang-modules-cache-path "/Users/buildslave/jenkins/workspace/lldb-cmake-sanitized/lldb-build/lldb-test-build.noindex/module-cache-lldb/lldb-api" output:

Hide Details

runCmd: settings set use-color false output:

Hide Details

runCmd: settings set target.env-vars ASAN_OPTIONS=detect_stack_use_after_return=1 DYLD_INSERT_LIBRARIES=/Users/buildslave/jenkins/workspace/lldb-cmake-sanitized/host-compiler/lib/clang/10.0.0/lib/darwin/libclang_rt.asan_osx_dynamic.dylib output:

Hide Details

runCmd: settings set target.env-vars ASAN_OPTIONS=detect_stack_use_after_return=1 DYLD_INSERT_LIBRARIES=/Users/buildslave/jenkins/workspace/lldb-cmake-sanitized/host-compiler/lib/clang/10.0.0/lib/darwin/libclang_rt.asan_osx_dynamic.dylib output:

Hide Details

FAIL: LLDB (/Users/buildslave/jenkins/workspace/lldb-cmake-sanitized/lldb-build/bin/clang-10-x86_64) :: test_kvo_with_run_command_dsym (TestDataFormatterObjCKVO.ObjCDataFormatterKVO) <bound method SBProcess.Kill of <lldb.SBProcess; proxy of <Swig Object of type 'lldb::SBProcess *' at 0x10ef24240> >>: success

Hide Details

runCmd: settings set symbols.enable-external-lookup false output:

Hide Details

runCmd: settings set plugin.process.gdb-remote.packet-timeout 60 output:

Hide Details

runCmd: settings set symbols.clang-modules-cache-path "/Users/buildslave/jenkins/workspace/lldb-cmake-sanitized/lldb-build/lldb-test-build.noindex/module-cache-lldb/lldb-api" output:

Hide Details

runCmd: settings set use-color false output:

Hide Details

runCmd: settings set target.env-vars ASAN_OPTIONS=detect_stack_use_after_return=1 DYLD_INSERT_LIBRARIES=/Users/buildslave/jenkins/workspace/lldb-cmake-sanitized/host-compiler/lib/clang/10.0.0/lib/darwin/libclang_rt.asan_osx_dynamic.dylib output:

Hide Details

runCmd: settings set target.env-vars ASAN_OPTIONS=detect_stack_use_after_return=1 DYLD_INSERT_LIBRARIES=/Users/buildslave/jenkins/workspace/lldb-cmake-sanitized/host-compiler/lib/clang/10.0.0/lib/darwin/libclang_rt.asan_osx_dynamic.dylib output:

Hide Details

FAIL: LLDB (/Users/buildslave/jenkins/workspace/lldb-cmake-sanitized/lldb-build/bin/clang-10-x86_64) :: test_kvo_with_run_command_dwarf (TestDataFormatterObjCKVO.ObjCDataFormatterKVO) <bound method SBProcess.Kill of <lldb.SBProcess; proxy of <Swig Object of type 'lldb::SBProcess *' at 0x10e952630> >>: success

Hide Details

UNSUPPORTED: LLDB (/Users/buildslave/jenkins/workspace/lldb-cmake-sanitized/lldb-build/bin/clang-10-x86_64) :: test_kvo_with_run_command_dwo (TestDataFormatterObjCKVO.ObjCDataFormatterKVO) (test case does not fall in any category of interest for this run) runCmd: settings set symbols.enable-external-lookup false output:

Hide Details

runCmd: settings set plugin.process.gdb-remote.packet-timeout 60 output:

Hide Details

runCmd: settings set symbols.clang-modules-cache-path "/Users/buildslave/jenkins/workspace/lldb-cmake-sanitized/lldb-build/lldb-test-build.noindex/module-cache-lldb/lldb-api" output:

Hide Details

runCmd: settings set use-color false output:

Hide Details

runCmd: settings set target.env-vars ASAN_OPTIONS=detect_stack_use_after_return=1 DYLD_INSERT_LIBRARIES=/Users/buildslave/jenkins/workspace/lldb-cmake-sanitized/host-compiler/lib/clang/10.0.0/lib/darwin/libclang_rt.asan_osx_dynamic.dylib output:

Hide Details

runCmd: settings set target.env-vars ASAN_OPTIONS=detect_stack_use_after_return=1 DYLD_INSERT_LIBRARIES=/Users/buildslave/jenkins/workspace/lldb-cmake-sanitized/host-compiler/lib/clang/10.0.0/lib/darwin/libclang_rt.asan_osx_dynamic.dylib output:

Hide Details

FAIL: LLDB (/Users/buildslave/jenkins/workspace/lldb-cmake-sanitized/lldb-build/bin/clang-10-x86_64) :: test_kvo_with_run_command_gmodules (TestDataFormatterObjCKVO.ObjCDataFormatterKVO) <bound method SBProcess.Kill of <lldb.SBProcess; proxy of <Swig Object of type 'lldb::SBProcess *' at 0x10ef24090> >>: success

Hide Details

Restore dir to: /Users/buildslave/jenkins/workspace/lldb-cmake-sanitized/lldb-build/tools/lldb/test ====================================================================== FAIL: test_kvo_with_run_command_dsym (TestDataFormatterObjCKVO.ObjCDataFormatterKVO) Test the behavior of formatters when KVO is in use. ---------------------------------------------------------------------- Traceback (most recent call last): File "/Users/buildslave/jenkins/workspace/lldb-cmake-sanitized/llvm-project/lldb/packages/Python/lldbsuite/test/lldbtest.py", line 1732, in test_method return attrvalue(self) File "/Users/buildslave/jenkins/workspace/lldb-cmake-sanitized/llvm-project/lldb/packages/Python/lldbsuite/test/functionalities/data-formatter/data-formatter-objc/TestDataFormatterObjCKVO.py", line 23, in test_kvo_with_run_command lldb.SBFileSpec('main.m', False)) File "/Users/buildslave/jenkins/workspace/lldb-cmake-sanitized/llvm-project/lldb/packages/Python/lldbsuite/test/lldbutil.py", line 868, in run_to_source_breakpoint only_one_thread, extra_images) File "/Users/buildslave/jenkins/workspace/lldb-cmake-sanitized/llvm-project/lldb/packages/Python/lldbsuite/test/lldbutil.py", line 797, in run_to_breakpoint_do_run test.assertEqual(num_threads, 1, "Expected 1 thread to stop at breakpoint, %d did."%(num_threads)) AssertionError: 0 != 1 : Expected 1 thread to stop at breakpoint, 0 did. Config=x86_64-/Users/buildslave/jenkins/workspace/lldb-cmake-sanitized/lldb-build/bin/clang-10 ====================================================================== FAIL: test_kvo_with_run_command_dwarf (TestDataFormatterObjCKVO.ObjCDataFormatterKVO) Test the behavior of formatters when KVO is in use. ---------------------------------------------------------------------- Traceback (most recent call last): File "/Users/buildslave/jenkins/workspace/lldb-cmake-sanitized/llvm-project/lldb/packages/Python/lldbsuite/test/lldbtest.py", line 1732, in test_method return attrvalue(self) File "/Users/buildslave/jenkins/workspace/lldb-cmake-sanitized/llvm-project/lldb/packages/Python/lldbsuite/test/functionalities/data-formatter/data-formatter-objc/TestDataFormatterObjCKVO.py", line 23, in test_kvo_with_run_command lldb.SBFileSpec('main.m', False)) File "/Users/buildslave/jenkins/workspace/lldb-cmake-sanitized/llvm-project/lldb/packages/Python/lldbsuite/test/lldbutil.py", line 868, in run_to_source_breakpoint only_one_thread, extra_images) File "/Users/buildslave/jenkins/workspace/lldb-cmake-sanitized/llvm-project/lldb/packages/Python/lldbsuite/test/lldbutil.py", line 797, in run_to_breakpoint_do_run test.assertEqual(num_threads, 1, "Expected 1 thread to stop at breakpoint, %d did."%(num_threads)) AssertionError: 0 != 1 : Expected 1 thread to stop at breakpoint, 0 did. Config=x86_64-/Users/buildslave/jenkins/workspace/lldb-cmake-sanitized/lldb-build/bin/clang-10 ====================================================================== FAIL: test_kvo_with_run_command_gmodules (TestDataFormatterObjCKVO.ObjCDataFormatterKVO) Test the behavior of formatters when KVO is in use. ---------------------------------------------------------------------- Traceback (most recent call last): File "/Users/buildslave/jenkins/workspace/lldb-cmake-sanitized/llvm-project/lldb/packages/Python/lldbsuite/test/lldbtest.py", line 1732, in test_method return attrvalue(self) File "/Users/buildslave/jenkins/workspace/lldb-cmake-sanitized/llvm-project/lldb/packages/Python/lldbsuite/test/functionalities/data-formatter/data-formatter-objc/TestDataFormatterObjCKVO.py", line 23, in test_kvo_with_run_command lldb.SBFileSpec('main.m', False)) File "/Users/buildslave/jenkins/workspace/lldb-cmake-sanitized/llvm-project/lldb/packages/Python/lldbsuite/test/lldbutil.py", line 868, in run_to_source_breakpoint only_one_thread, extra_images) File "/Users/buildslave/jenkins/workspace/lldb-cmake-sanitized/llvm-project/lldb/packages/Python/lldbsuite/test/lldbutil.py", line 797, in run_to_breakpoint_do_run test.assertEqual(num_threads, 1, "Expected 1 thread to stop at breakpoint, %d did."%(num_threads)) AssertionError: 0 != 1 : Expected 1 thread to stop at breakpoint, 0 did. Config=x86_64-/Users/buildslave/jenkins/workspace/lldb-cmake-sanitized/lldb-build/bin/clang-10 ---------------------------------------------------------------------- Ran 4 tests in 154.216s

Hide Details

RESULT: FAILED (0 passes, 3 failures, 0 errors, 1 skipped, 0 expected failures, 0 unexpected successes)

Hide Details

******************** PASS: lldb-unit :: Language/CPlusPlus/./LanguageCPlusPlusTests/CPlusPlusLanguage.FindAlternateFunctionManglings (1763 of 1892) PASS: lldb-unit :: Utility/./UtilityTests/StreamTeeTest.DefaultConstructor (1764 of 1892) PASS: lldb-api :: lang/c/bitfields/TestBitfields.py (1765 of 1892) PASS: lldb-unit :: UnwindAssembly/x86/./UnwindAssemblyx86Tests/Testx86AssemblyInspectionEngine.TestDisassemblyMidFunctionEpilogues (1766 of 1892) UNSUPPORTED: lldb-api :: functionalities/breakpoint/hardware_breakpoints/hardware_breakpoint_on_multiple_threads/TestHWBreakMultiThread.py (1767 of 1892) PASS: lldb-unit :: Utility/./UtilityTests/VMRange.ContainsRange (1768 of 1892) UNSUPPORTED: lldb-api :: functionalities/thread/concurrent_events/TestConcurrentManySignals.py (1769 of 1892) UNSUPPORTED: lldb-api :: macosx/macabi/TestMacABImacOSFramework.py (1770 of 1892) PASS: lldb-unit :: Utility/./UtilityTests/TimeoutTest.Construction (1771 of 1892) PASS: lldb-unit :: Process/gdb-remote/./ProcessGdbRemoteTests/GDBRemoteClientBaseTest.SendPacketAndReceiveResponseWithOutputSupport (1772 of 1892) PASS: lldb-unit :: Utility/./UtilityTests/StringExtractorTest.GetU64LittleEndian (1773 of 1892) PASS: lldb-api :: python_api/debugger/TestDebuggerAPI.py (1774 of 1892) PASS: lldb-api :: functionalities/data-formatter/dump_dynamic/TestDumpDynamic.py (1775 of 1892) PASS: lldb-shell :: Reproducer/TestDiscard.test (1776 of 1892) PASS: lldb-shell :: SymbolFile/DWARF/find-basic-variable.cpp (1777 of 1892) PASS: lldb-unit :: Utility/./UtilityTests/BinaryStreamTest.PutULEB128FiveBytes (1778 of 1892) PASS: lldb-api :: python_api/watchpoint/watchlocation/TestSetWatchlocation.py (1779 of 1892) PASS: lldb-api :: lang/c/anonymous/TestAnonymous.py (1780 of 1892) PASS: lldb-unit :: Utility/./UtilityTests/ReproducerTest.SetCapture (1781 of 1892) PASS: lldb-shell :: BuildScript/script-args.test (1782 of 1892) PASS: lldb-unit :: Host/./HostTests/MainLoopTest.DetectsEOF (1783 of 1892) PASS: lldb-unit :: Utility/./UtilityTests/ArgsTest.ReplaceArgumentAtIndexShort (1784 of 1892) PASS: lldb-shell :: Reproducer/TestMultipleTargets.test (1785 of 1892) PASS: lldb-unit :: SymbolFile/NativePDB/./SymbolFileNativePDBTests/PDBFPOProgramToDWARFExpressionTests.InvalidOpBinary (1786 of 1892) PASS: lldb-api :: lang/cpp/nested-class-other-compilation-unit/TestNestedClassWithParentInAnotherCU.py (1787 of 1892) PASS: lldb-unit :: Utility/./UtilityTests/CompletionRequest.FakeLastArg (1788 of 1892) PASS: lldb-unit :: Utility/./UtilityTests/UriParserTest.MinimalPath (1789 of 1892) PASS: lldb-api :: commands/expression/dont_allow_jit/TestAllowJIT.py (1790 of 1892) PASS: lldb-api :: functionalities/lazy-loading/TestLazyLoading.py (1791 of 1892) PASS: lldb-api :: functionalities/deleted-executable/TestDeletedExecutable.py (1792 of 1892) PASS: lldb-unit :: Utility/./UtilityTests/OptionsWithRawTest.EmptyArgsOnlySuffix (1793 of 1892) PASS: lldb-shell :: SymbolFile/DWARF/debug-types-address-ranges.s (1794 of 1892) PASS: lldb-unit :: Symbol/./SymbolTests/DWARFCallFrameInfoTest.Basic_dwarf3 (1795 of 1892) PASS: lldb-api :: commands/command/delete/TestCommandDelete.py (1796 of 1892) UNSUPPORTED: lldb-shell :: ObjectFile/PECOFF/disassemble-thumb.yaml (1797 of 1892) PASS: lldb-unit :: UnwindAssembly/x86/./UnwindAssemblyx86Tests/Testx86AssemblyInspectionEngine.Test64bitFramelessSmallStackFrame (1798 of 1892) PASS: lldb-api :: commands/watchpoints/watchpoint_on_vectors/TestValueOfVectorVariable.py (1799 of 1892) PASS: lldb-unit :: Process/minidump/./LLDBMinidumpTests/MinidumpParserTest.GetMemoryRegionInfoLinuxMaps (1800 of 1892) PASS: lldb-unit :: Utility/./UtilityTests/StringExtractorTest.GetHexBytesAvail_FullString (1801 of 1892) PASS: lldb-unit :: Utility/./UtilityTests/EnvironmentTest.EnvpConstruction (1802 of 1892) PASS: lldb-unit :: UnwindAssembly/x86/./UnwindAssemblyx86Tests/Testx86AssemblyInspectionEngine.TestStackRealign8BitDisp_i386 (1803 of 1892) PASS: lldb-unit :: Utility/./UtilityTests/StringListTest.GetMaxStringLengthEmpty (1804 of 1892) PASS: lldb-unit :: UnwindAssembly/x86/./UnwindAssemblyx86Tests/Testx86AssemblyInspectionEngine.TestAddRSP (1805 of 1892) UNSUPPORTED: lldb-api :: arm/breakpoint-thumb-codesection/TestBreakpointThumbCodesection.py (1806 of 1892) PASS: lldb-api :: lang/objc/blocks/TestObjCIvarsInBlocks.py (1807 of 1892) PASS: lldb-shell :: SymbolFile/DWARF/inline-function-address-shared.test (1808 of 1892) PASS: lldb-api :: commands/expression/unwind_expression/TestUnwindExpression.py (1809 of 1892) PASS: lldb-shell :: SymbolFile/Breakpad/line-table.test (1810 of 1892) PASS: lldb-api :: python_api/value_var_update/TestValueVarUpdate.py (1811 of 1892) PASS: lldb-unit :: Host/./HostTests/Host.GetEnvironment (1812 of 1892) PASS: lldb-unit :: Symbol/./SymbolTests/TestClangASTContext.TemplateArguments (1813 of 1892) PASS: lldb-unit :: Utility/./UtilityTests/StringListTest.GetMaxStringLengthIncreasingSize (1814 of 1892) PASS: lldb-api :: lang/cpp/extern_c/TestExternCSymbols.py (1815 of 1892) PASS: lldb-api :: python_api/thread/TestThreadAPI.py (1816 of 1892) PASS: lldb-unit :: Utility/./UtilityTests/ArgsTest.BareSingleQuote (1817 of 1892) PASS: lldb-unit :: Utility/./UtilityTests/ArgsTest.DoubleQuotedItem (1818 of 1892) PASS: lldb-api :: functionalities/data-formatter/data-formatter-stl/libcxx/list/TestDataFormatterLibcxxList.py (1819 of 1892) PASS: lldb-api :: lang/objc/objc-static-method-stripped/TestObjCStaticMethodStripped.py (1820 of 1892) PASS: lldb-unit :: Utility/./UtilityTests/Flags.AllSet (1821 of 1892) PASS: lldb-unit :: Process/gdb-remote/./ProcessGdbRemoteTests/GDBRemoteClientBaseTest.SendContinueAndAsyncPacket (1822 of 1892) PASS: lldb-api :: types/TestDoubleTypesExpr.py (1823 of 1892) PASS: lldb-api :: lang/objc/modules-incomplete/TestIncompleteModules.py (1824 of 1892) PASS: lldb-api :: python_api/watchpoint/TestWatchpointIter.py (1825 of 1892) PASS: lldb-api :: functionalities/tail_call_frames/ambiguous_tail_call_seq2/TestAmbiguousTailCallSeq2.py (1826 of 1892) PASS: lldb-api :: functionalities/gdb_remote_client/TestJLink6Armv7RegisterDefinition.py (1827 of 1892) PASS: lldb-unit :: Utility/./UtilityTests/StringExtractorTest.DecodeHexU8_Extra (1828 of 1892) PASS: lldb-unit :: ScriptInterpreter/Python/./ScriptInterpreterPythonTests/PythonDataObjectsTest.TestPythonListManipulation (1829 of 1892) PASS: lldb-unit :: Utility/./UtilityTests/StreamTeeTest.SetStreamAtIndexOutOfBounds (1830 of 1892) PASS: lldb-api :: functionalities/inferior-crashing/recursive-inferior/TestRecursiveInferiorStep.py (1831 of 1892) UNSUPPORTED: lldb-api :: functionalities/unwind/ehframe/TestEhFrameUnwind.py (1832 of 1892) PASS: lldb-unit :: Utility/./UtilityTests/UUIDTest.SetFromStringRef (1833 of 1892) PASS: lldb-api :: functionalities/thread/exit_during_break/TestExitDuringBreak.py (1834 of 1892) PASS: lldb-unit :: ObjectFile/Breakpad/./ObjectFileBreakpadTests/LineRecord.parse (1835 of 1892) PASS: lldb-shell :: ObjectFile/PECOFF/sections.yaml (1836 of 1892) PASS: lldb-api :: commands/expression/import-std-module/vector-bool/TestBoolVector.py (1837 of 1892) PASS: lldb-unit :: Utility/./UtilityTests/StringLexerTest.Peek (1838 of 1892) PASS: lldb-api :: functionalities/process_group/TestChangeProcessGroup.py (1839 of 1892) PASS: lldb-unit :: Utility/./UtilityTests/AnsiTerminal.AtStart (1840 of 1892) PASS: lldb-shell :: Reproducer/TestSynchronous.test (1841 of 1892) PASS: lldb-api :: lang/cpp/static_methods/TestCPPStaticMethods.py (1842 of 1892) PASS: lldb-unit :: UnwindAssembly/x86/./UnwindAssemblyx86Tests/Testx86AssemblyInspectionEngine.TestReturnDetect (1843 of 1892) PASS: lldb-unit :: Utility/./UtilityTests/LogTest.LLDB_LOG_nullptr (1844 of 1892) UNSUPPORTED: lldb-shell :: SymbolFile/NativePDB/local-variables.cpp (1845 of 1892) PASS: lldb-api :: lang/objc/real-definition/TestRealDefinition.py (1846 of 1892) PASS: lldb-unit :: Process/minidump/./LLDBMinidumpTests/MinidumpParserTest.GetMemoryRegionInfoFromMemoryList (1847 of 1892) PASS: lldb-unit :: Utility/./UtilityTests/OptionsWithRawTest.ArgsButNoLeadingDash (1848 of 1892) PASS: lldb-api :: commands/expression/import-std-module/empty-module/TestEmptyStdModule.py (1849 of 1892) PASS: lldb-unit :: Process/minidump/./LLDBMinidumpTests/MinidumpParserTest.GetLinuxProcStatus (1850 of 1892) PASS: lldb-api :: commands/disassemble/basic/TestFrameDisassemble.py (1851 of 1892) PASS: lldb-shell :: SymbolFile/NativePDB/function-types-classes.cpp (1852 of 1892) PASS: lldb-api :: types/TestCharTypeExpr.py (1853 of 1892) PASS: lldb-unit :: Utility/./UtilityTests/FileSpecTest.Match (1854 of 1892) PASS: lldb-shell :: ScriptInterpreter/None/import_module.test (1855 of 1892) PASS: lldb-shell :: Reproducer/TestVersionCheck.test (1856 of 1892) PASS: lldb-unit :: Symbol/./SymbolTests/TestClangASTContext.TestGetTypeClassTypeOf (1857 of 1892) PASS: lldb-unit :: Utility/./UtilityTests/ArchSpecTest.MergeFrom (1858 of 1892) UNSUPPORTED: lldb-api :: tools/lldb-server/signal-filtering/TestGdbRemote_QPassSignals.py (1859 of 1892) PASS: lldb-unit :: Utility/./UtilityTests/UUIDTest.RelationalOperators (1860 of 1892) PASS: lldb-unit :: Utility/./UtilityTests/DataExtractorTest.GetMaxU64 (1861 of 1892) PASS: lldb-api :: functionalities/breakpoint/address_breakpoints/TestBadAddressBreakpoints.py (1862 of 1892) PASS: lldb-unit :: Utility/./UtilityTests/StringListTest.CopyListSingle (1863 of 1892) PASS: lldb-api :: functionalities/data-formatter/data-formatter-stl/libcxx/atomic/TestLibCxxAtomic.py (1864 of 1892) PASS: lldb-unit :: ScriptInterpreter/Python/./ScriptInterpreterPythonTests/PythonDataObjectsTest.TestObjectAttributes (1865 of 1892) PASS: lldb-api :: functionalities/thread/concurrent_events/TestConcurrentManyWatchpoints.py (1866 of 1892) PASS: lldb-unit :: Utility/./UtilityTests/Predicate.WaitForValueEqualTo (1867 of 1892) PASS: lldb-api :: lang/objc/objc-property/TestObjCProperty.py (1868 of 1892) PASS: lldb-unit :: Expression/./ExpressionTests/DiagnosticManagerTest.GetStringNoDiags (1869 of 1892) PASS: lldb-shell :: Driver/TestCore.test (1870 of 1892) PASS: lldb-api :: python_api/value/empty_class/TestValueAPIEmptyClass.py (1871 of 1892) PASS: lldb-unit :: Expression/./ExpressionTests/DiagnosticManagerTest.AppendMessageSubsequentDiags (1872 of 1892) PASS: lldb-api :: functionalities/thread/create_after_attach/TestCreateAfterAttach.py (1873 of 1892) PASS: lldb-unit :: Utility/./UtilityTests/Flags.IsClear (1874 of 1892) PASS: lldb-shell :: Driver/TestProcessAttach.test (1875 of 1892) PASS: lldb-unit :: Process/gdb-remote/./ProcessGdbRemoteTests/GDBRemoteCommunicationClientTest.GetModulesInfoInvalidResponse (1876 of 1892) PASS: lldb-unit :: Utility/./UtilityTests/EnvironmentTest.EnvpConversion (1877 of 1892) PASS: lldb-api :: commands/apropos/basic/TestApropos.py (1878 of 1892) PASS: lldb-shell :: Reproducer/TestWorkingDir.test (1879 of 1892) PASS: lldb-api :: tools/lldb-server/TestGdbRemote_vCont.py (1880 of 1892) PASS: lldb-api :: commands/expression/import-std-module/list-dbg-info-content/TestDbgInfoContentList.py (1881 of 1892) PASS: lldb-api :: functionalities/step-avoids-no-debug/TestStepNoDebug.py (1882 of 1892) PASS: lldb-api :: lang/objc/objc++/TestObjCXX.py (1883 of 1892) PASS: lldb-api :: lang/cpp/class_types/TestClassTypesDisassembly.py (1884 of 1892) PASS: lldb-api :: commands/settings/quoting/TestQuoting.py (1885 of 1892) PASS: lldb-api :: lang/objc/print-obj/TestPrintObj.py (1886 of 1892) PASS: lldb-api :: lang/objcxx/objcxx-ivar-vector/TestIvarVector.py (1887 of 1892) FAIL: lldb-api :: functionalities/data-formatter/data-formatter-objc/TestDataFormatterObjCNSData.py (1888 of 1892) ******************** TEST 'lldb-api :: functionalities/data-formatter/data-formatter-objc/TestDataFormatterObjCNSData.py' FAILED ******************** lldb version 10.0.99 (http://labmaster3.local/git/llvm-project.git revision c1b13a1b17719aebace1b3be7a6ac7f90b1901a6) clang revision c1b13a1b17719aebace1b3be7a6ac7f90b1901a6 llvm revision c1b13a1b17719aebace1b3be7a6ac7f90b1901a6 LLDB library dir: /Users/buildslave/jenkins/workspace/lldb-cmake-sanitized/lldb-build/bin LLDB import library dir: /Users/buildslave/jenkins/workspace/lldb-cmake-sanitized/lldb-build/bin libstdcxx tests will not be run because: Don't know how to build with libstdcxx on macosx Skipping following debug info categories: ['dwo'] AddressSanitizer report breakpoint hit. Use 'thread info -s' to get extended information about the report. AddressSanitizer report breakpoint hit. Use 'thread info -s' to get extended information about the report. AddressSanitizer report breakpoint hit. Use 'thread info -s' to get extended information about the report.

Hide Details

Session logs for test failures/errors/unexpected successes will go into directory '/Users/buildslave/jenkins/workspace/lldb-cmake-sanitized/test/logs' Command invoked: /Users/buildslave/jenkins/workspace/lldb-cmake-sanitized/llvm-project/lldb/test/API/dotest.py --arch x86_64 -s /Users/buildslave/jenkins/workspace/lldb-cmake-sanitized/lldb-build/lldb-test-traces -S nm -u CXXFLAGS -u CFLAGS --codesign-identity lldb_codesign --server /Users/buildslave/jenkins/workspace/lldb-cmake-sanitized/lldb-build/./bin/debugserver --arch x86_64 --build-dir /Users/buildslave/jenkins/workspace/lldb-cmake-sanitized/lldb-build/lldb-test-build.noindex -s=/Users/buildslave/jenkins/workspace/lldb-cmake-sanitized/test/logs -t --env TERM=vt100 --env LLVM_LIBS_DIR=/Users/buildslave/jenkins/workspace/lldb-cmake-sanitized/lldb-build/./lib --inferior-env ASAN_OPTIONS=detect_stack_use_after_return=1 --inferior-env DYLD_INSERT_LIBRARIES=/Users/buildslave/jenkins/workspace/lldb-cmake-sanitized/host-compiler/lib/clang/10.0.0/lib/darwin/libclang_rt.asan_osx_dynamic.dylib --build-dir /Users/buildslave/jenkins/workspace/lldb-cmake-sanitized/lldb-build/lldb-test-build.noindex --lldb-module-cache-dir /Users/buildslave/jenkins/workspace/lldb-cmake-sanitized/lldb-build/lldb-test-build.noindex/module-cache-lldb/lldb-api --clang-module-cache-dir /Users/buildslave/jenkins/workspace/lldb-cmake-sanitized/lldb-build/lldb-test-build.noindex/module-cache-clang/lldb-api --executable /Users/buildslave/jenkins/workspace/lldb-cmake-sanitized/lldb-build/./bin/lldb --compiler /Users/buildslave/jenkins/workspace/lldb-cmake-sanitized/lldb-build/./bin/clang --dsymutil /Users/buildslave/jenkins/workspace/lldb-cmake-sanitized/lldb-build/./bin/dsymutil --filecheck /Users/buildslave/jenkins/workspace/lldb-cmake-sanitized/lldb-build/./bin/FileCheck /Users/buildslave/jenkins/workspace/lldb-cmake-sanitized/llvm-project/lldb/packages/Python/lldbsuite/test/functionalities/data-formatter/data-formatter-objc -p TestDataFormatterObjCNSData.py Change dir to: /Users/buildslave/jenkins/workspace/lldb-cmake-sanitized/llvm-project/lldb/packages/Python/lldbsuite/test/functionalities/data-formatter/data-formatter-objc runCmd: settings set symbols.enable-external-lookup false output:

Hide Details

runCmd: settings set plugin.process.gdb-remote.packet-timeout 60 output:

Hide Details

runCmd: settings set symbols.clang-modules-cache-path "/Users/buildslave/jenkins/workspace/lldb-cmake-sanitized/lldb-build/lldb-test-build.noindex/module-cache-lldb/lldb-api" output:

Hide Details

runCmd: settings set use-color false output:

Hide Details

runCmd: settings set target.env-vars ASAN_OPTIONS=detect_stack_use_after_return=1 DYLD_INSERT_LIBRARIES=/Users/buildslave/jenkins/workspace/lldb-cmake-sanitized/host-compiler/lib/clang/10.0.0/lib/darwin/libclang_rt.asan_osx_dynamic.dylib output:

Hide Details

runCmd: settings set target.env-vars ASAN_OPTIONS=detect_stack_use_after_return=1 DYLD_INSERT_LIBRARIES=/Users/buildslave/jenkins/workspace/lldb-cmake-sanitized/host-compiler/lib/clang/10.0.0/lib/darwin/libclang_rt.asan_osx_dynamic.dylib output:

Hide Details

FAIL: LLDB (/Users/buildslave/jenkins/workspace/lldb-cmake-sanitized/lldb-build/bin/clang-10-x86_64) :: test_nsdata_with_run_command_dsym (TestDataFormatterObjCNSData.ObjCDataFormatterNSData) <bound method SBProcess.Kill of <lldb.SBProcess; proxy of <Swig Object of type 'lldb::SBProcess *' at 0x1154ce090> >>: success

Hide Details

runCmd: settings set symbols.enable-external-lookup false output:

Hide Details

runCmd: settings set plugin.process.gdb-remote.packet-timeout 60 output:

Hide Details

runCmd: settings set symbols.clang-modules-cache-path "/Users/buildslave/jenkins/workspace/lldb-cmake-sanitized/lldb-build/lldb-test-build.noindex/module-cache-lldb/lldb-api" output:

Hide Details

runCmd: settings set use-color false output:

Hide Details

runCmd: settings set target.env-vars ASAN_OPTIONS=detect_stack_use_after_return=1 DYLD_INSERT_LIBRARIES=/Users/buildslave/jenkins/workspace/lldb-cmake-sanitized/host-compiler/lib/clang/10.0.0/lib/darwin/libclang_rt.asan_osx_dynamic.dylib output:

Hide Details

runCmd: settings set target.env-vars ASAN_OPTIONS=detect_stack_use_after_return=1 DYLD_INSERT_LIBRARIES=/Users/buildslave/jenkins/workspace/lldb-cmake-sanitized/host-compiler/lib/clang/10.0.0/lib/darwin/libclang_rt.asan_osx_dynamic.dylib output:

Hide Details

FAIL: LLDB (/Users/buildslave/jenkins/workspace/lldb-cmake-sanitized/lldb-build/bin/clang-10-x86_64) :: test_nsdata_with_run_command_dwarf (TestDataFormatterObjCNSData.ObjCDataFormatterNSData) <bound method SBProcess.Kill of <lldb.SBProcess; proxy of <Swig Object of type 'lldb::SBProcess *' at 0x114efa630> >>: success

Hide Details

UNSUPPORTED: LLDB (/Users/buildslave/jenkins/workspace/lldb-cmake-sanitized/lldb-build/bin/clang-10-x86_64) :: test_nsdata_with_run_command_dwo (TestDataFormatterObjCNSData.ObjCDataFormatterNSData) (test case does not fall in any category of interest for this run) runCmd: settings set symbols.enable-external-lookup false output:

Hide Details

runCmd: settings set plugin.process.gdb-remote.packet-timeout 60 output:

Hide Details

runCmd: settings set symbols.clang-modules-cache-path "/Users/buildslave/jenkins/workspace/lldb-cmake-sanitized/lldb-build/lldb-test-build.noindex/module-cache-lldb/lldb-api" output:

Hide Details

runCmd: settings set use-color false output:

Hide Details

runCmd: settings set target.env-vars ASAN_OPTIONS=detect_stack_use_after_return=1 DYLD_INSERT_LIBRARIES=/Users/buildslave/jenkins/workspace/lldb-cmake-sanitized/host-compiler/lib/clang/10.0.0/lib/darwin/libclang_rt.asan_osx_dynamic.dylib output:

Hide Details

runCmd: settings set target.env-vars ASAN_OPTIONS=detect_stack_use_after_return=1 DYLD_INSERT_LIBRARIES=/Users/buildslave/jenkins/workspace/lldb-cmake-sanitized/host-compiler/lib/clang/10.0.0/lib/darwin/libclang_rt.asan_osx_dynamic.dylib output:

Hide Details

FAIL: LLDB (/Users/buildslave/jenkins/workspace/lldb-cmake-sanitized/lldb-build/bin/clang-10-x86_64) :: test_nsdata_with_run_command_gmodules (TestDataFormatterObjCNSData.ObjCDataFormatterNSData) <bound method SBProcess.Kill of <lldb.SBProcess; proxy of <Swig Object of type 'lldb::SBProcess *' at 0x1154ce210> >>: success

Hide Details

Restore dir to: /Users/buildslave/jenkins/workspace/lldb-cmake-sanitized/lldb-build/tools/lldb/test ====================================================================== FAIL: test_nsdata_with_run_command_dsym (TestDataFormatterObjCNSData.ObjCDataFormatterNSData) Test formatters for NSData. ---------------------------------------------------------------------- Traceback (most recent call last): File "/Users/buildslave/jenkins/workspace/lldb-cmake-sanitized/llvm-project/lldb/packages/Python/lldbsuite/test/lldbtest.py", line 1732, in test_method return attrvalue(self) File "/Users/buildslave/jenkins/workspace/lldb-cmake-sanitized/llvm-project/lldb/packages/Python/lldbsuite/test/functionalities/data-formatter/data-formatter-objc/TestDataFormatterObjCNSData.py", line 20, in test_nsdata_with_run_command self.appkit_tester_impl(self.nsdata_data_formatter_commands) File "/Users/buildslave/jenkins/workspace/lldb-cmake-sanitized/llvm-project/lldb/packages/Python/lldbsuite/test/functionalities/data-formatter/data-formatter-objc/ObjCDataFormatterTestCase.py", line 19, in appkit_tester_impl self.appkit_common_data_formatters_command() File "/Users/buildslave/jenkins/workspace/lldb-cmake-sanitized/llvm-project/lldb/packages/Python/lldbsuite/test/functionalities/data-formatter/data-formatter-objc/ObjCDataFormatterTestCase.py", line 26, in appkit_common_data_formatters_command lldb.SBFileSpec('main.m', False)) File "/Users/buildslave/jenkins/workspace/lldb-cmake-sanitized/llvm-project/lldb/packages/Python/lldbsuite/test/lldbutil.py", line 868, in run_to_source_breakpoint only_one_thread, extra_images) File "/Users/buildslave/jenkins/workspace/lldb-cmake-sanitized/llvm-project/lldb/packages/Python/lldbsuite/test/lldbutil.py", line 797, in run_to_breakpoint_do_run test.assertEqual(num_threads, 1, "Expected 1 thread to stop at breakpoint, %d did."%(num_threads)) AssertionError: 0 != 1 : Expected 1 thread to stop at breakpoint, 0 did. Config=x86_64-/Users/buildslave/jenkins/workspace/lldb-cmake-sanitized/lldb-build/bin/clang-10 ====================================================================== FAIL: test_nsdata_with_run_command_dwarf (TestDataFormatterObjCNSData.ObjCDataFormatterNSData) Test formatters for NSData. ---------------------------------------------------------------------- Traceback (most recent call last): File "/Users/buildslave/jenkins/workspace/lldb-cmake-sanitized/llvm-project/lldb/packages/Python/lldbsuite/test/lldbtest.py", line 1732, in test_method return attrvalue(self) File "/Users/buildslave/jenkins/workspace/lldb-cmake-sanitized/llvm-project/lldb/packages/Python/lldbsuite/test/functionalities/data-formatter/data-formatter-objc/TestDataFormatterObjCNSData.py", line 20, in test_nsdata_with_run_command self.appkit_tester_impl(self.nsdata_data_formatter_commands) File "/Users/buildslave/jenkins/workspace/lldb-cmake-sanitized/llvm-project/lldb/packages/Python/lldbsuite/test/functionalities/data-formatter/data-formatter-objc/ObjCDataFormatterTestCase.py", line 19, in appkit_tester_impl self.appkit_common_data_formatters_command() File "/Users/buildslave/jenkins/workspace/lldb-cmake-sanitized/llvm-project/lldb/packages/Python/lldbsuite/test/functionalities/data-formatter/data-formatter-objc/ObjCDataFormatterTestCase.py", line 26, in appkit_common_data_formatters_command lldb.SBFileSpec('main.m', False)) File "/Users/buildslave/jenkins/workspace/lldb-cmake-sanitized/llvm-project/lldb/packages/Python/lldbsuite/test/lldbutil.py", line 868, in run_to_source_breakpoint only_one_thread, extra_images) File "/Users/buildslave/jenkins/workspace/lldb-cmake-sanitized/llvm-project/lldb/packages/Python/lldbsuite/test/lldbutil.py", line 797, in run_to_breakpoint_do_run test.assertEqual(num_threads, 1, "Expected 1 thread to stop at breakpoint, %d did."%(num_threads)) AssertionError: 0 != 1 : Expected 1 thread to stop at breakpoint, 0 did. Config=x86_64-/Users/buildslave/jenkins/workspace/lldb-cmake-sanitized/lldb-build/bin/clang-10 ====================================================================== FAIL: test_nsdata_with_run_command_gmodules (TestDataFormatterObjCNSData.ObjCDataFormatterNSData) Test formatters for NSData. ---------------------------------------------------------------------- Traceback (most recent call last): File "/Users/buildslave/jenkins/workspace/lldb-cmake-sanitized/llvm-project/lldb/packages/Python/lldbsuite/test/lldbtest.py", line 1732, in test_method return attrvalue(self) File "/Users/buildslave/jenkins/workspace/lldb-cmake-sanitized/llvm-project/lldb/packages/Python/lldbsuite/test/functionalities/data-formatter/data-formatter-objc/TestDataFormatterObjCNSData.py", line 20, in test_nsdata_with_run_command self.appkit_tester_impl(self.nsdata_data_formatter_commands) File "/Users/buildslave/jenkins/workspace/lldb-cmake-sanitized/llvm-project/lldb/packages/Python/lldbsuite/test/functionalities/data-formatter/data-formatter-objc/ObjCDataFormatterTestCase.py", line 19, in appkit_tester_impl self.appkit_common_data_formatters_command() File "/Users/buildslave/jenkins/workspace/lldb-cmake-sanitized/llvm-project/lldb/packages/Python/lldbsuite/test/functionalities/data-formatter/data-formatter-objc/ObjCDataFormatterTestCase.py", line 26, in appkit_common_data_formatters_command lldb.SBFileSpec('main.m', False)) File "/Users/buildslave/jenkins/workspace/lldb-cmake-sanitized/llvm-project/lldb/packages/Python/lldbsuite/test/lldbutil.py", line 868, in run_to_source_breakpoint only_one_thread, extra_images) File "/Users/buildslave/jenkins/workspace/lldb-cmake-sanitized/llvm-project/lldb/packages/Python/lldbsuite/test/lldbutil.py", line 797, in run_to_breakpoint_do_run test.assertEqual(num_threads, 1, "Expected 1 thread to stop at breakpoint, %d did."%(num_threads)) AssertionError: 0 != 1 : Expected 1 thread to stop at breakpoint, 0 did. Config=x86_64-/Users/buildslave/jenkins/workspace/lldb-cmake-sanitized/lldb-build/bin/clang-10 ---------------------------------------------------------------------- Ran 4 tests in 82.496s

Hide Details

RESULT: FAILED (0 passes, 3 failures, 0 errors, 1 skipped, 0 expected failures, 0 unexpected successes)

Hide Details

******************** PASS: lldb-api :: commands/expression/two-files/TestObjCTypeQueryFromOtherCompileUnit.py (1889 of 1892) PASS: lldb-api :: tools/lldb-server/TestLldbGdbServer.py (1890 of 1892) PASS: lldb-api :: api/multithreaded/TestMultithreaded.py (1891 of 1892) PASS: lldb-api :: lang/cpp/enum_types/TestCPP11EnumTypes.py (1892 of 1892)

Hide Details

Testing Time: 3523.80s ******************** Failing Tests (11): lldb-api :: functionalities/data-formatter/data-formatter-objc/TestDataFormatterObjCNSDate.py lldb-api :: functionalities/data-formatter/data-formatter-objc/TestDataFormatterObjCNSURL.py lldb-api :: functionalities/data-formatter/data-formatter-objc/TestDataFormatterObjNSException.py lldb-api :: functionalities/data-formatter/data-formatter-objc/TestDataFormatterObjCExpr.py lldb-api :: functionalities/data-formatter/data-formatter-objc/TestDataFormatterObjCNSContainer.py lldb-api :: functionalities/data-formatter/data-formatter-objc/TestDataFormatterObjCNSError.py lldb-api :: functionalities/data-formatter/data-formatter-objc/TestDataFormatterObjCPlain.py lldb-api :: functionalities/data-formatter/data-formatter-objc/TestDataFormatterObjCNSBundle.py lldb-api :: functionalities/data-formatter/data-formatter-objc/TestDataFormatterObjCCF.py lldb-api :: functionalities/data-formatter/data-formatter-objc/TestDataFormatterObjCKVO.py lldb-api :: functionalities/data-formatter/data-formatter-objc/TestDataFormatterObjCNSData.py

Hide Details

Hide Details

Slowest Tests: -------------------------------------------------------------------------- 291.68s: lldb-api :: commands/expression/import-std-module/vector-dbg-info-content/TestDbgInfoContentVector.py 294.30s: lldb-api :: lang/objc/forward-decl/TestForwardDecl.py 299.14s: lldb-api :: commands/expression/import-std-module/stack/TestStack.py 326.93s: lldb-api :: functionalities/data-formatter/boolreference/TestFormattersBoolRefPtr.py 342.31s: lldb-api :: functionalities/data-formatter/compactvectors/TestCompactVectors.py 373.13s: lldb-api :: tools/lldb-server/TestGdbRemoteThreadsInStopReply.py 395.12s: lldb-api :: types/TestLongTypesExpr.py 425.57s: lldb-api :: lang/objc/foundation/TestObjCMethodsNSError.py 430.55s: lldb-api :: lang/objc/objc-new-syntax/TestObjCNewSyntaxDictionary.py 432.16s: lldb-api :: lang/objc/objc-new-syntax/TestObjCNewSyntaxArray.py 434.06s: lldb-api :: lang/objc/foundation/TestObjCMethodsString.py 491.85s: lldb-api :: lang/objc/exceptions/TestObjCExceptions.py 504.61s: lldb-api :: lang/cpp/namespace/TestNamespaceLookup.py 535.55s: lldb-api :: lang/objc/real-definition/TestRealDefinition.py 539.08s: lldb-api :: api/multithreaded/TestMultithreaded.py 561.91s: lldb-api :: lang/cpp/enum_types/TestCPP11EnumTypes.py 564.37s: lldb-api :: lang/objc/objc-new-syntax/TestObjCNewSyntaxLiteral.py 728.50s: lldb-api :: tools/lldb-server/TestLldbGdbServer.py 794.17s: lldb-api :: lang/objc/foundation/TestObjCMethods.py 896.79s: lldb-api :: lang/objc/hidden-ivars/TestHiddenIvars.py

Hide Details

Tests Times: -------------------------------------------------------------------------- [ Range ] :: [ Percentage ] :: [ Count ] -------------------------------------------------------------------------- [ 0s, 50s) :: [********************************** ] :: [1622/1892] [ 50s,100s) :: [** ] :: [ 102/1892] [100s,150s) :: [* ] :: [ 65/1892] [150s,200s) :: [* ] :: [ 52/1892] [200s,250s) :: [ ] :: [ 21/1892] [250s,300s) :: [ ] :: [ 12/1892] [300s,350s) :: [ ] :: [ 3/1892] [350s,400s) :: [ ] :: [ 2/1892] [400s,450s) :: [ ] :: [ 4/1892] [450s,500s) :: [ ] :: [ 1/1892] [500s,550s) :: [ ] :: [ 3/1892] [550s,600s) :: [ ] :: [ 2/1892] [600s,650s) :: [ ] :: [ 0/1892] [650s,700s) :: [ ] :: [ 0/1892] [700s,750s) :: [ ] :: [ 1/1892] [750s,800s) :: [ ] :: [ 1/1892] [800s,850s) :: [ ] :: [ 0/1892] [850s,900s) :: [ ] :: [ 1/1892] Expected Passes : 1713 Expected Failures : 6 Unsupported Tests : 162 Unexpected Failures: 11 FAILED: tools/lldb/test/CMakeFiles/check-lldb-lit cd /Users/buildslave/jenkins/workspace/lldb-cmake-sanitized/lldb-build/tools/lldb/test && /usr/local/bin/python /Users/buildslave/jenkins/workspace/lldb-cmake-sanitized/lldb-build/./bin/llvm-lit -v --time-tests --shuffle --xunit-xml-output=/Users/buildslave/jenkins/workspace/lldb-cmake-sanitized/test/results.xml -v --timeout 1200 /Users/buildslave/jenkins/workspace/lldb-cmake-sanitized/lldb-build/tools/lldb/test ninja: build stopped: subcommand failed. Command failed: Command '['/usr/bin/env', 'TERM=vt100', '/usr/local/bin/ninja', '-v', 'check-lldb']' returned non-zero exit status 1. Command: ['/usr/bin/env', 'TERM=vt100', '/usr/local/bin/ninja', '-v', 'check-lldb'] [Pipeline] } [Pipeline] // timeout [Pipeline] } [Pipeline] // stage [Pipeline] stage [Pipeline] { (Declarative: Post Actions) [Pipeline] scanForIssues No credentials specified [Clang (LLVM based)] Sleeping for 5 seconds due to JENKINS-32191... [Clang (LLVM based)] Parsing console log (workspace: '/Users/buildslave/jenkins/workspace/lldb-cmake-sanitized') [Pipeline] junit Recording test results [Pipeline] } [Pipeline] // stage [Pipeline] } [Pipeline] // withEnv [Pipeline] } [Pipeline] // node [Pipeline] End of Pipeline ERROR: script returned exit code 1 Finished: FAILURE