FailedConsole Output

Skipping 5,024 KB.. Full Log
t breakpoint, %d did."%(num_threads))
AssertionError: 0 != 1 : Expected 1 thread to stop at breakpoint, 0 did.
Config=x86_64-/Users/buildslave/jenkins/workspace/lldb-cmake-sanitized/lldb-build/bin/clang-10
======================================================================
FAIL: test_kvo_with_run_command_gmodules (TestDataFormatterObjCKVO.ObjCDataFormatterKVO)
   Test the behavior of formatters when KVO is in use.
----------------------------------------------------------------------
Traceback (most recent call last):
  File "/Users/buildslave/jenkins/workspace/lldb-cmake-sanitized/llvm-project/lldb/packages/Python/lldbsuite/test/lldbtest.py", line 1732, in test_method
    return attrvalue(self)
  File "/Users/buildslave/jenkins/workspace/lldb-cmake-sanitized/llvm-project/lldb/packages/Python/lldbsuite/test/functionalities/data-formatter/data-formatter-objc/TestDataFormatterObjCKVO.py", line 23, in test_kvo_with_run_command
    lldb.SBFileSpec('main.m', False))
  File "/Users/buildslave/jenkins/workspace/lldb-cmake-sanitized/llvm-project/lldb/packages/Python/lldbsuite/test/lldbutil.py", line 868, in run_to_source_breakpoint
    only_one_thread, extra_images)
  File "/Users/buildslave/jenkins/workspace/lldb-cmake-sanitized/llvm-project/lldb/packages/Python/lldbsuite/test/lldbutil.py", line 797, in run_to_breakpoint_do_run
    test.assertEqual(num_threads, 1, "Expected 1 thread to stop at breakpoint, %d did."%(num_threads))
AssertionError: 0 != 1 : Expected 1 thread to stop at breakpoint, 0 did.
Config=x86_64-/Users/buildslave/jenkins/workspace/lldb-cmake-sanitized/lldb-build/bin/clang-10
----------------------------------------------------------------------
Ran 4 tests in 143.789s

Hide Details

RESULT: FAILED (0 passes, 3 failures, 0 errors, 1 skipped, 0 expected failures, 0 unexpected successes)

Hide Details

******************** PASS: lldb-unit :: UnwindAssembly/x86/./UnwindAssemblyx86Tests/Testx86AssemblyInspectionEngine.Test32bitFramelessBigStackFrame (1047 of 1892) PASS: lldb-api :: commands/expression/expr-in-syscall/TestExpressionInSyscall.py (1048 of 1892) PASS: lldb-api :: lang/cpp/dynamic-value-same-basename/TestDynamicValueSameBase.py (1049 of 1892) PASS: lldb-shell :: ObjectFile/ELF/section-types.yaml (1050 of 1892) PASS: lldb-unit :: Utility/./UtilityTests/RangeDataVector.FindEntryThatContains_Overlap (1051 of 1892) PASS: lldb-unit :: Utility/./UtilityTests/StringExtractorTest.GetHexU8_Underflow2 (1052 of 1892) PASS: lldb-unit :: Utility/./UtilityTests/StringExtractorTest.GetHexU8_Underflow_NoEof (1053 of 1892) PASS: lldb-api :: lang/objc/modules-auto-import/TestModulesAutoImport.py (1054 of 1892) PASS: lldb-unit :: Target/./TargetTests/PathMappingListTest.AbsoluteTests (1055 of 1892) PASS: lldb-api :: commands/frame/diagnose/dereference-function-return/TestDiagnoseDereferenceFunctionReturn.py (1056 of 1892) PASS: lldb-unit :: Utility/./UtilityTests/RangeTest.Union (1057 of 1892) UNSUPPORTED: lldb-api :: functionalities/process_save_core/TestProcessSaveCore.py (1058 of 1892) PASS: lldb-unit :: SymbolFile/NativePDB/./SymbolFileNativePDBTests/PDBFPOProgramToDWARFExpressionTests.MissingTargetRegister (1059 of 1892) PASS: lldb-unit :: Utility/./UtilityTests/ReproducerTest.SetReplay (1060 of 1892) PASS: lldb-api :: python_api/interpreter/TestCommandInterpreterAPI.py (1061 of 1892) UNSUPPORTED: lldb-shell :: Register/x86-gp-write.test (1062 of 1892) UNSUPPORTED: lldb-api :: commands/gui/basic/TestGuiBasic.py (1063 of 1892) PASS: lldb-unit :: Process/minidump/./LLDBMinidumpTests/MinidumpParserTest.MinidumpDuplicateModuleMinAddress (1064 of 1892) PASS: lldb-unit :: Utility/./UtilityTests/StreamTest.PutHex32ByteOrderLittle (1065 of 1892) PASS: lldb-api :: functionalities/breakpoint/objc/TestObjCBreakpoints.py (1066 of 1892) PASS: lldb-api :: commands/expression/save_jit_objects/TestSaveJITObjects.py (1067 of 1892) PASS: lldb-unit :: Utility/./UtilityTests/LogTest.LLDB_LOG_nullptr (1068 of 1892) PASS: lldb-unit :: UnwindAssembly/x86/./UnwindAssemblyx86Tests/Testx86AssemblyInspectionEngine.TestPopR15 (1069 of 1892) PASS: lldb-api :: python_api/thread/TestThreadAPI.py (1070 of 1892) UNSUPPORTED: lldb-api :: commands/expression/call-restarts/TestCallThatRestarts.py (1071 of 1892) PASS: lldb-unit :: Process/minidump/./LLDBMinidumpTests/MinidumpParserTest.GetFilteredModuleList (1072 of 1892) PASS: lldb-unit :: UnwindAssembly/x86/./UnwindAssemblyx86Tests/Testx86AssemblyInspectionEngine.TestAddESP (1073 of 1892) PASS: lldb-shell :: Reproducer/TestReuseDirectory.test (1074 of 1892) PASS: lldb-api :: lang/c/shared_lib/TestSharedLib.py (1075 of 1892) PASS: lldb-unit :: Utility/./UtilityTests/StreamTeeTest.Write (1076 of 1892) UNSUPPORTED: lldb-shell :: SymbolFile/NativePDB/typedefs.cpp (1077 of 1892) PASS: lldb-shell :: Breakpoint/jitbp_elf.test (1078 of 1892) PASS: lldb-shell :: Heap/heap-cstr.test (1079 of 1892) PASS: lldb-shell :: Breakpoint/debug_rnglistx_rlex.test (1080 of 1892) PASS: lldb-unit :: Host/./HostTests/FileSystemTest.EnumerateDirectory (1081 of 1892) PASS: lldb-api :: functionalities/postmortem/elf-core/thread_crash/TestLinuxCoreThreads.py (1082 of 1892) PASS: lldb-api :: python_api/type/TestTypeList.py (1083 of 1892) UNSUPPORTED: lldb-shell :: SymbolFile/PDB/pointers.test (1084 of 1892) PASS: lldb-unit :: Utility/./UtilityTests/ArgsTest.ReplaceArgumentAtIndexShort (1085 of 1892) PASS: lldb-unit :: Utility/./UtilityTests/ArchSpecTest.TestParseMachCPUDashSubtypeTripleExtra (1086 of 1892) UNSUPPORTED: lldb-shell :: Register/aarch64-gp-read.test (1087 of 1892) PASS: lldb-unit :: Utility/./UtilityTests/StringExtractorTest.GetNameColonValueSuccess (1088 of 1892) PASS: lldb-unit :: Utility/./UtilityTests/CompletionRequest.FakeLastArg (1089 of 1892) PASS: lldb-unit :: Interpreter/./InterpreterTests/CompletionTest.DirCompletionUsername (1090 of 1892) PASS: lldb-api :: functionalities/data-formatter/data-formatter-stl/libcxx/multiset/TestDataFormatterLibcxxMultiSet.py (1091 of 1892) UNSUPPORTED: lldb-api :: functionalities/tsan/multiple/TestTsanMultiple.py (1092 of 1892) PASS: lldb-api :: commands/command/nested_alias/TestNestedAlias.py (1093 of 1892) PASS: lldb-unit :: Utility/./UtilityTests/BinaryStreamTest.PutSLEB128One (1094 of 1892) PASS: lldb-unit :: Symbol/./SymbolTests/TestClangASTContext.TemplateArguments (1095 of 1892) PASS: lldb-unit :: Language/Highlighting/./HighlighterTests/HighlighterTest.ClangTrailingBackslashMissingNewLine (1096 of 1892) PASS: lldb-api :: commands/expression/import-std-module/vector-bool/TestBoolVector.py (1097 of 1892) PASS: lldb-api :: python_api/watchpoint/TestSetWatchpoint.py (1098 of 1892) PASS: lldb-api :: lang/objc/objc_direct-methods/TestObjCDirectMethods.py (1099 of 1892) PASS: lldb-unit :: Target/./TargetTests/PathMappingListTest.RelativeTests (1100 of 1892) PASS: lldb-api :: functionalities/load_using_paths/TestLoadUsingPaths.py (1101 of 1892) PASS: lldb-unit :: Utility/./UtilityTests/StreamTeeTest.DefaultConstructor (1102 of 1892) PASS: lldb-shell :: Commands/command-backtrace.test (1103 of 1892) PASS: lldb-unit :: Utility/./UtilityTests/StreamTeeTest.AppendStream (1104 of 1892) UNSUPPORTED: lldb-api :: lang/c/typedef/Testtypedef.py (1105 of 1892) PASS: lldb-unit :: Target/./TargetTests/ExecutionContextTest.GetByteOrderTarget (1106 of 1892) PASS: lldb-unit :: Symbol/./SymbolTests/DWARFCallFrameInfoTest.Basic_dwarf3 (1107 of 1892) PASS: lldb-unit :: ScriptInterpreter/Python/./ScriptInterpreterPythonTests/PythonDataObjectsTest.TestExtractingUInt64ThroughStructuredData (1108 of 1892) PASS: lldb-unit :: Utility/./UtilityTests/AnsiTerminal.WhiteSpace (1109 of 1892) PASS: lldb-shell :: BuildScript/toolchain-clang.test (1110 of 1892) PASS: lldb-api :: functionalities/data-formatter/nssetsynth/TestNSSetSynthetic.py (1111 of 1892) PASS: lldb-unit :: Host/./HostTests/NativeProcessProtocolTest.ReadCStringFromMemory_CrossPageBoundary (1112 of 1892) PASS: lldb-unit :: Utility/./UtilityTests/TimerTest.CategoryTimesNested (1113 of 1892) PASS: lldb-shell :: ObjectFile/ELF/duplicate-section.yaml (1114 of 1892) PASS: lldb-unit :: Interpreter/./InterpreterTests/OptionArgParserTest.toBoolean (1115 of 1892) UNSUPPORTED: lldb-api :: functionalities/darwin_log/filter/regex/category/TestDarwinLogFilterRegexCategory.py (1116 of 1892) PASS: lldb-unit :: SymbolFile/DWARF/./SymbolFileDWARFTests/SymbolFileDWARFTests.TestAbilitiesForDWARF (1117 of 1892) PASS: lldb-api :: functionalities/return-value/TestReturnValue.py (1118 of 1892) PASS: lldb-unit :: UnwindAssembly/x86/./UnwindAssemblyx86Tests/Testx86AssemblyInspectionEngine.TestSimplex86_64Augmented (1119 of 1892) PASS: lldb-api :: lang/cpp/overloaded-functions/TestOverloadedFunctions.py (1120 of 1892) PASS: lldb-api :: lang/objc/global_ptrs/TestGlobalObjects.py (1121 of 1892) PASS: lldb-unit :: Utility/./UtilityTests/LogChannelEnabledTest.LLDB_LOG_ERROR (1122 of 1892) PASS: lldb-shell :: SymbolFile/Breakpad/unwind-via-stack-cfi.test (1123 of 1892) PASS: lldb-api :: functionalities/data-formatter/data-formatter-stl/libcxx/iterator/TestDataFormatterLibccIterator.py (1124 of 1892) PASS: lldb-unit :: Utility/./UtilityTests/StreamTest.QuotedCString (1125 of 1892) PASS: lldb-unit :: ScriptInterpreter/Python/./ScriptInterpreterPythonTests/PythonDataObjectsTest.TestPythonStringToStructuredString (1126 of 1892) PASS: lldb-api :: functionalities/data-formatter/data-formatter-stl/libcxx/vbool/TestDataFormatterLibcxxVBool.py (1127 of 1892) PASS: lldb-unit :: Utility/./UtilityTests/BroadcasterTest.EventTypeHasListeners (1128 of 1892) PASS: lldb-api :: functionalities/data-formatter/format-propagation/TestFormatPropagation.py (1129 of 1892) PASS: lldb-api :: commands/watchpoints/watchpoint_commands/condition/TestWatchpointConditionCmd.py (1130 of 1892) UNSUPPORTED: lldb-api :: benchmarks/startup/TestStartupDelays.py (1131 of 1892) PASS: lldb-unit :: Utility/./UtilityTests/FileSpecTest.EqualDotsWindows (1132 of 1892) PASS: lldb-unit :: debugserver/./debugserverTests/RNBSocket.AnyListen (1133 of 1892) PASS: lldb-api :: lang/c/const_variables/TestConstVariables.py (1134 of 1892) PASS: lldb-unit :: Utility/./UtilityTests/ConstStringTest.CompareConstString (1135 of 1892) PASS: lldb-api :: lang/objcxx/hide-runtime-values/TestObjCXXHideRuntimeValues.py (1136 of 1892) PASS: lldb-shell :: Commands/command-regex-delete.test (1137 of 1892) PASS: lldb-unit :: Utility/./UtilityTests/ConstStringTest.FromMidOfBufferStringRef (1138 of 1892) PASS: lldb-shell :: ObjectFile/ELF/section-addresses.yaml (1139 of 1892) PASS: lldb-shell :: Expr/TestTypeOfDeclTypeExpr.test (1140 of 1892) PASS: lldb-shell :: SymbolFile/NativePDB/ast-functions.cpp (1141 of 1892) PASS: lldb-api :: lang/cpp/dynamic-value/TestCppValueCast.py (1142 of 1892) PASS: lldb-api :: lang/cpp/incomplete-types/TestCppIncompleteTypes.py (1143 of 1892) PASS: lldb-shell :: SymbolFile/NativePDB/ast-types.cpp (1144 of 1892) PASS: lldb-unit :: Utility/./UtilityTests/RangeTest.LessThanInvalid (1145 of 1892) PASS: lldb-unit :: Utility/./UtilityTests/StreamTest.PutHex8 (1146 of 1892) PASS: lldb-unit :: ScriptInterpreter/Python/./ScriptInterpreterPythonTests/PythonDataObjectsTest.TestPythonListToStructuredList (1147 of 1892) PASS: lldb-api :: python_api/function_symbol/TestDisasmAPI.py (1148 of 1892) PASS: lldb-api :: lang/c/tls_globals/TestTlsGlobals.py (1149 of 1892) PASS: lldb-unit :: SymbolFile/NativePDB/./SymbolFileNativePDBTests/PDBFPOProgramToDWARFExpressionTests.InvalidOpUnary (1150 of 1892) FAIL: lldb-api :: functionalities/data-formatter/data-formatter-objc/TestDataFormatterObjCExpr.py (1151 of 1892) ******************** TEST 'lldb-api :: functionalities/data-formatter/data-formatter-objc/TestDataFormatterObjCExpr.py' FAILED ******************** lldb version 10.0.99 (http://labmaster3.local/git/llvm-project.git revision c1b13a1b17719aebace1b3be7a6ac7f90b1901a6) clang revision bff33bd5c83b947cccb4d6cf6ebca9dc021f716b llvm revision bff33bd5c83b947cccb4d6cf6ebca9dc021f716b LLDB library dir: /Users/buildslave/jenkins/workspace/lldb-cmake-sanitized/lldb-build/bin LLDB import library dir: /Users/buildslave/jenkins/workspace/lldb-cmake-sanitized/lldb-build/bin libstdcxx tests will not be run because: Don't know how to build with libstdcxx on macosx Skipping following debug info categories: ['dwo'] AddressSanitizer report breakpoint hit. Use 'thread info -s' to get extended information about the report. AddressSanitizer report breakpoint hit. Use 'thread info -s' to get extended information about the report. AddressSanitizer report breakpoint hit. Use 'thread info -s' to get extended information about the report.

Hide Details

Session logs for test failures/errors/unexpected successes will go into directory '/Users/buildslave/jenkins/workspace/lldb-cmake-sanitized/test/logs' Command invoked: /Users/buildslave/jenkins/workspace/lldb-cmake-sanitized/llvm-project/lldb/test/API/dotest.py --arch x86_64 -s /Users/buildslave/jenkins/workspace/lldb-cmake-sanitized/lldb-build/lldb-test-traces -S nm -u CXXFLAGS -u CFLAGS --codesign-identity lldb_codesign --server /Users/buildslave/jenkins/workspace/lldb-cmake-sanitized/lldb-build/./bin/debugserver --arch x86_64 --build-dir /Users/buildslave/jenkins/workspace/lldb-cmake-sanitized/lldb-build/lldb-test-build.noindex -s=/Users/buildslave/jenkins/workspace/lldb-cmake-sanitized/test/logs -t --env TERM=vt100 --env LLVM_LIBS_DIR=/Users/buildslave/jenkins/workspace/lldb-cmake-sanitized/lldb-build/./lib --inferior-env ASAN_OPTIONS=detect_stack_use_after_return=1 --inferior-env DYLD_INSERT_LIBRARIES=/Users/buildslave/jenkins/workspace/lldb-cmake-sanitized/host-compiler/lib/clang/10.0.0/lib/darwin/libclang_rt.asan_osx_dynamic.dylib --build-dir /Users/buildslave/jenkins/workspace/lldb-cmake-sanitized/lldb-build/lldb-test-build.noindex --lldb-module-cache-dir /Users/buildslave/jenkins/workspace/lldb-cmake-sanitized/lldb-build/lldb-test-build.noindex/module-cache-lldb/lldb-api --clang-module-cache-dir /Users/buildslave/jenkins/workspace/lldb-cmake-sanitized/lldb-build/lldb-test-build.noindex/module-cache-clang/lldb-api --executable /Users/buildslave/jenkins/workspace/lldb-cmake-sanitized/lldb-build/./bin/lldb --compiler /Users/buildslave/jenkins/workspace/lldb-cmake-sanitized/lldb-build/./bin/clang --dsymutil /Users/buildslave/jenkins/workspace/lldb-cmake-sanitized/lldb-build/./bin/dsymutil --filecheck /Users/buildslave/jenkins/workspace/lldb-cmake-sanitized/lldb-build/./bin/FileCheck /Users/buildslave/jenkins/workspace/lldb-cmake-sanitized/llvm-project/lldb/packages/Python/lldbsuite/test/functionalities/data-formatter/data-formatter-objc -p TestDataFormatterObjCExpr.py Change dir to: /Users/buildslave/jenkins/workspace/lldb-cmake-sanitized/llvm-project/lldb/packages/Python/lldbsuite/test/functionalities/data-formatter/data-formatter-objc runCmd: settings set symbols.enable-external-lookup false output:

Hide Details

runCmd: settings set plugin.process.gdb-remote.packet-timeout 60 output:

Hide Details

runCmd: settings set symbols.clang-modules-cache-path "/Users/buildslave/jenkins/workspace/lldb-cmake-sanitized/lldb-build/lldb-test-build.noindex/module-cache-lldb/lldb-api" output:

Hide Details

runCmd: settings set use-color false output:

Hide Details

runCmd: settings set target.env-vars ASAN_OPTIONS=detect_stack_use_after_return=1 DYLD_INSERT_LIBRARIES=/Users/buildslave/jenkins/workspace/lldb-cmake-sanitized/host-compiler/lib/clang/10.0.0/lib/darwin/libclang_rt.asan_osx_dynamic.dylib output:

Hide Details

runCmd: settings set target.env-vars ASAN_OPTIONS=detect_stack_use_after_return=1 DYLD_INSERT_LIBRARIES=/Users/buildslave/jenkins/workspace/lldb-cmake-sanitized/host-compiler/lib/clang/10.0.0/lib/darwin/libclang_rt.asan_osx_dynamic.dylib output:

Hide Details

FAIL: LLDB (/Users/buildslave/jenkins/workspace/lldb-cmake-sanitized/lldb-build/bin/clang-10-x86_64) :: test_expr_with_run_command_dsym (TestDataFormatterObjCExpr.ObjCDataFormatterExpr) <bound method SBProcess.Kill of <lldb.SBProcess; proxy of <Swig Object of type 'lldb::SBProcess *' at 0x1117ca240> >>: success

Hide Details

runCmd: settings set symbols.enable-external-lookup false output:

Hide Details

runCmd: settings set plugin.process.gdb-remote.packet-timeout 60 output:

Hide Details

runCmd: settings set symbols.clang-modules-cache-path "/Users/buildslave/jenkins/workspace/lldb-cmake-sanitized/lldb-build/lldb-test-build.noindex/module-cache-lldb/lldb-api" output:

Hide Details

runCmd: settings set use-color false output:

Hide Details

runCmd: settings set target.env-vars ASAN_OPTIONS=detect_stack_use_after_return=1 DYLD_INSERT_LIBRARIES=/Users/buildslave/jenkins/workspace/lldb-cmake-sanitized/host-compiler/lib/clang/10.0.0/lib/darwin/libclang_rt.asan_osx_dynamic.dylib output:

Hide Details

runCmd: settings set target.env-vars ASAN_OPTIONS=detect_stack_use_after_return=1 DYLD_INSERT_LIBRARIES=/Users/buildslave/jenkins/workspace/lldb-cmake-sanitized/host-compiler/lib/clang/10.0.0/lib/darwin/libclang_rt.asan_osx_dynamic.dylib output:

Hide Details

FAIL: LLDB (/Users/buildslave/jenkins/workspace/lldb-cmake-sanitized/lldb-build/bin/clang-10-x86_64) :: test_expr_with_run_command_dwarf (TestDataFormatterObjCExpr.ObjCDataFormatterExpr) <bound method SBProcess.Kill of <lldb.SBProcess; proxy of <Swig Object of type 'lldb::SBProcess *' at 0x111222630> >>: success

Hide Details

UNSUPPORTED: LLDB (/Users/buildslave/jenkins/workspace/lldb-cmake-sanitized/lldb-build/bin/clang-10-x86_64) :: test_expr_with_run_command_dwo (TestDataFormatterObjCExpr.ObjCDataFormatterExpr) (test case does not fall in any category of interest for this run) runCmd: settings set symbols.enable-external-lookup false output:

Hide Details

runCmd: settings set plugin.process.gdb-remote.packet-timeout 60 output:

Hide Details

runCmd: settings set symbols.clang-modules-cache-path "/Users/buildslave/jenkins/workspace/lldb-cmake-sanitized/lldb-build/lldb-test-build.noindex/module-cache-lldb/lldb-api" output:

Hide Details

runCmd: settings set use-color false output:

Hide Details

runCmd: settings set target.env-vars ASAN_OPTIONS=detect_stack_use_after_return=1 DYLD_INSERT_LIBRARIES=/Users/buildslave/jenkins/workspace/lldb-cmake-sanitized/host-compiler/lib/clang/10.0.0/lib/darwin/libclang_rt.asan_osx_dynamic.dylib output:

Hide Details

runCmd: settings set target.env-vars ASAN_OPTIONS=detect_stack_use_after_return=1 DYLD_INSERT_LIBRARIES=/Users/buildslave/jenkins/workspace/lldb-cmake-sanitized/host-compiler/lib/clang/10.0.0/lib/darwin/libclang_rt.asan_osx_dynamic.dylib output:

Hide Details

FAIL: LLDB (/Users/buildslave/jenkins/workspace/lldb-cmake-sanitized/lldb-build/bin/clang-10-x86_64) :: test_expr_with_run_command_gmodules (TestDataFormatterObjCExpr.ObjCDataFormatterExpr) <bound method SBProcess.Kill of <lldb.SBProcess; proxy of <Swig Object of type 'lldb::SBProcess *' at 0x1117ca540> >>: success

Hide Details

Restore dir to: /Users/buildslave/jenkins/workspace/lldb-cmake-sanitized/lldb-build/tools/lldb/test ====================================================================== FAIL: test_expr_with_run_command_dsym (TestDataFormatterObjCExpr.ObjCDataFormatterExpr) Test common cases of expression parser <--> formatters interaction. ---------------------------------------------------------------------- Traceback (most recent call last): File "/Users/buildslave/jenkins/workspace/lldb-cmake-sanitized/llvm-project/lldb/packages/Python/lldbsuite/test/lldbtest.py", line 1732, in test_method return attrvalue(self) File "/Users/buildslave/jenkins/workspace/lldb-cmake-sanitized/llvm-project/lldb/packages/Python/lldbsuite/test/functionalities/data-formatter/data-formatter-objc/TestDataFormatterObjCExpr.py", line 23, in test_expr_with_run_command lldb.SBFileSpec('main.m', False)) File "/Users/buildslave/jenkins/workspace/lldb-cmake-sanitized/llvm-project/lldb/packages/Python/lldbsuite/test/lldbutil.py", line 868, in run_to_source_breakpoint only_one_thread, extra_images) File "/Users/buildslave/jenkins/workspace/lldb-cmake-sanitized/llvm-project/lldb/packages/Python/lldbsuite/test/lldbutil.py", line 797, in run_to_breakpoint_do_run test.assertEqual(num_threads, 1, "Expected 1 thread to stop at breakpoint, %d did."%(num_threads)) AssertionError: 0 != 1 : Expected 1 thread to stop at breakpoint, 0 did. Config=x86_64-/Users/buildslave/jenkins/workspace/lldb-cmake-sanitized/lldb-build/bin/clang-10 ====================================================================== FAIL: test_expr_with_run_command_dwarf (TestDataFormatterObjCExpr.ObjCDataFormatterExpr) Test common cases of expression parser <--> formatters interaction. ---------------------------------------------------------------------- Traceback (most recent call last): File "/Users/buildslave/jenkins/workspace/lldb-cmake-sanitized/llvm-project/lldb/packages/Python/lldbsuite/test/lldbtest.py", line 1732, in test_method return attrvalue(self) File "/Users/buildslave/jenkins/workspace/lldb-cmake-sanitized/llvm-project/lldb/packages/Python/lldbsuite/test/functionalities/data-formatter/data-formatter-objc/TestDataFormatterObjCExpr.py", line 23, in test_expr_with_run_command lldb.SBFileSpec('main.m', False)) File "/Users/buildslave/jenkins/workspace/lldb-cmake-sanitized/llvm-project/lldb/packages/Python/lldbsuite/test/lldbutil.py", line 868, in run_to_source_breakpoint only_one_thread, extra_images) File "/Users/buildslave/jenkins/workspace/lldb-cmake-sanitized/llvm-project/lldb/packages/Python/lldbsuite/test/lldbutil.py", line 797, in run_to_breakpoint_do_run test.assertEqual(num_threads, 1, "Expected 1 thread to stop at breakpoint, %d did."%(num_threads)) AssertionError: 0 != 1 : Expected 1 thread to stop at breakpoint, 0 did. Config=x86_64-/Users/buildslave/jenkins/workspace/lldb-cmake-sanitized/lldb-build/bin/clang-10 ====================================================================== FAIL: test_expr_with_run_command_gmodules (TestDataFormatterObjCExpr.ObjCDataFormatterExpr) Test common cases of expression parser <--> formatters interaction. ---------------------------------------------------------------------- Traceback (most recent call last): File "/Users/buildslave/jenkins/workspace/lldb-cmake-sanitized/llvm-project/lldb/packages/Python/lldbsuite/test/lldbtest.py", line 1732, in test_method return attrvalue(self) File "/Users/buildslave/jenkins/workspace/lldb-cmake-sanitized/llvm-project/lldb/packages/Python/lldbsuite/test/functionalities/data-formatter/data-formatter-objc/TestDataFormatterObjCExpr.py", line 23, in test_expr_with_run_command lldb.SBFileSpec('main.m', False)) File "/Users/buildslave/jenkins/workspace/lldb-cmake-sanitized/llvm-project/lldb/packages/Python/lldbsuite/test/lldbutil.py", line 868, in run_to_source_breakpoint only_one_thread, extra_images) File "/Users/buildslave/jenkins/workspace/lldb-cmake-sanitized/llvm-project/lldb/packages/Python/lldbsuite/test/lldbutil.py", line 797, in run_to_breakpoint_do_run test.assertEqual(num_threads, 1, "Expected 1 thread to stop at breakpoint, %d did."%(num_threads)) AssertionError: 0 != 1 : Expected 1 thread to stop at breakpoint, 0 did. Config=x86_64-/Users/buildslave/jenkins/workspace/lldb-cmake-sanitized/lldb-build/bin/clang-10 ---------------------------------------------------------------------- Ran 4 tests in 140.269s

Hide Details

RESULT: FAILED (0 passes, 3 failures, 0 errors, 1 skipped, 0 expected failures, 0 unexpected successes)

Hide Details

******************** PASS: lldb-api :: python_api/debugger/TestDebuggerAPI.py (1152 of 1892) PASS: lldb-unit :: Utility/./UtilityTests/CompletionRequest.TryCompleteCurrentArgMode (1153 of 1892) PASS: lldb-unit :: Utility/./UtilityTests/OptionsWithRawTest.SingleWhitespaceInput (1154 of 1892) PASS: lldb-unit :: Utility/./UtilityTests/StreamTest.AddressSuffix (1155 of 1892) PASS: lldb-unit :: Utility/./UtilityTests/ConstStringTest.format_provider (1156 of 1892) PASS: lldb-api :: lang/objc/objc-runtime-ivars/TestRuntimeIvars.py (1157 of 1892) PASS: lldb-shell :: Register/x86-64-ymm-read.test (1158 of 1892) PASS: lldb-shell :: SymbolFile/DWARF/dir-separator-windows.s (1159 of 1892) PASS: lldb-api :: lang/objc/objc-new-syntax/TestObjCNewSyntaxArray.py (1160 of 1892) PASS: lldb-api :: functionalities/data-formatter/data-formatter-stl/libcxx/optional/TestDataFormatterLibcxxOptional.py (1161 of 1892) PASS: lldb-api :: commands/expression/import-std-module/list-basic/TestBasicList.py (1162 of 1892) XFAIL: lldb-shell :: Register/x86-mm-xmm-write.test (1163 of 1892) PASS: lldb-api :: functionalities/completion/TestCompletion.py (1164 of 1892) PASS: lldb-unit :: Utility/./UtilityTests/NameMatchesTest.Ignore (1165 of 1892) PASS: lldb-api :: functionalities/thread/create_after_attach/TestCreateAfterAttach.py (1166 of 1892) PASS: lldb-api :: functionalities/inferior-crashing/TestInferiorCrashing.py (1167 of 1892) PASS: lldb-shell :: SymbolFile/DWARF/find-method-local-struct.cpp (1168 of 1892) PASS: lldb-unit :: Process/minidump/./LLDBMinidumpTests/MinidumpParserTest.GetThreadContext_x86_32_wow64 (1169 of 1892) PASS: lldb-unit :: Utility/./UtilityTests/RangeTest.DoesIntersect (1170 of 1892) PASS: lldb-unit :: SymbolFile/DWARF/./SymbolFileDWARFTests/DWARFASTParserClangTests.EnsureAllDIEsInDeclContextHaveBeenParsedParsesOnlyMatchingEntries (1171 of 1892) PASS: lldb-unit :: Utility/./UtilityTests/ConstStringTest.CompareStringRef (1172 of 1892) PASS: lldb-api :: functionalities/data-formatter/data-formatter-skip-summary/TestDataFormatterSkipSummary.py (1173 of 1892) PASS: lldb-unit :: ScriptInterpreter/Python/./ScriptInterpreterPythonTests/PythonDataObjectsTest.TestPythonTupleSize (1174 of 1892) PASS: lldb-unit :: Utility/./UtilityTests/UriParserTest.SchemeHostSeparator3 (1175 of 1892) UNSUPPORTED: lldb-shell :: Register/x86-ymm-read.test (1176 of 1892) PASS: lldb-unit :: Utility/./UtilityTests/LogChannelEnabledTest.LogVerboseThread (1177 of 1892) PASS: lldb-unit :: Host/./HostTests/FileSystemTest.GetByteSize (1178 of 1892) PASS: lldb-api :: lang/cpp/scope/TestCppScope.py (1179 of 1892) PASS: lldb-unit :: Utility/./UtilityTests/StringExtractorTest.GetHexU8_Extra (1180 of 1892) PASS: lldb-unit :: Utility/./UtilityTests/StringListTest.SplitIntoLines (1181 of 1892) PASS: lldb-unit :: Symbol/./SymbolTests/TestClangASTContext.TestFunctionTemplateConstruction (1182 of 1892) UNSUPPORTED: lldb-shell :: ScriptInterpreter/Lua/bindings.test (1183 of 1892) PASS: lldb-unit :: Expression/./ExpressionTests/DiagnosticManagerTest.PutStringSeverities (1184 of 1892) PASS: lldb-unit :: Utility/./UtilityTests/StreamTest.PutHex64ByteOrderLittle (1185 of 1892) PASS: lldb-unit :: Utility/./UtilityTests/CompletionRequest.Constructor (1186 of 1892) PASS: lldb-api :: functionalities/breakpoint/breakpoint_command/TestBreakpointCommand.py (1187 of 1892) PASS: lldb-unit :: Utility/./UtilityTests/StructuredDataTest.ParseJSONFromFile (1188 of 1892) UNSUPPORTED: lldb-shell :: SymbolFile/NativePDB/local-variables.cpp (1189 of 1892) PASS: lldb-api :: functionalities/thread/concurrent_events/TestConcurrentBreakpointsDelayedBreakpointOneWatchpoint.py (1190 of 1892) PASS: lldb-unit :: Utility/./UtilityTests/StringExtractorTest.GetHexBytesAvail_Partial (1191 of 1892) PASS: lldb-api :: functionalities/data-formatter/dump_dynamic/TestDumpDynamic.py (1192 of 1892) PASS: lldb-unit :: Language/Highlighting/./HighlighterTests/HighlighterTest.ClangCursorPosBeforeOtherToken (1193 of 1892) PASS: lldb-api :: lang/c/step_over_no_deadlock/TestStepOverDoesntBlock.py (1194 of 1892) PASS: lldb-unit :: Process/minidump/./LLDBMinidumpTests/MinidumpParserTest.GetExceptionStream (1195 of 1892) PASS: lldb-api :: macosx/thread-names/TestInterruptThreadNames.py (1196 of 1892) UNSUPPORTED: lldb-shell :: Watchpoint/netbsd-nouserdbregs.test (1197 of 1892) PASS: lldb-unit :: Utility/./UtilityTests/StringListTest.AppendListCStringArray (1198 of 1892) PASS: lldb-unit :: Language/Highlighting/./HighlighterTests/HighlighterTest.ClangUnterminatedString (1199 of 1892) UNSUPPORTED: lldb-api :: functionalities/data-formatter/data-formatter-stl/libstdcpp/string/TestDataFormatterStdString.py (1200 of 1892) PASS: lldb-shell :: Commands/command-source.test (1201 of 1892) PASS: lldb-unit :: Utility/./UtilityTests/StreamTest.PutNHex8 (1202 of 1892) PASS: lldb-unit :: Process/minidump/./LLDBMinidumpTests/MinidumpParserTest.GetMemoryRegionInfoFromMemory64List (1203 of 1892) PASS: lldb-shell :: SymbolFile/Breakpad/stack-cfi-parsing.test (1204 of 1892) PASS: lldb-unit :: Utility/./UtilityTests/StatusTest.ErrorConstructor (1205 of 1892) PASS: lldb-api :: functionalities/thread/concurrent_events/TestConcurrentTwoWatchpointsOneBreakpoint.py (1206 of 1892) PASS: lldb-unit :: ObjectFile/Breakpad/./ObjectFileBreakpadTests/PublicRecord.parse (1207 of 1892) PASS: lldb-api :: commands/process/attach-resume/TestAttachResume.py (1208 of 1892) PASS: lldb-api :: macosx/version_zero/TestGetVersionZeroVersion.py (1209 of 1892) PASS: lldb-shell :: SymbolFile/DWARF/debug_loc_and_loclists.s (1210 of 1892) UNSUPPORTED: lldb-api :: functionalities/darwin_log/filter/exact_match/category/TestDarwinLogFilterMatchCategory.py (1211 of 1892) PASS: lldb-unit :: UnwindAssembly/x86/./UnwindAssemblyx86Tests/Testx86AssemblyInspectionEngine.TestSubESP (1212 of 1892) PASS: lldb-api :: lang/objc/conflicting-definition/TestConflictingDefinition.py (1213 of 1892) PASS: lldb-api :: commands/frame/diagnose/bad-reference/TestBadReference.py (1214 of 1892) PASS: lldb-shell :: Driver/TestRepl.test (1215 of 1892) PASS: lldb-unit :: SymbolFile/NativePDB/./SymbolFileNativePDBTests/PDBFPOProgramToDWARFExpressionTests.UnresolvedDependentCyclicRegisterAssignmentReference (1216 of 1892) PASS: lldb-api :: lang/objc/objc-ivar-offsets/TestObjCIvarOffsets.py (1217 of 1892) PASS: lldb-unit :: UnwindAssembly/x86/./UnwindAssemblyx86Tests/Testx86AssemblyInspectionEngine.TestSpillRegToStackViaMOVx86_64 (1218 of 1892) PASS: lldb-api :: lang/objc/foundation/TestObjCMethodsNSArray.py (1219 of 1892) PASS: lldb-unit :: Target/./TargetTests/MemoryRegionInfoTest.Formatv (1220 of 1892) PASS: lldb-unit :: Utility/./UtilityTests/NameMatchesTest.RegularExpression (1221 of 1892) PASS: lldb-unit :: Utility/./UtilityTests/FileSpecTest.CopyByAppendingPathComponent (1222 of 1892) PASS: lldb-api :: functionalities/data-formatter/data-formatter-ptr-to-array/TestPtrToArrayFormatting.py (1223 of 1892) PASS: lldb-unit :: Language/Highlighting/./HighlighterTests/HighlighterTest.DefaultHighlighterWithCursorOutOfBounds (1224 of 1892) PASS: lldb-unit :: Utility/./UtilityTests/StreamTeeTest.Constructor2Streams (1225 of 1892) PASS: lldb-unit :: Utility/./UtilityTests/StringListTest.AppendList (1226 of 1892) PASS: lldb-unit :: Utility/./UtilityTests/StreamTeeTest.SetStreamAtIndexOutOfBounds (1227 of 1892) PASS: lldb-api :: functionalities/thread/concurrent_events/TestConcurrentSignalWatch.py (1228 of 1892) PASS: lldb-unit :: Utility/./UtilityTests/Predicate.WaitForValueEqualTo (1229 of 1892) PASS: lldb-unit :: Symbol/./SymbolTests/TestClangASTImporter.CopyTypeTagDecl (1230 of 1892) PASS: lldb-unit :: Utility/./UtilityTests/RangeTest.Constructor (1231 of 1892) PASS: lldb-unit :: Utility/./UtilityTests/StreamTest.PutHex64ByteOrderBig (1232 of 1892) PASS: lldb-shell :: SymbolFile/NativePDB/globals-fundamental.cpp (1233 of 1892) PASS: lldb-api :: lang/objc/exceptions/TestObjCExceptions.py (1234 of 1892) PASS: lldb-api :: lang/objc/objc-property/TestObjCProperty.py (1235 of 1892) PASS: lldb-api :: functionalities/gdb_remote_client/TestJLink6Armv7RegisterDefinition.py (1236 of 1892) PASS: lldb-api :: lang/objc/objc-new-syntax/TestObjCNewSyntaxDictionary.py (1237 of 1892) XFAIL: lldb-shell :: Unwind/prefer-debug-over-eh-frame.test (1238 of 1892) UNSUPPORTED: lldb-api :: commands/watchpoints/hello_watchlocation/TestWatchLocation.py (1239 of 1892) PASS: lldb-unit :: Utility/./UtilityTests/RegularExpression.Invalid (1240 of 1892) PASS: lldb-shell :: ObjectFile/ELF/PT_LOAD-overlap-section.yaml (1241 of 1892) PASS: lldb-unit :: Utility/./UtilityTests/TimeoutTest.Format (1242 of 1892) PASS: lldb-unit :: Utility/./UtilityTests/StreamTest.PutBytesAsRawHex8ToBigEndian (1243 of 1892) PASS: lldb-unit :: Language/Highlighting/./HighlighterTests/HighlighterTest.DefaultHighlighter (1244 of 1892) PASS: lldb-shell :: SymbolFile/DWARF/find-basic-variable.cpp (1245 of 1892) PASS: lldb-api :: commands/platform/basic/TestPlatformCommand.py (1246 of 1892) UNSUPPORTED: lldb-api :: iohandler/unicode/TestUnicode.py (1247 of 1892) PASS: lldb-unit :: ScriptInterpreter/Python/./ScriptInterpreterPythonTests/PythonDataObjectsTest.TestPythonListManipulation (1248 of 1892) PASS: lldb-unit :: Utility/./UtilityTests/RangeTest.Equal (1249 of 1892) PASS: lldb-api :: python_api/lldbutil/iter/TestLLDBIterator.py (1250 of 1892) PASS: lldb-unit :: Utility/./UtilityTests/ScalarTest.Scalar_512 (1251 of 1892) PASS: lldb-api :: tools/lldb-server/register-reading/TestGdbRemoteGPacket.py (1252 of 1892) PASS: lldb-unit :: ScriptInterpreter/Python/./ScriptInterpreterPythonTests/PythonDataObjectsTest.TestPythonIntegerToStr (1253 of 1892) UNSUPPORTED: lldb-shell :: SymbolFile/PDB/variables.test (1254 of 1892) PASS: lldb-unit :: Utility/./UtilityTests/CompletionRequest.DuplicateFiltering (1255 of 1892) PASS: lldb-unit :: Process/gdb-remote/./ProcessGdbRemoteTests/GDBRemoteCommunicationClientTest.SaveRestoreRegistersNoSuffix (1256 of 1892) PASS: lldb-api :: tools/lldb-server/TestGdbRemote_vCont.py (1257 of 1892) PASS: lldb-api :: functionalities/postmortem/elf-core/TestLinuxCore.py (1258 of 1892) PASS: lldb-api :: functionalities/breakpoint/serialize/TestBreakpointSerialization.py (1259 of 1892) PASS: lldb-api :: tools/lldb-server/TestGdbRemoteRegisterState.py (1260 of 1892) PASS: lldb-api :: lang/c/anonymous/TestAnonymous.py (1261 of 1892) PASS: lldb-unit :: UnwindAssembly/x86/./UnwindAssemblyx86Tests/Testx86AssemblyInspectionEngine.Test64bitFramelessSmallStackFrame (1262 of 1892) XFAIL: lldb-shell :: SymbolFile/DWARF/find-type-in-function.cpp (1263 of 1892) PASS: lldb-shell :: Settings/TestStopCommandSourceOnError.test (1264 of 1892) PASS: lldb-api :: lang/cpp/enum_types/TestCPP11EnumTypes.py (1265 of 1892) FAIL: lldb-api :: functionalities/data-formatter/data-formatter-objc/TestDataFormatterObjCNSURL.py (1266 of 1892) ******************** TEST 'lldb-api :: functionalities/data-formatter/data-formatter-objc/TestDataFormatterObjCNSURL.py' FAILED ******************** lldb version 10.0.99 (http://labmaster3.local/git/llvm-project.git revision c1b13a1b17719aebace1b3be7a6ac7f90b1901a6) clang revision bff33bd5c83b947cccb4d6cf6ebca9dc021f716b llvm revision bff33bd5c83b947cccb4d6cf6ebca9dc021f716b LLDB library dir: /Users/buildslave/jenkins/workspace/lldb-cmake-sanitized/lldb-build/bin LLDB import library dir: /Users/buildslave/jenkins/workspace/lldb-cmake-sanitized/lldb-build/bin libstdcxx tests will not be run because: Don't know how to build with libstdcxx on macosx Skipping following debug info categories: ['dwo'] AddressSanitizer report breakpoint hit. Use 'thread info -s' to get extended information about the report. AddressSanitizer report breakpoint hit. Use 'thread info -s' to get extended information about the report. AddressSanitizer report breakpoint hit. Use 'thread info -s' to get extended information about the report.

Hide Details

Session logs for test failures/errors/unexpected successes will go into directory '/Users/buildslave/jenkins/workspace/lldb-cmake-sanitized/test/logs' Command invoked: /Users/buildslave/jenkins/workspace/lldb-cmake-sanitized/llvm-project/lldb/test/API/dotest.py --arch x86_64 -s /Users/buildslave/jenkins/workspace/lldb-cmake-sanitized/lldb-build/lldb-test-traces -S nm -u CXXFLAGS -u CFLAGS --codesign-identity lldb_codesign --server /Users/buildslave/jenkins/workspace/lldb-cmake-sanitized/lldb-build/./bin/debugserver --arch x86_64 --build-dir /Users/buildslave/jenkins/workspace/lldb-cmake-sanitized/lldb-build/lldb-test-build.noindex -s=/Users/buildslave/jenkins/workspace/lldb-cmake-sanitized/test/logs -t --env TERM=vt100 --env LLVM_LIBS_DIR=/Users/buildslave/jenkins/workspace/lldb-cmake-sanitized/lldb-build/./lib --inferior-env ASAN_OPTIONS=detect_stack_use_after_return=1 --inferior-env DYLD_INSERT_LIBRARIES=/Users/buildslave/jenkins/workspace/lldb-cmake-sanitized/host-compiler/lib/clang/10.0.0/lib/darwin/libclang_rt.asan_osx_dynamic.dylib --build-dir /Users/buildslave/jenkins/workspace/lldb-cmake-sanitized/lldb-build/lldb-test-build.noindex --lldb-module-cache-dir /Users/buildslave/jenkins/workspace/lldb-cmake-sanitized/lldb-build/lldb-test-build.noindex/module-cache-lldb/lldb-api --clang-module-cache-dir /Users/buildslave/jenkins/workspace/lldb-cmake-sanitized/lldb-build/lldb-test-build.noindex/module-cache-clang/lldb-api --executable /Users/buildslave/jenkins/workspace/lldb-cmake-sanitized/lldb-build/./bin/lldb --compiler /Users/buildslave/jenkins/workspace/lldb-cmake-sanitized/lldb-build/./bin/clang --dsymutil /Users/buildslave/jenkins/workspace/lldb-cmake-sanitized/lldb-build/./bin/dsymutil --filecheck /Users/buildslave/jenkins/workspace/lldb-cmake-sanitized/lldb-build/./bin/FileCheck /Users/buildslave/jenkins/workspace/lldb-cmake-sanitized/llvm-project/lldb/packages/Python/lldbsuite/test/functionalities/data-formatter/data-formatter-objc -p TestDataFormatterObjCNSURL.py Change dir to: /Users/buildslave/jenkins/workspace/lldb-cmake-sanitized/llvm-project/lldb/packages/Python/lldbsuite/test/functionalities/data-formatter/data-formatter-objc runCmd: settings set symbols.enable-external-lookup false output:

Hide Details

runCmd: settings set plugin.process.gdb-remote.packet-timeout 60 output:

Hide Details

runCmd: settings set symbols.clang-modules-cache-path "/Users/buildslave/jenkins/workspace/lldb-cmake-sanitized/lldb-build/lldb-test-build.noindex/module-cache-lldb/lldb-api" output:

Hide Details

runCmd: settings set use-color false output:

Hide Details

runCmd: settings set target.env-vars ASAN_OPTIONS=detect_stack_use_after_return=1 DYLD_INSERT_LIBRARIES=/Users/buildslave/jenkins/workspace/lldb-cmake-sanitized/host-compiler/lib/clang/10.0.0/lib/darwin/libclang_rt.asan_osx_dynamic.dylib output:

Hide Details

runCmd: settings set target.env-vars ASAN_OPTIONS=detect_stack_use_after_return=1 DYLD_INSERT_LIBRARIES=/Users/buildslave/jenkins/workspace/lldb-cmake-sanitized/host-compiler/lib/clang/10.0.0/lib/darwin/libclang_rt.asan_osx_dynamic.dylib output:

Hide Details

FAIL: LLDB (/Users/buildslave/jenkins/workspace/lldb-cmake-sanitized/lldb-build/bin/clang-10-x86_64) :: test_nsurl_with_run_command_dsym (TestDataFormatterObjCNSURL.ObjCDataFormatterNSURL) <bound method SBProcess.Kill of <lldb.SBProcess; proxy of <Swig Object of type 'lldb::SBProcess *' at 0x10758c210> >>: success

Hide Details

runCmd: settings set symbols.enable-external-lookup false output:

Hide Details

runCmd: settings set plugin.process.gdb-remote.packet-timeout 60 output:

Hide Details

runCmd: settings set symbols.clang-modules-cache-path "/Users/buildslave/jenkins/workspace/lldb-cmake-sanitized/lldb-build/lldb-test-build.noindex/module-cache-lldb/lldb-api" output:

Hide Details

runCmd: settings set use-color false output:

Hide Details

runCmd: settings set target.env-vars ASAN_OPTIONS=detect_stack_use_after_return=1 DYLD_INSERT_LIBRARIES=/Users/buildslave/jenkins/workspace/lldb-cmake-sanitized/host-compiler/lib/clang/10.0.0/lib/darwin/libclang_rt.asan_osx_dynamic.dylib output:

Hide Details

runCmd: settings set target.env-vars ASAN_OPTIONS=detect_stack_use_after_return=1 DYLD_INSERT_LIBRARIES=/Users/buildslave/jenkins/workspace/lldb-cmake-sanitized/host-compiler/lib/clang/10.0.0/lib/darwin/libclang_rt.asan_osx_dynamic.dylib output:

Hide Details

FAIL: LLDB (/Users/buildslave/jenkins/workspace/lldb-cmake-sanitized/lldb-build/bin/clang-10-x86_64) :: test_nsurl_with_run_command_dwarf (TestDataFormatterObjCNSURL.ObjCDataFormatterNSURL) <bound method SBProcess.Kill of <lldb.SBProcess; proxy of <Swig Object of type 'lldb::SBProcess *' at 0x106fe5630> >>: success

Hide Details

UNSUPPORTED: LLDB (/Users/buildslave/jenkins/workspace/lldb-cmake-sanitized/lldb-build/bin/clang-10-x86_64) :: test_nsurl_with_run_command_dwo (TestDataFormatterObjCNSURL.ObjCDataFormatterNSURL) (test case does not fall in any category of interest for this run) runCmd: settings set symbols.enable-external-lookup false output:

Hide Details

runCmd: settings set plugin.process.gdb-remote.packet-timeout 60 output:

Hide Details

runCmd: settings set symbols.clang-modules-cache-path "/Users/buildslave/jenkins/workspace/lldb-cmake-sanitized/lldb-build/lldb-test-build.noindex/module-cache-lldb/lldb-api" output:

Hide Details

runCmd: settings set use-color false output:

Hide Details

runCmd: settings set target.env-vars ASAN_OPTIONS=detect_stack_use_after_return=1 DYLD_INSERT_LIBRARIES=/Users/buildslave/jenkins/workspace/lldb-cmake-sanitized/host-compiler/lib/clang/10.0.0/lib/darwin/libclang_rt.asan_osx_dynamic.dylib output:

Hide Details

runCmd: settings set target.env-vars ASAN_OPTIONS=detect_stack_use_after_return=1 DYLD_INSERT_LIBRARIES=/Users/buildslave/jenkins/workspace/lldb-cmake-sanitized/host-compiler/lib/clang/10.0.0/lib/darwin/libclang_rt.asan_osx_dynamic.dylib output:

Hide Details

FAIL: LLDB (/Users/buildslave/jenkins/workspace/lldb-cmake-sanitized/lldb-build/bin/clang-10-x86_64) :: test_nsurl_with_run_command_gmodules (TestDataFormatterObjCNSURL.ObjCDataFormatterNSURL) <bound method SBProcess.Kill of <lldb.SBProcess; proxy of <Swig Object of type 'lldb::SBProcess *' at 0x10758c540> >>: success

Hide Details

Restore dir to: /Users/buildslave/jenkins/workspace/lldb-cmake-sanitized/lldb-build/tools/lldb/test ====================================================================== FAIL: test_nsurl_with_run_command_dsym (TestDataFormatterObjCNSURL.ObjCDataFormatterNSURL) Test formatters for NSURL. ---------------------------------------------------------------------- Traceback (most recent call last): File "/Users/buildslave/jenkins/workspace/lldb-cmake-sanitized/llvm-project/lldb/packages/Python/lldbsuite/test/lldbtest.py", line 1732, in test_method return attrvalue(self) File "/Users/buildslave/jenkins/workspace/lldb-cmake-sanitized/llvm-project/lldb/packages/Python/lldbsuite/test/functionalities/data-formatter/data-formatter-objc/TestDataFormatterObjCNSURL.py", line 20, in test_nsurl_with_run_command self.appkit_tester_impl(self.nsurl_data_formatter_commands) File "/Users/buildslave/jenkins/workspace/lldb-cmake-sanitized/llvm-project/lldb/packages/Python/lldbsuite/test/functionalities/data-formatter/data-formatter-objc/ObjCDataFormatterTestCase.py", line 19, in appkit_tester_impl self.appkit_common_data_formatters_command() File "/Users/buildslave/jenkins/workspace/lldb-cmake-sanitized/llvm-project/lldb/packages/Python/lldbsuite/test/functionalities/data-formatter/data-formatter-objc/ObjCDataFormatterTestCase.py", line 26, in appkit_common_data_formatters_command lldb.SBFileSpec('main.m', False)) File "/Users/buildslave/jenkins/workspace/lldb-cmake-sanitized/llvm-project/lldb/packages/Python/lldbsuite/test/lldbutil.py", line 868, in run_to_source_breakpoint only_one_thread, extra_images) File "/Users/buildslave/jenkins/workspace/lldb-cmake-sanitized/llvm-project/lldb/packages/Python/lldbsuite/test/lldbutil.py", line 797, in run_to_breakpoint_do_run test.assertEqual(num_threads, 1, "Expected 1 thread to stop at breakpoint, %d did."%(num_threads)) AssertionError: 0 != 1 : Expected 1 thread to stop at breakpoint, 0 did. Config=x86_64-/Users/buildslave/jenkins/workspace/lldb-cmake-sanitized/lldb-build/bin/clang-10 ====================================================================== FAIL: test_nsurl_with_run_command_dwarf (TestDataFormatterObjCNSURL.ObjCDataFormatterNSURL) Test formatters for NSURL. ---------------------------------------------------------------------- Traceback (most recent call last): File "/Users/buildslave/jenkins/workspace/lldb-cmake-sanitized/llvm-project/lldb/packages/Python/lldbsuite/test/lldbtest.py", line 1732, in test_method return attrvalue(self) File "/Users/buildslave/jenkins/workspace/lldb-cmake-sanitized/llvm-project/lldb/packages/Python/lldbsuite/test/functionalities/data-formatter/data-formatter-objc/TestDataFormatterObjCNSURL.py", line 20, in test_nsurl_with_run_command self.appkit_tester_impl(self.nsurl_data_formatter_commands) File "/Users/buildslave/jenkins/workspace/lldb-cmake-sanitized/llvm-project/lldb/packages/Python/lldbsuite/test/functionalities/data-formatter/data-formatter-objc/ObjCDataFormatterTestCase.py", line 19, in appkit_tester_impl self.appkit_common_data_formatters_command() File "/Users/buildslave/jenkins/workspace/lldb-cmake-sanitized/llvm-project/lldb/packages/Python/lldbsuite/test/functionalities/data-formatter/data-formatter-objc/ObjCDataFormatterTestCase.py", line 26, in appkit_common_data_formatters_command lldb.SBFileSpec('main.m', False)) File "/Users/buildslave/jenkins/workspace/lldb-cmake-sanitized/llvm-project/lldb/packages/Python/lldbsuite/test/lldbutil.py", line 868, in run_to_source_breakpoint only_one_thread, extra_images) File "/Users/buildslave/jenkins/workspace/lldb-cmake-sanitized/llvm-project/lldb/packages/Python/lldbsuite/test/lldbutil.py", line 797, in run_to_breakpoint_do_run test.assertEqual(num_threads, 1, "Expected 1 thread to stop at breakpoint, %d did."%(num_threads)) AssertionError: 0 != 1 : Expected 1 thread to stop at breakpoint, 0 did. Config=x86_64-/Users/buildslave/jenkins/workspace/lldb-cmake-sanitized/lldb-build/bin/clang-10 ====================================================================== FAIL: test_nsurl_with_run_command_gmodules (TestDataFormatterObjCNSURL.ObjCDataFormatterNSURL) Test formatters for NSURL. ---------------------------------------------------------------------- Traceback (most recent call last): File "/Users/buildslave/jenkins/workspace/lldb-cmake-sanitized/llvm-project/lldb/packages/Python/lldbsuite/test/lldbtest.py", line 1732, in test_method return attrvalue(self) File "/Users/buildslave/jenkins/workspace/lldb-cmake-sanitized/llvm-project/lldb/packages/Python/lldbsuite/test/functionalities/data-formatter/data-formatter-objc/TestDataFormatterObjCNSURL.py", line 20, in test_nsurl_with_run_command self.appkit_tester_impl(self.nsurl_data_formatter_commands) File "/Users/buildslave/jenkins/workspace/lldb-cmake-sanitized/llvm-project/lldb/packages/Python/lldbsuite/test/functionalities/data-formatter/data-formatter-objc/ObjCDataFormatterTestCase.py", line 19, in appkit_tester_impl self.appkit_common_data_formatters_command() File "/Users/buildslave/jenkins/workspace/lldb-cmake-sanitized/llvm-project/lldb/packages/Python/lldbsuite/test/functionalities/data-formatter/data-formatter-objc/ObjCDataFormatterTestCase.py", line 26, in appkit_common_data_formatters_command lldb.SBFileSpec('main.m', False)) File "/Users/buildslave/jenkins/workspace/lldb-cmake-sanitized/llvm-project/lldb/packages/Python/lldbsuite/test/lldbutil.py", line 868, in run_to_source_breakpoint only_one_thread, extra_images) File "/Users/buildslave/jenkins/workspace/lldb-cmake-sanitized/llvm-project/lldb/packages/Python/lldbsuite/test/lldbutil.py", line 797, in run_to_breakpoint_do_run test.assertEqual(num_threads, 1, "Expected 1 thread to stop at breakpoint, %d did."%(num_threads)) AssertionError: 0 != 1 : Expected 1 thread to stop at breakpoint, 0 did. Config=x86_64-/Users/buildslave/jenkins/workspace/lldb-cmake-sanitized/lldb-build/bin/clang-10 ---------------------------------------------------------------------- Ran 4 tests in 143.638s

Hide Details

RESULT: FAILED (0 passes, 3 failures, 0 errors, 1 skipped, 0 expected failures, 0 unexpected successes)

Hide Details

******************** PASS: lldb-unit :: Process/gdb-remote/./ProcessGdbRemoteTests/GDBRemoteClientBaseTest.SendContinueDelegateInterface (1267 of 1892) PASS: lldb-api :: functionalities/inferior-assert/TestInferiorAssert.py (1268 of 1892) PASS: lldb-api :: functionalities/breakpoint/scripted_bkpt/TestScriptedResolver.py (1269 of 1892) PASS: lldb-api :: functionalities/thread/concurrent_events/TestConcurrentSignalNWatchNBreak.py (1270 of 1892) PASS: lldb-api :: functionalities/data-formatter/data-formatter-stl/libcxx/atomic/TestLibCxxAtomic.py (1271 of 1892) UNSUPPORTED: lldb-shell :: SymbolFile/DWARF/debug-types-expressions.test (1272 of 1892) PASS: lldb-unit :: Symbol/./SymbolTests/SymbolsTest.TerminateLocateExecutableSymbolFileForUnknownExecutableAndUnknownSymbolFile (1273 of 1892) UNSUPPORTED: lldb-shell :: Register/x86-64-gp-write.test (1274 of 1892) PASS: lldb-unit :: Utility/./UtilityTests/NameMatchesTest.EndsWith (1275 of 1892) PASS: lldb-api :: commands/expression/regression-access-function-template-in-record/TestRegressionAccessFunctionTemplateInRecord.py (1276 of 1892) PASS: lldb-api :: lang/objc/radar-9691614/TestObjCMethodReturningBOOL.py (1277 of 1892) FAIL: lldb-api :: functionalities/data-formatter/data-formatter-objc/TestDataFormatterObjCCF.py (1278 of 1892) ******************** TEST 'lldb-api :: functionalities/data-formatter/data-formatter-objc/TestDataFormatterObjCCF.py' FAILED ******************** lldb version 10.0.99 (http://labmaster3.local/git/llvm-project.git revision c1b13a1b17719aebace1b3be7a6ac7f90b1901a6) clang revision bff33bd5c83b947cccb4d6cf6ebca9dc021f716b llvm revision bff33bd5c83b947cccb4d6cf6ebca9dc021f716b LLDB library dir: /Users/buildslave/jenkins/workspace/lldb-cmake-sanitized/lldb-build/bin LLDB import library dir: /Users/buildslave/jenkins/workspace/lldb-cmake-sanitized/lldb-build/bin libstdcxx tests will not be run because: Don't know how to build with libstdcxx on macosx Skipping following debug info categories: ['dwo'] AddressSanitizer report breakpoint hit. Use 'thread info -s' to get extended information about the report. AddressSanitizer report breakpoint hit. Use 'thread info -s' to get extended information about the report. AddressSanitizer report breakpoint hit. Use 'thread info -s' to get extended information about the report.

Hide Details

Session logs for test failures/errors/unexpected successes will go into directory '/Users/buildslave/jenkins/workspace/lldb-cmake-sanitized/test/logs' Command invoked: /Users/buildslave/jenkins/workspace/lldb-cmake-sanitized/llvm-project/lldb/test/API/dotest.py --arch x86_64 -s /Users/buildslave/jenkins/workspace/lldb-cmake-sanitized/lldb-build/lldb-test-traces -S nm -u CXXFLAGS -u CFLAGS --codesign-identity lldb_codesign --server /Users/buildslave/jenkins/workspace/lldb-cmake-sanitized/lldb-build/./bin/debugserver --arch x86_64 --build-dir /Users/buildslave/jenkins/workspace/lldb-cmake-sanitized/lldb-build/lldb-test-build.noindex -s=/Users/buildslave/jenkins/workspace/lldb-cmake-sanitized/test/logs -t --env TERM=vt100 --env LLVM_LIBS_DIR=/Users/buildslave/jenkins/workspace/lldb-cmake-sanitized/lldb-build/./lib --inferior-env ASAN_OPTIONS=detect_stack_use_after_return=1 --inferior-env DYLD_INSERT_LIBRARIES=/Users/buildslave/jenkins/workspace/lldb-cmake-sanitized/host-compiler/lib/clang/10.0.0/lib/darwin/libclang_rt.asan_osx_dynamic.dylib --build-dir /Users/buildslave/jenkins/workspace/lldb-cmake-sanitized/lldb-build/lldb-test-build.noindex --lldb-module-cache-dir /Users/buildslave/jenkins/workspace/lldb-cmake-sanitized/lldb-build/lldb-test-build.noindex/module-cache-lldb/lldb-api --clang-module-cache-dir /Users/buildslave/jenkins/workspace/lldb-cmake-sanitized/lldb-build/lldb-test-build.noindex/module-cache-clang/lldb-api --executable /Users/buildslave/jenkins/workspace/lldb-cmake-sanitized/lldb-build/./bin/lldb --compiler /Users/buildslave/jenkins/workspace/lldb-cmake-sanitized/lldb-build/./bin/clang --dsymutil /Users/buildslave/jenkins/workspace/lldb-cmake-sanitized/lldb-build/./bin/dsymutil --filecheck /Users/buildslave/jenkins/workspace/lldb-cmake-sanitized/lldb-build/./bin/FileCheck /Users/buildslave/jenkins/workspace/lldb-cmake-sanitized/llvm-project/lldb/packages/Python/lldbsuite/test/functionalities/data-formatter/data-formatter-objc -p TestDataFormatterObjCCF.py Change dir to: /Users/buildslave/jenkins/workspace/lldb-cmake-sanitized/llvm-project/lldb/packages/Python/lldbsuite/test/functionalities/data-formatter/data-formatter-objc runCmd: settings set symbols.enable-external-lookup false output:

Hide Details

runCmd: settings set plugin.process.gdb-remote.packet-timeout 60 output:

Hide Details

runCmd: settings set symbols.clang-modules-cache-path "/Users/buildslave/jenkins/workspace/lldb-cmake-sanitized/lldb-build/lldb-test-build.noindex/module-cache-lldb/lldb-api" output:

Hide Details

runCmd: settings set use-color false output:

Hide Details

runCmd: settings set target.env-vars ASAN_OPTIONS=detect_stack_use_after_return=1 DYLD_INSERT_LIBRARIES=/Users/buildslave/jenkins/workspace/lldb-cmake-sanitized/host-compiler/lib/clang/10.0.0/lib/darwin/libclang_rt.asan_osx_dynamic.dylib output:

Hide Details

runCmd: settings set target.env-vars ASAN_OPTIONS=detect_stack_use_after_return=1 DYLD_INSERT_LIBRARIES=/Users/buildslave/jenkins/workspace/lldb-cmake-sanitized/host-compiler/lib/clang/10.0.0/lib/darwin/libclang_rt.asan_osx_dynamic.dylib output:

Hide Details

FAIL: LLDB (/Users/buildslave/jenkins/workspace/lldb-cmake-sanitized/lldb-build/bin/clang-10-x86_64) :: test_coreframeworks_and_run_command_dsym (TestDataFormatterObjCCF.ObjCDataFormatterCF) <bound method SBProcess.Kill of <lldb.SBProcess; proxy of <Swig Object of type 'lldb::SBProcess *' at 0x10b25fb10> >>: success

Hide Details

runCmd: settings set symbols.enable-external-lookup false output:

Hide Details

runCmd: settings set plugin.process.gdb-remote.packet-timeout 60 output:

Hide Details

runCmd: settings set symbols.clang-modules-cache-path "/Users/buildslave/jenkins/workspace/lldb-cmake-sanitized/lldb-build/lldb-test-build.noindex/module-cache-lldb/lldb-api" output:

Hide Details

runCmd: settings set use-color false output:

Hide Details

runCmd: settings set target.env-vars ASAN_OPTIONS=detect_stack_use_after_return=1 DYLD_INSERT_LIBRARIES=/Users/buildslave/jenkins/workspace/lldb-cmake-sanitized/host-compiler/lib/clang/10.0.0/lib/darwin/libclang_rt.asan_osx_dynamic.dylib output:

Hide Details

runCmd: settings set target.env-vars ASAN_OPTIONS=detect_stack_use_after_return=1 DYLD_INSERT_LIBRARIES=/Users/buildslave/jenkins/workspace/lldb-cmake-sanitized/host-compiler/lib/clang/10.0.0/lib/darwin/libclang_rt.asan_osx_dynamic.dylib output:

Hide Details

FAIL: LLDB (/Users/buildslave/jenkins/workspace/lldb-cmake-sanitized/lldb-build/bin/clang-10-x86_64) :: test_coreframeworks_and_run_command_dwarf (TestDataFormatterObjCCF.ObjCDataFormatterCF) <bound method SBProcess.Kill of <lldb.SBProcess; proxy of <Swig Object of type 'lldb::SBProcess *' at 0x10a685630> >>: success

Hide Details

UNSUPPORTED: LLDB (/Users/buildslave/jenkins/workspace/lldb-cmake-sanitized/lldb-build/bin/clang-10-x86_64) :: test_coreframeworks_and_run_command_dwo (TestDataFormatterObjCCF.ObjCDataFormatterCF) (test case does not fall in any category of interest for this run) runCmd: settings set symbols.enable-external-lookup false output:

Hide Details

runCmd: settings set plugin.process.gdb-remote.packet-timeout 60 output:

Hide Details

runCmd: settings set symbols.clang-modules-cache-path "/Users/buildslave/jenkins/workspace/lldb-cmake-sanitized/lldb-build/lldb-test-build.noindex/module-cache-lldb/lldb-api" output:

Hide Details

runCmd: settings set use-color false output:

Hide Details

runCmd: settings set target.env-vars ASAN_OPTIONS=detect_stack_use_after_return=1 DYLD_INSERT_LIBRARIES=/Users/buildslave/jenkins/workspace/lldb-cmake-sanitized/host-compiler/lib/clang/10.0.0/lib/darwin/libclang_rt.asan_osx_dynamic.dylib output:

Hide Details

runCmd: settings set target.env-vars ASAN_OPTIONS=detect_stack_use_after_return=1 DYLD_INSERT_LIBRARIES=/Users/buildslave/jenkins/workspace/lldb-cmake-sanitized/host-compiler/lib/clang/10.0.0/lib/darwin/libclang_rt.asan_osx_dynamic.dylib output:

Hide Details

FAIL: LLDB (/Users/buildslave/jenkins/workspace/lldb-cmake-sanitized/lldb-build/bin/clang-10-x86_64) :: test_coreframeworks_and_run_command_gmodules (TestDataFormatterObjCCF.ObjCDataFormatterCF) <bound method SBProcess.Kill of <lldb.SBProcess; proxy of <Swig Object of type 'lldb::SBProcess *' at 0x10b25fb10> >>: success

Hide Details

Restore dir to: /Users/buildslave/jenkins/workspace/lldb-cmake-sanitized/lldb-build/tools/lldb/test ====================================================================== FAIL: test_coreframeworks_and_run_command_dsym (TestDataFormatterObjCCF.ObjCDataFormatterCF) Test formatters for Core OSX frameworks. ---------------------------------------------------------------------- Traceback (most recent call last): File "/Users/buildslave/jenkins/workspace/lldb-cmake-sanitized/llvm-project/lldb/packages/Python/lldbsuite/test/lldbtest.py", line 1732, in test_method return attrvalue(self) File "/Users/buildslave/jenkins/workspace/lldb-cmake-sanitized/llvm-project/lldb/packages/Python/lldbsuite/test/functionalities/data-formatter/data-formatter-objc/TestDataFormatterObjCCF.py", line 23, in test_coreframeworks_and_run_command lldb.SBFileSpec('main.m', False)) File "/Users/buildslave/jenkins/workspace/lldb-cmake-sanitized/llvm-project/lldb/packages/Python/lldbsuite/test/lldbutil.py", line 868, in run_to_source_breakpoint only_one_thread, extra_images) File "/Users/buildslave/jenkins/workspace/lldb-cmake-sanitized/llvm-project/lldb/packages/Python/lldbsuite/test/lldbutil.py", line 797, in run_to_breakpoint_do_run test.assertEqual(num_threads, 1, "Expected 1 thread to stop at breakpoint, %d did."%(num_threads)) AssertionError: 0 != 1 : Expected 1 thread to stop at breakpoint, 0 did. Config=x86_64-/Users/buildslave/jenkins/workspace/lldb-cmake-sanitized/lldb-build/bin/clang-10 ====================================================================== FAIL: test_coreframeworks_and_run_command_dwarf (TestDataFormatterObjCCF.ObjCDataFormatterCF) Test formatters for Core OSX frameworks. ---------------------------------------------------------------------- Traceback (most recent call last): File "/Users/buildslave/jenkins/workspace/lldb-cmake-sanitized/llvm-project/lldb/packages/Python/lldbsuite/test/lldbtest.py", line 1732, in test_method return attrvalue(self) File "/Users/buildslave/jenkins/workspace/lldb-cmake-sanitized/llvm-project/lldb/packages/Python/lldbsuite/test/functionalities/data-formatter/data-formatter-objc/TestDataFormatterObjCCF.py", line 23, in test_coreframeworks_and_run_command lldb.SBFileSpec('main.m', False)) File "/Users/buildslave/jenkins/workspace/lldb-cmake-sanitized/llvm-project/lldb/packages/Python/lldbsuite/test/lldbutil.py", line 868, in run_to_source_breakpoint only_one_thread, extra_images) File "/Users/buildslave/jenkins/workspace/lldb-cmake-sanitized/llvm-project/lldb/packages/Python/lldbsuite/test/lldbutil.py", line 797, in run_to_breakpoint_do_run test.assertEqual(num_threads, 1, "Expected 1 thread to stop at breakpoint, %d did."%(num_threads)) AssertionError: 0 != 1 : Expected 1 thread to stop at breakpoint, 0 did. Config=x86_64-/Users/buildslave/jenkins/workspace/lldb-cmake-sanitized/lldb-build/bin/clang-10 ====================================================================== FAIL: test_coreframeworks_and_run_command_gmodules (TestDataFormatterObjCCF.ObjCDataFormatterCF) Test formatters for Core OSX frameworks. ---------------------------------------------------------------------- Traceback (most recent call last): File "/Users/buildslave/jenkins/workspace/lldb-cmake-sanitized/llvm-project/lldb/packages/Python/lldbsuite/test/lldbtest.py", line 1732, in test_method return attrvalue(self) File "/Users/buildslave/jenkins/workspace/lldb-cmake-sanitized/llvm-project/lldb/packages/Python/lldbsuite/test/functionalities/data-formatter/data-formatter-objc/TestDataFormatterObjCCF.py", line 23, in test_coreframeworks_and_run_command lldb.SBFileSpec('main.m', False)) File "/Users/buildslave/jenkins/workspace/lldb-cmake-sanitized/llvm-project/lldb/packages/Python/lldbsuite/test/lldbutil.py", line 868, in run_to_source_breakpoint only_one_thread, extra_images) File "/Users/buildslave/jenkins/workspace/lldb-cmake-sanitized/llvm-project/lldb/packages/Python/lldbsuite/test/lldbutil.py", line 797, in run_to_breakpoint_do_run test.assertEqual(num_threads, 1, "Expected 1 thread to stop at breakpoint, %d did."%(num_threads)) AssertionError: 0 != 1 : Expected 1 thread to stop at breakpoint, 0 did. Config=x86_64-/Users/buildslave/jenkins/workspace/lldb-cmake-sanitized/lldb-build/bin/clang-10 ---------------------------------------------------------------------- Ran 4 tests in 142.723s

Hide Details

RESULT: FAILED (0 passes, 3 failures, 0 errors, 1 skipped, 0 expected failures, 0 unexpected successes)

Hide Details

******************** PASS: lldb-unit :: Core/./LLDBCoreTests/UniqueCStringMap.NoDefaultConstructor (1279 of 1892) PASS: lldb-api :: lang/cpp/symbols/TestSymbols.py (1280 of 1892) PASS: lldb-unit :: Utility/./UtilityTests/StreamTest.AddressRangeEmptyRange (1281 of 1892) PASS: lldb-api :: functionalities/data-formatter/vector-types/TestVectorTypesFormatting.py (1282 of 1892) PASS: lldb-api :: functionalities/tail_call_frames/ambiguous_tail_call_seq1/TestAmbiguousTailCallSeq1.py (1283 of 1892) PASS: lldb-api :: commands/gui/invalid-args/TestInvalidArgsGui.py (1284 of 1892) PASS: lldb-shell :: BuildScript/modes.test (1285 of 1892) PASS: lldb-unit :: Utility/./UtilityTests/ArchSpecTest.TestParseMachCPUDashSubtypeTripleSimple (1286 of 1892) UNSUPPORTED: lldb-shell :: SymbolFile/PDB/func-symbols.test (1287 of 1892) PASS: lldb-api :: lang/objc/objc-static-method/TestObjCStaticMethod.py (1288 of 1892) PASS: lldb-unit :: ObjectFile/PECOFF/./ObjectFilePECOFFTests/PECallFrameInfoTest.Chained_eh (1289 of 1892) PASS: lldb-api :: tools/lldb-vscode/step/TestVSCode_step.py (1290 of 1892) PASS: lldb-unit :: Utility/./UtilityTests/StructuredDataTest.StringDump (1291 of 1892) PASS: lldb-unit :: Utility/./UtilityTests/FileSpecTest.FormatFileSpec (1292 of 1892) UNSUPPORTED: lldb-api :: functionalities/ubsan/basic/TestUbsanBasic.py (1293 of 1892) PASS: lldb-shell :: Quit/TestQuitExitCode30.test (1294 of 1892) PASS: lldb-api :: commands/watchpoints/watchpoint_events/TestWatchpointEvents.py (1295 of 1892) PASS: lldb-api :: commands/command/history/TestCommandHistory.py (1296 of 1892) PASS: lldb-unit :: Editline/./EditlineTests/EditlineTestFixture.EditlineReceivesMultiLineText (1297 of 1892) PASS: lldb-api :: functionalities/data-formatter/data-formatter-stl/libcxx/vector/TestDataFormatterLibcxxVector.py (1298 of 1892) UNSUPPORTED: lldb-api :: benchmarks/turnaround/TestCompileRunToBreakpointTurnaround.py (1299 of 1892) PASS: lldb-unit :: debugserver/./debugserverTests/RNBSocket.LoopBackListenIPv6 (1300 of 1892) PASS: lldb-api :: functionalities/gdb_remote_client/TestGDBRemoteClient.py (1301 of 1892) PASS: lldb-api :: commands/expression/import-std-module/unique_ptr-dbg-info-content/TestUniquePtrDbgInfoContent.py (1302 of 1892) UNSUPPORTED: lldb-api :: tools/lldb-server/platform-process-connect/TestPlatformProcessConnect.py (1303 of 1892) PASS: lldb-unit :: Process/minidump/./LLDBMinidumpTests/MinidumpParserTest.GetArchitectureWindows (1304 of 1892) PASS: lldb-unit :: Utility/./UtilityTests/RangeTest.Slide (1305 of 1892) UNSUPPORTED: lldb-api :: functionalities/darwin_log/filter/regex/message/TestDarwinLogFilterRegexMessage.py (1306 of 1892) PASS: lldb-api :: macosx/find-dsym/deep-bundle/TestDeepBundle.py (1307 of 1892) PASS: lldb-api :: commands/expression/call-function/TestCallStopAndContinue.py (1308 of 1892) PASS: lldb-unit :: Utility/./UtilityTests/RangeTest.SetRangeBase (1309 of 1892) PASS: lldb-shell :: Reproducer/Functionalities/TestExpressionEvaluation.test (1310 of 1892) UNSUPPORTED: lldb-api :: functionalities/ubsan/user-expression/TestUbsanUserExpression.py (1311 of 1892) PASS: lldb-api :: commands/expression/no-deadlock/TestExprDoesntBlock.py (1312 of 1892) PASS: lldb-unit :: Utility/./UtilityTests/StringListTest.JoinMultiCharSeparator (1313 of 1892) PASS: lldb-unit :: UnwindAssembly/x86/./UnwindAssemblyx86Tests/Testx86AssemblyInspectionEngine.TestPushEDI (1314 of 1892) UNSUPPORTED: lldb-shell :: SymbolFile/PDB/compilands.test (1315 of 1892) PASS: lldb-unit :: Utility/./UtilityTests/ArgsTest.AppendArguments (1316 of 1892) PASS: lldb-unit :: Utility/./UtilityTests/OptionsWithRawTest.EmptySuffixSingleWhitespace (1317 of 1892) UNSUPPORTED: lldb-shell :: SymbolFile/PDB/typedefs.test (1318 of 1892) PASS: lldb-api :: functionalities/unwind/noreturn/TestNoreturnUnwind.py (1319 of 1892) PASS: lldb-unit :: Utility/./UtilityTests/BinaryStreamTest.PutULEB128ThreeBytes (1320 of 1892) PASS: lldb-unit :: Process/gdb-remote/./ProcessGdbRemoteTests/GDBRemoteClientBaseTest.SendContinueAndInterrupt2PacketBug (1321 of 1892) PASS: lldb-unit :: Utility/./UtilityTests/StringListTest.ShiftStdString (1322 of 1892) PASS: lldb-api :: lang/cpp/offsetof/TestOffsetofCpp.py (1323 of 1892) PASS: lldb-api :: lang/cpp/nsimport/TestCppNsImport.py (1324 of 1892) PASS: lldb-unit :: Symbol/./SymbolTests/TestClangASTContext.TestUnifyAccessSpecifiers (1325 of 1892) PASS: lldb-api :: functionalities/wrong_commands/TestWrongCommands.py (1326 of 1892) PASS: lldb-unit :: Utility/./UtilityTests/SerializationRountripTest.SerializeDeserializePod (1327 of 1892) PASS: lldb-api :: python_api/watchpoint/condition/TestWatchpointConditionAPI.py (1328 of 1892) PASS: lldb-unit :: Utility/./UtilityTests/BinaryStreamTest.PutSLEB128EightBytes (1329 of 1892) PASS: lldb-unit :: Utility/./UtilityTests/EnvironmentTest.EnvpConstruction (1330 of 1892) PASS: lldb-api :: types/TestFloatTypes.py (1331 of 1892) PASS: lldb-shell :: ObjectFile/ELF/basic-info.yaml (1332 of 1892) PASS: lldb-api :: functionalities/float-display/TestFloatDisplay.py (1333 of 1892) UNSUPPORTED: lldb-shell :: SymbolFile/target-symbols-add-unwind.test (1334 of 1892) PASS: lldb-unit :: Utility/./UtilityTests/RecordReplayTest.InstrumentedFooSameThis (1335 of 1892) PASS: lldb-unit :: SymbolFile/DWARF/./SymbolFileDWARFTests/SymbolFileDWARFTests.TestAbbrevOutOfOrder (1336 of 1892) PASS: lldb-unit :: Utility/./UtilityTests/ScalarTest.ExtractBitfield (1337 of 1892) PASS: lldb-shell :: SymbolFile/DWARF/DW_AT_low_pc-addrx.s (1338 of 1892) PASS: lldb-unit :: Utility/./UtilityTests/DataExtractorTest.GetCStrUnterminated (1339 of 1892) UNSUPPORTED: lldb-api :: benchmarks/continue/TestBenchmarkContinue.py (1340 of 1892) PASS: lldb-api :: lang/objc/objc-ivar-protocols/TestIvarProtocols.py (1341 of 1892) PASS: lldb-api :: functionalities/breakpoint/move_nearest/TestMoveNearest.py (1342 of 1892) PASS: lldb-unit :: ScriptInterpreter/Python/./ScriptInterpreterPythonTests/PythonDataObjectsTest.TestPythonDictionaryManipulation (1343 of 1892) PASS: lldb-api :: lang/objc/modules-app-update/TestClangModulesAppUpdate.py (1344 of 1892) PASS: lldb-unit :: Utility/./UtilityTests/UriParserTest.BadPort2 (1345 of 1892) PASS: lldb-api :: tools/lldb-vscode/variables/TestVSCode_variables.py (1346 of 1892) PASS: lldb-api :: lang/objc/foundation/TestObjectDescriptionAPI.py (1347 of 1892) PASS: lldb-api :: tools/lldb-server/TestAppleSimulatorOSType.py (1348 of 1892) PASS: lldb-shell :: Breakpoint/debug_addrx.test (1349 of 1892) PASS: lldb-shell :: SymbolFile/DWARF/anon_class_w_and_wo_export_symbols.ll (1350 of 1892) PASS: lldb-unit :: Utility/./UtilityTests/StringExtractorTest.GetHexBytes_OddPair (1351 of 1892) PASS: lldb-unit :: Core/./LLDBCoreTests/RichManglingContextTest.Basic (1352 of 1892) PASS: lldb-unit :: Utility/./UtilityTests/VMRange.Comparison (1353 of 1892) PASS: lldb-api :: commands/expression/import-std-module/forward_list-dbg-info-content/TestDbgInfoContentForwardList.py (1354 of 1892) PASS: lldb-unit :: Utility/./UtilityTests/BinaryStreamTest.PutSLEB128ThreeBytes (1355 of 1892) PASS: lldb-unit :: Utility/./UtilityTests/BinaryStreamTest.PutSLEB128SixBytes (1356 of 1892) PASS: lldb-api :: lang/cpp/template/TestTemplateArgs.py (1357 of 1892) PASS: lldb-api :: commands/frame/recognizer/TestFrameRecognizer.py (1358 of 1892) UNSUPPORTED: lldb-api :: functionalities/darwin_log/filter/exact_match/activity-chain/TestDarwinLogFilterMatchActivityChain.py (1359 of 1892) PASS: lldb-unit :: Utility/./UtilityTests/TimerTest.CategoryTimes2 (1360 of 1892) PASS: lldb-api :: python_api/lldbutil/frame/TestFrameUtils.py (1361 of 1892) PASS: lldb-unit :: Utility/./UtilityTests/StreamTest.AddressNoSuffix (1362 of 1892) PASS: lldb-api :: commands/expression/codegen-crash-typedefdecl-not-in_declcontext/TestCodegenCrashTypedefDeclNotInDeclContext.py (1363 of 1892) PASS: lldb-unit :: Process/gdb-remote/./ProcessGdbRemoteTests/GDBRemoteCommunicationClientTest.SendGetDataPacket (1364 of 1892) PASS: lldb-shell :: ObjectFile/PECOFF/basic-info.yaml (1365 of 1892) PASS: lldb-shell :: Expr/TestIRMemoryMap.test (1366 of 1892) PASS: lldb-unit :: Utility/./UtilityTests/StreamTest.PutCString (1367 of 1892) PASS: lldb-shell :: SymbolFile/DWARF/debug_loc.s (1368 of 1892) UNSUPPORTED: lldb-shell :: ObjectFile/ELF/minidebuginfo-set-and-hit-breakpoint.test (1369 of 1892) PASS: lldb-shell :: Settings/TestModuleCacheSanity.test (1370 of 1892) PASS: lldb-api :: tools/lldb-server/inferior-crash/TestGdbRemoteSegFault.py (1371 of 1892) PASS: lldb-unit :: debugserver/./debugserverTests/RNBSocket.LoopBackListenIPv4 (1372 of 1892) PASS: lldb-unit :: Utility/./UtilityTests/StringListTest.DefaultConstructor (1373 of 1892) PASS: lldb-api :: functionalities/thread/concurrent_events/TestConcurrentTwoBreakpointsOneDelaySignal.py (1374 of 1892) PASS: lldb-api :: functionalities/mtc/simple/TestMTCSimple.py (1375 of 1892) UNSUPPORTED: lldb-api :: functionalities/longjmp/TestLongjmp.py (1376 of 1892) PASS: lldb-shell :: Driver/TestFile.test (1377 of 1892) PASS: lldb-api :: functionalities/breakpoint/breakpoint_by_line_and_column/TestBreakpointByLineAndColumn.py (1378 of 1892) PASS: lldb-api :: functionalities/thread/backtrace_all/TestBacktraceAll.py (1379 of 1892) PASS: lldb-unit :: Utility/./UtilityTests/BinaryStreamTest.PutULEB128EightBytes (1380 of 1892) PASS: lldb-unit :: Utility/./UtilityTests/ArgsTest.ReplaceArgumentAtIndexEqual (1381 of 1892) PASS: lldb-api :: commands/expression/namespace_local_var_same_name_obj_c/TestNamespaceLocalVarSameNameObjC.py (1382 of 1892) PASS: lldb-api :: lang/cpp/unsigned_types/TestUnsignedTypes.py (1383 of 1892) PASS: lldb-api :: lang/c/inlines/TestRedefinitionsInInlines.py (1384 of 1892) PASS: lldb-api :: functionalities/data-formatter/var-in-aggregate-misuse/TestVarInAggregateMisuse.py (1385 of 1892) UNSUPPORTED: lldb-shell :: ScriptInterpreter/Lua/breakpoint_callback.test (1386 of 1892) PASS: lldb-api :: functionalities/data-formatter/refpointer-recursion/TestDataFormatterRefPtrRecursion.py (1387 of 1892) PASS: lldb-api :: types/TestShortTypeExpr.py (1388 of 1892) PASS: lldb-api :: api/check_public_api_headers/TestPublicAPIHeaders.py (1389 of 1892) PASS: lldb-shell :: ObjectFile/Breakpad/discontiguous-sections.test (1390 of 1892) PASS: lldb-unit :: Host/./HostTests/FileSystemTest.OpenErrno (1391 of 1892) PASS: lldb-unit :: Utility/./UtilityTests/BinaryStreamTest.PutSLEB128MaxValue (1392 of 1892) PASS: lldb-api :: functionalities/postmortem/wow64_minidump/TestWow64MiniDump.py (1393 of 1892) PASS: lldb-api :: functionalities/postmortem/minidump-new/TestMiniDumpUUID.py (1394 of 1892) PASS: lldb-api :: functionalities/lazy-loading/TestLazyLoading.py (1395 of 1892) PASS: lldb-unit :: Signals/./SignalsTests/UnixSignalsTest.Iteration (1396 of 1892) PASS: lldb-api :: python_api/formatters/TestFormattersSBAPI.py (1397 of 1892) PASS: lldb-api :: functionalities/data-formatter/type_summary_list_script/TestTypeSummaryListScript.py (1398 of 1892) PASS: lldb-unit :: Utility/./UtilityTests/ProcessInstanceInfoMatch.Name (1399 of 1892) PASS: lldb-unit :: Language/Highlighting/./HighlighterTests/HighlighterTest.ClangTrailingBackslashWithWhitespace (1400 of 1892) PASS: lldb-shell :: ExecControl/StopHook/stop-hook.test (1401 of 1892) PASS: lldb-shell :: Driver/TestCommands.test (1402 of 1892) PASS: lldb-shell :: SymbolFile/Breakpad/line-table-edgecases.test (1403 of 1892) PASS: lldb-unit :: Utility/./UtilityTests/RangeTest.DefaultConstructor (1404 of 1892) UNSUPPORTED: lldb-api :: functionalities/tsan/thread_numbers/TestTsanThreadNumbers.py (1405 of 1892) PASS: lldb-api :: lang/objc/forward-decl/TestForwardDecl.py (1406 of 1892) PASS: lldb-unit :: Utility/./UtilityTests/ListenerTest.GetEventWait (1407 of 1892) PASS: lldb-api :: functionalities/data-formatter/data-formatter-objc/nsindexpath/TestDataFormatterNSIndexPath.py (1408 of 1892) PASS: lldb-unit :: Symbol/./SymbolTests/TestClangASTContext.TestGetTypeClassNested (1409 of 1892) PASS: lldb-unit :: Utility/./UtilityTests/FileSpecTest.RemoveLastPathComponent (1410 of 1892) PASS: lldb-shell :: SymbolFile/Breakpad/line-table-discontinuous-file-ids.test (1411 of 1892) PASS: lldb-unit :: Host/./HostTests/HostInfoTest.GetAugmentedArchSpec (1412 of 1892) PASS: lldb-unit :: SymbolFile/DWARF/./SymbolFileDWARFTests/SymbolFileDWARFTests.TestAbbrevOrder1Start5 (1413 of 1892) UNSUPPORTED: lldb-api :: benchmarks/stepping/TestSteppingSpeed.py (1414 of 1892) PASS: lldb-api :: commands/expression/test/TestExprs2.py (1415 of 1892) PASS: lldb-unit :: Host/./HostTests/SocketTest.TCPListen0ConnectAccept (1416 of 1892) PASS: lldb-api :: functionalities/data-formatter/boolreference/TestFormattersBoolRefPtr.py (1417 of 1892) PASS: lldb-api :: commands/expression/radar_9673664/TestExprHelpExamples.py (1418 of 1892) PASS: lldb-api :: python_api/frame/get-variables/TestGetVariables.py (1419 of 1892) PASS: lldb-shell :: Reproducer/Functionalities/TestStepping.test (1420 of 1892) PASS: lldb-api :: commands/expression/namespace_local_var_same_name_cpp_and_c/TestNamespaceLocalVarSameNameCppAndC.py (1421 of 1892) PASS: lldb-unit :: Utility/./UtilityTests/StringExtractorTest.GetHexBytesAvail_Underflow (1422 of 1892) PASS: lldb-unit :: Utility/./UtilityTests/StreamTest.PutRawBytesToLittleEndian (1423 of 1892) PASS: lldb-api :: functionalities/breakpoint/dummy_target_breakpoints/TestBreakpointsWithNoTargets.py (1424 of 1892) PASS: lldb-unit :: Host/./HostTests/File.GetStreamFromDescriptor (1425 of 1892) PASS: lldb-api :: tools/lldb-server/TestGdbRemoteHostInfo.py (1426 of 1892) PASS: lldb-api :: macosx/universal/TestUniversal.py (1427 of 1892) PASS: lldb-unit :: Utility/./UtilityTests/StringListTest.AppendStringMove (1428 of 1892) PASS: lldb-unit :: Utility/./UtilityTests/OptionsWithRawTest.EmptyArgsOnlySuffix (1429 of 1892) PASS: lldb-shell :: Unwind/thread-step-out-ret-addr-check.test (1430 of 1892) UNSUPPORTED: lldb-api :: functionalities/tsan/global_location/TestTsanGlobalLocation.py (1431 of 1892) PASS: lldb-api :: lang/cpp/this/TestCPPThis.py (1432 of 1892) PASS: lldb-shell :: SymbolFile/DWARF/deterministic-build.cpp (1433 of 1892) PASS: lldb-unit :: Utility/./UtilityTests/Flags.AnySet (1434 of 1892) PASS: lldb-shell :: ObjectFile/ELF/gnu-debuglink.yaml (1435 of 1892) PASS: lldb-unit :: Language/Highlighting/./HighlighterTests/HighlighterTest.DefaultHighlighterWithCursor (1436 of 1892) PASS: lldb-unit :: Symbol/./SymbolTests/TestClangASTContext.TestGetTypeClassTypeOfExpr (1437 of 1892) PASS: lldb-unit :: Utility/./UtilityTests/BinaryStreamTest.PutULEB128FourBytes (1438 of 1892) PASS: lldb-unit :: Process/minidump/./LLDBMinidumpTests/MinidumpParserTest.GetPidWow64 (1439 of 1892) PASS: lldb-api :: functionalities/thread/concurrent_events/TestConcurrentTwoWatchpointsOneSignal.py (1440 of 1892) UNSUPPORTED: lldb-api :: arm/breakpoint-it/TestBreakpointIt.py (1441 of 1892) PASS: lldb-unit :: Interpreter/./InterpreterTests/OptionArgParserTest.toScriptLanguage (1442 of 1892) PASS: lldb-unit :: UnwindAssembly/x86/./UnwindAssemblyx86Tests/Testx86AssemblyInspectionEngine.TestPopR13 (1443 of 1892) PASS: lldb-unit :: Language/Highlighting/./HighlighterTests/HighlighterTest.ClangSquareBrackets (1444 of 1892) PASS: lldb-unit :: UnwindAssembly/x86/./UnwindAssemblyx86Tests/Testx86AssemblyInspectionEngine.TestPopRBX (1445 of 1892) PASS: lldb-unit :: Utility/./UtilityTests/StringExtractorTest.GetHexU8_InvalidHex_NoEof (1446 of 1892) UNSUPPORTED: lldb-shell :: SymbolFile/PDB/function-nested-block.test (1447 of 1892) PASS: lldb-shell :: SymbolFile/DWARF/debug-types-dwo-cross-reference.cpp (1448 of 1892) PASS: lldb-unit :: Utility/./UtilityTests/RangeTest.LessThan (1449 of 1892) PASS: lldb-shell :: Reproducer/Functionalities/TestImageList.test (1450 of 1892) PASS: lldb-unit :: Utility/./UtilityTests/StreamTeeTest.Constructor1Stream (1451 of 1892) UNSUPPORTED: lldb-api :: functionalities/data-formatter/data-formatter-stl/libstdcpp/list/TestDataFormatterStdList.py (1452 of 1892) PASS: lldb-api :: functionalities/thread/concurrent_events/TestConcurrentSignalBreak.py (1453 of 1892) PASS: lldb-unit :: Utility/./UtilityTests/ArgsTest.DoubleQuotedItem (1454 of 1892) PASS: lldb-unit :: Utility/./UtilityTests/StreamTest.AddressEmptyPrefix (1455 of 1892) UNSUPPORTED: lldb-api :: linux/add-symbols/TestTargetSymbolsAddCommand.py (1456 of 1892) PASS: lldb-api :: python_api/sblaunchinfo/TestSBLaunchInfo.py (1457 of 1892) PASS: lldb-api :: python_api/exprpath_synthetic/TestExprPathSynthetic.py (1458 of 1892) FAIL: lldb-api :: functionalities/data-formatter/data-formatter-objc/TestDataFormatterObjCNSBundle.py (1459 of 1892) ******************** TEST 'lldb-api :: functionalities/data-formatter/data-formatter-objc/TestDataFormatterObjCNSBundle.py' FAILED ******************** lldb version 10.0.99 (http://labmaster3.local/git/llvm-project.git revision c1b13a1b17719aebace1b3be7a6ac7f90b1901a6) clang revision bff33bd5c83b947cccb4d6cf6ebca9dc021f716b llvm revision bff33bd5c83b947cccb4d6cf6ebca9dc021f716b LLDB library dir: /Users/buildslave/jenkins/workspace/lldb-cmake-sanitized/lldb-build/bin LLDB import library dir: /Users/buildslave/jenkins/workspace/lldb-cmake-sanitized/lldb-build/bin libstdcxx tests will not be run because: Don't know how to build with libstdcxx on macosx Skipping following debug info categories: ['dwo'] AddressSanitizer report breakpoint hit. Use 'thread info -s' to get extended information about the report. AddressSanitizer report breakpoint hit. Use 'thread info -s' to get extended information about the report. AddressSanitizer report breakpoint hit. Use 'thread info -s' to get extended information about the report.

Hide Details

Session logs for test failures/errors/unexpected successes will go into directory '/Users/buildslave/jenkins/workspace/lldb-cmake-sanitized/test/logs' Command invoked: /Users/buildslave/jenkins/workspace/lldb-cmake-sanitized/llvm-project/lldb/test/API/dotest.py --arch x86_64 -s /Users/buildslave/jenkins/workspace/lldb-cmake-sanitized/lldb-build/lldb-test-traces -S nm -u CXXFLAGS -u CFLAGS --codesign-identity lldb_codesign --server /Users/buildslave/jenkins/workspace/lldb-cmake-sanitized/lldb-build/./bin/debugserver --arch x86_64 --build-dir /Users/buildslave/jenkins/workspace/lldb-cmake-sanitized/lldb-build/lldb-test-build.noindex -s=/Users/buildslave/jenkins/workspace/lldb-cmake-sanitized/test/logs -t --env TERM=vt100 --env LLVM_LIBS_DIR=/Users/buildslave/jenkins/workspace/lldb-cmake-sanitized/lldb-build/./lib --inferior-env ASAN_OPTIONS=detect_stack_use_after_return=1 --inferior-env DYLD_INSERT_LIBRARIES=/Users/buildslave/jenkins/workspace/lldb-cmake-sanitized/host-compiler/lib/clang/10.0.0/lib/darwin/libclang_rt.asan_osx_dynamic.dylib --build-dir /Users/buildslave/jenkins/workspace/lldb-cmake-sanitized/lldb-build/lldb-test-build.noindex --lldb-module-cache-dir /Users/buildslave/jenkins/workspace/lldb-cmake-sanitized/lldb-build/lldb-test-build.noindex/module-cache-lldb/lldb-api --clang-module-cache-dir /Users/buildslave/jenkins/workspace/lldb-cmake-sanitized/lldb-build/lldb-test-build.noindex/module-cache-clang/lldb-api --executable /Users/buildslave/jenkins/workspace/lldb-cmake-sanitized/lldb-build/./bin/lldb --compiler /Users/buildslave/jenkins/workspace/lldb-cmake-sanitized/lldb-build/./bin/clang --dsymutil /Users/buildslave/jenkins/workspace/lldb-cmake-sanitized/lldb-build/./bin/dsymutil --filecheck /Users/buildslave/jenkins/workspace/lldb-cmake-sanitized/lldb-build/./bin/FileCheck /Users/buildslave/jenkins/workspace/lldb-cmake-sanitized/llvm-project/lldb/packages/Python/lldbsuite/test/functionalities/data-formatter/data-formatter-objc -p TestDataFormatterObjCNSBundle.py Change dir to: /Users/buildslave/jenkins/workspace/lldb-cmake-sanitized/llvm-project/lldb/packages/Python/lldbsuite/test/functionalities/data-formatter/data-formatter-objc runCmd: settings set symbols.enable-external-lookup false output:

Hide Details

runCmd: settings set plugin.process.gdb-remote.packet-timeout 60 output:

Hide Details

runCmd: settings set symbols.clang-modules-cache-path "/Users/buildslave/jenkins/workspace/lldb-cmake-sanitized/lldb-build/lldb-test-build.noindex/module-cache-lldb/lldb-api" output:

Hide Details

runCmd: settings set use-color false output:

Hide Details

runCmd: settings set target.env-vars ASAN_OPTIONS=detect_stack_use_after_return=1 DYLD_INSERT_LIBRARIES=/Users/buildslave/jenkins/workspace/lldb-cmake-sanitized/host-compiler/lib/clang/10.0.0/lib/darwin/libclang_rt.asan_osx_dynamic.dylib output:

Hide Details

runCmd: settings set target.env-vars ASAN_OPTIONS=detect_stack_use_after_return=1 DYLD_INSERT_LIBRARIES=/Users/buildslave/jenkins/workspace/lldb-cmake-sanitized/host-compiler/lib/clang/10.0.0/lib/darwin/libclang_rt.asan_osx_dynamic.dylib output:

Hide Details

FAIL: LLDB (/Users/buildslave/jenkins/workspace/lldb-cmake-sanitized/lldb-build/bin/clang-10-x86_64) :: test_nsbundle_with_run_command_dsym (TestDataFormatterObjCNSBundle.ObjCDataFormatterNSBundle) <bound method SBProcess.Kill of <lldb.SBProcess; proxy of <Swig Object of type 'lldb::SBProcess *' at 0x1101ca240> >>: success

Hide Details

runCmd: settings set symbols.enable-external-lookup false output:

Hide Details

runCmd: settings set plugin.process.gdb-remote.packet-timeout 60 output:

Hide Details

runCmd: settings set symbols.clang-modules-cache-path "/Users/buildslave/jenkins/workspace/lldb-cmake-sanitized/lldb-build/lldb-test-build.noindex/module-cache-lldb/lldb-api" output:

Hide Details

runCmd: settings set use-color false output:

Hide Details

runCmd: settings set target.env-vars ASAN_OPTIONS=detect_stack_use_after_return=1 DYLD_INSERT_LIBRARIES=/Users/buildslave/jenkins/workspace/lldb-cmake-sanitized/host-compiler/lib/clang/10.0.0/lib/darwin/libclang_rt.asan_osx_dynamic.dylib output:

Hide Details

runCmd: settings set target.env-vars ASAN_OPTIONS=detect_stack_use_after_return=1 DYLD_INSERT_LIBRARIES=/Users/buildslave/jenkins/workspace/lldb-cmake-sanitized/host-compiler/lib/clang/10.0.0/lib/darwin/libclang_rt.asan_osx_dynamic.dylib output:

Hide Details

FAIL: LLDB (/Users/buildslave/jenkins/workspace/lldb-cmake-sanitized/lldb-build/bin/clang-10-x86_64) :: test_nsbundle_with_run_command_dwarf (TestDataFormatterObjCNSBundle.ObjCDataFormatterNSBundle) <bound method SBProcess.Kill of <lldb.SBProcess; proxy of <Swig Object of type 'lldb::SBProcess *' at 0x10fc25630> >>: success

Hide Details

UNSUPPORTED: LLDB (/Users/buildslave/jenkins/workspace/lldb-cmake-sanitized/lldb-build/bin/clang-10-x86_64) :: test_nsbundle_with_run_command_dwo (TestDataFormatterObjCNSBundle.ObjCDataFormatterNSBundle) (test case does not fall in any category of interest for this run) runCmd: settings set symbols.enable-external-lookup false output:

Hide Details

runCmd: settings set plugin.process.gdb-remote.packet-timeout 60 output:

Hide Details

runCmd: settings set symbols.clang-modules-cache-path "/Users/buildslave/jenkins/workspace/lldb-cmake-sanitized/lldb-build/lldb-test-build.noindex/module-cache-lldb/lldb-api" output:

Hide Details

runCmd: settings set use-color false output:

Hide Details

runCmd: settings set target.env-vars ASAN_OPTIONS=detect_stack_use_after_return=1 DYLD_INSERT_LIBRARIES=/Users/buildslave/jenkins/workspace/lldb-cmake-sanitized/host-compiler/lib/clang/10.0.0/lib/darwin/libclang_rt.asan_osx_dynamic.dylib output:

Hide Details

runCmd: settings set target.env-vars ASAN_OPTIONS=detect_stack_use_after_return=1 DYLD_INSERT_LIBRARIES=/Users/buildslave/jenkins/workspace/lldb-cmake-sanitized/host-compiler/lib/clang/10.0.0/lib/darwin/libclang_rt.asan_osx_dynamic.dylib output:

Hide Details

FAIL: LLDB (/Users/buildslave/jenkins/workspace/lldb-cmake-sanitized/lldb-build/bin/clang-10-x86_64) :: test_nsbundle_with_run_command_gmodules (TestDataFormatterObjCNSBundle.ObjCDataFormatterNSBundle) <bound method SBProcess.Kill of <lldb.SBProcess; proxy of <Swig Object of type 'lldb::SBProcess *' at 0x1101ca570> >>: success

Hide Details

Restore dir to: /Users/buildslave/jenkins/workspace/lldb-cmake-sanitized/lldb-build/tools/lldb/test ====================================================================== FAIL: test_nsbundle_with_run_command_dsym (TestDataFormatterObjCNSBundle.ObjCDataFormatterNSBundle) Test formatters for NSBundle. ---------------------------------------------------------------------- Traceback (most recent call last): File "/Users/buildslave/jenkins/workspace/lldb-cmake-sanitized/llvm-project/lldb/packages/Python/lldbsuite/test/lldbtest.py", line 1732, in test_method return attrvalue(self) File "/Users/buildslave/jenkins/workspace/lldb-cmake-sanitized/llvm-project/lldb/packages/Python/lldbsuite/test/functionalities/data-formatter/data-formatter-objc/TestDataFormatterObjCNSBundle.py", line 20, in test_nsbundle_with_run_command self.appkit_tester_impl(self.nsbundle_data_formatter_commands) File "/Users/buildslave/jenkins/workspace/lldb-cmake-sanitized/llvm-project/lldb/packages/Python/lldbsuite/test/functionalities/data-formatter/data-formatter-objc/ObjCDataFormatterTestCase.py", line 19, in appkit_tester_impl self.appkit_common_data_formatters_command() File "/Users/buildslave/jenkins/workspace/lldb-cmake-sanitized/llvm-project/lldb/packages/Python/lldbsuite/test/functionalities/data-formatter/data-formatter-objc/ObjCDataFormatterTestCase.py", line 26, in appkit_common_data_formatters_command lldb.SBFileSpec('main.m', False)) File "/Users/buildslave/jenkins/workspace/lldb-cmake-sanitized/llvm-project/lldb/packages/Python/lldbsuite/test/lldbutil.py", line 868, in run_to_source_breakpoint only_one_thread, extra_images) File "/Users/buildslave/jenkins/workspace/lldb-cmake-sanitized/llvm-project/lldb/packages/Python/lldbsuite/test/lldbutil.py", line 797, in run_to_breakpoint_do_run test.assertEqual(num_threads, 1, "Expected 1 thread to stop at breakpoint, %d did."%(num_threads)) AssertionError: 0 != 1 : Expected 1 thread to stop at breakpoint, 0 did. Config=x86_64-/Users/buildslave/jenkins/workspace/lldb-cmake-sanitized/lldb-build/bin/clang-10 ====================================================================== FAIL: test_nsbundle_with_run_command_dwarf (TestDataFormatterObjCNSBundle.ObjCDataFormatterNSBundle) Test formatters for NSBundle. ---------------------------------------------------------------------- Traceback (most recent call last): File "/Users/buildslave/jenkins/workspace/lldb-cmake-sanitized/llvm-project/lldb/packages/Python/lldbsuite/test/lldbtest.py", line 1732, in test_method return attrvalue(self) File "/Users/buildslave/jenkins/workspace/lldb-cmake-sanitized/llvm-project/lldb/packages/Python/lldbsuite/test/functionalities/data-formatter/data-formatter-objc/TestDataFormatterObjCNSBundle.py", line 20, in test_nsbundle_with_run_command self.appkit_tester_impl(self.nsbundle_data_formatter_commands) File "/Users/buildslave/jenkins/workspace/lldb-cmake-sanitized/llvm-project/lldb/packages/Python/lldbsuite/test/functionalities/data-formatter/data-formatter-objc/ObjCDataFormatterTestCase.py", line 19, in appkit_tester_impl self.appkit_common_data_formatters_command() File "/Users/buildslave/jenkins/workspace/lldb-cmake-sanitized/llvm-project/lldb/packages/Python/lldbsuite/test/functionalities/data-formatter/data-formatter-objc/ObjCDataFormatterTestCase.py", line 26, in appkit_common_data_formatters_command lldb.SBFileSpec('main.m', False)) File "/Users/buildslave/jenkins/workspace/lldb-cmake-sanitized/llvm-project/lldb/packages/Python/lldbsuite/test/lldbutil.py", line 868, in run_to_source_breakpoint only_one_thread, extra_images) File "/Users/buildslave/jenkins/workspace/lldb-cmake-sanitized/llvm-project/lldb/packages/Python/lldbsuite/test/lldbutil.py", line 797, in run_to_breakpoint_do_run test.assertEqual(num_threads, 1, "Expected 1 thread to stop at breakpoint, %d did."%(num_threads)) AssertionError: 0 != 1 : Expected 1 thread to stop at breakpoint, 0 did. Config=x86_64-/Users/buildslave/jenkins/workspace/lldb-cmake-sanitized/lldb-build/bin/clang-10 ====================================================================== FAIL: test_nsbundle_with_run_command_gmodules (TestDataFormatterObjCNSBundle.ObjCDataFormatterNSBundle) Test formatters for NSBundle. ---------------------------------------------------------------------- Traceback (most recent call last): File "/Users/buildslave/jenkins/workspace/lldb-cmake-sanitized/llvm-project/lldb/packages/Python/lldbsuite/test/lldbtest.py", line 1732, in test_method return attrvalue(self) File "/Users/buildslave/jenkins/workspace/lldb-cmake-sanitized/llvm-project/lldb/packages/Python/lldbsuite/test/functionalities/data-formatter/data-formatter-objc/TestDataFormatterObjCNSBundle.py", line 20, in test_nsbundle_with_run_command self.appkit_tester_impl(self.nsbundle_data_formatter_commands) File "/Users/buildslave/jenkins/workspace/lldb-cmake-sanitized/llvm-project/lldb/packages/Python/lldbsuite/test/functionalities/data-formatter/data-formatter-objc/ObjCDataFormatterTestCase.py", line 19, in appkit_tester_impl self.appkit_common_data_formatters_command() File "/Users/buildslave/jenkins/workspace/lldb-cmake-sanitized/llvm-project/lldb/packages/Python/lldbsuite/test/functionalities/data-formatter/data-formatter-objc/ObjCDataFormatterTestCase.py", line 26, in appkit_common_data_formatters_command lldb.SBFileSpec('main.m', False)) File "/Users/buildslave/jenkins/workspace/lldb-cmake-sanitized/llvm-project/lldb/packages/Python/lldbsuite/test/lldbutil.py", line 868, in run_to_source_breakpoint only_one_thread, extra_images) File "/Users/buildslave/jenkins/workspace/lldb-cmake-sanitized/llvm-project/lldb/packages/Python/lldbsuite/test/lldbutil.py", line 797, in run_to_breakpoint_do_run test.assertEqual(num_threads, 1, "Expected 1 thread to stop at breakpoint, %d did."%(num_threads)) AssertionError: 0 != 1 : Expected 1 thread to stop at breakpoint, 0 did. Config=x86_64-/Users/buildslave/jenkins/workspace/lldb-cmake-sanitized/lldb-build/bin/clang-10 ---------------------------------------------------------------------- Ran 4 tests in 150.360s

Hide Details

RESULT: FAILED (0 passes, 3 failures, 0 errors, 1 skipped, 0 expected failures, 0 unexpected successes)

Hide Details

******************** PASS: lldb-unit :: Utility/./UtilityTests/SerializationRountripTest.SerializeDeserializeObjectReference (1460 of 1892) PASS: lldb-api :: functionalities/fat_archives/TestFatArchives.py (1461 of 1892) PASS: lldb-unit :: UnwindAssembly/x86/./UnwindAssemblyx86Tests/Testx86AssemblyInspectionEngine.Test32bitFramelessSmallStackFrame (1462 of 1892) PASS: lldb-api :: lang/c/local_types/TestUseClosestType.py (1463 of 1892) PASS: lldb-api :: functionalities/unwind/noreturn/module-end/TestNoReturnModuleEnd.py (1464 of 1892) PASS: lldb-unit :: Utility/./UtilityTests/StreamTest.AddressPrefixAndSuffix (1465 of 1892) PASS: lldb-api :: commands/frame/diagnose/inheritance/TestDiagnoseInheritance.py (1466 of 1892) PASS: lldb-unit :: UnwindAssembly/x86/./UnwindAssemblyx86Tests/Testx86AssemblyInspectionEngine.TestPushR12 (1467 of 1892) PASS: lldb-api :: commands/expression/completion/TestExprCompletion.py (1468 of 1892) PASS: lldb-api :: commands/expression/diagnostics/TestExprDiagnostics.py (1469 of 1892) PASS: lldb-shell :: Settings/TestSettingsSet.test (1470 of 1892) PASS: lldb-unit :: Target/./TargetTests/ModuleCacheTest.GetAndPut (1471 of 1892) PASS: lldb-unit :: Process/minidump/./LLDBMinidumpTests/MinidumpParserTest.GetThreadContext_x86_32 (1472 of 1892) PASS: lldb-api :: python_api/value/empty_class/TestValueAPIEmptyClass.py (1473 of 1892) UNSUPPORTED: lldb-api :: tools/lldb-server/TestGdbRemoteAuxvSupport.py (1474 of 1892) PASS: lldb-unit :: Language/Highlighting/./HighlighterTests/HighlighterTest.FallbackHighlighter (1475 of 1892) PASS: lldb-api :: commands/expression/class_template_specialization_empty_pack/TestClassTemplateSpecializationParametersHandling.py (1476 of 1892) PASS: lldb-shell :: SymbolFile/NativePDB/tag-types.cpp (1477 of 1892) PASS: lldb-unit :: Expression/./ExpressionTests/CppModuleConfigurationTest.AmbiguousLibCpp (1478 of 1892) PASS: lldb-unit :: Utility/./UtilityTests/ArchSpecTest.MergeFrom (1479 of 1892) PASS: lldb-api :: commands/target/create-no-such-arch/TestNoSuchArch.py (1480 of 1892) PASS: lldb-api :: lang/cpp/member-and-local-vars-with-same-name/TestMembersAndLocalsWithSameName.py (1481 of 1892) PASS: lldb-api :: functionalities/thread/exit_during_break/TestExitDuringBreak.py (1482 of 1892) PASS: lldb-unit :: Core/./LLDBCoreTests/RichManglingContextTest.FromCxxMethodName (1483 of 1892) PASS: lldb-unit :: ScriptInterpreter/Python/./ScriptInterpreterPythonTests/PythonDataObjectsTest.TestPythonFile (1484 of 1892) PASS: lldb-unit :: Utility/./UtilityTests/ArgsTest.TestOverwriteArgs (1485 of 1892) PASS: lldb-unit :: UnwindAssembly/x86/./UnwindAssemblyx86Tests/Testx86AssemblyInspectionEngine.TestPushEAX (1486 of 1892) PASS: lldb-shell :: SymbolFile/DWARF/dwarf5-debug_line.s (1487 of 1892) PASS: lldb-unit :: Signals/./SignalsTests/UnixSignalsTest.GetInfo (1488 of 1892) PASS: lldb-api :: python_api/lldbutil/TestSwigVersion.py (1489 of 1892) PASS: lldb-unit :: Process/minidump/./LLDBMinidumpTests/MinidumpParserTest.GetPid (1490 of 1892) PASS: lldb-unit :: Utility/./UtilityTests/StreamTest.AddressRange (1491 of 1892) PASS: lldb-api :: lang/cpp/global_operators/TestCppGlobalOperators.py (1492 of 1892) PASS: lldb-api :: functionalities/data-formatter/data-formatter-enum-format/TestDataFormatterEnumFormat.py (1493 of 1892) PASS: lldb-api :: python_api/value_var_update/TestValueVarUpdate.py (1494 of 1892) PASS: lldb-api :: macosx/find-app-in-bundle/TestFindAppInBundle.py (1495 of 1892) PASS: lldb-shell :: ObjectFile/MachO/lc_version_min.yaml (1496 of 1892) PASS: lldb-unit :: UnwindAssembly/x86/./UnwindAssemblyx86Tests/Testx86AssemblyInspectionEngine.TestCALLNextInsn (1497 of 1892) PASS: lldb-api :: lang/cpp/namespace_definitions/TestNamespaceDefinitions.py (1498 of 1892) PASS: lldb-unit :: Host/./HostTests/FileSystemTest.FileAndDirectoryComponents (1499 of 1892) UNSUPPORTED: lldb-api :: functionalities/tty/TestTerminal.py (1500 of 1892) PASS: lldb-shell :: SymbolFile/DWARF/debug_ranges-missing-section.s (1501 of 1892) PASS: lldb-api :: functionalities/breakpoint/step_over_breakpoint/TestStepOverBreakpoint.py (1502 of 1892) PASS: lldb-unit :: Core/./LLDBCoreTests/MangledTest.ResultForBlockInvocation (1503 of 1892) PASS: lldb-unit :: Host/./HostTests/NativeProcessProtocolTest.ReadMemoryWithoutTrap (1504 of 1892) PASS: lldb-unit :: Process/gdb-remote/./ProcessGdbRemoteTests/GDBRemoteClientBaseTest.SendPacketAndReceiveResponseWithOutputSupport (1505 of 1892) PASS: lldb-api :: functionalities/data-formatter/data-formatter-stl/libcxx/set/TestDataFormatterLibcxxSet.py (1506 of 1892) PASS: lldb-unit :: UnwindAssembly/x86/./UnwindAssemblyx86Tests/Testx86AssemblyInspectionEngine.TestPushRBX (1507 of 1892) PASS: lldb-api :: functionalities/thread/concurrent_events/TestConcurrentWatchpointDelayWatchpointOneBreakpoint.py (1508 of 1892) PASS: lldb-api :: commands/statistics/basic/TestStats.py (1509 of 1892) PASS: lldb-shell :: Quit/TestQuitExitCodeHex0.test (1510 of 1892) PASS: lldb-api :: functionalities/gdb_remote_client/TestArmRegisterDefinition.py (1511 of 1892) PASS: lldb-api :: commands/expression/char/TestExprsChar.py (1512 of 1892) PASS: lldb-shell :: ObjectFile/ELF/netbsd-core-amd64.test (1513 of 1892) PASS: lldb-api :: functionalities/data-formatter/data-formatter-stl/libcxx/bitset/TestDataFormatterLibcxxBitset.py (1514 of 1892) PASS: lldb-shell :: Minidump/memory-region-from-module.yaml (1515 of 1892) PASS: lldb-unit :: Utility/./UtilityTests/RangeTest.ClearWithStarAddress (1516 of 1892) PASS: lldb-api :: functionalities/breakpoint/cpp/TestCPPBreakpointLocations.py (1517 of 1892) PASS: lldb-shell :: SymbolFile/DWARF/parallel-indexing-stress.s (1518 of 1892) PASS: lldb-unit :: Expression/./ExpressionTests/DiagnosticManagerTest.GetStringMultipleDiags (1519 of 1892) PASS: lldb-api :: commands/expression/calculator_mode/TestCalculatorMode.py (1520 of 1892) PASS: lldb-api :: functionalities/tail_call_frames/disambiguate_paths_to_common_sink/TestDisambiguatePathsToCommonSink.py (1521 of 1892) PASS: lldb-api :: functionalities/inferior-crashing/TestInferiorCrashingStep.py (1522 of 1892) PASS: lldb-shell :: ObjectFile/PECOFF/sections-names.yaml (1523 of 1892) PASS: lldb-unit :: SymbolFile/NativePDB/./SymbolFileNativePDBTests/PDBFPOProgramToDWARFExpressionTests.UnresolvedRegisterAssignmentReference (1524 of 1892) PASS: lldb-unit :: UnwindAssembly/x86/./UnwindAssemblyx86Tests/Testx86AssemblyInspectionEngine.TestPushR14 (1525 of 1892) PASS: lldb-api :: functionalities/breakpoint/global_constructor/TestBreakpointInGlobalConstructor.py (1526 of 1892) PASS: lldb-unit :: Utility/./UtilityTests/OptionsWithRawTest.WhitespaceSuffix (1527 of 1892) PASS: lldb-unit :: ScriptInterpreter/Python/./ScriptInterpreterPythonTests/PythonDataObjectsTest.TestTypeNameResolutionNoDot (1528 of 1892) PASS: lldb-api :: functionalities/source-map/TestTargetSourceMap.py (1529 of 1892) PASS: lldb-api :: functionalities/postmortem/netbsd-core/TestNetBSDCore.py (1530 of 1892) PASS: lldb-api :: commands/expression/completion-in-lambda-and-unnamed-class/TestCompletionInLambdaAndUnnamedClass.py (1531 of 1892) PASS: lldb-api :: functionalities/gdb_remote_client/TestGDBRemoteLoad.py (1532 of 1892) PASS: lldb-unit :: Utility/./UtilityTests/StringListTest.ShiftMove (1533 of 1892) PASS: lldb-shell :: SymbolFile/DWARF/DW_OP_piece-struct.s (1534 of 1892) PASS: lldb-api :: commands/watchpoints/watchpoint_set_command/TestWatchLocationWithWatchSet.py (1535 of 1892) PASS: lldb-api :: commands/expression/timeout/TestCallWithTimeout.py (1536 of 1892) PASS: lldb-unit :: Symbol/./SymbolTests/TestClangASTContext.TestRemoveFastQualifiers (1537 of 1892) PASS: lldb-unit :: Utility/./UtilityTests/UUIDTest.StringConverion (1538 of 1892) PASS: lldb-api :: functionalities/tail_call_frames/inlining_and_tail_calls/TestInliningAndTailCalls.py (1539 of 1892) PASS: lldb-unit :: Utility/./UtilityTests/StringExtractorTest.DecodeHexU8_Exact (1540 of 1892) PASS: lldb-unit :: UnwindAssembly/x86/./UnwindAssemblyx86Tests/Testx86AssemblyInspectionEngine.Testi386IgnoredRegisters (1541 of 1892) PASS: lldb-unit :: Host/./HostTests/Host.WaitStatusFormat (1542 of 1892) PASS: lldb-unit :: Utility/./UtilityTests/ArgsTest.ReplaceArgumentAtIndexOutOfRange (1543 of 1892) PASS: lldb-shell :: SymbolFile/DWARF/compilercontext.ll (1544 of 1892) PASS: lldb-unit :: Utility/./UtilityTests/RangeTest.ContainsRangeStartingFromZero (1545 of 1892) PASS: lldb-shell :: SymbolFile/DWARF/debug-types-address-ranges.s (1546 of 1892) PASS: lldb-unit :: Symbol/./SymbolTests/TestClangASTContext.TestRecordHasFields (1547 of 1892) PASS: lldb-api :: commands/expression/import-std-module/unique_ptr/TestUniquePtr.py (1548 of 1892) PASS: lldb-unit :: Utility/./UtilityTests/BinaryStreamTest.PutSLEB128FiveBytes (1549 of 1892) PASS: lldb-api :: lang/c/step-target/TestStepTarget.py (1550 of 1892) PASS: lldb-unit :: Utility/./UtilityTests/ScalarTest.ComparisonFloat (1551 of 1892) PASS: lldb-api :: commands/watchpoints/watchpoint_size/TestWatchpointSizes.py (1552 of 1892) PASS: lldb-shell :: Settings/TestEchoCommands.test (1553 of 1892) PASS: lldb-unit :: Process/minidump/./LLDBMinidumpTests/MinidumpParserTest.GetThreadsAndGetThreadContext (1554 of 1892) PASS: lldb-api :: lang/objc/objc-super/TestObjCSuper.py (1555 of 1892) PASS: lldb-unit :: ObjectFile/Breakpad/./ObjectFileBreakpadTests/Record.classify (1556 of 1892) PASS: lldb-shell :: SymbolFile/DWARF/split-dwarf-inlining.cpp (1557 of 1892) PASS: lldb-api :: functionalities/breakpoint/breakpoint_set_restart/TestBreakpointSetRestart.py (1558 of 1892) UNSUPPORTED: lldb-api :: tools/lldb-server/signal-filtering/TestGdbRemote_QPassSignals.py (1559 of 1892) PASS: lldb-api :: commands/expression/radar_8638051/Test8638051.py (1560 of 1892) PASS: lldb-unit :: Language/Highlighting/./HighlighterTests/HighlighterTest.ClangStringLiterals (1561 of 1892) PASS: lldb-unit :: Utility/./UtilityTests/StringExtractorTest.GetHexU8_Underflow2_NoEof (1562 of 1892) PASS: lldb-shell :: SymbolFile/Breakpad/line-table.test (1563 of 1892) PASS: lldb-unit :: Target/./TargetTests/ExecutionContextTest.GetByteOrderProcess (1564 of 1892) FAIL: lldb-api :: functionalities/data-formatter/data-formatter-objc/TestDataFormatterObjNSException.py (1565 of 1892) ******************** TEST 'lldb-api :: functionalities/data-formatter/data-formatter-objc/TestDataFormatterObjNSException.py' FAILED ******************** lldb version 10.0.99 (http://labmaster3.local/git/llvm-project.git revision c1b13a1b17719aebace1b3be7a6ac7f90b1901a6) clang revision bff33bd5c83b947cccb4d6cf6ebca9dc021f716b llvm revision bff33bd5c83b947cccb4d6cf6ebca9dc021f716b LLDB library dir: /Users/buildslave/jenkins/workspace/lldb-cmake-sanitized/lldb-build/bin LLDB import library dir: /Users/buildslave/jenkins/workspace/lldb-cmake-sanitized/lldb-build/bin libstdcxx tests will not be run because: Don't know how to build with libstdcxx on macosx Skipping following debug info categories: ['dwo'] AddressSanitizer report breakpoint hit. Use 'thread info -s' to get extended information about the report. AddressSanitizer report breakpoint hit. Use 'thread info -s' to get extended information about the report. AddressSanitizer report breakpoint hit. Use 'thread info -s' to get extended information about the report.

Hide Details

Session logs for test failures/errors/unexpected successes will go into directory '/Users/buildslave/jenkins/workspace/lldb-cmake-sanitized/test/logs' Command invoked: /Users/buildslave/jenkins/workspace/lldb-cmake-sanitized/llvm-project/lldb/test/API/dotest.py --arch x86_64 -s /Users/buildslave/jenkins/workspace/lldb-cmake-sanitized/lldb-build/lldb-test-traces -S nm -u CXXFLAGS -u CFLAGS --codesign-identity lldb_codesign --server /Users/buildslave/jenkins/workspace/lldb-cmake-sanitized/lldb-build/./bin/debugserver --arch x86_64 --build-dir /Users/buildslave/jenkins/workspace/lldb-cmake-sanitized/lldb-build/lldb-test-build.noindex -s=/Users/buildslave/jenkins/workspace/lldb-cmake-sanitized/test/logs -t --env TERM=vt100 --env LLVM_LIBS_DIR=/Users/buildslave/jenkins/workspace/lldb-cmake-sanitized/lldb-build/./lib --inferior-env ASAN_OPTIONS=detect_stack_use_after_return=1 --inferior-env DYLD_INSERT_LIBRARIES=/Users/buildslave/jenkins/workspace/lldb-cmake-sanitized/host-compiler/lib/clang/10.0.0/lib/darwin/libclang_rt.asan_osx_dynamic.dylib --build-dir /Users/buildslave/jenkins/workspace/lldb-cmake-sanitized/lldb-build/lldb-test-build.noindex --lldb-module-cache-dir /Users/buildslave/jenkins/workspace/lldb-cmake-sanitized/lldb-build/lldb-test-build.noindex/module-cache-lldb/lldb-api --clang-module-cache-dir /Users/buildslave/jenkins/workspace/lldb-cmake-sanitized/lldb-build/lldb-test-build.noindex/module-cache-clang/lldb-api --executable /Users/buildslave/jenkins/workspace/lldb-cmake-sanitized/lldb-build/./bin/lldb --compiler /Users/buildslave/jenkins/workspace/lldb-cmake-sanitized/lldb-build/./bin/clang --dsymutil /Users/buildslave/jenkins/workspace/lldb-cmake-sanitized/lldb-build/./bin/dsymutil --filecheck /Users/buildslave/jenkins/workspace/lldb-cmake-sanitized/lldb-build/./bin/FileCheck /Users/buildslave/jenkins/workspace/lldb-cmake-sanitized/llvm-project/lldb/packages/Python/lldbsuite/test/functionalities/data-formatter/data-formatter-objc -p TestDataFormatterObjNSException.py Change dir to: /Users/buildslave/jenkins/workspace/lldb-cmake-sanitized/llvm-project/lldb/packages/Python/lldbsuite/test/functionalities/data-formatter/data-formatter-objc runCmd: settings set symbols.enable-external-lookup false output:

Hide Details

runCmd: settings set plugin.process.gdb-remote.packet-timeout 60 output:

Hide Details

runCmd: settings set symbols.clang-modules-cache-path "/Users/buildslave/jenkins/workspace/lldb-cmake-sanitized/lldb-build/lldb-test-build.noindex/module-cache-lldb/lldb-api" output:

Hide Details

runCmd: settings set use-color false output:

Hide Details

runCmd: settings set target.env-vars ASAN_OPTIONS=detect_stack_use_after_return=1 DYLD_INSERT_LIBRARIES=/Users/buildslave/jenkins/workspace/lldb-cmake-sanitized/host-compiler/lib/clang/10.0.0/lib/darwin/libclang_rt.asan_osx_dynamic.dylib output:

Hide Details

runCmd: settings set target.env-vars ASAN_OPTIONS=detect_stack_use_after_return=1 DYLD_INSERT_LIBRARIES=/Users/buildslave/jenkins/workspace/lldb-cmake-sanitized/host-compiler/lib/clang/10.0.0/lib/darwin/libclang_rt.asan_osx_dynamic.dylib output:

Hide Details

FAIL: LLDB (/Users/buildslave/jenkins/workspace/lldb-cmake-sanitized/lldb-build/bin/clang-10-x86_64) :: test_nsexception_with_run_command_dsym (TestDataFormatterObjNSException.ObjCDataFormatterNSException) <bound method SBProcess.Kill of <lldb.SBProcess; proxy of <Swig Object of type 'lldb::SBProcess *' at 0x1217a7210> >>: success

Hide Details

runCmd: settings set symbols.enable-external-lookup false output:

Hide Details

runCmd: settings set plugin.process.gdb-remote.packet-timeout 60 output:

Hide Details

runCmd: settings set symbols.clang-modules-cache-path "/Users/buildslave/jenkins/workspace/lldb-cmake-sanitized/lldb-build/lldb-test-build.noindex/module-cache-lldb/lldb-api" output:

Hide Details

runCmd: settings set use-color false output:

Hide Details

runCmd: settings set target.env-vars ASAN_OPTIONS=detect_stack_use_after_return=1 DYLD_INSERT_LIBRARIES=/Users/buildslave/jenkins/workspace/lldb-cmake-sanitized/host-compiler/lib/clang/10.0.0/lib/darwin/libclang_rt.asan_osx_dynamic.dylib output:

Hide Details

runCmd: settings set target.env-vars ASAN_OPTIONS=detect_stack_use_after_return=1 DYLD_INSERT_LIBRARIES=/Users/buildslave/jenkins/workspace/lldb-cmake-sanitized/host-compiler/lib/clang/10.0.0/lib/darwin/libclang_rt.asan_osx_dynamic.dylib output:

Hide Details

FAIL: LLDB (/Users/buildslave/jenkins/workspace/lldb-cmake-sanitized/lldb-build/bin/clang-10-x86_64) :: test_nsexception_with_run_command_dwarf (TestDataFormatterObjNSException.ObjCDataFormatterNSException) <bound method SBProcess.Kill of <lldb.SBProcess; proxy of <Swig Object of type 'lldb::SBProcess *' at 0x10b1c4630> >>: success

Hide Details

UNSUPPORTED: LLDB (/Users/buildslave/jenkins/workspace/lldb-cmake-sanitized/lldb-build/bin/clang-10-x86_64) :: test_nsexception_with_run_command_dwo (TestDataFormatterObjNSException.ObjCDataFormatterNSException) (test case does not fall in any category of interest for this run) runCmd: settings set symbols.enable-external-lookup false output:

Hide Details

runCmd: settings set plugin.process.gdb-remote.packet-timeout 60 output:

Hide Details

runCmd: settings set symbols.clang-modules-cache-path "/Users/buildslave/jenkins/workspace/lldb-cmake-sanitized/lldb-build/lldb-test-build.noindex/module-cache-lldb/lldb-api" output:

Hide Details

runCmd: settings set use-color false output:

Hide Details

runCmd: settings set target.env-vars ASAN_OPTIONS=detect_stack_use_after_return=1 DYLD_INSERT_LIBRARIES=/Users/buildslave/jenkins/workspace/lldb-cmake-sanitized/host-compiler/lib/clang/10.0.0/lib/darwin/libclang_rt.asan_osx_dynamic.dylib output:

Hide Details

runCmd: settings set target.env-vars ASAN_OPTIONS=detect_stack_use_after_return=1 DYLD_INSERT_LIBRARIES=/Users/buildslave/jenkins/workspace/lldb-cmake-sanitized/host-compiler/lib/clang/10.0.0/lib/darwin/libclang_rt.asan_osx_dynamic.dylib output:

Hide Details

FAIL: LLDB (/Users/buildslave/jenkins/workspace/lldb-cmake-sanitized/lldb-build/bin/clang-10-x86_64) :: test_nsexception_with_run_command_gmodules (TestDataFormatterObjNSException.ObjCDataFormatterNSException) <bound method SBProcess.Kill of <lldb.SBProcess; proxy of <Swig Object of type 'lldb::SBProcess *' at 0x1217a7540> >>: success

Hide Details

Restore dir to: /Users/buildslave/jenkins/workspace/lldb-cmake-sanitized/lldb-build/tools/lldb/test ====================================================================== FAIL: test_nsexception_with_run_command_dsym (TestDataFormatterObjNSException.ObjCDataFormatterNSException) Test formatters for NSException. ---------------------------------------------------------------------- Traceback (most recent call last): File "/Users/buildslave/jenkins/workspace/lldb-cmake-sanitized/llvm-project/lldb/packages/Python/lldbsuite/test/lldbtest.py", line 1732, in test_method return attrvalue(self) File "/Users/buildslave/jenkins/workspace/lldb-cmake-sanitized/llvm-project/lldb/packages/Python/lldbsuite/test/functionalities/data-formatter/data-formatter-objc/TestDataFormatterObjNSException.py", line 20, in test_nsexception_with_run_command self.appkit_tester_impl(self.nsexception_data_formatter_commands) File "/Users/buildslave/jenkins/workspace/lldb-cmake-sanitized/llvm-project/lldb/packages/Python/lldbsuite/test/functionalities/data-formatter/data-formatter-objc/ObjCDataFormatterTestCase.py", line 19, in appkit_tester_impl self.appkit_common_data_formatters_command() File "/Users/buildslave/jenkins/workspace/lldb-cmake-sanitized/llvm-project/lldb/packages/Python/lldbsuite/test/functionalities/data-formatter/data-formatter-objc/ObjCDataFormatterTestCase.py", line 26, in appkit_common_data_formatters_command lldb.SBFileSpec('main.m', False)) File "/Users/buildslave/jenkins/workspace/lldb-cmake-sanitized/llvm-project/lldb/packages/Python/lldbsuite/test/lldbutil.py", line 868, in run_to_source_breakpoint only_one_thread, extra_images) File "/Users/buildslave/jenkins/workspace/lldb-cmake-sanitized/llvm-project/lldb/packages/Python/lldbsuite/test/lldbutil.py", line 797, in run_to_breakpoint_do_run test.assertEqual(num_threads, 1, "Expected 1 thread to stop at breakpoint, %d did."%(num_threads)) AssertionError: 0 != 1 : Expected 1 thread to stop at breakpoint, 0 did. Config=x86_64-/Users/buildslave/jenkins/workspace/lldb-cmake-sanitized/lldb-build/bin/clang-10 ====================================================================== FAIL: test_nsexception_with_run_command_dwarf (TestDataFormatterObjNSException.ObjCDataFormatterNSException) Test formatters for NSException. ---------------------------------------------------------------------- Traceback (most recent call last): File "/Users/buildslave/jenkins/workspace/lldb-cmake-sanitized/llvm-project/lldb/packages/Python/lldbsuite/test/lldbtest.py", line 1732, in test_method return attrvalue(self) File "/Users/buildslave/jenkins/workspace/lldb-cmake-sanitized/llvm-project/lldb/packages/Python/lldbsuite/test/functionalities/data-formatter/data-formatter-objc/TestDataFormatterObjNSException.py", line 20, in test_nsexception_with_run_command self.appkit_tester_impl(self.nsexception_data_formatter_commands) File "/Users/buildslave/jenkins/workspace/lldb-cmake-sanitized/llvm-project/lldb/packages/Python/lldbsuite/test/functionalities/data-formatter/data-formatter-objc/ObjCDataFormatterTestCase.py", line 19, in appkit_tester_impl self.appkit_common_data_formatters_command() File "/Users/buildslave/jenkins/workspace/lldb-cmake-sanitized/llvm-project/lldb/packages/Python/lldbsuite/test/functionalities/data-formatter/data-formatter-objc/ObjCDataFormatterTestCase.py", line 26, in appkit_common_data_formatters_command lldb.SBFileSpec('main.m', False)) File "/Users/buildslave/jenkins/workspace/lldb-cmake-sanitized/llvm-project/lldb/packages/Python/lldbsuite/test/lldbutil.py", line 868, in run_to_source_breakpoint only_one_thread, extra_images) File "/Users/buildslave/jenkins/workspace/lldb-cmake-sanitized/llvm-project/lldb/packages/Python/lldbsuite/test/lldbutil.py", line 797, in run_to_breakpoint_do_run test.assertEqual(num_threads, 1, "Expected 1 thread to stop at breakpoint, %d did."%(num_threads)) AssertionError: 0 != 1 : Expected 1 thread to stop at breakpoint, 0 did. Config=x86_64-/Users/buildslave/jenkins/workspace/lldb-cmake-sanitized/lldb-build/bin/clang-10 ====================================================================== FAIL: test_nsexception_with_run_command_gmodules (TestDataFormatterObjNSException.ObjCDataFormatterNSException) Test formatters for NSException. ---------------------------------------------------------------------- Traceback (most recent call last): File "/Users/buildslave/jenkins/workspace/lldb-cmake-sanitized/llvm-project/lldb/packages/Python/lldbsuite/test/lldbtest.py", line 1732, in test_method return attrvalue(self) File "/Users/buildslave/jenkins/workspace/lldb-cmake-sanitized/llvm-project/lldb/packages/Python/lldbsuite/test/functionalities/data-formatter/data-formatter-objc/TestDataFormatterObjNSException.py", line 20, in test_nsexception_with_run_command self.appkit_tester_impl(self.nsexception_data_formatter_commands) File "/Users/buildslave/jenkins/workspace/lldb-cmake-sanitized/llvm-project/lldb/packages/Python/lldbsuite/test/functionalities/data-formatter/data-formatter-objc/ObjCDataFormatterTestCase.py", line 19, in appkit_tester_impl self.appkit_common_data_formatters_command() File "/Users/buildslave/jenkins/workspace/lldb-cmake-sanitized/llvm-project/lldb/packages/Python/lldbsuite/test/functionalities/data-formatter/data-formatter-objc/ObjCDataFormatterTestCase.py", line 26, in appkit_common_data_formatters_command lldb.SBFileSpec('main.m', False)) File "/Users/buildslave/jenkins/workspace/lldb-cmake-sanitized/llvm-project/lldb/packages/Python/lldbsuite/test/lldbutil.py", line 868, in run_to_source_breakpoint only_one_thread, extra_images) File "/Users/buildslave/jenkins/workspace/lldb-cmake-sanitized/llvm-project/lldb/packages/Python/lldbsuite/test/lldbutil.py", line 797, in run_to_breakpoint_do_run test.assertEqual(num_threads, 1, "Expected 1 thread to stop at breakpoint, %d did."%(num_threads)) AssertionError: 0 != 1 : Expected 1 thread to stop at breakpoint, 0 did. Config=x86_64-/Users/buildslave/jenkins/workspace/lldb-cmake-sanitized/lldb-build/bin/clang-10 ---------------------------------------------------------------------- Ran 4 tests in 153.309s

Hide Details

RESULT: FAILED (0 passes, 3 failures, 0 errors, 1 skipped, 0 expected failures, 0 unexpected successes)

Hide Details

******************** UNSUPPORTED: lldb-shell :: SymbolFile/PDB/class-layout.test (1566 of 1892) PASS: lldb-unit :: Utility/./UtilityTests/Predicate.WaitForValueNotEqualTo (1567 of 1892) PASS: lldb-unit :: Expression/./ExpressionTests/DiagnosticManagerTest.GetStringPreserveOrder (1568 of 1892) UNSUPPORTED: lldb-shell :: Unwind/eh-frame-small-fde.test (1569 of 1892) PASS: lldb-api :: commands/log/invalid-args/TestInvalidArgsLog.py (1570 of 1892) PASS: lldb-unit :: ObjectFile/ELF/./ObjectFileELFTests/ObjectFileELFTest.GetModuleSpecifications_EarlySectionHeaders (1571 of 1892) PASS: lldb-shell :: SymbolFile/DWARF/childless-compile-unit.s (1572 of 1892) PASS: lldb-unit :: Utility/./UtilityTests/StreamTeeTest.GetStreamAtIndexOutOfBounds (1573 of 1892) PASS: lldb-unit :: Target/./TargetTests/PathMappingListTest.RemapRoot (1574 of 1892) PASS: lldb-api :: lang/cpp/frame-var-anon-unions/TestFrameVariableAnonymousUnions.py (1575 of 1892) PASS: lldb-api :: functionalities/process_group/TestChangeProcessGroup.py (1576 of 1892) UNSUPPORTED: lldb-api :: python_api/event/TestEvents.py (1577 of 1892) PASS: lldb-api :: functionalities/data-formatter/data-formatter-globals/TestDataFormatterGlobals.py (1578 of 1892) PASS: lldb-api :: python_api/target/TestTargetAPI.py (1579 of 1892) PASS: lldb-api :: functionalities/data-formatter/data-formatter-stl/libcxx/string/TestDataFormatterLibcxxString.py (1580 of 1892) PASS: lldb-unit :: Expression/./ExpressionTests/CppModuleConfigurationTest.UnknownLibCppFile (1581 of 1892) PASS: lldb-unit :: Symbol/./SymbolTests/TestClangASTContext.TestGetTypeClassDeclType (1582 of 1892) PASS: lldb-unit :: Signals/./SignalsTests/UnixSignalsTest.GetFilteredSignals (1583 of 1892) PASS: lldb-unit :: ScriptInterpreter/Python/./ScriptInterpreterPythonTests/PythonDataObjectsTest.TestBorrowedReferences (1584 of 1892) PASS: lldb-api :: lang/c/offsetof/TestOffsetof.py (1585 of 1892) PASS: lldb-shell :: ObjectFile/ELF/many-sections.s (1586 of 1892) PASS: lldb-unit :: ScriptInterpreter/Python/./ScriptInterpreterPythonTests/PythonDataObjectsTest.TestPythonInteger (1587 of 1892) PASS: lldb-api :: functionalities/thread/thread_exit/TestThreadExit.py (1588 of 1892) UNSUPPORTED: lldb-api :: python_api/disassemble-raw-data/TestDisassemble_VST1_64.py (1589 of 1892) PASS: lldb-unit :: Utility/./UtilityTests/StringLexerTest.GetUnlexed (1590 of 1892) UNSUPPORTED: lldb-shell :: Register/x86-64-xmm16-read.test (1591 of 1892) PASS: lldb-shell :: Settings/TestFrameFormatColor.test (1592 of 1892) PASS: lldb-unit :: Host/./HostTests/FileSystemTest.GetPermissions (1593 of 1892) PASS: lldb-unit :: SymbolFile/NativePDB/./SymbolFileNativePDBTests/PDBFPOProgramToDWARFExpressionTests.UnresolvedRegisterReference (1594 of 1892) PASS: lldb-api :: functionalities/gdb_remote_client/TestTargetXMLArch.py (1595 of 1892) PASS: lldb-unit :: Utility/./UtilityTests/VMRange.SetEndAddress (1596 of 1892) PASS: lldb-unit :: Process/gdb-remote/./ProcessGdbRemoteTests/GDBRemoteCommunicationClientTest.GetMemoryRegionInfo (1597 of 1892) PASS: lldb-unit :: UnwindAssembly/x86/./UnwindAssemblyx86Tests/Testx86AssemblyInspectionEngine.TestPopESI (1598 of 1892) PASS: lldb-api :: functionalities/thread/concurrent_events/TestConcurrentWatchpointWithDelayWatchpointThreads.py (1599 of 1892) UNSUPPORTED: lldb-api :: commands/watchpoints/multi_watchpoint_slots/TestWatchpointMultipleSlots.py (1600 of 1892) PASS: lldb-api :: commands/expression/persistent_variables/TestPersistentVariables.py (1601 of 1892) PASS: lldb-unit :: Utility/./UtilityTests/GeneratorTest.Get (1602 of 1892) PASS: lldb-api :: commands/command/script_alias/TestCommandScriptAlias.py (1603 of 1892) PASS: lldb-api :: functionalities/type_completion/TestTypeCompletion.py (1604 of 1892) PASS: lldb-unit :: Target/./TargetTests/ModuleCacheTest.GetAndPutStrangeHostname (1605 of 1892) PASS: lldb-api :: functionalities/param_entry_vals/basic_entry_values_x86_64/TestBasicEntryValuesX86_64.py (1606 of 1892) PASS: lldb-api :: functionalities/data-formatter/data-formatter-script/TestDataFormatterScript.py (1607 of 1892) PASS: lldb-unit :: Utility/./UtilityTests/ArgsTest.TestSingleArg (1608 of 1892) PASS: lldb-api :: linux/builtin_trap/TestBuiltinTrap.py (1609 of 1892) PASS: lldb-shell :: ObjectFile/PECOFF/section-types.yaml (1610 of 1892) PASS: lldb-unit :: Utility/./UtilityTests/StreamTeeTest.SetStreamAtIndexOverwrite (1611 of 1892) PASS: lldb-api :: python_api/default-constructor/TestDefaultConstructorForAPIObjects.py (1612 of 1892) PASS: lldb-unit :: Utility/./UtilityTests/DeserializerTest.HasData (1613 of 1892) PASS: lldb-shell :: Unwind/trap_frame_sym_ctx.test (1614 of 1892) PASS: lldb-unit :: Utility/./UtilityTests/AnsiTerminal.AtStart (1615 of 1892) PASS: lldb-shell :: Commands/command-regex-unalias.test (1616 of 1892) PASS: lldb-unit :: Utility/./UtilityTests/ArgsTest.TestArgv (1617 of 1892) PASS: lldb-unit :: Utility/./UtilityTests/BinaryStreamTest.PutSLEB128NineBytes (1618 of 1892) PASS: lldb-api :: api/multiple-targets/TestMultipleTargets.py (1619 of 1892) PASS: lldb-unit :: Process/minidump/./LLDBMinidumpTests/MinidumpParserTest.GetMiscInfo_no_stream (1620 of 1892) PASS: lldb-unit :: Utility/./UtilityTests/StringExtractorTest.GetHexBytesAvail_FullString (1621 of 1892) UNSUPPORTED: lldb-shell :: Register/aarch64-fp-read.test (1622 of 1892) PASS: lldb-api :: functionalities/thread/concurrent_events/TestConcurrentManyWatchpoints.py (1623 of 1892) PASS: lldb-unit :: UnwindAssembly/x86/./UnwindAssemblyx86Tests/Testx86AssemblyInspectionEngine.TestPushEBX (1624 of 1892) PASS: lldb-unit :: Language/CPlusPlus/./LanguageCPlusPlusTests/CPlusPlusLanguage.ExtractContextAndIdentifier (1625 of 1892) PASS: lldb-shell :: Driver/TestSingleQuote.test (1626 of 1892) PASS: lldb-api :: lang/cpp/virtual-overload/TestVirtualOverload.py (1627 of 1892) PASS: lldb-api :: functionalities/breakpoint/breakpoint_locations/TestBreakpointLocations.py (1628 of 1892) PASS: lldb-api :: macosx/nslog/TestDarwinNSLogOutput.py (1629 of 1892) PASS: lldb-api :: lang/objc/modules-incomplete/TestIncompleteModules.py (1630 of 1892) PASS: lldb-api :: commands/add-dsym/uuid/TestAddDsymCommand.py (1631 of 1892) PASS: lldb-api :: functionalities/plugins/command_plugin/TestPluginCommands.py (1632 of 1892) PASS: lldb-unit :: UnwindAssembly/x86/./UnwindAssemblyx86Tests/Testx86AssemblyInspectionEngine.TestPushEDX (1633 of 1892) PASS: lldb-unit :: Expression/./ExpressionTests/ClangHostTest.ComputeClangResourceDirectory (1634 of 1892) PASS: lldb-unit :: SymbolFile/NativePDB/./SymbolFileNativePDBTests/PDBFPOProgramToDWARFExpressionTests.UnsupportedRASearch (1635 of 1892) PASS: lldb-unit :: Host/./HostTests/TaskPoolTest.AddTask (1636 of 1892) PASS: lldb-api :: functionalities/thread/step_out/TestThreadStepOut.py (1637 of 1892) PASS: lldb-shell :: SymbolFile/NativePDB/break-by-function.cpp (1638 of 1892) PASS: lldb-unit :: Process/gdb-remote/./ProcessGdbRemoteTests/GDBRemoteClientBaseTest.SendContinueAndInterrupt (1639 of 1892) PASS: lldb-api :: macosx/lc-note/kern-ver-str/TestKernVerStrLCNOTE.py (1640 of 1892) PASS: lldb-unit :: Utility/./UtilityTests/ArchSpecTest.MergeFromMachOUnknown (1641 of 1892) PASS: lldb-api :: functionalities/inferior-crashing/recursive-inferior/TestRecursiveInferiorStep.py (1642 of 1892) PASS: lldb-shell :: Commands/command-script-import.test (1643 of 1892) PASS: lldb-api :: types/TestDoubleTypes.py (1644 of 1892) PASS: lldb-unit :: Utility/./UtilityTests/CompletionRequest.DuplicateFilteringWithComments (1645 of 1892) PASS: lldb-unit :: Utility/./UtilityTests/StringExtractorTest.GetHexBytes_OddPair2 (1646 of 1892) PASS: lldb-api :: commands/expression/call-throws/TestCallThatThrows.py (1647 of 1892) PASS: lldb-api :: python_api/watchpoint/watchlocation/TestSetWatchlocation.py (1648 of 1892) PASS: lldb-unit :: Utility/./UtilityTests/UriParserTest.PortOverflow (1649 of 1892) PASS: lldb-unit :: Symbol/./SymbolTests/TestClangASTImporter.MetadataPropagationAfterCopying (1650 of 1892) UNSUPPORTED: lldb-api :: functionalities/darwin_log/filter/regex/activity/TestDarwinLogFilterRegexActivity.py (1651 of 1892) PASS: lldb-api :: lang/objc/objc-struct-return/TestObjCStructReturn.py (1652 of 1892) UNSUPPORTED: lldb-api :: commands/register/register/intel_xtended_registers/TestMPXRegisters.py (1653 of 1892) PASS: lldb-api :: macosx/indirect_symbol/TestIndirectSymbols.py (1654 of 1892) PASS: lldb-unit :: Expression/./ExpressionTests/DiagnosticManagerTest.GetStringMultiline (1655 of 1892) PASS: lldb-api :: lang/cpp/gmodules/TestWithModuleDebugging.py (1656 of 1892) PASS: lldb-api :: python_api/breakpoint/TestBreakpointAPI.py (1657 of 1892) PASS: lldb-api :: lang/cpp/const_this/TestConstThis.py (1658 of 1892) PASS: lldb-api :: functionalities/non-overlapping-index-variable-i/TestIndexVariable.py (1659 of 1892) UNSUPPORTED: lldb-api :: linux/mix-dwo-and-regular-objects/TestMixedDwarfBinary.py (1660 of 1892) PASS: lldb-api :: python_api/watchpoint/watchlocation/TestTargetWatchAddress.py (1661 of 1892) PASS: lldb-unit :: Utility/./UtilityTests/StringListTest.AppendListCStringArrayEmpty (1662 of 1892) PASS: lldb-unit :: Symbol/./SymbolTests/TestClangASTContext.TestFunctionTemplateInRecordConstruction (1663 of 1892) PASS: lldb-shell :: SymbolFile/NativePDB/disassembly.cpp (1664 of 1892) PASS: lldb-api :: commands/platform/basic/TestPlatformPython.py (1665 of 1892) PASS: lldb-shell :: Settings/TestDisassemblyFormat.test (1666 of 1892) PASS: lldb-unit :: Process/gdb-remote/./ProcessGdbRemoteTests/GDBRemoteClientBaseTest.InterruptNoResponse (1667 of 1892) PASS: lldb-unit :: Utility/./UtilityTests/StreamTest.AddressSize (1668 of 1892) PASS: lldb-api :: lang/c/vla/TestVLA.py (1669 of 1892) PASS: lldb-api :: tools/lldb-server/TestGdbRemoteProcessInfo.py (1670 of 1892) PASS: lldb-shell :: SymbolFile/DWARF/debug_ranges.s (1671 of 1892) PASS: lldb-shell :: SymbolFile/DWARF/find-basic-namespace.cpp (1672 of 1892) PASS: lldb-api :: functionalities/gdb_remote_client/TestThreadSelectionBug.py (1673 of 1892) UNSUPPORTED: lldb-api :: functionalities/thread/state/TestThreadStates.py (1674 of 1892) PASS: lldb-shell :: Process/TestEnvironment.test (1675 of 1892) PASS: lldb-unit :: Utility/./UtilityTests/StringListTest.ForRangeEmpty (1676 of 1892) PASS: lldb-unit :: Utility/./UtilityTests/StreamTest.AddressRangeInvalidRange (1677 of 1892) UNSUPPORTED: lldb-shell :: Register/x86-64-zmm-read.test (1678 of 1892) PASS: lldb-unit :: Language/Highlighting/./HighlighterTests/HighlighterTest.HighlighterSelectionPath (1679 of 1892) PASS: lldb-unit :: Utility/./UtilityTests/StringLexerTest.NextIf (1680 of 1892) PASS: lldb-api :: lang/objc/objc-optimized/TestObjcOptimized.py (1681 of 1892) PASS: lldb-unit :: Language/Highlighting/./HighlighterTests/HighlighterTest.ClangBraces (1682 of 1892) PASS: lldb-unit :: Utility/./UtilityTests/UriParserTest.BracketedHostnameWithColon (1683 of 1892) PASS: lldb-unit :: Target/./TargetTests/ExecutionContextTest.GetByteOrder (1684 of 1892) UNSUPPORTED: lldb-api :: functionalities/data-formatter/data-formatter-stl/libstdcpp/smart_ptr/TestDataFormatterStdSmartPtr.py (1685 of 1892) PASS: lldb-api :: types/TestIntegerType.py (1686 of 1892) PASS: lldb-shell :: Minidump/Windows/broken-unwind.test (1687 of 1892) PASS: lldb-unit :: Process/gdb-remote/./ProcessGdbRemoteTests/GDBRemoteCommunicationClientTest.WriteRegister (1688 of 1892) PASS: lldb-unit :: Symbol/./SymbolTests/TestClangASTContext.TestConvertAccessTypeToAccessSpecifier (1689 of 1892) PASS: lldb-api :: lang/cpp/virtual/TestVirtual.py (1690 of 1892) PASS: lldb-unit :: Utility/./UtilityTests/OptionsWithRawTest.UnterminatedQuote (1691 of 1892) PASS: lldb-api :: functionalities/gdb_remote_client/TestWriteMemory.py (1692 of 1892) PASS: lldb-api :: commands/expression/import-std-module/list-dbg-info-content/TestDbgInfoContentList.py (1693 of 1892) PASS: lldb-unit :: SymbolFile/DWARF/./SymbolFileDWARFTests/SymbolFileDWARFTests.TestAbbrevOrder1Start1 (1694 of 1892) PASS: lldb-api :: commands/expression/fixits/TestFixIts.py (1695 of 1892) PASS: lldb-api :: functionalities/thread/concurrent_events/TestConcurrentSignalDelayWatch.py (1696 of 1892) PASS: lldb-unit :: SymbolFile/NativePDB/./SymbolFileNativePDBTests/PDBFPOProgramToDWARFExpressionTests.MultipleDependentAssignments (1697 of 1892) XFAIL: lldb-shell :: Register/x86-64-ymm-write.test (1698 of 1892) PASS: lldb-unit :: Expression/./ExpressionTests/DiagnosticManagerTest.PutString (1699 of 1892) PASS: lldb-unit :: Utility/./UtilityTests/ScalarTest.Comparison (1700 of 1892) PASS: lldb-unit :: Process/gdb-remote/./ProcessGdbRemoteTests/GDBRemoteCommunicationTest.ReadPacket_checksum (1701 of 1892) PASS: lldb-api :: functionalities/data-formatter/compactvectors/TestCompactVectors.py (1702 of 1892) PASS: lldb-api :: tools/lldb-vscode/stackTrace/TestVSCode_stackTrace.py (1703 of 1892) PASS: lldb-shell :: Commands/CommandScriptImmediateOutput/CommandScriptImmediateOutputFile.test (1704 of 1892) PASS: lldb-api :: lang/cpp/call-function/TestCallCPPFunction.py (1705 of 1892) PASS: lldb-unit :: Breakpoint/./LLDBBreakpointTests/BreakpointIDTest.StringIsBreakpointName (1706 of 1892) PASS: lldb-unit :: SymbolFile/NativePDB/./SymbolFileNativePDBTests/PDBFPOProgramToDWARFExpressionTests.UnknownOp (1707 of 1892) PASS: lldb-shell :: ObjectFile/ELF/section-permissions.yaml (1708 of 1892) PASS: lldb-shell :: Reproducer/TestCaptureEnvOverride.test (1709 of 1892) PASS: lldb-api :: functionalities/value_md5_crash/TestValueMD5Crash.py (1710 of 1892) PASS: lldb-unit :: Utility/./UtilityTests/FileSpecTest.EqualDotsPosix (1711 of 1892) PASS: lldb-unit :: Utility/./UtilityTests/FileSpecTest.Match (1712 of 1892) PASS: lldb-unit :: Process/gdb-remote/./ProcessGdbRemoteTests/GDBRemoteCommunicationClientTest.SyncThreadState (1713 of 1892) UNSUPPORTED: lldb-api :: iohandler/completion/TestIOHandlerCompletion.py (1714 of 1892) PASS: lldb-unit :: Utility/./UtilityTests/StringListTest.LongestCommonPrefixDuplicateElement (1715 of 1892) PASS: lldb-api :: functionalities/multidebugger_commands/TestMultipleDebuggersCommands.py (1716 of 1892) PASS: lldb-api :: functionalities/thread/concurrent_events/TestConcurrentDelayWatchBreak.py (1717 of 1892) PASS: lldb-shell :: SymbolFile/DWARF/find-basic-type.cpp (1718 of 1892) PASS: lldb-api :: tools/lldb-server/commandline/TestStubSetSID.py (1719 of 1892) PASS: lldb-api :: lang/cpp/namespace/TestNamespace.py (1720 of 1892) PASS: lldb-unit :: Expression/./ExpressionTests/ClangExpressionDeclMapTest.TestPersistentDeclLookup (1721 of 1892) PASS: lldb-shell :: Reproducer/TestRelativePath.test (1722 of 1892) PASS: lldb-api :: functionalities/data-formatter/varscript_formatting/TestDataFormatterVarScriptFormatting.py (1723 of 1892) UNSUPPORTED: lldb-api :: functionalities/asan/TestReportData.py (1724 of 1892) PASS: lldb-api :: lang/objc/foundation/TestSymbolTable.py (1725 of 1892) PASS: lldb-api :: functionalities/thread/concurrent_events/TestConcurrentTwoWatchpointThreads.py (1726 of 1892) PASS: lldb-unit :: Utility/./UtilityTests/RecordReplayTest.InstrumentedFoo (1727 of 1892) PASS: lldb-api :: functionalities/tail_call_frames/disambiguate_call_site/TestDisambiguateCallSite.py (1728 of 1892) PASS: lldb-unit :: Utility/./UtilityTests/StreamTest.PutULEB128 (1729 of 1892) PASS: lldb-unit :: ScriptInterpreter/Python/./ScriptInterpreterPythonTests/PythonDataObjectsTest.TestInstanceNameResolutionNoDot (1730 of 1892) PASS: lldb-unit :: Utility/./UtilityTests/StreamTest.ShiftOperatorStrings (1731 of 1892) PASS: lldb-api :: lang/objc/objc-class-method/TestObjCClassMethod.py (1732 of 1892) PASS: lldb-unit :: Interpreter/./InterpreterTests/CompletionTest.FileCompletionAbsolute (1733 of 1892) PASS: lldb-api :: commands/expression/import-std-module/forward_list-basic/TestBasicForwardList.py (1734 of 1892) PASS: lldb-api :: lang/cpp/auto/TestCPPAuto.py (1735 of 1892) PASS: lldb-api :: functionalities/data-formatter/data-formatter-stl/libcxx/list/loop/TestDataFormatterLibcxxListLoop.py (1736 of 1892) PASS: lldb-unit :: Utility/./UtilityTests/ArchSpecTest.OperatorBool (1737 of 1892) PASS: lldb-api :: api/multithreaded/TestMultithreaded.py (1738 of 1892) PASS: lldb-unit :: Utility/./UtilityTests/VMRange.CollectionContains (1739 of 1892) PASS: lldb-unit :: Utility/./UtilityTests/OptionsWithRawTest.MultiWordSuffix (1740 of 1892) PASS: lldb-unit :: Utility/./UtilityTests/StatusTest.ErrorConversion (1741 of 1892) PASS: lldb-shell :: ObjectFile/PECOFF/export-dllfunc.yaml (1742 of 1892) PASS: lldb-unit :: Utility/./UtilityTests/StringListTest.LongestCommonPrefixEmpty (1743 of 1892) PASS: lldb-api :: functionalities/tail_call_frames/disambiguate_tail_call_seq/TestDisambiguateTailCallSeq.py (1744 of 1892) PASS: lldb-unit :: SymbolFile/DWARF/./SymbolFileDWARFTests/SymbolFileDWARFTests.TestAbbrevValidAttrNullForm (1745 of 1892) PASS: lldb-api :: functionalities/breakpoint/consecutive_breakpoints/TestConsecutiveBreakpoints.py (1746 of 1892) PASS: lldb-api :: functionalities/data-formatter/setvaluefromcstring/TestSetValueFromCString.py (1747 of 1892) PASS: lldb-unit :: ScriptInterpreter/Python/./ScriptInterpreterPythonTests/PythonDataObjectsTest.TestGlobalNameResolutionNoDot (1748 of 1892) PASS: lldb-api :: lang/objc/objc-struct-argument/TestObjCStructArgument.py (1749 of 1892) PASS: lldb-unit :: Utility/./UtilityTests/ScalarTest.SetValueFromCString (1750 of 1892) PASS: lldb-unit :: SymbolFile/DWARF/./SymbolFileDWARFTests/SymbolFileDWARFTests.TestAbbrevNullAttrValidForm (1751 of 1892) PASS: lldb-api :: lang/objc/objc-foundation-dictionary-empty/TestNSDictionary0.py (1752 of 1892) PASS: lldb-api :: macosx/order/TestOrderFile.py (1753 of 1892) PASS: lldb-unit :: Utility/./UtilityTests/StringExtractorTest.GetU64BigEndian (1754 of 1892) PASS: lldb-shell :: Breakpoint/debug_rnglist_basic.test (1755 of 1892) PASS: lldb-unit :: Symbol/./SymbolTests/Type.CompilerContextPattern (1756 of 1892) PASS: lldb-shell :: SymbolFile/NativePDB/ast-methods.cpp (1757 of 1892) PASS: lldb-unit :: Utility/./UtilityTests/StreamTeeTest.CopyConstructor (1758 of 1892) PASS: lldb-unit :: Utility/./UtilityTests/StreamTest.PutRawBytesToBigEndian (1759 of 1892) PASS: lldb-api :: functionalities/thread/concurrent_events/TestConcurrentSignalDelayBreak.py (1760 of 1892) PASS: lldb-shell :: SymbolFile/DWARF/debug-types-line-tables.s (1761 of 1892) PASS: lldb-api :: commands/command/script/import/rdar-12586188/TestRdar12586188.py (1762 of 1892) PASS: lldb-api :: lang/cpp/accelerator-table/TestCPPAccelerator.py (1763 of 1892) PASS: lldb-unit :: Utility/./UtilityTests/LogTest.Register (1764 of 1892) PASS: lldb-api :: functionalities/data-formatter/data-formatter-named-summaries/TestDataFormatterNamedSummaries.py (1765 of 1892) PASS: lldb-unit :: Utility/./UtilityTests/DataExtractorTest.GetCStrAtNullOffset (1766 of 1892) PASS: lldb-unit :: Expression/./ExpressionTests/DiagnosticManagerTest.FixedExpression (1767 of 1892) PASS: lldb-unit :: Utility/./UtilityTests/StringListTest.LongestCommonPrefixNoPrefix (1768 of 1892) PASS: lldb-unit :: SymbolFile/NativePDB/./SymbolFileNativePDBTests/PDBFPOProgramToDWARFExpressionTests.DependencyChain (1769 of 1892) PASS: lldb-api :: python_api/function_symbol/TestSymbolAPI.py (1770 of 1892) PASS: lldb-unit :: Utility/./UtilityTests/UriParserTest.BracketedHostnamePort (1771 of 1892) PASS: lldb-unit :: Expression/./ExpressionTests/CppModuleConfigurationTest.Sysroot (1772 of 1892) PASS: lldb-unit :: Utility/./UtilityTests/AnsiTerminal.AtEnd (1773 of 1892) PASS: lldb-api :: commands/frame/diagnose/array/TestArray.py (1774 of 1892) PASS: lldb-unit :: Utility/./UtilityTests/ProcessInfoTest.Constructor (1775 of 1892) PASS: lldb-unit :: UnwindAssembly/x86/./UnwindAssemblyx86Tests/Testx86AssemblyInspectionEngine.TestPopEDI (1776 of 1892) PASS: lldb-unit :: Host/./HostTests/NativeProcessProtocolTest.ReadCStringFromMemory (1777 of 1892) PASS: lldb-api :: functionalities/archives/TestBSDArchives.py (1778 of 1892) PASS: lldb-shell :: Driver/TestCore.test (1779 of 1892) PASS: lldb-unit :: Utility/./UtilityTests/ArgsTest.ReplaceArgumentAtIndexFarOutOfRange (1780 of 1892) PASS: lldb-api :: functionalities/data-formatter/data-formatter-stl/libcxx/multimap/TestDataFormatterLibccMultiMap.py (1781 of 1892) PASS: lldb-api :: functionalities/dynamic_value_child_count/TestDynamicValueChildCount.py (1782 of 1892) PASS: lldb-unit :: ScriptInterpreter/Python/./ScriptInterpreterPythonTests/PythonDataObjectsTest.TestPythonString (1783 of 1892) PASS: lldb-api :: functionalities/signal/handle-abrt/TestHandleAbort.py (1784 of 1892) PASS: lldb-shell :: ObjectFile/ELF/minidebuginfo-find-symbols.yaml (1785 of 1892) PASS: lldb-api :: lang/objc/unicode-string/TestUnicodeString.py (1786 of 1892) PASS: lldb-api :: lang/objc/modules-inline-functions/TestModulesInlineFunctions.py (1787 of 1892) PASS: lldb-unit :: Host/./HostTests/MainLoopTest.ReadObject (1788 of 1892) PASS: lldb-shell :: ObjectFile/PECOFF/dep-modules.yaml (1789 of 1892) XFAIL: lldb-shell :: Register/x86-64-write.test (1790 of 1892) PASS: lldb-api :: commands/expression/persistent_types/TestNestedPersistentTypes.py (1791 of 1892) PASS: lldb-api :: functionalities/thread/concurrent_events/TestConcurrentTwoBreakpointsOneWatchpoint.py (1792 of 1892) PASS: lldb-unit :: Utility/./UtilityTests/VMRange.Ordering (1793 of 1892) PASS: lldb-unit :: Expression/./ExpressionTests/CppModuleConfigurationTest.Xcode (1794 of 1892) PASS: lldb-api :: tools/lldb-server/TestGdbRemoteThreadsInStopReply.py (1795 of 1892) PASS: lldb-api :: commands/expression/issue_11588/Test11588.py (1796 of 1892) PASS: lldb-api :: functionalities/jitloader_gdb/TestJITLoaderGDB.py (1797 of 1892) PASS: lldb-api :: tools/lldb-server/TestGdbRemoteKill.py (1798 of 1892) PASS: lldb-api :: commands/frame/var-scope/TestFrameVariableScope.py (1799 of 1892) PASS: lldb-unit :: Utility/./UtilityTests/LogChannelEnabledTest.LogThread (1800 of 1892) PASS: lldb-api :: functionalities/multiword-commands/TestMultiWordCommands.py (1801 of 1892) PASS: lldb-api :: functionalities/thread/concurrent_events/TestConcurrentBreakpointDelayBreakpointOneSignal.py (1802 of 1892) PASS: lldb-unit :: Utility/./UtilityTests/StreamTeeTest.Assignment (1803 of 1892) PASS: lldb-api :: macosx/DBGSourcePathRemapping/TestDSYMSourcePathRemapping.py (1804 of 1892) PASS: lldb-api :: functionalities/gdb_remote_client/TestRegDefinitionInParts.py (1805 of 1892) PASS: lldb-api :: commands/expression/dont_allow_jit/TestAllowJIT.py (1806 of 1892) PASS: lldb-unit :: Utility/./UtilityTests/UUIDTest.SetFromStringRef (1807 of 1892) PASS: lldb-api :: commands/expression/po_verbosity/TestPoVerbosity.py (1808 of 1892) PASS: lldb-unit :: Utility/./UtilityTests/StateTest.Formatv (1809 of 1892) PASS: lldb-unit :: Utility/./UtilityTests/AnsiTerminal.Basic (1810 of 1892) PASS: lldb-api :: functionalities/data-formatter/frameformat_smallstruct/TestFrameFormatSmallStruct.py (1811 of 1892) UNSUPPORTED: lldb-api :: functionalities/data-formatter/data-formatter-stl/libstdcpp/tuple/TestDataFormatterStdTuple.py (1812 of 1892) PASS: lldb-unit :: Symbol/./SymbolTests/TestClangASTImporter.ImportInvalidType (1813 of 1892) PASS: lldb-api :: commands/expression/import-std-module/basic/TestImportStdModule.py (1814 of 1892) PASS: lldb-api :: functionalities/postmortem/mach-core/TestMachCore.py (1815 of 1892) PASS: lldb-unit :: Utility/./UtilityTests/StringListTest.SetSize (1816 of 1892) PASS: lldb-api :: commands/frame/var/TestFrameVar.py (1817 of 1892) PASS: lldb-unit :: Utility/./UtilityTests/BinaryStreamTest.PutSLEB128Zero (1818 of 1892) PASS: lldb-shell :: ObjectFile/ELF/short-build-id.yaml (1819 of 1892) PASS: lldb-unit :: Utility/./UtilityTests/StringListTest.SplitIntoLinesEmpty (1820 of 1892) PASS: lldb-api :: commands/command/delete/TestCommandDelete.py (1821 of 1892) PASS: lldb-unit :: Utility/./UtilityTests/ArgsTest.StringListConstructor (1822 of 1892) PASS: lldb-api :: tools/lldb-vscode/launch/TestVSCode_launch.py (1823 of 1892) UNSUPPORTED: lldb-api :: benchmarks/libcxxmap/TestBenchmarkLibcxxMap.py (1824 of 1892) PASS: lldb-unit :: Utility/./UtilityTests/AnsiTerminal.Twice (1825 of 1892) PASS: lldb-unit :: Utility/./UtilityTests/StringListTest.ForRange (1826 of 1892) UNSUPPORTED: lldb-api :: functionalities/darwin_log/filter/exact_match/activity/TestDarwinLogFilterMatchActivity.py (1827 of 1892) PASS: lldb-unit :: Utility/./UtilityTests/RecordReplayTest.InstrumentedBarRef (1828 of 1892) PASS: lldb-api :: commands/settings/TestSettings.py (1829 of 1892) PASS: lldb-unit :: Core/./LLDBCoreTests/StreamCallbackTest.Callback (1830 of 1892) PASS: lldb-unit :: Host/./HostTests/FileSystemTest.Resolve (1831 of 1892) PASS: lldb-unit :: Symbol/./SymbolTests/DWARFCallFrameInfoTest.Basic_dwarf4 (1832 of 1892) PASS: lldb-unit :: Utility/./UtilityTests/StatusTest.Formatv (1833 of 1892) PASS: lldb-unit :: Utility/./UtilityTests/BinaryStreamTest.PutULEB128NineBytes (1834 of 1892) PASS: lldb-shell :: SymbolFile/DWARF/DW_AT_loclists_base.s (1835 of 1892) PASS: lldb-unit :: Host/./HostTests/ConnectionFileDescriptorTest.TCPGetURIv4 (1836 of 1892) PASS: lldb-api :: commands/expression/call-function/TestCallStdStringFunction.py (1837 of 1892) PASS: lldb-unit :: Host/./HostTests/TaskPoolTest.RunTasks (1838 of 1892) PASS: lldb-api :: commands/process/attach/TestProcessAttach.py (1839 of 1892) PASS: lldb-unit :: UnwindAssembly/x86/./UnwindAssemblyx86Tests/Testx86AssemblyInspectionEngine.TestSubRSP (1840 of 1892) PASS: lldb-unit :: Platform/./LLDBPlatformTests/PlatformDarwinTest.TestParseVersionBuildDir (1841 of 1892) PASS: lldb-api :: lang/objc/blocks/TestObjCIvarsInBlocks.py (1842 of 1892) PASS: lldb-unit :: Process/gdb-remote/./ProcessGdbRemoteTests/GDBRemoteCommunicationServerTest.SendErrorResponse_UnimplementedError (1843 of 1892) PASS: lldb-shell :: BuildScript/compiler-full-path.test (1844 of 1892) PASS: lldb-api :: python_api/name_lookup/TestNameLookup.py (1845 of 1892) PASS: lldb-unit :: Process/gdb-remote/./ProcessGdbRemoteTests/GDBRemoteClientBaseTest.SendContinueAndWait (1846 of 1892) PASS: lldb-api :: lang/objc/variadic_methods/TestVariadicMethods.py (1847 of 1892) PASS: lldb-unit :: Utility/./UtilityTests/StringExtractorTest.GetHexBytes_FullString (1848 of 1892) PASS: lldb-api :: python_api/objc_type/TestObjCType.py (1849 of 1892) PASS: lldb-unit :: Expression/./ExpressionTests/DiagnosticManagerTest.GetStringNoDiags (1850 of 1892) PASS: lldb-unit :: SymbolFile/NativePDB/./SymbolFileNativePDBTests/PDBFPOProgramToDWARFExpressionTests.SingleAssignmentRegisterRef (1851 of 1892) PASS: lldb-api :: lang/cpp/template-function/TestTemplateFunctions.py (1852 of 1892) PASS: lldb-api :: lang/mixed/TestMixedLanguages.py (1853 of 1892) PASS: lldb-unit :: Utility/./UtilityTests/StringListTest.AppendStringCString (1854 of 1892) PASS: lldb-api :: python_api/process/TestProcessAPI.py (1855 of 1892) PASS: lldb-unit :: Utility/./UtilityTests/UserIDResolver.GetUserName (1856 of 1892) PASS: lldb-shell :: Settings/TestFrameFormatNoColor.test (1857 of 1892) PASS: lldb-unit :: Utility/./UtilityTests/SubsystemRAIITest.SubsystemWithErrorFailure (1858 of 1892) PASS: lldb-unit :: Utility/./UtilityTests/UriParserTest.TypicalPortPath (1859 of 1892) PASS: lldb-shell :: Expr/TestMultilineExpr.test (1860 of 1892) PASS: lldb-unit :: Process/gdb-remote/./ProcessGdbRemoteTests/GDBRemoteCommunicationClientTest.TestPacketSpeedJSON (1861 of 1892) PASS: lldb-api :: commands/expression/top-level/TestTopLevelExprs.py (1862 of 1892) PASS: lldb-api :: functionalities/step-avoids-no-debug/TestStepNoDebug.py (1863 of 1892) PASS: lldb-shell :: SymbolFile/DWARF/inline-function-address.ll (1864 of 1892) PASS: lldb-unit :: Expression/./ExpressionTests/DiagnosticManagerTest.HasFixits (1865 of 1892) PASS: lldb-api :: commands/process/attach/attach_denied/TestAttachDenied.py (1866 of 1892) PASS: lldb-unit :: Symbol/./SymbolTests/TestClangASTImporter.CanImportInvalidType (1867 of 1892) PASS: lldb-unit :: Language/Highlighting/./HighlighterTests/HighlighterTest.ClangCursorPosAfterOtherToken (1868 of 1892) PASS: lldb-unit :: Utility/./UtilityTests/FileSpecTest.IsRelative (1869 of 1892) PASS: lldb-unit :: Utility/./UtilityTests/BinaryStreamTest.PutULEB128FiveBytes (1870 of 1892) PASS: lldb-unit :: Process/minidump/./LLDBMinidumpTests/MinidumpParserTest.MinidumpModuleOrder (1871 of 1892) PASS: lldb-api :: macosx/duplicate-archive-members/TestDuplicateMembers.py (1872 of 1892) PASS: lldb-unit :: Utility/./UtilityTests/StringListTest.CopyListSingle (1873 of 1892) PASS: lldb-unit :: Utility/./UtilityTests/StringListTest.AppendStringStdString (1874 of 1892) PASS: lldb-unit :: Utility/./UtilityTests/AnsiTerminal.KnownPrefix (1875 of 1892) PASS: lldb-api :: functionalities/memory/find/TestMemoryFind.py (1876 of 1892) PASS: lldb-unit :: Utility/./UtilityTests/RangeTest.SizeTypes (1877 of 1892) PASS: lldb-api :: python_api/hello_world/TestHelloWorld.py (1878 of 1892) PASS: lldb-api :: lang/c/blocks/TestBlocks.py (1879 of 1892) PASS: lldb-api :: python_api/sbtype_typeclass/TestSBTypeTypeClass.py (1880 of 1892) PASS: lldb-api :: functionalities/data-formatter/summary-string-onfail/Test-rdar-9974002.py (1881 of 1892) PASS: lldb-api :: lang/c/global_variables/TestGlobalVariables.py (1882 of 1892) PASS: lldb-api :: commands/expression/import-std-module/weak_ptr/TestWeakPtr.py (1883 of 1892) PASS: lldb-api :: lang/objc/objc++/TestObjCXX.py (1884 of 1892) PASS: lldb-api :: lang/objc/real-definition/TestRealDefinition.py (1885 of 1892) PASS: lldb-api :: lang/objc/rdar-10967107/TestRdar10967107.py (1886 of 1892) PASS: lldb-api :: commands/expression/import-std-module/vector-basic/TestBasicVector.py (1887 of 1892) PASS: lldb-api :: types/TestShortType.py (1888 of 1892) PASS: lldb-api :: lang/objc/print-obj/TestPrintObj.py (1889 of 1892) PASS: lldb-api :: functionalities/load_unload/TestLoadUnload.py (1890 of 1892) PASS: lldb-api :: types/TestLongTypesExpr.py (1891 of 1892) PASS: lldb-api :: lang/objc/objc-new-syntax/TestObjCNewSyntaxLiteral.py (1892 of 1892)

Hide Details

Testing Time: 3492.09s ******************** Failing Tests (11): lldb-api :: functionalities/data-formatter/data-formatter-objc/TestDataFormatterObjCPlain.py lldb-api :: functionalities/data-formatter/data-formatter-objc/TestDataFormatterObjCNSError.py lldb-api :: functionalities/data-formatter/data-formatter-objc/TestDataFormatterObjCNSContainer.py lldb-api :: functionalities/data-formatter/data-formatter-objc/TestDataFormatterObjCNSData.py lldb-api :: functionalities/data-formatter/data-formatter-objc/TestDataFormatterObjCNSDate.py lldb-api :: functionalities/data-formatter/data-formatter-objc/TestDataFormatterObjCKVO.py lldb-api :: functionalities/data-formatter/data-formatter-objc/TestDataFormatterObjCExpr.py lldb-api :: functionalities/data-formatter/data-formatter-objc/TestDataFormatterObjCNSURL.py lldb-api :: functionalities/data-formatter/data-formatter-objc/TestDataFormatterObjCCF.py lldb-api :: functionalities/data-formatter/data-formatter-objc/TestDataFormatterObjCNSBundle.py lldb-api :: functionalities/data-formatter/data-formatter-objc/TestDataFormatterObjNSException.py

Hide Details

Hide Details

Slowest Tests: -------------------------------------------------------------------------- 305.23s: lldb-api :: commands/expression/import-std-module/stack/TestStack.py 310.13s: lldb-api :: lang/objc/foundation/TestRuntimeTypes.py 315.84s: lldb-api :: commands/expression/import-std-module/vector-dbg-info-content/TestDbgInfoContentVector.py 324.67s: lldb-api :: functionalities/data-formatter/compactvectors/TestCompactVectors.py 325.73s: lldb-api :: types/TestIntegerTypeExpr.py 332.69s: lldb-api :: functionalities/recursion/TestValueObjectRecursion.py 354.35s: lldb-api :: functionalities/data-formatter/poarray/TestPrintObjectArray.py 370.41s: lldb-api :: tools/lldb-server/TestGdbRemoteThreadsInStopReply.py 411.82s: lldb-api :: lang/objc/foundation/TestObjCMethodsString.py 415.73s: lldb-api :: lang/objc/foundation/TestObjCMethodsNSError.py 418.37s: lldb-api :: lang/objc/objc-new-syntax/TestObjCNewSyntaxDictionary.py 421.82s: lldb-api :: lang/objc/objc-new-syntax/TestObjCNewSyntaxArray.py 479.27s: lldb-api :: lang/objc/exceptions/TestObjCExceptions.py 490.93s: lldb-api :: lang/objc/real-definition/TestRealDefinition.py 554.87s: lldb-api :: lang/cpp/namespace/TestNamespaceLookup.py 800.69s: lldb-api :: lang/objc/foundation/TestObjCMethods.py 883.64s: lldb-api :: lang/objc/hidden-ivars/TestHiddenIvars.py 953.66s: lldb-api :: api/multithreaded/TestMultithreaded.py 957.69s: lldb-api :: lang/cpp/enum_types/TestCPP11EnumTypes.py 1043.96s: lldb-api :: tools/lldb-server/TestLldbGdbServer.py

Hide Details

Tests Times: -------------------------------------------------------------------------- [ Range ] :: [ Percentage ] :: [ Count ] -------------------------------------------------------------------------- [ 0s, 100s) :: [************************************ ] :: [1720/1892] [ 100s, 200s) :: [** ] :: [ 117/1892] [ 200s, 300s) :: [ ] :: [ 31/1892] [ 300s, 400s) :: [ ] :: [ 12/1892] [ 400s, 500s) :: [ ] :: [ 4/1892] [ 500s, 600s) :: [ ] :: [ 3/1892] [ 600s, 700s) :: [ ] :: [ 0/1892] [ 700s, 800s) :: [ ] :: [ 0/1892] [ 800s, 900s) :: [ ] :: [ 1/1892] [ 900s,1000s) :: [ ] :: [ 1/1892] [1000s,1100s) :: [ ] :: [ 3/1892] Expected Passes : 1713 Expected Failures : 6 Unsupported Tests : 162 Unexpected Failures: 11 FAILED: tools/lldb/test/CMakeFiles/check-lldb-lit cd /Users/buildslave/jenkins/workspace/lldb-cmake-sanitized/lldb-build/tools/lldb/test && /usr/local/bin/python /Users/buildslave/jenkins/workspace/lldb-cmake-sanitized/lldb-build/./bin/llvm-lit -v --time-tests --shuffle --xunit-xml-output=/Users/buildslave/jenkins/workspace/lldb-cmake-sanitized/test/results.xml -v --timeout 1200 /Users/buildslave/jenkins/workspace/lldb-cmake-sanitized/lldb-build/tools/lldb/test ninja: build stopped: subcommand failed. Command failed: Command '['/usr/bin/env', 'TERM=vt100', '/usr/local/bin/ninja', '-v', 'check-lldb']' returned non-zero exit status 1. Command: ['/usr/bin/env', 'TERM=vt100', '/usr/local/bin/ninja', '-v', 'check-lldb'] [Pipeline] } [Pipeline] // timeout [Pipeline] } [Pipeline] // stage [Pipeline] stage [Pipeline] { (Declarative: Post Actions) [Pipeline] scanForIssues No credentials specified [Clang (LLVM based)] Sleeping for 5 seconds due to JENKINS-32191... [Clang (LLVM based)] Parsing console log (workspace: '/Users/buildslave/jenkins/workspace/lldb-cmake-sanitized') [Pipeline] junit Recording test results [Pipeline] } [Pipeline] // stage [Pipeline] } [Pipeline] // withEnv [Pipeline] } [Pipeline] // node [Pipeline] End of Pipeline ERROR: script returned exit code 1 Finished: FAILURE