FailedConsole Output

Skipping 8,128 KB.. Full Log
nts/TestConcurrentDelayedCrashWithBreakpointSignal.py (349 of 1808)
PASS: lldb-api :: functionalities/data-formatter/data-formatter-stl/libcxx/list/TestDataFormatterLibcxxList.py (350 of 1808)
PASS: lldb-api :: lang/cpp/virtual-overload/TestVirtualOverload.py (351 of 1808)
PASS: lldb-unit :: Target/./TargetTests/ExecutionContextTest.GetByteOrder (352 of 1808)
PASS: lldb-api :: functionalities/thread/create_after_attach/TestCreateAfterAttach.py (353 of 1808)
PASS: lldb-unit :: UnwindAssembly/x86/./UnwindAssemblyx86Tests/Testx86AssemblyInspectionEngine.TestSpArithx86_64Augmented (354 of 1808)
PASS: lldb-shell :: SymbolFile/DWARF/debug-types-dwarf5.s (355 of 1808)
PASS: lldb-shell :: Settings/TestSettingsSet.test (356 of 1808)
PASS: lldb-unit :: Utility/./UtilityTests/StreamTest.PutCStringWithStringRef (357 of 1808)
PASS: lldb-api :: functionalities/gdb_remote_client/TestWriteMemory.py (358 of 1808)
PASS: lldb-api :: python_api/value/linked_list/TestValueAPILinkedList.py (359 of 1808)
PASS: lldb-shell :: SymbolFile/Breakpad/line-table-edgecases.test (360 of 1808)
PASS: lldb-api :: lang/c/bitfields/TestBitfields.py (361 of 1808)
PASS: lldb-api :: commands/expression/import-std-module/empty-module/TestEmptyStdModule.py (362 of 1808)
PASS: lldb-unit :: Host/./HostTests/SocketTest.TCPGetConnectURI (363 of 1808)
PASS: lldb-unit :: Expression/./ExpressionTests/CppModuleConfigurationTest.UnknownLibCppFile (364 of 1808)
PASS: lldb-api :: functionalities/tail_call_frames/thread_step_out_or_return/TestSteppingOutWithArtificialFrames.py (365 of 1808)
PASS: lldb-unit :: Utility/./UtilityTests/RangeTest.ContainsEndInclusive (366 of 1808)
PASS: lldb-shell :: Python/crashlog.test (367 of 1808)
PASS: lldb-unit :: Host/./HostTests/NativeProcessProtocolTest.SetBreakpointFailWrite (368 of 1808)
PASS: lldb-shell :: SymbolFile/NativePDB/global-classes.cpp (369 of 1808)
PASS: lldb-unit :: Utility/./UtilityTests/FileSpecTest.GetNormalizedPath (370 of 1808)
PASS: lldb-unit :: ScriptInterpreter/Python/./ScriptInterpreterPythonTests/PythonDataObjectsTest.TestPythonByteArray (371 of 1808)
UNSUPPORTED: lldb-shell :: SymbolFile/PDB/vbases.test (372 of 1808)
PASS: lldb-unit :: Utility/./UtilityTests/StringListTest.AppendStringMove (373 of 1808)
PASS: lldb-unit :: Utility/./UtilityTests/RangeDataVector.FindEntryThatContains_Overlap (374 of 1808)
PASS: lldb-api :: lang/cpp/namespace_definitions/TestNamespaceDefinitions.py (375 of 1808)
PASS: lldb-api :: python_api/value/TestValueAPI.py (376 of 1808)
PASS: lldb-api :: commands/expression/unicode-in-variable/TestUnicodeInVariable.py (377 of 1808)
PASS: lldb-api :: functionalities/postmortem/elf-core/gcore/TestGCore.py (378 of 1808)
PASS: lldb-unit :: Language/Highlighting/./HighlighterTests/HighlighterTest.Colons (379 of 1808)
PASS: lldb-unit :: Process/minidump/./LLDBMinidumpTests/MinidumpParserTest.FindMemoryRange (380 of 1808)
PASS: lldb-unit :: Editline/./EditlineTests/EditlineTestFixture.EditlineReceivesSingleLineText (381 of 1808)
PASS: lldb-unit :: Expression/./ExpressionTests/ClangHostTest.ComputeClangResourceDirectory (382 of 1808)
PASS: lldb-api :: lang/cpp/namespace_conflicts/TestNamespaceConflicts.py (383 of 1808)
PASS: lldb-unit :: Process/gdb-remote/./ProcessGdbRemoteTests/GDBRemoteCommunicationClientTest.SendGetMetaDataPacket (384 of 1808)
PASS: lldb-unit :: Utility/./UtilityTests/CompletionRequest.Constructor (385 of 1808)
PASS: lldb-unit :: Utility/./UtilityTests/ArgsTest.BareSingleQuote (386 of 1808)
PASS: lldb-unit :: Symbol/./SymbolTests/TestClangASTContext.TestGetBasicTypeFromEnum (387 of 1808)
UNSUPPORTED: lldb-shell :: Breakpoint/case-insensitive.test (388 of 1808)
PASS: lldb-unit :: Utility/./UtilityTests/BroadcasterTest.BroadcastEvent (389 of 1808)
PASS: lldb-api :: commands/expression/import-std-module/weak_ptr/TestWeakPtr.py (390 of 1808)
PASS: lldb-unit :: Utility/./UtilityTests/StringListTest.ShiftCString (391 of 1808)
PASS: lldb-unit :: ObjectFile/Breakpad/./ObjectFileBreakpadTests/FileRecord.parse (392 of 1808)
PASS: lldb-unit :: Utility/./UtilityTests/LogChannelEnabledTest.log_options (393 of 1808)
UNSUPPORTED: lldb-shell :: Register/x86-ymm-write.test (394 of 1808)
PASS: lldb-api :: lang/objc/single-entry-dictionary/TestObjCSingleEntryDictionary.py (395 of 1808)
PASS: lldb-shell :: SymbolFile/DWARF/parallel-indexing-stress.s (396 of 1808)
PASS: lldb-unit :: Process/minidump/./LLDBMinidumpTests/MinidumpParserTest.GetMemoryRegionInfoFromMemory64List (397 of 1808)
PASS: lldb-unit :: UnwindAssembly/x86/./UnwindAssemblyx86Tests/Testx86AssemblyInspectionEngine.TestDisassemblyJunkBytes (398 of 1808)
PASS: lldb-api :: source-manager/TestSourceManager.py (399 of 1808)
PASS: lldb-unit :: Process/minidump/./LLDBMinidumpTests/RegisterContextMinidump.ConvertMinidumpContext_x86_64 (400 of 1808)
PASS: lldb-api :: functionalities/gdb_remote_client/TestPlatformClient.py (401 of 1808)
PASS: lldb-api :: lang/objcxx/hide-runtime-values/TestObjCXXHideRuntimeValues.py (402 of 1808)
XFAIL: lldb-shell :: Register/x86-mm-xmm-read.test (403 of 1808)
PASS: lldb-api :: functionalities/postmortem/elf-core/TestLinuxCore.py (404 of 1808)
PASS: lldb-unit :: Language/CPlusPlus/./LanguageCPlusPlusTests/CPlusPlusLanguage.MethodNameParsing (405 of 1808)
PASS: lldb-api :: macosx/DBGSourcePathRemapping/TestDSYMSourcePathRemapping.py (406 of 1808)
PASS: lldb-shell :: ObjectFile/ELF/many-sections.s (407 of 1808)
PASS: lldb-unit :: Utility/./UtilityTests/ArgsTest.ReplaceArgumentAtIndexOutOfRange (408 of 1808)
UNSUPPORTED: lldb-api :: tools/lldb-server/TestGdbRemoteAuxvSupport.py (409 of 1808)
PASS: lldb-unit :: Core/./LLDBCoreTests/RichManglingContextTest.FromCxxMethodName (410 of 1808)
PASS: lldb-api :: python_api/frame/get-variables/TestGetVariables.py (411 of 1808)
PASS: lldb-unit :: Expression/./ExpressionTests/CppModuleConfigurationTest.Linux (412 of 1808)
PASS: lldb-unit :: Utility/./UtilityTests/ConstStringTest.MangledCounterpart (413 of 1808)
PASS: lldb-api :: functionalities/data-formatter/data-formatter-disabling/TestDataFormatterDisabling.py (414 of 1808)
PASS: lldb-unit :: Utility/./UtilityTests/SerializationRountripTest.SerializeDeserializePodPointers (415 of 1808)
PASS: lldb-unit :: Language/Highlighting/./HighlighterTests/HighlighterTest.ClangTrailingBackslashWithWhitespace (416 of 1808)
UNSUPPORTED: lldb-api :: functionalities/thread/thread_specific_break_plus_condition/TestThreadSpecificBpPlusCondition.py (417 of 1808)
PASS: lldb-api :: lang/cpp/rvalue-references/TestRvalueReferences.py (418 of 1808)
PASS: lldb-api :: commands/watchpoints/watchpoint_commands/TestWatchpointCommands.py (419 of 1808)
PASS: lldb-api :: functionalities/postmortem/wow64_minidump/TestWow64MiniDump.py (420 of 1808)
PASS: lldb-unit :: Language/Highlighting/./HighlighterTests/HighlighterTest.HighlighterSelectionType (421 of 1808)
PASS: lldb-unit :: Host/./HostTests/TaskPoolTest.AddTask (422 of 1808)
UNSUPPORTED: lldb-shell :: SymbolFile/PDB/expressions.test (423 of 1808)
PASS: lldb-api :: functionalities/data-formatter/vector-types/TestVectorTypesFormatting.py (424 of 1808)
PASS: lldb-unit :: Utility/./UtilityTests/StringExtractorTest.GetHexU8_Exact_NoEof (425 of 1808)
PASS: lldb-api :: commands/expression/rdar42038760/TestScalarURem.py (426 of 1808)
PASS: lldb-api :: python_api/function_symbol/TestSymbolAPI.py (427 of 1808)
PASS: lldb-unit :: Utility/./UtilityTests/StringExtractorTest.GetNameColonValueContainsColon (428 of 1808)
PASS: lldb-unit :: Symbol/./SymbolTests/TestClangASTContext.TestRecordHasFields (429 of 1808)
PASS: lldb-api :: python_api/debugger/TestDebuggerAPI.py (430 of 1808)
PASS: lldb-api :: functionalities/gdb_remote_client/TestNoGPacketSupported.py (431 of 1808)
PASS: lldb-unit :: Host/./HostTests/NativeProcessProtocolTest.SetBreakpoint (432 of 1808)
PASS: lldb-unit :: Process/gdb-remote/./ProcessGdbRemoteTests/GDBRemoteCommunicationClientTest.SendStopTracePacket (433 of 1808)
PASS: lldb-unit :: Utility/./UtilityTests/ArgsTest.TestAppendArg (434 of 1808)
PASS: lldb-api :: functionalities/inferior-crashing/recursive-inferior/TestRecursiveInferiorStep.py (435 of 1808)
PASS: lldb-api :: python_api/hello_world/TestHelloWorld.py (436 of 1808)
PASS: lldb-shell :: Settings/TestDisableColor.test (437 of 1808)
PASS: lldb-shell :: SymbolFile/DWARF/debug_ranges_and_rnglists.test (438 of 1808)
PASS: lldb-shell :: Minidump/dump-all.test (439 of 1808)
UNSUPPORTED: lldb-shell :: Register/x86-gp-write.test (440 of 1808)
PASS: lldb-unit :: Utility/./UtilityTests/SerializationRountripTest.SerializeDeserializePodReferences (441 of 1808)
PASS: lldb-unit :: Expression/./ExpressionTests/DiagnosticManagerTest.AppendMessageSubsequentDiags (442 of 1808)
PASS: lldb-api :: functionalities/data-formatter/pyobjsynthprovider/TestPyObjSynthProvider.py (443 of 1808)
PASS: lldb-unit :: ScriptInterpreter/Python/./ScriptInterpreterPythonTests/PythonDataObjectsTest.TestTypeNameResolutionNoDot (444 of 1808)
PASS: lldb-unit :: Expression/./ExpressionTests/ClangHostTest.MacOSX (445 of 1808)
PASS: lldb-unit :: Utility/./UtilityTests/StreamTeeTest.GetStreamAtIndexOutOfBoundsEmpty (446 of 1808)
PASS: lldb-api :: lang/cpp/unique-types/TestUniqueTypes.py (447 of 1808)
PASS: lldb-unit :: Core/./LLDBCoreTests/RichManglingContextTest.Basic (448 of 1808)
PASS: lldb-unit :: Target/./TargetTests/ExecutionContextTest.GetByteOrderProcess (449 of 1808)
PASS: lldb-unit :: Utility/./UtilityTests/BinaryStreamTest.PutSLEB128TwoBytes (450 of 1808)
PASS: lldb-unit :: Utility/./UtilityTests/ArgsTest.TestSingleArgWithQuotedSpace (451 of 1808)
PASS: lldb-shell :: ObjectFile/PECOFF/symbol.yaml (452 of 1808)
PASS: lldb-api :: commands/target/stop-hooks/TestStopHooks.py (453 of 1808)
PASS: lldb-unit :: Utility/./UtilityTests/RegularExpression.Match (454 of 1808)
PASS: lldb-shell :: Minidump/breakpad-symbols.test (455 of 1808)
PASS: lldb-unit :: Utility/./UtilityTests/StringListTest.AppendList (456 of 1808)
PASS: lldb-api :: commands/expression/import-std-module/forward_list-dbg-info-content/TestDbgInfoContentForwardList.py (457 of 1808)
PASS: lldb-api :: functionalities/data-formatter/data-formatter-advanced/TestDataFormatterAdv.py (458 of 1808)
PASS: lldb-shell :: Commands/CommandScriptImmediateOutput/CommandScriptImmediateOutputConsole.test (459 of 1808)
PASS: lldb-api :: functionalities/thread/concurrent_events/TestConcurrentBreakpointDelayBreakpointOneSignal.py (460 of 1808)
PASS: lldb-api :: functionalities/gdb_remote_client/TestArmRegisterDefinition.py (461 of 1808)
PASS: lldb-shell :: BuildScript/toolchain-clang.test (462 of 1808)
PASS: lldb-api :: python_api/value_var_update/TestValueVarUpdate.py (463 of 1808)
PASS: lldb-unit :: Platform/./LLDBPlatformTests/PlatformDarwinTest.TestParseVersionBuildDir (464 of 1808)
PASS: lldb-api :: commands/expression/import-std-module/vector-basic/TestBasicVector.py (465 of 1808)
PASS: lldb-unit :: Utility/./UtilityTests/StringListTest.SplitIntoLinesSingleTrailingCR (466 of 1808)
PASS: lldb-api :: functionalities/thread/concurrent_events/TestConcurrentNWatchNBreak.py (467 of 1808)
PASS: lldb-api :: api/multiple-targets/TestMultipleTargets.py (468 of 1808)
PASS: lldb-api :: functionalities/data-formatter/data-formatter-python-synth/TestDataFormatterPythonSynth.py (469 of 1808)
PASS: lldb-api :: commands/watchpoints/watchpoint_commands/command/TestWatchpointCommandLLDB.py (470 of 1808)
PASS: lldb-api :: commands/add-dsym/uuid/TestAddDsymCommand.py (471 of 1808)
PASS: lldb-unit :: Editline/./EditlineTests/EditlineTestFixture.EditlineReceivesMultiLineText (472 of 1808)
PASS: lldb-api :: functionalities/data-formatter/data-formatter-categories/TestDataFormatterCategories.py (473 of 1808)
PASS: lldb-unit :: Language/Highlighting/./HighlighterTests/HighlighterTest.ClangCursorPosInOtherToken (474 of 1808)
PASS: lldb-api :: lang/objc/foundation/TestObjCMethodsString.py (475 of 1808)
PASS: lldb-shell :: Register/x86-64-gp-read.test (476 of 1808)
PASS: lldb-api :: functionalities/thread/concurrent_events/TestConcurrentTwoBreakpointThreads.py (477 of 1808)
PASS: lldb-api :: functionalities/archives/TestBSDArchives.py (478 of 1808)
PASS: lldb-shell :: SymbolFile/NativePDB/break-by-line.cpp (479 of 1808)
PASS: lldb-unit :: ScriptInterpreter/Python/./ScriptInterpreterPythonTests/PythonDataObjectsTest.TestPythonIntegerToStr (480 of 1808)
PASS: lldb-api :: lang/cpp/offsetof/TestOffsetofCpp.py (481 of 1808)
PASS: lldb-unit :: Utility/./UtilityTests/OptionsWithRawTest.WhitespaceSuffix (482 of 1808)
PASS: lldb-api :: functionalities/tail_call_frames/ambiguous_tail_call_seq1/TestAmbiguousTailCallSeq1.py (483 of 1808)
PASS: lldb-unit :: ScriptInterpreter/Python/./ScriptInterpreterPythonTests/PythonDataObjectsTest.TestPythonListValueEquality (484 of 1808)
PASS: lldb-unit :: Utility/./UtilityTests/BinaryStreamTest.PutSLEB128Zero (485 of 1808)
PASS: lldb-unit :: Utility/./UtilityTests/AnsiTerminal.Twice (486 of 1808)
PASS: lldb-api :: functionalities/data-formatter/boolreference/TestFormattersBoolRefPtr.py (487 of 1808)
PASS: lldb-unit :: UnwindAssembly/x86/./UnwindAssemblyx86Tests/Testx86AssemblyInspectionEngine.TestPushRBPWithREX (488 of 1808)
UNSUPPORTED: lldb-shell :: SymbolFile/PDB/ast-restore.test (489 of 1808)
PASS: lldb-api :: macosx/indirect_symbol/TestIndirectSymbols.py (490 of 1808)
PASS: lldb-unit :: Host/./HostTests/NativeProcessProtocolTest.ReadCStringFromMemory_CrossPageBoundary (491 of 1808)
PASS: lldb-unit :: Utility/./UtilityTests/CompletionRequest.FakeLastArg (492 of 1808)
PASS: lldb-unit :: Process/minidump/./LLDBMinidumpTests/MinidumpParserTest.GetLinuxProcStatus_no_stream (493 of 1808)
PASS: lldb-unit :: Utility/./UtilityTests/StringListTest.JoinMultiCharSeparator (494 of 1808)
PASS: lldb-api :: functionalities/data-formatter/refpointer-recursion/TestDataFormatterRefPtrRecursion.py (495 of 1808)
PASS: lldb-unit :: Utility/./UtilityTests/AnsiTerminal.AtStart (496 of 1808)
PASS: lldb-unit :: Utility/./UtilityTests/StringExtractorTest.DecodeHexU8_Extra (497 of 1808)
PASS: lldb-api :: macosx/thread-names/TestInterruptThreadNames.py (498 of 1808)
PASS: lldb-unit :: Utility/./UtilityTests/StringListTest.GetMaxStringLengthEmpty (499 of 1808)
PASS: lldb-unit :: Language/CPlusPlus/./LanguageCPlusPlusTests/CPlusPlusLanguage.CPlusPlusNameParser (500 of 1808)
PASS: lldb-shell :: Driver/TestConvenienceVariables.test (501 of 1808)
PASS: lldb-api :: functionalities/data-formatter/data-formatter-objc/TestDataFormatterObjCNSDate.py (502 of 1808)
PASS: lldb-shell :: Quit/TestQuitExitCode0.test (503 of 1808)
PASS: lldb-unit :: Host/./HostTests/Host.WaitStatusFormat (504 of 1808)
PASS: lldb-unit :: Utility/./UtilityTests/LogChannelEnabledTest.LogVerboseThread (505 of 1808)
PASS: lldb-api :: lang/objcxx/cxx-bridged-po/TestObjCXXBridgedPO.py (506 of 1808)
PASS: lldb-api :: lang/cpp/unsigned_types/TestUnsignedTypes.py (507 of 1808)
PASS: lldb-unit :: Language/Highlighting/./HighlighterTests/HighlighterTest.ClangCursorPos (508 of 1808)
PASS: lldb-unit :: Utility/./UtilityTests/UUIDTest.Validity (509 of 1808)
PASS: lldb-unit :: Utility/./UtilityTests/VASprintfTest.BufferResize (510 of 1808)
PASS: lldb-api :: commands/expression/radar_9673664/TestExprHelpExamples.py (511 of 1808)
PASS: lldb-api :: functionalities/data-formatter/data-formatter-objc/TestDataFormatterObjCNSBundle.py (512 of 1808)
PASS: lldb-unit :: tools/lldb-server/tests/./LLDBServerTests/TestBase.DebugserverEnv (513 of 1808)
PASS: lldb-api :: functionalities/signal/TestSendSignal.py (514 of 1808)
PASS: lldb-shell :: Settings/TestSettingsWrite.test (515 of 1808)
PASS: lldb-unit :: Utility/./UtilityTests/ArgsTest.TestInsertArg (516 of 1808)
PASS: lldb-api :: commands/expression/context-object/TestContextObject.py (517 of 1808)
PASS: lldb-unit :: Utility/./UtilityTests/GeneratorTest.Create (518 of 1808)
UNSUPPORTED: lldb-shell :: SymbolFile/NativePDB/stack_unwinding01.cpp (519 of 1808)
PASS: lldb-unit :: Utility/./UtilityTests/StringExtractorTest.GetU32BigEndian (520 of 1808)
PASS: lldb-api :: python_api/frame/TestFrames.py (521 of 1808)
PASS: lldb-shell :: Driver/TestFile.test (522 of 1808)
PASS: lldb-shell :: Host/TestCustomShell.test (523 of 1808)
PASS: lldb-unit :: Utility/./UtilityTests/BinaryStreamTest.PutSLEB128OneByte (524 of 1808)
PASS: lldb-unit :: Utility/./UtilityTests/ScalarTest.Equality (525 of 1808)
UNSUPPORTED: lldb-shell :: BuildScript/toolchain-msvc.test (526 of 1808)
PASS: lldb-api :: functionalities/thread/concurrent_events/TestConcurrentManyBreakpoints.py (527 of 1808)
PASS: lldb-unit :: SymbolFile/DWARF/./SymbolFileDWARFTests/DWARFASTParserClangTests.EnsureAllDIEsInDeclContextHaveBeenParsedParsesOnlyMatchingEntries (528 of 1808)
PASS: lldb-unit :: Utility/./UtilityTests/StringExtractorTest.DecodeHexU8_InvalidHex (529 of 1808)
UNSUPPORTED: lldb-shell :: Breakpoint/ppc64-localentry.test (530 of 1808)
PASS: lldb-unit :: Utility/./UtilityTests/ProcessInstanceInfo.Dump (531 of 1808)
PASS: lldb-unit :: Utility/./UtilityTests/VMRange.ContainsAddr (532 of 1808)
PASS: lldb-api :: commands/expression/call-function/TestCallStdStringFunction.py (533 of 1808)
UNSUPPORTED: lldb-api :: functionalities/data-formatter/data-formatter-stl/libstdcpp/string/TestDataFormatterStdString.py (534 of 1808)
PASS: lldb-api :: functionalities/data-formatter/user-format-vs-summary/TestUserFormatVsSummary.py (535 of 1808)
PASS: lldb-api :: commands/expression/xvalue/TestXValuePrinting.py (536 of 1808)
PASS: lldb-unit :: Interpreter/./InterpreterTests/OptionArgParserTest.toScriptLanguage (537 of 1808)
PASS: lldb-unit :: Symbol/./SymbolTests/Type.GetTypeScopeAndBasename (538 of 1808)
PASS: lldb-unit :: Utility/./UtilityTests/ArchSpecTest.TestParseMachCPUDashSubtypeTripleExtra (539 of 1808)
PASS: lldb-unit :: Utility/./UtilityTests/StringListTest.Assignment (540 of 1808)
PASS: lldb-unit :: Language/Highlighting/./HighlighterTests/HighlighterTest.ClangComments (541 of 1808)
PASS: lldb-api :: functionalities/data-formatter/data-formatter-stl/libcxx/set/TestDataFormatterLibcxxSet.py (542 of 1808)
PASS: lldb-api :: functionalities/data-formatter/data-formatter-stl/libcxx/map/TestDataFormatterLibccMap.py (543 of 1808)
PASS: lldb-api :: python_api/value/empty_class/TestValueAPIEmptyClass.py (544 of 1808)
PASS: lldb-unit :: SymbolFile/DWARF/./SymbolFileDWARFTests/SymbolFileDWARFTests.TestAbbrevOrder1Start5 (545 of 1808)
UNSUPPORTED: lldb-api :: benchmarks/frame_variable/TestFrameVariableResponse.py (546 of 1808)
PASS: lldb-unit :: Utility/./UtilityTests/StringExtractorTest.GetNameColonValueNoSemicolon (547 of 1808)
PASS: lldb-unit :: Symbol/./SymbolTests/LineEntryTest.GetSameLineContiguousAddressRangeNoInlines (548 of 1808)
PASS: lldb-api :: functionalities/data-formatter/data-formatter-stl/libcxx/function/TestLibCxxFunction.py (549 of 1808)
PASS: lldb-shell :: Process/TestEnvironment.test (550 of 1808)
PASS: lldb-unit :: Utility/./UtilityTests/BinaryStreamTest.PutSLEB128MaxValue (551 of 1808)
UNSUPPORTED: lldb-api :: commands/watchpoints/multi_watchpoint_slots/TestWatchpointMultipleSlots.py (552 of 1808)
PASS: lldb-unit :: Utility/./UtilityTests/RegularExpression.Empty (553 of 1808)
PASS: lldb-unit :: Utility/./UtilityTests/RangeTest.LessThan (554 of 1808)
PASS: lldb-shell :: SymbolFile/Breakpad/line-table.test (555 of 1808)
PASS: lldb-api :: macosx/nslog/TestDarwinNSLogOutput.py (556 of 1808)
PASS: lldb-api :: lang/c/conflicting-symbol/TestConflictingSymbol.py (557 of 1808)
PASS: lldb-unit :: Utility/./UtilityTests/ListenerTest.GetEventWait (558 of 1808)
PASS: lldb-unit :: Process/minidump/./LLDBMinidumpTests/MinidumpParserTest.GetLinuxProcStatus (559 of 1808)
PASS: lldb-unit :: UnwindAssembly/x86/./UnwindAssemblyx86Tests/Testx86AssemblyInspectionEngine.TestPushECX (560 of 1808)
PASS: lldb-api :: commands/expression/import_builtin_fileid/TestImportBuiltinFileID.py (561 of 1808)
PASS: lldb-api :: lang/cpp/stl/TestStdCXXDisassembly.py (562 of 1808)
PASS: lldb-unit :: Utility/./UtilityTests/NameMatchesTest.StartsWith (563 of 1808)
PASS: lldb-shell :: Breakpoint/split-dwarf-5-addrbase.test (564 of 1808)
PASS: lldb-api :: macosx/duplicate-archive-members/TestDuplicateMembers.py (565 of 1808)
PASS: lldb-unit :: Host/./HostTests/HostInfoTest.GetAugmentedArchSpec (566 of 1808)
PASS: lldb-api :: python_api/frame/inlines/TestInlinedFrame.py (567 of 1808)
PASS: lldb-unit :: Utility/./UtilityTests/StringExtractorTest.GetHexU8_InvalidHex_NoEof (568 of 1808)
PASS: lldb-unit :: Utility/./UtilityTests/StructuredDataTest.ParseJSONFromFile (569 of 1808)
PASS: lldb-unit :: Utility/./UtilityTests/StringListTest.ShiftMove (570 of 1808)
PASS: lldb-api :: python_api/watchpoint/TestSetWatchpoint.py (571 of 1808)
PASS: lldb-api :: functionalities/inferior-crashing/recursive-inferior/TestRecursiveInferior.py (572 of 1808)
PASS: lldb-unit :: Expression/./ExpressionTests/CppModuleConfigurationTest.MissingLibCpp (573 of 1808)
UNSUPPORTED: lldb-shell :: Register/arm-gp-read.test (574 of 1808)
PASS: lldb-shell :: ObjectFile/PECOFF/basic-info-arm64.yaml (575 of 1808)
PASS: lldb-unit :: Utility/./UtilityTests/BinaryStreamTest.PutULEB128ThreeBytes (576 of 1808)
PASS: lldb-api :: functionalities/step_scripted/TestStepScripted.py (577 of 1808)
PASS: lldb-shell :: SymbolFile/DWARF/debug_loc.s (578 of 1808)
PASS: lldb-api :: lang/cpp/char8_t/TestCxxChar8_t.py (579 of 1808)
PASS: lldb-api :: functionalities/signal/handle-abrt/TestHandleAbort.py (580 of 1808)
PASS: lldb-api :: commands/expression/import-std-module/list-basic/TestBasicList.py (581 of 1808)
PASS: lldb-unit :: Process/gdb-remote/./ProcessGdbRemoteTests/GDBRemoteCommunicationClientTest.GetMemoryRegionInfo (582 of 1808)
PASS: lldb-api :: functionalities/thread/concurrent_events/TestConcurrentDelayedCrashWithBreakpointWatchpoint.py (583 of 1808)
PASS: lldb-api :: sample_test/TestSampleInlineTest.py (584 of 1808)
PASS: lldb-api :: functionalities/data-formatter/parray/TestPrintArray.py (585 of 1808)
PASS: lldb-api :: python_api/formatters/TestFormattersSBAPI.py (586 of 1808)
PASS: lldb-unit :: Host/./HostTests/NativeProcessProtocolTest.ReadMemoryWithoutTrap (587 of 1808)
PASS: lldb-unit :: Utility/./UtilityTests/BinaryStreamTest.PutULEB128Zero (588 of 1808)
PASS: lldb-unit :: ScriptInterpreter/Python/./ScriptInterpreterPythonTests/PythonDataObjectsTest.TestPythonDictionaryToStructuredDictionary (589 of 1808)
PASS: lldb-api :: functionalities/breakpoint/objc/TestObjCBreakpoints.py (590 of 1808)
PASS: lldb-unit :: Utility/./UtilityTests/StreamTest.PutNHex8 (591 of 1808)
PASS: lldb-api :: functionalities/data-formatter/data-formatter-stl/libcxx/optional/TestDataFormatterLibcxxOptional.py (592 of 1808)
PASS: lldb-unit :: SymbolFile/NativePDB/./SymbolFileNativePDBTests/PDBFPOProgramToDWARFExpressionTests.UnknownOp (593 of 1808)
PASS: lldb-shell :: Breakpoint/debug_rnglist_offset_pair.test (594 of 1808)
PASS: lldb-unit :: Utility/./UtilityTests/LogChannelTest.Disable (595 of 1808)
PASS: lldb-shell :: Driver/TestSingleQuote.test (596 of 1808)
PASS: lldb-unit :: UnwindAssembly/x86/./UnwindAssemblyx86Tests/Testx86AssemblyInspectionEngine.TestPopR14 (597 of 1808)
PASS: lldb-shell :: Quit/TestQuitExitCodeImplicit0.test (598 of 1808)
PASS: lldb-api :: functionalities/thread/concurrent_events/TestConcurrentWatchpointDelayWatchpointOneBreakpoint.py (599 of 1808)
PASS: lldb-api :: commands/expression/radar_9531204/TestPrintfAfterUp.py (600 of 1808)
PASS: lldb-unit :: Expression/./ExpressionTests/DiagnosticManagerTest.FixedExpression (601 of 1808)
UNSUPPORTED: lldb-api :: functionalities/darwin_log/filter/exact_match/message/TestDarwinLogFilterMatchMessage.py (602 of 1808)
PASS: lldb-api :: lang/objc/objc-ivar-protocols/TestIvarProtocols.py (603 of 1808)
PASS: lldb-unit :: Process/minidump/./LLDBMinidumpTests/MinidumpParserTest.GetThreadContext_x86_32 (604 of 1808)
PASS: lldb-api :: commands/watchpoints/watchpoint_set_command/TestWatchLocationWithWatchSet.py (605 of 1808)
PASS: lldb-unit :: Utility/./UtilityTests/StringExtractorTest.GetNameColonValueNoColon (606 of 1808)
PASS: lldb-shell :: ObjectFile/PECOFF/export-dllfunc.yaml (607 of 1808)
PASS: lldb-unit :: Utility/./UtilityTests/NameMatchesTest.EndsWith (608 of 1808)
PASS: lldb-unit :: Process/gdb-remote/./ProcessGdbRemoteTests/GDBRemoteCommunicationServerTest.SendErrorResponse_ErrorNumber (609 of 1808)
PASS: lldb-unit :: Process/gdb-remote/./ProcessGdbRemoteTests/GDBRemoteCommunicationClientTest.ReadRegister (610 of 1808)
PASS: lldb-unit :: Utility/./UtilityTests/BinaryStreamTest.PutULEB128SixBytes (611 of 1808)
PASS: lldb-unit :: Utility/./UtilityTests/StringLexerTest.NextIf (612 of 1808)
PASS: lldb-unit :: Expression/./ExpressionTests/DiagnosticManagerTest.AppendMessageNoDiag (613 of 1808)
PASS: lldb-api :: commands/expression/function_template_specialization_temp_args/TestFunctionTemplateSpecializationTempArgs.py (614 of 1808)
PASS: lldb-api :: commands/expression/persistent_ptr_update/TestPersistentPtrUpdate.py (615 of 1808)
PASS: lldb-api :: python_api/sbstructureddata/TestStructuredDataAPI.py (616 of 1808)
PASS: lldb-api :: python_api/sbtype_typeclass/TestSBTypeTypeClass.py (617 of 1808)
PASS: lldb-api :: functionalities/breakpoint/breakpoint_options/TestBreakpointOptions.py (618 of 1808)
PASS: lldb-api :: commands/reproducer/invalid-args/TestInvalidArgsReproducer.py (619 of 1808)
PASS: lldb-api :: macosx/find-dsym/deep-bundle/TestDeepBundle.py (620 of 1808)
PASS: lldb-api :: functionalities/data-formatter/data-formatter-ptr-to-array/TestPtrToArrayFormatting.py (621 of 1808)
PASS: lldb-api :: tools/lldb-server/TestAppleSimulatorOSType.py (622 of 1808)
PASS: lldb-api :: functionalities/var_path/TestVarPath.py (623 of 1808)
PASS: lldb-unit :: ScriptInterpreter/Python/./ScriptInterpreterPythonTests/PythonDataObjectsTest.TestPythonIntegerToStructuredInteger (624 of 1808)
PASS: lldb-api :: types/TestFloatTypes.py (625 of 1808)
PASS: lldb-shell :: SymbolFile/DWARF/array-sizes.s (626 of 1808)
PASS: lldb-api :: lang/cpp/bool/TestCPPBool.py (627 of 1808)
PASS: lldb-unit :: Utility/./UtilityTests/StringListTest.JoinThree (628 of 1808)
PASS: lldb-api :: lang/objc/hidden-ivars/TestHiddenIvars.py (629 of 1808)
PASS: lldb-api :: functionalities/data-formatter/data-formatter-stl/libcxx/vbool/TestDataFormatterLibcxxVBool.py (630 of 1808)
PASS: lldb-unit :: Utility/./UtilityTests/VMRange.IsValid (631 of 1808)
PASS: lldb-api :: commands/expression/expr-in-syscall/TestExpressionInSyscall.py (632 of 1808)
PASS: lldb-unit :: Utility/./UtilityTests/FileSpecTest.AppendPathComponent (633 of 1808)
PASS: lldb-api :: commands/expression/import-std-module/sysroot/TestStdModuleSysroot.py (634 of 1808)
PASS: lldb-unit :: Utility/./UtilityTests/UriParserTest.Empty (635 of 1808)
UNSUPPORTED: lldb-api :: commands/expression/call-restarts/TestCallThatRestarts.py (636 of 1808)
UNSUPPORTED: lldb-shell :: ObjectFile/ELF/minidebuginfo-no-lzma.yaml (637 of 1808)
PASS: lldb-unit :: Expression/./ExpressionTests/DWARFExpression.DW_OP_convert (638 of 1808)
PASS: lldb-shell :: Quit/TestQuitExitCodeTooManyArgs.test (639 of 1808)
PASS: lldb-api :: lang/cpp/overloaded-functions/TestOverloadedFunctions.py (640 of 1808)
PASS: lldb-unit :: Utility/./UtilityTests/StringExtractorTest.GetHexU8_Extra (641 of 1808)
PASS: lldb-shell :: Reproducer/Functionalities/TestImageList.test (642 of 1808)
PASS: lldb-api :: commands/target/dump-symtab-demangle/TestDumpSymtabDemangle.py (643 of 1808)
PASS: lldb-api :: python_api/sbdata/TestSBData.py (644 of 1808)
PASS: lldb-api :: lang/c/offsetof/TestOffsetof.py (645 of 1808)
PASS: lldb-unit :: Utility/./UtilityTests/RecordReplayTest.InstrumentedFoo (646 of 1808)
UNSUPPORTED: lldb-api :: commands/expression/completion-crash-incomplete-record/TestCompletionCrashIncompleteRecord.py (647 of 1808)
PASS: lldb-unit :: UnwindAssembly/x86/./UnwindAssemblyx86Tests/Testx86AssemblyInspectionEngine.TestAddRSP (648 of 1808)
PASS: lldb-unit :: Utility/./UtilityTests/AnsiTerminal.WhiteSpace (649 of 1808)
PASS: lldb-api :: python_api/module_section/TestModuleAndSection.py (650 of 1808)
PASS: lldb-api :: functionalities/breakpoint/breakpoint_by_line_and_column/TestBreakpointByLineAndColumn.py (651 of 1808)
PASS: lldb-unit :: Utility/./UtilityTests/Flags.Test (652 of 1808)
PASS: lldb-unit :: Utility/./UtilityTests/DataExtractorTest.GetBitfield (653 of 1808)
PASS: lldb-unit :: Utility/./UtilityTests/UriParserTest.BracketedHostname (654 of 1808)
PASS: lldb-api :: functionalities/thread/exit_during_break/TestExitDuringBreak.py (655 of 1808)
UNSUPPORTED: lldb-shell :: Register/x86-gp-read.test (656 of 1808)
PASS: lldb-unit :: Host/./HostTests/File.GetStreamFromDescriptor (657 of 1808)
PASS: lldb-api :: lang/cpp/chained-calls/TestCppChainedCalls.py (658 of 1808)
PASS: lldb-unit :: Utility/./UtilityTests/VASprintfTest.EncodingError (659 of 1808)
PASS: lldb-unit :: Utility/./UtilityTests/StreamTest.PutSLEB128 (660 of 1808)
PASS: lldb-unit :: Utility/./UtilityTests/RangeTest.ContainsEndInclusiveInvalid (661 of 1808)
PASS: lldb-unit :: Process/minidump/./LLDBMinidumpTests/MinidumpParserTest.MinidumpDuplicateModuleMinAddress (662 of 1808)
PASS: lldb-api :: functionalities/mtc/simple/TestMTCSimple.py (663 of 1808)
PASS: lldb-api :: lang/cpp/auto/TestCPPAuto.py (664 of 1808)
PASS: lldb-api :: lang/cpp/limit-debug-info/TestWithLimitDebugInfo.py (665 of 1808)
PASS: lldb-api :: functionalities/breakpoint/breakpoint_locations/TestBreakpointLocations.py (666 of 1808)
UNSUPPORTED: lldb-api :: benchmarks/libcxxlist/TestBenchmarkLibcxxList.py (667 of 1808)
PASS: lldb-api :: commands/expression/context-object-objc/TestContextObjectObjc.py (668 of 1808)
PASS: lldb-api :: commands/frame/diagnose/array/TestArray.py (669 of 1808)
PASS: lldb-api :: functionalities/tail_call_frames/ambiguous_tail_call_seq2/TestAmbiguousTailCallSeq2.py (670 of 1808)
PASS: lldb-api :: lang/cpp/incomplete-types/TestCppIncompleteTypes.py (671 of 1808)
PASS: lldb-api :: commands/expression/entry-bp/TestExprEntryBP.py (672 of 1808)
PASS: lldb-api :: lang/objc/objc-ivar-offsets/TestObjCIvarOffsets.py (673 of 1808)
PASS: lldb-api :: commands/apropos/basic/TestApropos.py (674 of 1808)
PASS: lldb-api :: functionalities/thread/concurrent_events/TestConcurrentSignalDelayBreak.py (675 of 1808)
PASS: lldb-api :: commands/expression/namespace_local_var_same_name_obj_c/TestNamespaceLocalVarSameNameObjC.py (676 of 1808)
PASS: lldb-shell :: SymbolFile/DWARF/dir-separator-windows.s (677 of 1808)
PASS: lldb-api :: functionalities/thread/concurrent_events/TestConcurrentSignalWatch.py (678 of 1808)
PASS: lldb-unit :: ScriptInterpreter/Python/./ScriptInterpreterPythonTests/PythonDataObjectsTest.TestScript (679 of 1808)
PASS: lldb-shell :: Reproducer/Functionalities/TestExpressionEvaluation.test (680 of 1808)
PASS: lldb-unit :: Utility/./UtilityTests/StringExtractorTest.GetHexBytes_FullString (681 of 1808)
PASS: lldb-unit :: ObjectFile/Breakpad/./ObjectFileBreakpadTests/PublicRecord.parse (682 of 1808)
PASS: lldb-unit :: Utility/./UtilityTests/TimerTest.CategoryTimesNested (683 of 1808)
UNSUPPORTED: lldb-shell :: Register/x86-64-gp-write.test (684 of 1808)
PASS: lldb-unit :: Process/minidump/./LLDBMinidumpTests/RegisterContextMinidump.ConvertMinidumpContext_x86_32 (685 of 1808)
PASS: lldb-unit :: UnwindAssembly/x86/./UnwindAssemblyx86Tests/Testx86AssemblyInspectionEngine.TestPopR13 (686 of 1808)
PASS: lldb-api :: commands/expression/import-std-module/list-dbg-info-content/TestDbgInfoContentList.py (687 of 1808)
PASS: lldb-api :: commands/expression/import-std-module/deque-dbg-info-content/TestDbgInfoContentDeque.py (688 of 1808)
PASS: lldb-unit :: Utility/./UtilityTests/StringExtractorTest.GetHexU8_Underflow_NoEof (689 of 1808)
PASS: lldb-unit :: SymbolFile/NativePDB/./SymbolFileNativePDBTests/PDBFPOProgramToDWARFExpressionTests.UnresolvedDependentCyclicRegisterAssignmentReference (690 of 1808)
PASS: lldb-shell :: Quit/TestQuitExitCode-30.test (691 of 1808)
PASS: lldb-unit :: SymbolFile/NativePDB/./SymbolFileNativePDBTests/PDBFPOProgramToDWARFExpressionTests.UnresolvedCyclicRegisterAssignmentReference (692 of 1808)
PASS: lldb-unit :: Language/Highlighting/./HighlighterTests/HighlighterTest.DefaultHighlighterWithCursor (693 of 1808)
PASS: lldb-unit :: Utility/./UtilityTests/StringExtractorTest.GetHexBytes_OddPair2 (694 of 1808)
PASS: lldb-api :: commands/log/basic/TestLogging.py (695 of 1808)
PASS: lldb-unit :: UnwindAssembly/x86/./UnwindAssemblyx86Tests/Testx86AssemblyInspectionEngine.TestStackRealign32BitDisp_x86_64 (696 of 1808)
PASS: lldb-unit :: Utility/./UtilityTests/StreamTest.PutMaxHex64ByteOrderLittle (697 of 1808)
PASS: lldb-unit :: ScriptInterpreter/Python/./ScriptInterpreterPythonTests/PythonDataObjectsTest.TestResetting (698 of 1808)
PASS: lldb-api :: lang/objc/objc-struct-argument/TestObjCStructArgument.py (699 of 1808)
PASS: lldb-api :: lang/cpp/wchar_t/TestCxxWCharT.py (700 of 1808)
PASS: lldb-unit :: Utility/./UtilityTests/ArgsTest.ReplaceArgumentAtIndexEqual (701 of 1808)
PASS: lldb-api :: commands/expression/import-std-module/queue/TestQueue.py (702 of 1808)
UNSUPPORTED: lldb-api :: functionalities/tsan/basic/TestTsanBasic.py (703 of 1808)
PASS: lldb-unit :: debugserver/./debugserverTests/RNBSocket.AnyListen (704 of 1808)
PASS: lldb-unit :: Utility/./UtilityTests/VMRange.ContainsRange (705 of 1808)
PASS: lldb-api :: commands/expression/radar_8638051/Test8638051.py (706 of 1808)
PASS: lldb-api :: commands/expression/import-std-module/weak_ptr-dbg-info-content/TestDbgInfoContentWeakPtr.py (707 of 1808)
PASS: lldb-api :: functionalities/signal/raise/TestRaise.py (708 of 1808)
PASS: lldb-api :: commands/expression/options/TestExprOptions.py (709 of 1808)
PASS: lldb-unit :: Language/Highlighting/./HighlighterTests/HighlighterTest.Keywords (710 of 1808)
PASS: lldb-unit :: ObjectFile/Breakpad/./ObjectFileBreakpadTests/ModuleRecord.parse (711 of 1808)
PASS: lldb-unit :: Utility/./UtilityTests/StreamTest.PutPtr (712 of 1808)
PASS: lldb-api :: macosx/find-app-in-bundle/TestFindAppInBundle.py (713 of 1808)
PASS: lldb-api :: functionalities/stats_api/TestStatisticsAPI.py (714 of 1808)
PASS: lldb-unit :: Utility/./UtilityTests/StreamTest.ShiftOperatorPtr (715 of 1808)
PASS: lldb-unit :: UnwindAssembly/x86/./UnwindAssemblyx86Tests/Testx86AssemblyInspectionEngine.TestPush0 (716 of 1808)
PASS: lldb-shell :: Breakpoint/debug_addrx.test (717 of 1808)
PASS: lldb-api :: lang/cpp/global_variables/TestCPPGlobalVariables.py (718 of 1808)
PASS: lldb-unit :: Target/./TargetTests/MemoryRegionInfoTest.Formatv (719 of 1808)
PASS: lldb-unit :: UnwindAssembly/x86/./UnwindAssemblyx86Tests/Testx86AssemblyInspectionEngine.TestReturnDetect (720 of 1808)
PASS: lldb-api :: functionalities/gdb_remote_client/TestGDBRemoteLoad.py (721 of 1808)
PASS: lldb-shell :: SymbolFile/DWARF/find-method.cpp (722 of 1808)
PASS: lldb-shell :: SymbolFile/DWARF/debug_aranges-empty-section.s (723 of 1808)
PASS: lldb-api :: types/TestDoubleTypes.py (724 of 1808)
PASS: lldb-unit :: SymbolFile/NativePDB/./SymbolFileNativePDBTests/PDBFPOProgramToDWARFExpressionTests.MultipleIndependentAssignments (725 of 1808)
PASS: lldb-unit :: Utility/./UtilityTests/RecordReplayTest.InstrumentedBarPtr (726 of 1808)
PASS: lldb-unit :: SymbolFile/NativePDB/./SymbolFileNativePDBTests/PDBFPOProgramToDWARFExpressionTests.DependencyChain (727 of 1808)
PASS: lldb-api :: functionalities/rerun/TestRerun.py (728 of 1808)
PASS: lldb-shell :: Commands/command-regex-unalias.test (729 of 1808)
PASS: lldb-unit :: Utility/./UtilityTests/StringListTest.SetSize (730 of 1808)
PASS: lldb-api :: functionalities/dead-strip/TestDeadStrip.py (731 of 1808)
PASS: lldb-api :: functionalities/value_md5_crash/TestValueMD5Crash.py (732 of 1808)
PASS: lldb-unit :: Utility/./UtilityTests/SerializationRountripTest.SerializeDeserializeObjectPointer (733 of 1808)
PASS: lldb-unit :: Expression/./ExpressionTests/DiagnosticManagerTest.PutString (734 of 1808)
PASS: lldb-api :: functionalities/data-formatter/data-formatter-objc/TestDataFormatterObjCCF.py (735 of 1808)
PASS: lldb-unit :: Utility/./UtilityTests/ArchSpecTest.MergeFromMachOUnknown (736 of 1808)
PASS: lldb-api :: commands/statistics/basic/TestStats.py (737 of 1808)
PASS: lldb-api :: functionalities/set-data/TestSetData.py (738 of 1808)
PASS: lldb-api :: commands/expression/import-std-module/stack/TestStack.py (739 of 1808)
UNSUPPORTED: lldb-api :: functionalities/signal/handle-segv/TestHandleSegv.py (740 of 1808)
PASS: lldb-api :: lang/cpp/namespace/TestNamespace.py (741 of 1808)
PASS: lldb-unit :: UnwindAssembly/x86/./UnwindAssemblyx86Tests/Testx86AssemblyInspectionEngine.Test64bitFramelessBigStackFrame (742 of 1808)
PASS: lldb-shell :: Settings/TestEchoCommands.test (743 of 1808)
PASS: lldb-api :: commands/source/info/TestSourceInfo.py (744 of 1808)
PASS: lldb-api :: functionalities/data-formatter/data-formatter-named-summaries/TestDataFormatterNamedSummaries.py (745 of 1808)
PASS: lldb-unit :: Utility/./UtilityTests/VMRange.SetEndAddress (746 of 1808)
UNSUPPORTED: lldb-api :: functionalities/ubsan/user-expression/TestUbsanUserExpression.py (747 of 1808)
PASS: lldb-api :: python_api/thread/TestThreadAPI.py (748 of 1808)
PASS: lldb-shell :: BuildScript/script-args.test (749 of 1808)
PASS: lldb-api :: lang/c/stepping/TestThreadStepping.py (750 of 1808)
PASS: lldb-unit :: Utility/./UtilityTests/ConstStringTest.FromMidOfBufferStringRef (751 of 1808)
PASS: lldb-api :: functionalities/breakpoint/dummy_target_breakpoints/TestBreakpointsWithNoTargets.py (752 of 1808)
PASS: lldb-shell :: SymbolFile/NativePDB/function-types-classes.cpp (753 of 1808)
PASS: lldb-unit :: Language/Highlighting/./HighlighterTests/HighlighterTest.ClangPreserveNewLine (754 of 1808)
PASS: lldb-unit :: Expression/./ExpressionTests/DiagnosticManagerTest.HasFixits (755 of 1808)
UNSUPPORTED: lldb-api :: functionalities/process_save_core/TestProcessSaveCore.py (756 of 1808)
PASS: lldb-api :: functionalities/data-formatter/compactvectors/TestCompactVectors.py (757 of 1808)
PASS: lldb-api :: commands/expression/call-throws/TestCallThatThrows.py (758 of 1808)
PASS: lldb-shell :: Quit/TestQuitExitCode30.test (759 of 1808)
PASS: lldb-unit :: Utility/./UtilityTests/GeneratorTest.Get (760 of 1808)
PASS: lldb-unit :: Utility/./UtilityTests/RangeTest.DoesIntersect (761 of 1808)
PASS: lldb-api :: python_api/type/TestTypeList.py (762 of 1808)
PASS: lldb-unit :: Utility/./UtilityTests/OptionsWithRawTest.UnterminatedQuote (763 of 1808)
PASS: lldb-unit :: Language/Highlighting/./HighlighterTests/HighlighterTest.ClangStringLiterals (764 of 1808)
PASS: lldb-shell :: SymbolFile/DWARF/dir-separator-no-comp-dir-relative-name.s (765 of 1808)
PASS: lldb-unit :: Utility/./UtilityTests/ProcessInstanceInfo.DumpTable_invalidUID (766 of 1808)
UNSUPPORTED: lldb-api :: functionalities/data-formatter/data-formatter-stl/libstdcpp/vector/TestDataFormatterStdVector.py (767 of 1808)
PASS: lldb-api :: lang/c/shared_lib/TestSharedLib.py (768 of 1808)
PASS: lldb-shell :: ObjectFile/ELF/section-overlap.yaml (769 of 1808)
PASS: lldb-api :: functionalities/data-formatter/data-formatter-stl/libstdcpp/unique_ptr/invalid/TestDataFormatterInvalidStdUniquePtr.py (770 of 1808)
PASS: lldb-unit :: UnwindAssembly/x86/./UnwindAssemblyx86Tests/Testx86AssemblyInspectionEngine.TestPushR14 (771 of 1808)
PASS: lldb-unit :: Utility/./UtilityTests/StreamTeeTest.SetStreamAtIndexOutOfBounds (772 of 1808)
PASS: lldb-api :: lang/objc/objc-static-method/TestObjCStaticMethod.py (773 of 1808)
PASS: lldb-api :: commands/version/TestVersion.py (774 of 1808)
UNSUPPORTED: lldb-api :: functionalities/unwind/standard/TestStandardUnwind.py (775 of 1808)
PASS: lldb-unit :: Utility/./UtilityTests/StreamTeeTest.Assignment (776 of 1808)
PASS: lldb-unit :: Utility/./UtilityTests/BinaryStreamTest.PutSLEB128NineBytes (777 of 1808)
PASS: lldb-shell :: Breakpoint/debug_rnglist_rlestartend.test (778 of 1808)
PASS: lldb-api :: tools/lldb-server/inferior-crash/TestGdbRemoteSegFault.py (779 of 1808)
PASS: lldb-unit :: Host/./HostTests/FileSystemTest.GetByteSize (780 of 1808)
PASS: lldb-unit :: ObjectFile/ELF/./ObjectFileELFTests/ObjectFileELFTest.GetModuleSpecifications_EarlySectionHeaders (781 of 1808)
PASS: lldb-shell :: ObjectFile/PECOFF/sections-names.yaml (782 of 1808)
PASS: lldb-api :: tools/lldb-server/TestGdbRemoteExitCode.py (783 of 1808)
PASS: lldb-api :: commands/disassemble/basic/TestDisassembleBreakpoint.py (784 of 1808)
PASS: lldb-unit :: Utility/./UtilityTests/StringExtractorTest.DecodeHexU8_Exact (785 of 1808)
UNSUPPORTED: lldb-api :: functionalities/data-formatter/data-formatter-stl/libstdcpp/list/TestDataFormatterStdList.py (786 of 1808)
PASS: lldb-shell :: SymbolFile/DWARF/find-variable-file.cpp (787 of 1808)
PASS: lldb-unit :: Host/./HostTests/MainLoopTest.DetectsEOF (788 of 1808)
PASS: lldb-shell :: ObjectFile/PECOFF/dep-modules.yaml (789 of 1808)
PASS: lldb-unit :: UnwindAssembly/x86/./UnwindAssemblyx86Tests/Testx86AssemblyInspectionEngine.TestStackRealign8BitDisp_i386 (790 of 1808)
PASS: lldb-api :: commands/process/attach-resume/TestAttachResume.py (791 of 1808)
PASS: lldb-shell :: SymbolFile/DWARF/debug-types-signature-loop.s (792 of 1808)
PASS: lldb-unit :: Utility/./UtilityTests/StreamTest.PutRawBytesToLittleEndian (793 of 1808)
PASS: lldb-shell :: SymbolFile/DWARF/find-basic-variable.cpp (794 of 1808)
UNSUPPORTED: lldb-api :: lang/cpp/printf/TestPrintf.py (795 of 1808)
UNSUPPORTED: lldb-api :: benchmarks/stepping/TestSteppingSpeed.py (796 of 1808)
PASS: lldb-unit :: Process/gdb-remote/./ProcessGdbRemoteTests/GDBRemoteCommunicationServerTest.SendErrorResponse_StringError (797 of 1808)
PASS: lldb-unit :: Symbol/./SymbolTests/TestClangASTContext.TestConvertAccessTypeToAccessSpecifier (798 of 1808)
PASS: lldb-unit :: UnwindAssembly/x86/./UnwindAssemblyx86Tests/Testx86AssemblyInspectionEngine.TestStackRealignMSVC_i386 (799 of 1808)
PASS: lldb-unit :: Host/./HostTests/NativeProcessProtocolTest.ReadCStringFromMemory (800 of 1808)
PASS: lldb-api :: functionalities/data-formatter/data-formatter-synthval/TestDataFormatterSynthVal.py (801 of 1808)
PASS: lldb-api :: lang/c/step-target/TestStepTarget.py (802 of 1808)
PASS: lldb-shell :: SymbolFile/NativePDB/ast-types.cpp (803 of 1808)
TIMEOUT: lldb-api :: types/TestIntegerTypesExpr.py (804 of 1808)
******************** TEST 'lldb-api :: types/TestIntegerTypesExpr.py' FAILED ********************
Reached timeout of 1200 seconds
********************
PASS: lldb-api :: lang/c/shared_lib_stripped_symbols/TestSharedLibStrippedSymbols.py (805 of 1808)
PASS: lldb-api :: functionalities/breakpoint/breakpoint_names/TestBreakpointNames.py (806 of 1808)
UNSUPPORTED: lldb-shell :: Register/x86-64-xmm16-read.test (807 of 1808)
PASS: lldb-api :: commands/expression/anonymous-struct/TestCallUserAnonTypedef.py (808 of 1808)
PASS: lldb-unit :: Utility/./UtilityTests/ProcessInstanceInfo.DumpTable (809 of 1808)
UNSUPPORTED: lldb-api :: tools/lldb-server/thread-name/TestGdbRemoteThreadName.py (810 of 1808)
PASS: lldb-api :: functionalities/thread/concurrent_events/TestConcurrentTwoWatchpointsOneSignal.py (811 of 1808)
PASS: lldb-unit :: ScriptInterpreter/Python/./ScriptInterpreterPythonTests/PythonDataObjectsTest.TestCallable (812 of 1808)
PASS: lldb-api :: lang/objc/objc-new-syntax/TestObjCNewSyntaxLiteral.py (813 of 1808)
PASS: lldb-api :: functionalities/gdb_remote_client/TestGDBRemoteClient.py (814 of 1808)
PASS: lldb-api :: commands/expression/call-function/TestCallBuiltinFunction.py (815 of 1808)
PASS: lldb-unit :: Utility/./UtilityTests/ArchSpecTest.TestParseMachCPUDashSubtypeTripleSimple (816 of 1808)
PASS: lldb-unit :: Utility/./UtilityTests/StreamTest.PutHex8 (817 of 1808)
PASS: lldb-api :: functionalities/abbreviation/TestAbbreviations.py (818 of 1808)
PASS: lldb-unit :: Utility/./UtilityTests/StringListTest.ForRange (819 of 1808)
PASS: lldb-unit :: Utility/./UtilityTests/OptionsWithRawTest.EmptySuffix (820 of 1808)
PASS: lldb-api :: commands/expression/completion/TestExprCompletion.py (821 of 1808)
PASS: lldb-api :: functionalities/param_entry_vals/basic_entry_values_x86_64/TestBasicEntryValuesX86_64.py (822 of 1808)
PASS: lldb-shell :: Unwind/eh-frame-dwarf-unwind.test (823 of 1808)
PASS: lldb-unit :: Utility/./UtilityTests/StringListTest.AppendStringCString (824 of 1808)
PASS: lldb-unit :: Utility/./UtilityTests/StreamTest.PutULEB128 (825 of 1808)
PASS: lldb-unit :: Language/Highlighting/./HighlighterTests/HighlighterTest.ClangUnterminatedString (826 of 1808)
PASS: lldb-api :: macosx/lc-note/kern-ver-str/TestKernVerStrLCNOTE.py (827 of 1808)
PASS: lldb-api :: functionalities/data-formatter/synthupdate/TestSyntheticFilterRecompute.py (828 of 1808)
PASS: lldb-unit :: ScriptInterpreter/Python/./ScriptInterpreterPythonTests/PythonDataObjectsTest.TestPythonInteger (829 of 1808)
UNSUPPORTED: lldb-api :: functionalities/data-formatter/data-formatter-stl/libstdcpp/iterator/TestDataFormatterStdIterator.py (830 of 1808)
PASS: lldb-unit :: Language/Highlighting/./HighlighterTests/HighlighterTest.ClangCursorPosAfterOtherToken (831 of 1808)
PASS: lldb-unit :: Language/Highlighting/./HighlighterTests/HighlighterTest.ClangTrailingBackslashBeforeNewline (832 of 1808)
PASS: lldb-api :: lang/mixed/TestMixedLanguages.py (833 of 1808)
UNSUPPORTED: lldb-api :: tools/lldb-vscode/completions/TestVSCode_completions.py (834 of 1808)
PASS: lldb-unit :: Utility/./UtilityTests/BinaryStreamTest.PutSLEB128SixBytes (835 of 1808)
PASS: lldb-shell :: ObjectFile/ELF/gnu-debuglink.yaml (836 of 1808)
PASS: lldb-unit :: Utility/./UtilityTests/RangeTest.EqualInvalid (837 of 1808)
PASS: lldb-api :: lang/objc/objc-static-method-stripped/TestObjCStaticMethodStripped.py (838 of 1808)
PASS: lldb-unit :: SymbolFile/NativePDB/./SymbolFileNativePDBTests/PDBFPOProgramToDWARFExpressionTests.MissingTargetRegister (839 of 1808)
PASS: lldb-api :: lang/objc/ivar-IMP/TestObjCiVarIMP.py (840 of 1808)
PASS: lldb-unit :: UnwindAssembly/x86/./UnwindAssemblyx86Tests/Testx86AssemblyInspectionEngine.Test32bitFramelessSmallStackFrame (841 of 1808)
PASS: lldb-api :: commands/expression/class_template_specialization_empty_pack/TestClassTemplateSpecializationParametersHandling.py (842 of 1808)
PASS: lldb-unit :: Utility/./UtilityTests/StreamTest.QuotedCString (843 of 1808)
PASS: lldb-api :: lang/objc/modules-auto-import/TestModulesAutoImport.py (844 of 1808)
PASS: lldb-unit :: Host/./HostTests/FileSystemTest.EnumerateDirectory (845 of 1808)
PASS: lldb-shell :: SymbolFile/DWARF/debug-types-missing-signature.test (846 of 1808)
PASS: lldb-api :: functionalities/data-formatter/setvaluefromcstring/TestSetValueFromCString.py (847 of 1808)
PASS: lldb-unit :: Utility/./UtilityTests/BinaryStreamTest.PutULEB128MaxValue (848 of 1808)
PASS: lldb-unit :: Process/gdb-remote/./ProcessGdbRemoteTests/GDBRemoteCommunicationClientTest.SyncThreadState (849 of 1808)
PASS: lldb-unit :: Utility/./UtilityTests/RangeTest.Slide (850 of 1808)
PASS: lldb-unit :: Process/gdb-remote/./ProcessGdbRemoteTests/GDBRemoteClientBaseTest.SendContinueDelegateStructuredDataReceipt (851 of 1808)
PASS: lldb-unit :: Utility/./UtilityTests/StringLexerTest.Next (852 of 1808)
PASS: lldb-api :: commands/expression/timeout/TestCallWithTimeout.py (853 of 1808)
PASS: lldb-api :: lang/cpp/diamond/TestDiamond.py (854 of 1808)
PASS: lldb-unit :: Utility/./UtilityTests/StringExtractorTest.GetHexBytesAvail_OddPair (855 of 1808)
UNSUPPORTED: lldb-api :: functionalities/tsan/thread_numbers/TestTsanThreadNumbers.py (856 of 1808)
PASS: lldb-api :: tools/lldb-vscode/breakpoint/TestVSCode_setBreakpoints.py (857 of 1808)
PASS: lldb-api :: functionalities/history/TestHistoryRecall.py (858 of 1808)
PASS: lldb-api :: macosx/find-dsym/bundle-with-dot-in-filename/TestBundleWithDotInFilename.py (859 of 1808)
PASS: lldb-shell :: SymbolFile/DWARF/gnu-style-compression.cpp (860 of 1808)
UNSUPPORTED: lldb-api :: macosx/macabi/TestMacABImacOSFramework.py (861 of 1808)
PASS: lldb-unit :: Utility/./UtilityTests/StatusTest.ErrorConversion (862 of 1808)
PASS: lldb-shell :: Expr/TestIRMemoryMap.test (863 of 1808)
PASS: lldb-shell :: SymbolFile/NativePDB/disassembly.cpp (864 of 1808)
PASS: lldb-shell :: Commands/command-script-import.test (865 of 1808)
PASS: lldb-unit :: UnwindAssembly/x86/./UnwindAssemblyx86Tests/Testx86AssemblyInspectionEngine.TestPushEBP (866 of 1808)
UNSUPPORTED: lldb-shell :: BuildScript/toolchain-clang-cl.test (867 of 1808)
PASS: lldb-api :: lang/objc/foundation/TestObjCMethods2.py (868 of 1808)
PASS: lldb-unit :: Utility/./UtilityTests/StringListTest.InsertStringAtIndexStart (869 of 1808)
PASS: lldb-api :: functionalities/inline-stepping/TestInlineStepping.py (870 of 1808)
PASS: lldb-unit :: Host/./HostTests/NativeProcessProtocolTest.ReadCStringFromMemory_MaxSize (871 of 1808)
PASS: lldb-unit :: Process/gdb-remote/./ProcessGdbRemoteTests/GDBRemoteCommunicationTest.ReadPacket_checksum (872 of 1808)
PASS: lldb-shell :: Breakpoint/dummy-target.test (873 of 1808)
PASS: lldb-unit :: Utility/./UtilityTests/FileSpecTest.EqualDotsWindows (874 of 1808)
UNSUPPORTED: lldb-api :: benchmarks/expression/TestRepeatedExprs.py (875 of 1808)
PASS: lldb-unit :: ObjectFile/Breakpad/./ObjectFileBreakpadTests/LineRecord.parse (876 of 1808)
PASS: lldb-api :: python_api/objc_type/TestObjCType.py (877 of 1808)
PASS: lldb-api :: functionalities/wrong_commands/TestWrongCommands.py (878 of 1808)
UNSUPPORTED: lldb-api :: commands/register/register/intel_xtended_registers/TestMPXRegisters.py (879 of 1808)
PASS: lldb-unit :: UnwindAssembly/x86/./UnwindAssemblyx86Tests/Testx86AssemblyInspectionEngine.Test64bitFramelessSmallStackFrame (880 of 1808)
PASS: lldb-api :: functionalities/modern-type-lookup/libcxx/TestLibCxxModernTypeLookup.py (881 of 1808)
PASS: lldb-unit :: SymbolFile/NativePDB/./SymbolFileNativePDBTests/PDBFPOProgramToDWARFExpressionTests.InvalidOpBinary (882 of 1808)
PASS: lldb-unit :: Utility/./UtilityTests/CompletionRequest.ShiftArguments (883 of 1808)
UNSUPPORTED: lldb-api :: tools/lldb-server/libraries-svr4/TestGdbRemoteLibrariesSvr4Support.py (884 of 1808)
PASS: lldb-api :: tools/lldb-vscode/step/TestVSCode_step.py (885 of 1808)
UNSUPPORTED: lldb-api :: lang/c/typedef/Testtypedef.py (886 of 1808)
PASS: lldb-api :: lang/c/set_values/TestSetValues.py (887 of 1808)
PASS: lldb-api :: commands/command/nested_alias/TestNestedAlias.py (888 of 1808)
PASS: lldb-unit :: Expression/./ExpressionTests/DiagnosticManagerTest.GetStringMultiline (889 of 1808)
PASS: lldb-unit :: SymbolFile/NativePDB/./SymbolFileNativePDBTests/PDBFPOProgramToDWARFExpressionTests.SingleAssignmentRegisterRef (890 of 1808)
PASS: lldb-api :: lang/c/unicode/TestUnicodeSymbols.py (891 of 1808)
PASS: lldb-unit :: Utility/./UtilityTests/BinaryStreamTest.PutULEB128One (892 of 1808)
PASS: lldb-unit :: ScriptInterpreter/Python/./ScriptInterpreterPythonTests/PythonDataObjectsTest.TestPythonTupleInitializerList2 (893 of 1808)
PASS: lldb-unit :: Process/minidump/./LLDBMinidumpTests/MinidumpParserTest.MinidumpModuleOrder (894 of 1808)
PASS: lldb-api :: commands/frame/var-scope/TestFrameVariableScope.py (895 of 1808)
PASS: lldb-unit :: Utility/./UtilityTests/BinaryStreamTest.PutULEB128OneByte (896 of 1808)
UNSUPPORTED: lldb-api :: functionalities/thread/break_after_join/TestBreakAfterJoin.py (897 of 1808)
PASS: lldb-api :: functionalities/gdb_remote_client/TestStopPCs.py (898 of 1808)
UNSUPPORTED: lldb-api :: functionalities/data-formatter/data-formatter-stl/libstdcpp/vbool/TestDataFormatterStdVBool.py (899 of 1808)
PASS: lldb-unit :: Utility/./UtilityTests/StreamTest.PutBytesAsRawHex8ToMixedEndian (900 of 1808)
PASS: lldb-unit :: ScriptInterpreter/Python/./ScriptInterpreterPythonTests/PythonDataObjectsTest.TestRun (901 of 1808)
PASS: lldb-shell :: Settings/TestFrameFormatColor.test (902 of 1808)
PASS: lldb-unit :: Symbol/./SymbolTests/LineEntryTest.GetSameLineContiguousAddressRangeNestedInline (903 of 1808)
PASS: lldb-api :: macosx/safe-to-func-call/TestSafeFuncCalls.py (904 of 1808)
PASS: lldb-unit :: Utility/./UtilityTests/RangeTest.ContainsRangeStartingFromZero (905 of 1808)
PASS: lldb-api :: commands/command/source/TestCommandSource.py (906 of 1808)
PASS: lldb-api :: tools/lldb-server/TestGdbRemoteExpeditedRegisters.py (907 of 1808)
PASS: lldb-shell :: SymbolFile/DWARF/dwarf5-partial-index.cpp (908 of 1808)
PASS: lldb-unit :: Utility/./UtilityTests/BinaryStreamTest.PutSLEB128FiveBytes (909 of 1808)
PASS: lldb-unit :: Utility/./UtilityTests/ScalarTest.CastOperations (910 of 1808)
PASS: lldb-unit :: UnwindAssembly/x86/./UnwindAssemblyx86Tests/Testx86AssemblyInspectionEngine.TestPushEAX (911 of 1808)
PASS: lldb-api :: commands/expression/calculator_mode/TestCalculatorMode.py (912 of 1808)
PASS: lldb-shell :: Reproducer/TestRelativePath.test (913 of 1808)
UNSUPPORTED: lldb-api :: functionalities/darwin_log/filter/regex/subsystem/TestDarwinLogFilterRegexSubsystem.py (914 of 1808)
PASS: lldb-unit :: Process/minidump/./LLDBMinidumpTests/MinidumpParserTest.FindMemoryRangeWithFullMemoryMinidump (915 of 1808)
UNSUPPORTED: lldb-api :: tools/lldb-server/platform-process-connect/TestPlatformProcessConnect.py (916 of 1808)
PASS: lldb-api :: commands/process/attach/attach_denied/TestAttachDenied.py (917 of 1808)
PASS: lldb-unit :: UnwindAssembly/x86/./UnwindAssemblyx86Tests/Testx86AssemblyInspectionEngine.TestPopR12 (918 of 1808)
PASS: lldb-api :: functionalities/thread/concurrent_events/TestConcurrentManyCrash.py (919 of 1808)
UNSUPPORTED: lldb-api :: functionalities/darwin_log/filter/regex/activity-chain/TestDarwinLogFilterRegexActivityChain.py (920 of 1808)
PASS: lldb-shell :: Quit/TestQuitExitCodeHex0.test (921 of 1808)
PASS: lldb-unit :: debugserver/./debugserverTests/RNBSocket.LoopBackConnectIPv4 (922 of 1808)
PASS: lldb-api :: lang/objc/modules-incomplete/TestIncompleteModules.py (923 of 1808)
PASS: lldb-shell :: SymbolFile/DWARF/compilercontext.ll (924 of 1808)
PASS: lldb-unit :: Language/Highlighting/./HighlighterTests/HighlighterTest.ClangTrailingBackslashMissingNewLine (925 of 1808)
PASS: lldb-api :: lang/cpp/char1632_t/TestChar1632T.py (926 of 1808)
PASS: lldb-unit :: SymbolFile/NativePDB/./SymbolFileNativePDBTests/PDBFPOProgramToDWARFExpressionTests.InvalidOpUnary (927 of 1808)
PASS: lldb-shell :: SymbolFile/DWARF/split-dwarf-inlining.cpp (928 of 1808)
PASS: lldb-api :: lang/cpp/operator-overload/TestOperatorOverload.py (929 of 1808)
PASS: lldb-api :: tools/lldb-server/TestGdbRemote_vCont.py (930 of 1808)
PASS: lldb-api :: functionalities/breakpoint/global_constructor/TestBreakpointInGlobalConstructor.py (931 of 1808)
PASS: lldb-unit :: UnwindAssembly/x86/./UnwindAssemblyx86Tests/Testx86AssemblyInspectionEngine.TestPopEDI (932 of 1808)
PASS: lldb-unit :: Host/./HostTests/SocketTest.UDPConnect (933 of 1808)
PASS: lldb-unit :: ObjectFile/Breakpad/./ObjectFileBreakpadTests/StackCFIRecord.parse (934 of 1808)
PASS: lldb-unit :: Utility/./UtilityTests/CompletionRequest.DuplicateFilteringWithComments (935 of 1808)
PASS: lldb-api :: functionalities/data-formatter/nsdictionarysynth/TestNSDictionarySynthetic.py (936 of 1808)
PASS: lldb-shell :: Driver/TestCore.test (937 of 1808)
PASS: lldb-unit :: Core/./LLDBCoreTests/UniqueCStringMap.NoDefaultConstructor (938 of 1808)
PASS: lldb-api :: functionalities/unwind/noreturn/TestNoreturnUnwind.py (939 of 1808)
PASS: lldb-api :: functionalities/thread/concurrent_events/TestConcurrentTwoWatchpointsOneBreakpoint.py (940 of 1808)
PASS: lldb-unit :: Utility/./UtilityTests/ArgsTest.ReplaceArgumentAtIndexLonger (941 of 1808)
PASS: lldb-unit :: Utility/./UtilityTests/ScalarTest.SetValueFromCString (942 of 1808)
PASS: lldb-api :: functionalities/tail_call_frames/disambiguate_paths_to_common_sink/TestDisambiguatePathsToCommonSink.py (943 of 1808)
PASS: lldb-unit :: Symbol/./SymbolTests/TestClangASTContext.TestIsClangType (944 of 1808)
PASS: lldb-unit :: Utility/./UtilityTests/UriParserTest.TypicalPortPath (945 of 1808)
PASS: lldb-unit :: Utility/./UtilityTests/CompletionRequest.DuplicateFiltering (946 of 1808)
PASS: lldb-shell :: SymbolFile/NativePDB/nested-types.cpp (947 of 1808)
PASS: lldb-api :: functionalities/data-formatter/poarray/TestPrintObjectArray.py (948 of 1808)
PASS: lldb-unit :: UnwindAssembly/x86/./UnwindAssemblyx86Tests/Testx86AssemblyInspectionEngine.TestSimple64bitFrameFunction (949 of 1808)
PASS: lldb-unit :: Utility/./UtilityTests/DataExtractorTest.PeekData (950 of 1808)
PASS: lldb-api :: functionalities/gdb_remote_client/TestRecognizeBreakpoint.py (951 of 1808)
PASS: lldb-api :: functionalities/data-formatter/data-formatter-proper-plurals/TestFormattersOneIsSingular.py (952 of 1808)
FAIL: lldb-api :: terminal/TestEditline.py (953 of 1808)
******************** TEST 'lldb-api :: terminal/TestEditline.py' FAILED ********************
lldb version 10.0.99 (http://labmaster3.local/git/llvm-project.git revision f805c60a093325c16ce4200d2615ef48555d9cb8)
  clang revision f805c60a093325c16ce4200d2615ef48555d9cb8
  llvm revision f805c60a093325c16ce4200d2615ef48555d9cb8
(lldb) settings set symbols.enable-external-lookup false
(lldb) settings set plugin.process.gdb-remote.packet-timeout 60
(lldb) settings set symbols.clang-modules-cache-path "/Users/buildslave/jenkins/workspace/lldb-cmake-sanitized/lldb-build/lldb-test-build.noindex/module-cache-lldb/lldb-api"
(lldb) settings set use-color false
(lldb) el rintphp
el rintprinthel printelp print
     Evaluate an expression on the current thread.  Displays any returned value
     with LLDB's default formatting.  Expects 'raw' input (see 'help
     raw-input'.)

Hide Details

Syntax: print <expr>

Hide Details

Command Options Usage: print <expr>

Hide Details

Hide Details

'print' is an abbreviation for 'expression --' (lldb) el tepshp el tepstephel stepelp step Source level single step, stepping into calls. Defaults to current thread unless specified.

Hide Details

Syntax: step <cmd-options> [<thread-id>]

Hide Details

Command Options Usage: step [-c <count>] [-e <linenum>] [-m <run-mode>] [-a <boolean>] [-t <function-name>] [-A <boolean>] [-r <regular-expression>] [<thread-id>]

Hide Details

-A <boolean> ( --step-out-avoids-no-debug <boolean> ) A boolean value, if true stepping out of functions will continue to step out till it hits a function with debug information.

Hide Details

-a <boolean> ( --step-in-avoids-no-debug <boolean> ) A boolean value that sets whether stepping into functions will step over functions with no debug information.

Hide Details

-c <count> ( --count <count> ) How many times to perform the stepping operation - currently only supported for step-inst and next-inst.

Hide Details

-e <linenum> ( --end-linenumber <linenum> ) The line at which to stop stepping - defaults to the next line and only supported for step-in and step-over. You can also pass the string 'block' to step to the end of the current block. This is particularly use in conjunction with --step-target to step through a complex calling sequence.

Hide Details

-m <run-mode> ( --run-mode <run-mode> ) Determine how to run other threads while stepping the current thread. Values: this-thread | all-threads | while-stepping

Hide Details

-r <regular-expression> ( --step-over-regexp <regular-expression> ) A regular expression that definesfunction names to not to stop at when stepping in.

Hide Details

-t <function-name> ( --step-in-target <function-name> ) The name of the directly called function step in should stop at when stepping into.

Hide Details

This command takes options and free-form arguments. If your arguments resemble option specifiers (i.e., they start with a - or --), you must use ' -- ' between the end of the command options and the beginning of the arguments.

Hide Details

'step' is an abbreviation for 'thread step-in' (lldb) el xitehp el xitexithel exitelp exit Quit the LLDB debugger.

Hide Details

Syntax: exit

Hide Details

'exit' is an abbreviation for 'quit' (lldb) settings set interpreter.prompt-on-quit false LLDB library dir: /Users/buildslave/jenkins/workspace/lldb-cmake-sanitized/lldb-build/bin LLDB import library dir: /Users/buildslave/jenkins/workspace/lldb-cmake-sanitized/lldb-build/bin libstdcxx tests will not be run because: Don't know how to build with libstdcxx on macosx Skipping following debug info categories: ['dwo']

Hide Details

Session logs for test failures/errors/unexpected successes will go into directory '/Users/buildslave/jenkins/workspace/lldb-cmake-sanitized/test/logs' Command invoked: /Users/buildslave/jenkins/workspace/lldb-cmake-sanitized/llvm-project/lldb/test/API/dotest.py --arch=x86_64 -s /Users/buildslave/jenkins/workspace/lldb-cmake-sanitized/lldb-build/lldb-test-traces -S nm -u CXXFLAGS -u CFLAGS --executable /Users/buildslave/jenkins/workspace/lldb-cmake-sanitized/lldb-build/./bin/lldb --compiler /Users/buildslave/jenkins/workspace/lldb-cmake-sanitized/lldb-build/./bin/clang --dsymutil /Users/buildslave/jenkins/workspace/lldb-cmake-sanitized/lldb-build/./bin/dsymutil --filecheck /Users/buildslave/jenkins/workspace/lldb-cmake-sanitized/lldb-build/./bin/FileCheck --codesign-identity lldb_codesign --server /Users/buildslave/jenkins/workspace/lldb-cmake-sanitized/lldb-build/./bin/debugserver --arch x86_64 --build-dir /Users/buildslave/jenkins/workspace/lldb-cmake-sanitized/lldb-build/lldb-test-build.noindex -s=/Users/buildslave/jenkins/workspace/lldb-cmake-sanitized/test/logs -t --env TERM=vt100 --env LLVM_LIBS_DIR=/Users/buildslave/jenkins/workspace/lldb-cmake-sanitized/lldb-build/./lib --build-dir /Users/buildslave/jenkins/workspace/lldb-cmake-sanitized/lldb-build/lldb-test-build.noindex --lldb-module-cache-dir /Users/buildslave/jenkins/workspace/lldb-cmake-sanitized/lldb-build/lldb-test-build.noindex/module-cache-lldb/lldb-api --clang-module-cache-dir /Users/buildslave/jenkins/workspace/lldb-cmake-sanitized/lldb-build/lldb-test-build.noindex/module-cache-clang/lldb-api /Users/buildslave/jenkins/workspace/lldb-cmake-sanitized/llvm-project/lldb/packages/Python/lldbsuite/test/terminal -p TestEditline.py Change dir to: /Users/buildslave/jenkins/workspace/lldb-cmake-sanitized/llvm-project/lldb/packages/Python/lldbsuite/test/terminal runCmd: settings set symbols.enable-external-lookup false output:

Hide Details

runCmd: settings set plugin.process.gdb-remote.packet-timeout 60 output:

Hide Details

runCmd: settings set symbols.clang-modules-cache-path "/Users/buildslave/jenkins/workspace/lldb-cmake-sanitized/lldb-build/lldb-test-build.noindex/module-cache-lldb/lldb-api" output:

Hide Details

runCmd: settings set use-color false output:

Hide Details

FAIL: LLDB (/Users/buildslave/jenkins/workspace/lldb-cmake-sanitized/lldb-build/bin/clang-10-x86_64) :: test_left_right_arrow (TestEditline.EditlineTest) tearing down the child process....

Hide Details

CLEANUP ERROR: LLDB (/Users/buildslave/jenkins/workspace/lldb-cmake-sanitized/lldb-build/bin/clang-10-x86_64) :: test_left_right_arrow (TestEditline.EditlineTest) Restore dir to: /Users/buildslave/jenkins/workspace/lldb-cmake-sanitized/lldb-build/tools/lldb/test ====================================================================== ERROR: test_left_right_arrow (TestEditline.EditlineTest) Test that ctrl+left/right arrow navigates words correctly. ---------------------------------------------------------------------- Traceback (most recent call last): File "/Users/buildslave/jenkins/workspace/lldb-cmake-sanitized/llvm-project/lldb/third_party/Python/module/pexpect-4.6/pexpect/pty_spawn.py", line 23, in _wrap_ptyprocess_err yield File "/Users/buildslave/jenkins/workspace/lldb-cmake-sanitized/llvm-project/lldb/third_party/Python/module/pexpect-4.6/pexpect/pty_spawn.py", line 327, in close self.ptyproc.close(force=force) File "/Users/buildslave/jenkins/workspace/lldb-cmake-sanitized/llvm-project/lldb/third_party/Python/module/ptyprocess-0.6.0/ptyprocess/ptyprocess.py", line 400, in close raise PtyProcessError('Could not terminate the child.') ptyprocess.util.PtyProcessError: Could not terminate the child.

Hide Details

During handling of the above exception, another exception occurred:

Hide Details

Traceback (most recent call last): File "/Users/buildslave/jenkins/workspace/lldb-cmake-sanitized/llvm-project/lldb/packages/Python/lldbsuite/test/terminal/TestEditline.py", line 49, in test_left_right_arrow self.quit() File "/Users/buildslave/jenkins/workspace/lldb-cmake-sanitized/llvm-project/lldb/packages/Python/lldbsuite/test/lldbpexpect.py", line 61, in quit self.child.close(force=not gracefully) File "/Users/buildslave/jenkins/workspace/lldb-cmake-sanitized/llvm-project/lldb/third_party/Python/module/pexpect-4.6/pexpect/pty_spawn.py", line 327, in close self.ptyproc.close(force=force) File "/usr/local/Cellar/python/3.7.0/Frameworks/Python.framework/Versions/3.7/lib/python3.7/contextlib.py", line 130, in __exit__ self.gen.throw(type, value, traceback) File "/Users/buildslave/jenkins/workspace/lldb-cmake-sanitized/llvm-project/lldb/third_party/Python/module/pexpect-4.6/pexpect/pty_spawn.py", line 25, in _wrap_ptyprocess_err raise ExceptionPexpect(*e.args) pexpect.exceptions.ExceptionPexpect: Could not terminate the child. Config=x86_64-/Users/buildslave/jenkins/workspace/lldb-cmake-sanitized/lldb-build/bin/clang-10 ---------------------------------------------------------------------- Ran 1 test in 3.271s

Hide Details

RESULT: FAILED (0 passes, 0 failures, 1 errors, 0 skipped, 0 expected failures, 0 unexpected successes)

Hide Details

******************** PASS: lldb-api :: functionalities/data-formatter/ostypeformatting/TestFormattersOsType.py (954 of 1808) PASS: lldb-shell :: SymbolFile/DWARF/debug_rnglists.s (955 of 1808) PASS: lldb-unit :: Utility/./UtilityTests/StreamTest.ShiftOperatorStrings (956 of 1808) PASS: lldb-unit :: Utility/./UtilityTests/StreamTest.PutCString (957 of 1808) PASS: lldb-unit :: Host/./HostTests/Host.GetEnvironment (958 of 1808) UNSUPPORTED: lldb-shell :: Unwind/eh-frame-small-fde.test (959 of 1808) PASS: lldb-api :: lang/c/find_struct_type/TestFindStructTypes.py (960 of 1808) PASS: lldb-api :: lang/cpp/symbols/TestSymbols.py (961 of 1808) PASS: lldb-unit :: Language/Highlighting/./HighlighterTests/HighlighterTest.DefaultHighlighter (962 of 1808) PASS: lldb-shell :: SymbolFile/DWARF/debug-names-compressed.cpp (963 of 1808) UNSUPPORTED: lldb-api :: functionalities/darwin_log/filter/exact_match/activity/TestDarwinLogFilterMatchActivity.py (964 of 1808) PASS: lldb-unit :: Process/minidump/./LLDBMinidumpTests/MinidumpParserTest.GetMemoryRegionInfoFromMemoryList (965 of 1808) PASS: lldb-unit :: Host/./HostTests/FileSystemTest.GetPermissions (966 of 1808) PASS: lldb-api :: functionalities/memory-region/TestMemoryRegion.py (967 of 1808) UNSUPPORTED: lldb-api :: benchmarks/turnaround/TestCompileRunToBreakpointTurnaround.py (968 of 1808) PASS: lldb-shell :: ObjectFile/ELF/build-id-case.yaml (969 of 1808) PASS: lldb-api :: commands/platform/basic/TestPlatformPython.py (970 of 1808) PASS: lldb-shell :: SymbolFile/NativePDB/break-by-function.cpp (971 of 1808) PASS: lldb-unit :: Interpreter/./InterpreterTests/CompletionTest.DirCompletionUsername (972 of 1808) PASS: lldb-api :: lang/cpp/thread_local/TestThreadLocal.py (973 of 1808) PASS: lldb-api :: functionalities/target_var/TestTargetVar.py (974 of 1808) PASS: lldb-unit :: Utility/./UtilityTests/Flags.AllSet (975 of 1808) PASS: lldb-unit :: Utility/./UtilityTests/StreamTest.PutRawBytesToBigEndian (976 of 1808) PASS: lldb-shell :: ObjectFile/ELF/base-address.yaml (977 of 1808) PASS: lldb-unit :: Expression/./ExpressionTests/CppModuleConfigurationTest.Sysroot (978 of 1808) PASS: lldb-api :: functionalities/breakpoint/comp_dir_symlink/TestCompDirSymLink.py (979 of 1808) PASS: lldb-api :: lang/objc/foundation/TestObjCMethodsNSError.py (980 of 1808) PASS: lldb-unit :: Process/gdb-remote/./ProcessGdbRemoteTests/GDBRemoteClientBaseTest.SendPacketAndReceiveResponseWithOutputSupport (981 of 1808) PASS: lldb-shell :: Minidump/memory-region.yaml (982 of 1808) PASS: lldb-unit :: Utility/./UtilityTests/ArgsTest.TestArgv (983 of 1808) PASS: lldb-api :: commands/watchpoints/step_over_watchpoint/TestStepOverWatchpoint.py (984 of 1808) PASS: lldb-unit :: Utility/./UtilityTests/ArgsTest.TestMultipleArgs (985 of 1808) PASS: lldb-api :: functionalities/data-formatter/data-formatter-stl/libcxx/tuple/TestDataFormatterLibcxxTuple.py (986 of 1808) PASS: lldb-unit :: Process/minidump/./LLDBMinidumpTests/MinidumpParserTest.GetArchitectureWindows (987 of 1808) PASS: lldb-api :: commands/expression/fixits/TestFixIts.py (988 of 1808) PASS: lldb-api :: tools/lldb-server/TestGdbRemoteKill.py (989 of 1808) PASS: lldb-api :: functionalities/data-formatter/data-formatter-synth/TestDataFormatterSynth.py (990 of 1808) PASS: lldb-api :: functionalities/data-formatter/data-formatter-objc/TestDataFormatterObjNSException.py (991 of 1808) UNSUPPORTED: lldb-shell :: Register/x86-64-xmm16-write.test (992 of 1808) PASS: lldb-unit :: Target/./TargetTests/ModuleCacheTest.GetAndPutUuidExists (993 of 1808) PASS: lldb-shell :: Driver/TestProcessAttach.test (994 of 1808) PASS: lldb-unit :: Utility/./UtilityTests/RangeTest.ContainsAddrInvalid (995 of 1808) PASS: lldb-api :: commands/process/launch-with-shellexpand/TestLaunchWithShellExpand.py (996 of 1808) PASS: lldb-api :: lang/objc/blocks/TestObjCIvarsInBlocks.py (997 of 1808) PASS: lldb-api :: tools/lldb-vscode/variables/TestVSCode_variables.py (998 of 1808) PASS: lldb-api :: functionalities/data-formatter/data-formatter-stl/libcxx/bitset/TestDataFormatterLibcxxBitset.py (999 of 1808) PASS: lldb-unit :: Utility/./UtilityTests/RegisterValueTest.GetSet8 (1000 of 1808) UNSUPPORTED: lldb-api :: functionalities/data-formatter/data-formatter-stl/libstdcpp/smart_ptr/TestDataFormatterStdSmartPtr.py (1001 of 1808) PASS: lldb-unit :: Process/minidump/./LLDBMinidumpTests/MinidumpParserTest.GetMemoryRegionInfoLinuxMaps (1002 of 1808) UNSUPPORTED: lldb-api :: functionalities/data-formatter/data-formatter-stl/libstdcpp/map/TestDataFormatterStdMap.py (1003 of 1808) PASS: lldb-unit :: Utility/./UtilityTests/ConstStringTest.UpdateMangledCounterpart (1004 of 1808) UNSUPPORTED: lldb-api :: functionalities/breakpoint/hardware_breakpoints/hardware_breakpoint_on_multiple_threads/TestHWBreakMultiThread.py (1005 of 1808) PASS: lldb-shell :: SymbolFile/DWARF/DW_OP_piece-struct.s (1006 of 1808) PASS: lldb-shell :: SymbolFile/NativePDB/ast-functions.cpp (1007 of 1808) PASS: lldb-api :: functionalities/postmortem/minidump-new/TestMiniDumpNew.py (1008 of 1808) PASS: lldb-unit :: Utility/./UtilityTests/UUIDTest.StringConverion (1009 of 1808) PASS: lldb-api :: commands/frame/diagnose/complicated-expression/TestComplicatedExpression.py (1010 of 1808) PASS: lldb-api :: python_api/signals/TestSignalsAPI.py (1011 of 1808) PASS: lldb-api :: python_api/breakpoint/TestBreakpointAPI.py (1012 of 1808) PASS: lldb-unit :: Utility/./UtilityTests/StatusTest.ErrorConstructor (1013 of 1808) PASS: lldb-unit :: Utility/./UtilityTests/RegularExpression.Valid (1014 of 1808) PASS: lldb-api :: functionalities/data-formatter/data-formatter-stl/libcxx/iterator/TestDataFormatterLibccIterator.py (1015 of 1808) PASS: lldb-unit :: Utility/./UtilityTests/AnsiTerminal.KnownPrefix (1016 of 1808) PASS: lldb-api :: functionalities/postmortem/minidump/TestMiniDump.py (1017 of 1808) PASS: lldb-api :: functionalities/pre_run_dylibs/TestPreRunDylibs.py (1018 of 1808) PASS: lldb-shell :: Register/x86-64-read.test (1019 of 1808) PASS: lldb-api :: functionalities/thread/concurrent_events/TestConcurrentSignalWatchBreak.py (1020 of 1808) PASS: lldb-unit :: Utility/./UtilityTests/AnsiTerminal.Empty (1021 of 1808) PASS: lldb-unit :: Process/minidump/./LLDBMinidumpTests/MinidumpParserTest.GetMiscInfoWindows (1022 of 1808) PASS: lldb-unit :: Utility/./UtilityTests/UriParserTest.SchemeHostSeparator3 (1023 of 1808) PASS: lldb-shell :: ObjectFile/Breakpad/sections-trailing-func.test (1024 of 1808) PASS: lldb-api :: functionalities/thread/concurrent_events/TestConcurrentCrashWithWatchpoint.py (1025 of 1808) PASS: lldb-api :: python_api/watchpoint/TestWatchpointIgnoreCount.py (1026 of 1808) PASS: lldb-unit :: Host/./HostTests/ConnectionFileDescriptorTest.TCPGetURIv6 (1027 of 1808) UNSUPPORTED: lldb-api :: functionalities/darwin_log/filter/exact_match/category/TestDarwinLogFilterMatchCategory.py (1028 of 1808) PASS: lldb-api :: commands/expression/persistent_types/TestNestedPersistentTypes.py (1029 of 1808) PASS: lldb-api :: functionalities/ptr_refs/TestPtrRefs.py (1030 of 1808) PASS: lldb-api :: lang/objc/objc-runtime-ivars/TestRuntimeIvars.py (1031 of 1808) PASS: lldb-api :: lang/c/register_variables/TestRegisterVariables.py (1032 of 1808) PASS: lldb-unit :: Utility/./UtilityTests/BinaryStreamTest.PutULEB128TwoBytes (1033 of 1808) PASS: lldb-unit :: Language/Highlighting/./HighlighterTests/HighlighterTest.ClangCursorPosEndOfLine (1034 of 1808) PASS: lldb-unit :: Utility/./UtilityTests/DataExtractorTest.GetCStr (1035 of 1808) PASS: lldb-unit :: Host/./HostTests/FileSystemTest.MakeAbsolute (1036 of 1808) PASS: lldb-unit :: Utility/./UtilityTests/Predicate.WaitForValueNotEqualTo (1037 of 1808) PASS: lldb-api :: python_api/interpreter/TestCommandInterpreterAPI.py (1038 of 1808) PASS: lldb-shell :: SymbolFile/DWARF/apple-index-is-used.cpp (1039 of 1808) PASS: lldb-shell :: Reproducer/TestFileRepro.test (1040 of 1808) PASS: lldb-unit :: ObjectFile/ELF/./ObjectFileELFTests/ObjectFileELFTest.GetSymtab_NoSymEntryPointArmAddressClass (1041 of 1808) PASS: lldb-unit :: Process/gdb-remote/./ProcessGdbRemoteTests/GDBRemoteCommunicationClientTest.SaveRestoreRegistersNoSuffix (1042 of 1808) UNSUPPORTED: lldb-api :: linux/add-symbols/TestTargetSymbolsAddCommand.py (1043 of 1808) PASS: lldb-shell :: SymbolFile/DWARF/debug_ranges.s (1044 of 1808) PASS: lldb-api :: functionalities/modern-type-lookup/basic-objc/TestBasicObjcModernTypeLookup.py (1045 of 1808) PASS: lldb-shell :: Breakpoint/implicit_const_form_support.test (1046 of 1808) UNSUPPORTED: lldb-shell :: SymbolFile/PDB/variables-locations.test (1047 of 1808) PASS: lldb-unit :: UnwindAssembly/x86/./UnwindAssemblyx86Tests/Testx86AssemblyInspectionEngine.TestPopEBP (1048 of 1808) PASS: lldb-unit :: Signals/./SignalsTests/UnixSignalsTest.VersionChange (1049 of 1808) UNSUPPORTED: lldb-api :: benchmarks/startup/TestStartupDelays.py (1050 of 1808) PASS: lldb-api :: tools/lldb-server/inferior-crash/TestGdbRemoteAbort.py (1051 of 1808) PASS: lldb-api :: python_api/target/TestTargetAPI.py (1052 of 1808) PASS: lldb-unit :: UnwindAssembly/x86/./UnwindAssemblyx86Tests/Testx86AssemblyInspectionEngine.TestCALLNextInsn (1053 of 1808) PASS: lldb-unit :: Utility/./UtilityTests/StringListTest.LongestCommonPrefixEmpty (1054 of 1808) UNSUPPORTED: lldb-api :: functionalities/darwin_log/basic/TestDarwinLogBasic.py (1055 of 1808) PASS: lldb-shell :: Commands/command-regex-delete.test (1056 of 1808) PASS: lldb-api :: functionalities/breakpoint/source_regexp/TestSourceRegexBreakpoints.py (1057 of 1808) PASS: lldb-api :: lang/cpp/breakpoint-commands/TestCPPBreakpointCommands.py (1058 of 1808) PASS: lldb-api :: sanity/TestModuleCacheSanity.py (1059 of 1808) PASS: lldb-api :: arm/emulation/TestEmulations.py (1060 of 1808) PASS: lldb-unit :: SymbolFile/DWARF/./SymbolFileDWARFTests/SymbolFileDWARFTests.TestAbilitiesForDWARF (1061 of 1808) PASS: lldb-api :: commands/expression/scoped_enums/TestScopedEnumType.py (1062 of 1808) PASS: lldb-api :: types/TestFloatTypesExpr.py (1063 of 1808) PASS: lldb-shell :: ObjectFile/ELF/PT_LOAD.yaml (1064 of 1808) UNSUPPORTED: lldb-api :: iohandler/completion/TestIOHandlerCompletion.py (1065 of 1808) PASS: lldb-shell :: Driver/TestTarget.test (1066 of 1808) PASS: lldb-unit :: Utility/./UtilityTests/SerializationRountripTest.SerializeDeserializeObjectReference (1067 of 1808) PASS: lldb-shell :: ObjectFile/Breakpad/uuid-matching-mac.test (1068 of 1808) PASS: lldb-unit :: Utility/./UtilityTests/VASprintfTest.NoBufferResize (1069 of 1808) PASS: lldb-api :: functionalities/breakpoint/cpp_exception/TestCPPExceptionBreakpoint.py (1070 of 1808) PASS: lldb-api :: macosx/function-starts/TestFunctionStarts.py (1071 of 1808) PASS: lldb-api :: lang/cpp/std-function-step-into-callable/TestStdFunctionStepIntoCallable.py (1072 of 1808) PASS: lldb-api :: lang/objc/print-obj/TestPrintObj.py (1073 of 1808) PASS: lldb-api :: functionalities/memory/read/TestMemoryRead.py (1074 of 1808) PASS: lldb-api :: commands/command/invalid-args/TestInvalidArgsCommand.py (1075 of 1808) PASS: lldb-unit :: ScriptInterpreter/Python/./ScriptInterpreterPythonTests/PythonDataObjectsTest.TestPythonDictionaryValueEquality (1076 of 1808) PASS: lldb-unit :: Utility/./UtilityTests/StringListTest.Clear (1077 of 1808) PASS: lldb-unit :: Utility/./UtilityTests/OptionsWithRawTest.QuotedSuffix (1078 of 1808) PASS: lldb-api :: commands/expression/import-std-module/forward_list-basic/TestBasicForwardList.py (1079 of 1808) PASS: lldb-unit :: Utility/./UtilityTests/StreamTeeTest.CopyConstructor (1080 of 1808) PASS: lldb-api :: functionalities/backticks/TestBackticksWithoutATarget.py (1081 of 1808) PASS: lldb-api :: functionalities/data-formatter/data-formatter-enum-format/TestDataFormatterEnumFormat.py (1082 of 1808) PASS: lldb-api :: lang/objc/modules/TestObjCModules.py (1083 of 1808) PASS: lldb-api :: functionalities/breakpoint/inlined_breakpoints/TestInlinedBreakpoints.py (1084 of 1808) PASS: lldb-unit :: Utility/./UtilityTests/ConstStringTest.NullAndEmptyStates (1085 of 1808) PASS: lldb-unit :: Utility/./UtilityTests/RangeTest.Clear (1086 of 1808) PASS: lldb-unit :: Utility/./UtilityTests/ArgsTest.EscapeLLDBCommandArgument (1087 of 1808) PASS: lldb-unit :: ScriptInterpreter/Python/./ScriptInterpreterPythonTests/PythonDataObjectsTest.TestPythonStringToStr (1088 of 1808) UNSUPPORTED: lldb-api :: commands/expression/completion-crash1/TestCompletionCrash1.py (1089 of 1808) PASS: lldb-unit :: Process/gdb-remote/./ProcessGdbRemoteTests/GDBRemoteCommunicationServerTest.SendErrorResponse_ErrorList (1090 of 1808) PASS: lldb-api :: lang/c/strings/TestCStrings.py (1091 of 1808) PASS: lldb-api :: lang/objc/forward-decl/TestForwardDecl.py (1092 of 1808) PASS: lldb-unit :: Utility/./UtilityTests/RecordReplayTest.InstrumentedFooSameThis (1093 of 1808) UNSUPPORTED: lldb-shell :: SymbolFile/PDB/type-quals.test (1094 of 1808) PASS: lldb-api :: lang/objc/objc-dyn-sbtype/TestObjCDynamicSBType.py (1095 of 1808) UNSUPPORTED: lldb-api :: functionalities/darwin_log/source/info/TestDarwinLogSourceInfo.py (1096 of 1808) UNSUPPORTED: lldb-api :: functionalities/tsan/cpp_global_location/TestTsanCPPGlobalLocation.py (1097 of 1808) PASS: lldb-shell :: Quit/TestQuitExitCodeHexA.test (1098 of 1808) PASS: lldb-api :: functionalities/data-formatter/data-formatter-stl/libcxx/atomic/TestLibCxxAtomic.py (1099 of 1808) UNSUPPORTED: lldb-shell :: Register/x86-64-ymm16-read.test (1100 of 1808) PASS: lldb-api :: lang/objc/modules-update/TestClangModulesUpdate.py (1101 of 1808) UNSUPPORTED: lldb-api :: functionalities/thread/create_during_step/TestCreateDuringStep.py (1102 of 1808) PASS: lldb-api :: lang/c/unions/TestUnionMembers.py (1103 of 1808) PASS: lldb-api :: functionalities/data-formatter/var-in-aggregate-misuse/TestVarInAggregateMisuse.py (1104 of 1808) PASS: lldb-api :: python_api/watchpoint/watchlocation/TestSetWatchlocation.py (1105 of 1808) PASS: lldb-shell :: Commands/CommandScriptImmediateOutput/CommandScriptImmediateOutputFile.test (1106 of 1808) PASS: lldb-unit :: Host/./HostTests/SocketAddressTest.Set (1107 of 1808) PASS: lldb-api :: commands/expression/import-std-module/vector-dbg-info-content/TestDbgInfoContentVector.py (1108 of 1808) PASS: lldb-unit :: Utility/./UtilityTests/ArgsTest.AppendArguments (1109 of 1808) PASS: lldb-unit :: Utility/./UtilityTests/StringExtractorTest.GetHexBytes_OddPair (1110 of 1808) PASS: lldb-api :: python_api/lldbutil/iter/TestRegistersIterator.py (1111 of 1808) PASS: lldb-api :: commands/frame/diagnose/local-variable/TestLocalVariable.py (1112 of 1808) PASS: lldb-api :: functionalities/breakpoint/move_nearest/TestMoveNearest.py (1113 of 1808) PASS: lldb-shell :: Breakpoint/debug_rnglist_basic.test (1114 of 1808) PASS: lldb-unit :: Language/Highlighting/./HighlighterTests/HighlighterTest.ClangScalarLiterals (1115 of 1808) PASS: lldb-unit :: Utility/./UtilityTests/NameMatchesTest.Equals (1116 of 1808) PASS: lldb-unit :: Process/gdb-remote/./ProcessGdbRemoteTests/GDBRemoteCommunicationServerTest.SendErrorResponse_UnimplementedError (1117 of 1808) PASS: lldb-api :: commands/expression/import-std-module/shared_ptr-dbg-info-content/TestSharedPtrDbgInfoContent.py (1118 of 1808) PASS: lldb-unit :: Utility/./UtilityTests/LogChannelEnabledTest.LogThread (1119 of 1808) PASS: lldb-api :: types/TestDoubleTypesExpr.py (1120 of 1808) PASS: lldb-unit :: Utility/./UtilityTests/RangeTest.DefaultConstructor (1121 of 1808) PASS: lldb-api :: functionalities/postmortem/mach-core/TestMachCore.py (1122 of 1808) UNSUPPORTED: lldb-api :: functionalities/darwin_log/filter/exact_match/subsystem/TestDarwinLogFilterMatchSubsystem.py (1123 of 1808) PASS: lldb-api :: lang/cpp/call-function/TestCallCPPFunction.py (1124 of 1808) PASS: lldb-shell :: ObjectFile/ELF/PT_LOAD-overlap-section.yaml (1125 of 1808) PASS: lldb-unit :: Utility/./UtilityTests/TimerTest.CategoryTimesStats (1126 of 1808) PASS: lldb-unit :: Utility/./UtilityTests/StringExtractorTest.GetHexBytesAvail_FullString (1127 of 1808) PASS: lldb-shell :: SymbolFile/DWARF/deterministic-build.cpp (1128 of 1808) PASS: lldb-api :: lang/objc/objc-new-syntax/TestObjCNewSyntaxArray.py (1129 of 1808) PASS: lldb-unit :: Utility/./UtilityTests/StringExtractorTest.GetHexU8_Underflow (1130 of 1808) PASS: lldb-unit :: SymbolFile/DWARF/./SymbolFileDWARFTests/SymbolFileDWARFTests.TestAbbrevMissingTerminator (1131 of 1808) PASS: lldb-unit :: Utility/./UtilityTests/BinaryStreamTest.PutSLEB128FourBytes (1132 of 1808) PASS: lldb-unit :: Utility/./UtilityTests/RangeTest.Union (1133 of 1808) XFAIL: lldb-shell :: SymbolFile/DWARF/find-type-in-function.cpp (1134 of 1808) PASS: lldb-api :: lang/objc/radar-9691614/TestObjCMethodReturningBOOL.py (1135 of 1808) PASS: lldb-api :: commands/expression/import-std-module/deque-basic/TestBasicDeque.py (1136 of 1808) PASS: lldb-unit :: Utility/./UtilityTests/StreamTeeTest.Write (1137 of 1808) PASS: lldb-shell :: ObjectFile/ELF/netbsd-exec-8.99.30-amd64.yaml (1138 of 1808) PASS: lldb-api :: functionalities/breakpoint/breakpoint_conditions/TestBreakpointConditions.py (1139 of 1808) UNSUPPORTED: lldb-shell :: Expr/TestIRMemoryMapWindows.test (1140 of 1808) PASS: lldb-api :: commands/apropos/with-process/TestAproposWithProcess.py (1141 of 1808) PASS: lldb-unit :: Interpreter/./InterpreterTests/OptionArgParserTest.toBoolean (1142 of 1808) PASS: lldb-unit :: Utility/./UtilityTests/OptionsWithRawTest.SingleWordSuffix (1143 of 1808) PASS: lldb-unit :: Utility/./UtilityTests/UriParserTest.MinimalPath (1144 of 1808) PASS: lldb-api :: functionalities/thread/concurrent_events/TestConcurrentSignalDelayWatch.py (1145 of 1808) PASS: lldb-unit :: Host/./HostTests/MainLoopTest.TerminatesImmediately (1146 of 1808) PASS: lldb-api :: functionalities/gdb_remote_client/TestRestartBug.py (1147 of 1808) PASS: lldb-unit :: Host/./HostTests/FileSystemTest.FileAndDirectoryComponents (1148 of 1808) PASS: lldb-shell :: SymbolFile/DWARF/find-qualified-variable.cpp (1149 of 1808) PASS: lldb-unit :: Symbol/./SymbolTests/DWARFCallFrameInfoTest.Basic_dwarf4 (1150 of 1808) PASS: lldb-unit :: Utility/./UtilityTests/BinaryStreamTest.PutULEB128SevenBytes (1151 of 1808) PASS: lldb-api :: api/listeners/TestListener.py (1152 of 1808) PASS: lldb-api :: api/log/TestAPILog.py (1153 of 1808) UNSUPPORTED: lldb-shell :: Unwind/unwind-plan-dwarf-dump.test (1154 of 1808) PASS: lldb-api :: commands/target/create-deps/TestTargetCreateDeps.py (1155 of 1808) PASS: lldb-api :: commands/frame/select/TestFrameSelect.py (1156 of 1808) PASS: lldb-unit :: Utility/./UtilityTests/StringListTest.CopyListEmpty (1157 of 1808) PASS: lldb-shell :: Reproducer/TestDump.test (1158 of 1808) PASS: lldb-unit :: Utility/./UtilityTests/StringListTest.AppendStringStdString (1159 of 1808) PASS: lldb-api :: tools/lldb-vscode/breakpoint/TestVSCode_setFunctionBreakpoints.py (1160 of 1808) PASS: lldb-unit :: Process/gdb-remote/./ProcessGdbRemoteTests/GDBRemoteClientBaseTest.InterruptNoResponse (1161 of 1808) PASS: lldb-unit :: Utility/./UtilityTests/StringListTest.InsertStringAtIndexMove (1162 of 1808) PASS: lldb-api :: api/multithreaded/TestMultithreaded.py (1163 of 1808) PASS: lldb-api :: functionalities/gdb_remote_client/TestThreadSelectionBug.py (1164 of 1808) PASS: lldb-unit :: Utility/./UtilityTests/StringListTest.JoinEmpty (1165 of 1808) PASS: lldb-unit :: Utility/./UtilityTests/ConstStringTest.CompareConstString (1166 of 1808) UNSUPPORTED: lldb-api :: linux/sepdebugsymlink/TestTargetSymbolsSepDebugSymlink.py (1167 of 1808) PASS: lldb-api :: commands/log/invalid-args/TestInvalidArgsLog.py (1168 of 1808) PASS: lldb-api :: functionalities/data-formatter/synthcapping/TestSyntheticCapping.py (1169 of 1808) PASS: lldb-api :: commands/watchpoints/watchpoint_disable/TestWatchpointDisable.py (1170 of 1808) PASS: lldb-api :: python_api/class_members/TestSBTypeClassMembers.py (1171 of 1808) PASS: lldb-api :: functionalities/data-formatter/dump_dynamic/TestDumpDynamic.py (1172 of 1808) PASS: lldb-shell :: SymbolFile/Breakpad/line-table-mixed-path-styles.test (1173 of 1808) UNSUPPORTED: lldb-api :: lang/objc/objc-dynamic-value/TestObjCDynamicValue.py (1174 of 1808) PASS: lldb-unit :: Utility/./UtilityTests/RangeDataVector.FindEntryThatContains (1175 of 1808) PASS: lldb-unit :: Process/gdb-remote/./ProcessGdbRemoteTests/GDBRemoteCommunicationClientTest.SendStartTracePacket (1176 of 1808) PASS: lldb-unit :: Utility/./UtilityTests/RangeTest.ClearWithStarAddress (1177 of 1808) PASS: lldb-api :: functionalities/data-formatter/nssetsynth/TestNSSetSynthetic.py (1178 of 1808) PASS: lldb-shell :: Breakpoint/case-sensitive.test (1179 of 1808) PASS: lldb-unit :: Utility/./UtilityTests/RangeTest.LessThanInvalid (1180 of 1808) PASS: lldb-unit :: Utility/./UtilityTests/VMRange.Ordering (1181 of 1808) PASS: lldb-unit :: Utility/./UtilityTests/ArgsTest.DoubleQuotedItem (1182 of 1808) PASS: lldb-api :: commands/command/script/import/TestImport.py (1183 of 1808) PASS: lldb-unit :: Utility/./UtilityTests/TimeoutTest.Construction (1184 of 1808) PASS: lldb-api :: functionalities/memory/cache/TestMemoryCache.py (1185 of 1808) PASS: lldb-api :: commands/frame/diagnose/bad-reference/TestBadReference.py (1186 of 1808) PASS: lldb-api :: functionalities/thread/concurrent_events/TestConcurrentTwoBreakpointsOneDelaySignal.py (1187 of 1808) PASS: lldb-unit :: Utility/./UtilityTests/StringExtractorTest.GetHexBytesAvail_Underflow (1188 of 1808) PASS: lldb-shell :: ObjectFile/ELF/short-build-id.yaml (1189 of 1808) PASS: lldb-unit :: SymbolFile/DWARF/./SymbolFileDWARFTests/SymbolFileDWARFTests.TestAbbrevOrder1Start1 (1190 of 1808) PASS: lldb-api :: functionalities/breakpoint/breakpoint_hit_count/TestBreakpointHitCount.py (1191 of 1808) PASS: lldb-api :: functionalities/data-formatter/data-formatter-stl/libcxx/initializerlist/TestInitializerList.py (1192 of 1808) PASS: lldb-api :: functionalities/process_group/TestChangeProcessGroup.py (1193 of 1808) PASS: lldb-api :: functionalities/thread/concurrent_events/TestConcurrentWatchBreakDelay.py (1194 of 1808) PASS: lldb-unit :: UnwindAssembly/x86/./UnwindAssemblyx86Tests/Testx86AssemblyInspectionEngine.Test32bitFramelessBigStackFrame (1195 of 1808) PASS: lldb-unit :: Utility/./UtilityTests/StringExtractorTest.GetHexBytes_Partial (1196 of 1808) PASS: lldb-unit :: Utility/./UtilityTests/StreamTest.PutBytesAsRawHex8ToLittleEndian (1197 of 1808) PASS: lldb-shell :: Reproducer/TestReuseDirectory.test (1198 of 1808) PASS: lldb-shell :: SymbolFile/DWARF/debug-types-address-ranges.s (1199 of 1808) PASS: lldb-shell :: SymbolFile/NativePDB/bitfields.cpp (1200 of 1808) PASS: lldb-api :: lang/c/array_types/TestArrayTypes.py (1201 of 1808) PASS: lldb-api :: python_api/default-constructor/TestDefaultConstructorForAPIObjects.py (1202 of 1808) PASS: lldb-shell :: SymbolFile/NativePDB/globals-bss.cpp (1203 of 1808) PASS: lldb-unit :: Host/./HostTests/NativeProcessProtocolTest.SetBreakpointFailRead (1204 of 1808) UNSUPPORTED: lldb-api :: functionalities/tty/TestTerminal.py (1205 of 1808) PASS: lldb-api :: lang/objc/foundation/TestObjCMethods.py (1206 of 1808) PASS: lldb-shell :: ObjectFile/ELF/PT_LOAD-overlap-PT_INTERP.yaml (1207 of 1808) PASS: lldb-unit :: Expression/./ExpressionTests/CppModuleConfigurationTest.MissingUsrInclude (1208 of 1808) PASS: lldb-unit :: Interpreter/./InterpreterTests/OptionArgParserTest.toChar (1209 of 1808) PASS: lldb-unit :: Symbol/./SymbolTests/TestClangASTContext.TestRemoveFastQualifiers (1210 of 1808) PASS: lldb-unit :: Utility/./UtilityTests/StringListTest.InsertStringAtIndexOutOfBounds (1211 of 1808) UNSUPPORTED: lldb-api :: functionalities/ubsan/basic/TestUbsanBasic.py (1212 of 1808) PASS: lldb-shell :: SymbolFile/DWARF/dir-separator-posix.s (1213 of 1808) PASS: lldb-unit :: Utility/./UtilityTests/StringListTest.Join (1214 of 1808) PASS: lldb-unit :: ScriptInterpreter/Python/./ScriptInterpreterPythonTests/PythonDataObjectsTest.TestInstanceNameResolutionNoDot (1215 of 1808) PASS: lldb-unit :: Utility/./UtilityTests/StringExtractorTest.GetU64BigEndian (1216 of 1808) UNSUPPORTED: lldb-api :: commands/register/register/intel_xtended_registers/mpx_bound_violation/TestBoundViolation.py (1217 of 1808) PASS: lldb-api :: lang/cpp/gmodules/TestWithModuleDebugging.py (1218 of 1808) PASS: lldb-api :: functionalities/thread/thread_exit/TestThreadExit.py (1219 of 1808) PASS: lldb-api :: tools/lldb-server/register-reading/TestGdbRemoteGPacket.py (1220 of 1808) PASS: lldb-api :: lang/cpp/frame-var-anon-unions/TestFrameVariableAnonymousUnions.py (1221 of 1808) PASS: lldb-unit :: ScriptInterpreter/Python/./ScriptInterpreterPythonTests/PythonDataObjectsTest.TestPythonCallableCheck (1222 of 1808) PASS: lldb-unit :: debugserver/./debugserverTests/RNBSocket.LoopBackConnectIPv6 (1223 of 1808) PASS: lldb-unit :: Utility/./UtilityTests/StreamTest.ShiftOperatorUInts (1224 of 1808) PASS: lldb-shell :: ObjectFile/ELF/PT_LOAD-overlap.yaml (1225 of 1808) PASS: lldb-api :: lang/cpp/signed_types/TestSignedTypes.py (1226 of 1808) PASS: lldb-unit :: Utility/./UtilityTests/VMRange.Reset (1227 of 1808) UNSUPPORTED: lldb-api :: lang/cpp/function-template-parameter-pack/TestFunctionTemplateParameterPack.py (1228 of 1808) PASS: lldb-shell :: SymbolFile/Breakpad/symtab.test (1229 of 1808) PASS: lldb-api :: functionalities/breakpoint/breakpoint_ids/TestBreakpointIDs.py (1230 of 1808) UNSUPPORTED: lldb-shell :: Register/arm-fp-read.test (1231 of 1808) PASS: lldb-unit :: SymbolFile/NativePDB/./SymbolFileNativePDBTests/PDBFPOProgramToDWARFExpressionTests.MultipleDependentAssignments (1232 of 1808) PASS: lldb-unit :: Expression/./ExpressionTests/DWARFExpression.DW_OP_pick (1233 of 1808) PASS: lldb-api :: functionalities/fat_archives/TestFatArchives.py (1234 of 1808) PASS: lldb-api :: lang/objc/objc++/TestObjCXX.py (1235 of 1808) PASS: lldb-unit :: Language/Highlighting/./HighlighterTests/HighlighterTest.ClangBraces (1236 of 1808) PASS: lldb-api :: tools/lldb-vscode/breakpoint/TestVSCode_setExceptionBreakpoints.py (1237 of 1808) PASS: lldb-unit :: SymbolFile/NativePDB/./SymbolFileNativePDBTests/PDBFPOProgramToDWARFExpressionTests.InvalidAssignmentSingle (1238 of 1808) PASS: lldb-unit :: Utility/./UtilityTests/NameMatchesTest.Contains (1239 of 1808) PASS: lldb-unit :: Utility/./UtilityTests/BinaryStreamTest.PutULEB128FiveBytes (1240 of 1808) PASS: lldb-api :: lang/cpp/enum_types/TestCPP11EnumTypes.py (1241 of 1808) PASS: lldb-unit :: Utility/./UtilityTests/ArchSpecTest.OperatorBool (1242 of 1808) PASS: lldb-shell :: SymbolFile/DWARF/debug-types-line-tables.s (1243 of 1808) PASS: lldb-api :: commands/expression/call-overridden-method/TestCallOverriddenMethod.py (1244 of 1808) PASS: lldb-api :: commands/disassemble/basic/TestFrameDisassemble.py (1245 of 1808) PASS: lldb-unit :: Expression/./ExpressionTests/CppModuleConfigurationTest.AmbiguousLibCpp (1246 of 1808) PASS: lldb-api :: commands/watchpoints/watchpoint_commands/command/TestWatchpointCommandPython.py (1247 of 1808) PASS: lldb-api :: functionalities/data-formatter/data-formatter-objc/TestDataFormatterObjCNSData.py (1248 of 1808) PASS: lldb-api :: lang/c/blocks/TestBlocks.py (1249 of 1808) PASS: lldb-shell :: SymbolFile/NativePDB/source-list.cpp (1250 of 1808) PASS: lldb-api :: functionalities/float-display/TestFloatDisplay.py (1251 of 1808) PASS: lldb-api :: functionalities/gdb_remote_client/TestTargetXMLArch.py (1252 of 1808) PASS: lldb-unit :: Language/CPlusPlus/./LanguageCPlusPlusTests/CPlusPlusLanguage.FindAlternateFunctionManglings (1253 of 1808) PASS: lldb-api :: lang/objc/objc-super/TestObjCSuper.py (1254 of 1808) PASS: lldb-api :: commands/target/create-no-such-arch/TestNoSuchArch.py (1255 of 1808) PASS: lldb-api :: commands/expression/weak_symbols/TestWeakSymbols.py (1256 of 1808) PASS: lldb-unit :: Utility/./UtilityTests/TimeoutTest.Format (1257 of 1808) PASS: lldb-unit :: Utility/./UtilityTests/VMRange.CollectionContains (1258 of 1808) PASS: lldb-unit :: Utility/./UtilityTests/DataExtractorTest.GetMaxU64_unchecked (1259 of 1808) UNSUPPORTED: lldb-shell :: Register/x86-64-zmm-read.test (1260 of 1808) PASS: lldb-unit :: Utility/./UtilityTests/CompletionRequest.TryCompleteCurrentArgMode (1261 of 1808) PASS: lldb-api :: commands/expression/rdar44436068/Test128BitsInteger.py (1262 of 1808) PASS: lldb-unit :: ObjectFile/Breakpad/./ObjectFileBreakpadTests/StackWinRecord.parse (1263 of 1808) PASS: lldb-api :: lang/cpp/trivial_abi/TestTrivialABI.py (1264 of 1808) PASS: lldb-unit :: Host/./HostTests/TaskPoolTest.TaskMap (1265 of 1808) PASS: lldb-api :: commands/watchpoints/multiple_hits/TestMultipleHits.py (1266 of 1808) PASS: lldb-unit :: SymbolFile/NativePDB/./SymbolFileNativePDBTests/PDBFPOProgramToDWARFExpressionTests.UnresolvedRegisterReference (1267 of 1808) PASS: lldb-shell :: SymbolFile/DWARF/find-basic-namespace.cpp (1268 of 1808) PASS: lldb-unit :: Utility/./UtilityTests/StreamTest.PutCharWhitespace (1269 of 1808) PASS: lldb-api :: commands/expression/completion-in-lambda-and-unnnamed-class/TestCompletionInLambdaAndUnnamedClass.py (1270 of 1808) PASS: lldb-unit :: Utility/./UtilityTests/OptionsWithRawTest.ArgsButNoLeadingDash (1271 of 1808) PASS: lldb-unit :: Utility/./UtilityTests/ScalarTest.Division (1272 of 1808) PASS: lldb-api :: commands/expression/persistent_types/TestPersistentTypes.py (1273 of 1808) PASS: lldb-api :: commands/expression/call-function/TestCallUserDefinedFunction.py (1274 of 1808) PASS: lldb-unit :: Utility/./UtilityTests/OptionsWithRawTest.EmptyArgsOnlySuffix (1275 of 1808) PASS: lldb-api :: functionalities/data-formatter/data-formatter-skip-summary/TestDataFormatterSkipSummary.py (1276 of 1808) PASS: lldb-api :: functionalities/deleted-executable/TestDeletedExecutable.py (1277 of 1808) PASS: lldb-unit :: SymbolFile/DWARF/./SymbolFileDWARFTests/SymbolFileDWARFTests.TestAbbrevOutOfOrder (1278 of 1808) PASS: lldb-unit :: UnwindAssembly/x86/./UnwindAssemblyx86Tests/Testx86AssemblyInspectionEngine.TestPushEDX (1279 of 1808) PASS: lldb-unit :: Utility/./UtilityTests/BinaryStreamTest.PutSLEB128ThreeBytes (1280 of 1808) PASS: lldb-unit :: Utility/./UtilityTests/StringListTest.JoinNonSpace (1281 of 1808) PASS: lldb-unit :: Utility/./UtilityTests/SerializationRountripTest.SerializeDeserializePod (1282 of 1808) PASS: lldb-api :: functionalities/data-formatter/typedef_array/TestTypedefArray.py (1283 of 1808) PASS: lldb-api :: python_api/lldbutil/iter/TestLLDBIterator.py (1284 of 1808) PASS: lldb-api :: functionalities/tail_call_frames/unambiguous_sequence/TestUnambiguousTailCalls.py (1285 of 1808) PASS: lldb-unit :: Utility/./UtilityTests/ReproducerTest.SetReplay (1286 of 1808) PASS: lldb-unit :: Utility/./UtilityTests/OptionsWithRawTest.SingleWhitespaceInput (1287 of 1808) PASS: lldb-api :: lang/c/stepping/TestStepAndBreakpoints.py (1288 of 1808) PASS: lldb-shell :: ObjectFile/ELF/section-permissions.yaml (1289 of 1808) PASS: lldb-api :: python_api/symbol-context/two-files/TestSymbolContextTwoFiles.py (1290 of 1808) PASS: lldb-unit :: Utility/./UtilityTests/OptionsWithRawTest.WhitespaceInput (1291 of 1808) PASS: lldb-unit :: UnwindAssembly/x86/./UnwindAssemblyx86Tests/Testx86AssemblyInspectionEngine.TestSimplei386ugmented (1292 of 1808) PASS: lldb-unit :: Utility/./UtilityTests/StreamTeeTest.SetStreamAtIndexOverwrite (1293 of 1808) PASS: lldb-api :: tools/lldb-vscode/launch/TestVSCode_launch.py (1294 of 1808) PASS: lldb-unit :: UnwindAssembly/x86/./UnwindAssemblyx86Tests/Testx86AssemblyInspectionEngine.TestPushRBX (1295 of 1808) PASS: lldb-api :: driver/batch_mode/TestBatchMode.py (1296 of 1808) PASS: lldb-api :: lang/objc/unicode-string/TestUnicodeString.py (1297 of 1808) PASS: lldb-unit :: Utility/./UtilityTests/AnsiTerminal.Incomplete (1298 of 1808) PASS: lldb-unit :: Process/gdb-remote/./ProcessGdbRemoteTests/GDBRemoteCommunicationClientTest.GetMemoryRegionInfoInvalidResponse (1299 of 1808) PASS: lldb-api :: lang/cpp/gmodules-templates/TestGModules.py (1300 of 1808) PASS: lldb-unit :: Host/./HostTests/SocketTest.TCPListen0GetPort (1301 of 1808) UNSUPPORTED: lldb-api :: functionalities/longjmp/TestLongjmp.py (1302 of 1808) PASS: lldb-shell :: ObjectFile/ELF/duplicate-section.yaml (1303 of 1808) PASS: lldb-unit :: Utility/./UtilityTests/NameMatchesTest.Ignore (1304 of 1808) PASS: lldb-api :: commands/command/script/TestCommandScript.py (1305 of 1808) PASS: lldb-unit :: Process/gdb-remote/./ProcessGdbRemoteTests/GDBRemoteClientBaseTest.SendContinueAndAsyncSignal (1306 of 1808) PASS: lldb-unit :: Symbol/./SymbolTests/PostfixExpression.ParseOneExpression (1307 of 1808) PASS: lldb-api :: commands/expression/inline-namespace/TestInlineNamespace.py (1308 of 1808) PASS: lldb-api :: functionalities/thread/concurrent_events/TestConcurrentWatchBreak.py (1309 of 1808) PASS: lldb-unit :: Utility/./UtilityTests/StringExtractorTest.GetHexBytes (1310 of 1808) PASS: lldb-unit :: Expression/./ExpressionTests/DiagnosticManagerTest.AppendMessageAttachToLastDiag (1311 of 1808) PASS: lldb-shell :: SymbolFile/DWARF/find-basic-function.cpp (1312 of 1808) UNSUPPORTED: lldb-shell :: SymbolFile/PDB/pointers.test (1313 of 1808) PASS: lldb-api :: commands/expression/import-std-module/unique_ptr-dbg-info-content/TestUniquePtrDbgInfoContent.py (1314 of 1808) PASS: lldb-unit :: Utility/./UtilityTests/StringListTest.LongestCommonPrefix (1315 of 1808) PASS: lldb-unit :: Utility/./UtilityTests/AnsiTerminal.Basic (1316 of 1808) PASS: lldb-api :: functionalities/thread/jump/TestThreadJump.py (1317 of 1808) PASS: lldb-shell :: Heap/heap-cstr.test (1318 of 1808) PASS: lldb-unit :: Utility/./UtilityTests/RecordReplayTest.InstrumentedBarRef (1319 of 1808) PASS: lldb-api :: lang/objc/objc-checker/TestObjCCheckers.py (1320 of 1808) PASS: lldb-api :: functionalities/thread/thread_specific_break/TestThreadSpecificBreakpoint.py (1321 of 1808) PASS: lldb-api :: commands/expression/two-files/TestObjCTypeQueryFromOtherCompileUnit.py (1322 of 1808) PASS: lldb-unit :: tools/lldb-server/tests/./LLDBServerTests/StandardStartupTest.TestStopReplyContainsThreadPcs (1323 of 1808) PASS: lldb-unit :: Utility/./UtilityTests/DataExtractorTest.GetCStrAtNullOffset (1324 of 1808) PASS: lldb-api :: functionalities/modern-type-lookup/objc-modules/TestObjModulesModernTypeLookup.py (1325 of 1808) PASS: lldb-api :: functionalities/data-formatter/data-formatter-objc/TestDataFormatterObjCNSContainer.py (1326 of 1808) PASS: lldb-unit :: tools/lldb-server/tests/./LLDBServerTests/TestBase.LaunchModePreservesEnvironment (1327 of 1808) PASS: lldb-api :: commands/expression/diagnostics/TestExprDiagnostics.py (1328 of 1808) PASS: lldb-api :: lang/cpp/static_methods/TestCPPStaticMethods.py (1329 of 1808) PASS: lldb-unit :: Utility/./UtilityTests/LogChannelTest.List (1330 of 1808) UNSUPPORTED: lldb-shell :: Register/aarch64-fp-read.test (1331 of 1808) UNSUPPORTED: lldb-api :: functionalities/thread/state/TestThreadStates.py (1332 of 1808) PASS: lldb-unit :: Utility/./UtilityTests/StringListTest.JoinSingle (1333 of 1808) PASS: lldb-unit :: Target/./TargetTests/ModuleCacheTest.GetAndPutStrangeHostname (1334 of 1808) PASS: lldb-api :: lang/cpp/lambdas/TestLambdas.py (1335 of 1808) PASS: lldb-unit :: Utility/./UtilityTests/UriParserTest.MinimalPort (1336 of 1808) PASS: lldb-unit :: Utility/./UtilityTests/StringListTest.LongestCommonPrefixSingleElement (1337 of 1808) PASS: lldb-api :: commands/expression/no-deadlock/TestExprDoesntBlock.py (1338 of 1808) PASS: lldb-api :: functionalities/breakpoint/step_over_breakpoint/TestStepOverBreakpoint.py (1339 of 1808) PASS: lldb-unit :: Utility/./UtilityTests/TimerTest.CategoryTimes2 (1340 of 1808) PASS: lldb-api :: lang/objc/modules-inline-functions/TestModulesInlineFunctions.py (1341 of 1808) PASS: lldb-api :: commands/expression/vector_of_enums/TestVectorOfEnums.py (1342 of 1808) PASS: lldb-api :: lang/cpp/member-and-local-vars-with-same-name/TestMembersAndLocalsWithSameName.py (1343 of 1808) PASS: lldb-api :: python_api/process/read-mem-cstring/TestReadMemCString.py (1344 of 1808) PASS: lldb-unit :: Utility/./UtilityTests/StringListTest.PopBack (1345 of 1808) PASS: lldb-unit :: Utility/./UtilityTests/StreamTest.PutHex64ByteOrderLittle (1346 of 1808) UNSUPPORTED: lldb-api :: commands/register/register/intel_xtended_registers/mpx_offset_intersection/TestMPXOffsetIntersection.py (1347 of 1808) PASS: lldb-shell :: Minidump/Windows/Sigsegv/sigsegv.test (1348 of 1808) PASS: lldb-unit :: Utility/./UtilityTests/ConstStringTest.CompareStringRef (1349 of 1808) PASS: lldb-unit :: Utility/./UtilityTests/ScalarTest.GetValue (1350 of 1808) PASS: lldb-unit :: Language/Highlighting/./HighlighterTests/HighlighterTest.ClangIdentifiers (1351 of 1808) PASS: lldb-unit :: Process/minidump/./LLDBMinidumpTests/MinidumpParserTest.GetThreadContext_x86_32_wow64 (1352 of 1808) PASS: lldb-unit :: ObjectFile/Breakpad/./ObjectFileBreakpadTests/InfoRecord.parse (1353 of 1808) PASS: lldb-unit :: Utility/./UtilityTests/ArgsTest.TestSingleArg (1354 of 1808) PASS: lldb-api :: macosx/universal/TestUniversal.py (1355 of 1808) PASS: lldb-unit :: Utility/./UtilityTests/StringExtractorTest.GetHexU8_Underflow2 (1356 of 1808) UNSUPPORTED: lldb-api :: arm/breakpoint-thumb-codesection/TestBreakpointThumbCodesection.py (1357 of 1808) PASS: lldb-api :: commands/help/TestHelp.py (1358 of 1808) PASS: lldb-api :: lang/cpp/function_refs/TestFunctionRefs.py (1359 of 1808) PASS: lldb-api :: commands/expression/char/TestExprsChar.py (1360 of 1808) PASS: lldb-unit :: Utility/./UtilityTests/LogChannelEnabledTest.LogGetLogThread (1361 of 1808) PASS: lldb-unit :: Utility/./UtilityTests/StringExtractorTest.DecodeHexU8_Underflow2 (1362 of 1808) PASS: lldb-unit :: Utility/./UtilityTests/ScalarTest.RightShiftOperator (1363 of 1808) PASS: lldb-api :: commands/frame/diagnose/dereference-argument/TestDiagnoseDereferenceArgument.py (1364 of 1808) PASS: lldb-api :: commands/settings/TestSettings.py (1365 of 1808) PASS: lldb-unit :: UnwindAssembly/x86/./UnwindAssemblyx86Tests/Testx86AssemblyInspectionEngine.TestPushESI (1366 of 1808) PASS: lldb-unit :: Utility/./UtilityTests/StringListTest.GetMaxStringLengthMixed (1367 of 1808) UNSUPPORTED: lldb-api :: functionalities/exec/TestExec.py (1368 of 1808) PASS: lldb-api :: commands/expression/argument_passing_restrictions/TestArgumentPassingRestrictions.py (1369 of 1808) PASS: lldb-shell :: ObjectFile/Breakpad/sections.test (1370 of 1808) PASS: lldb-unit :: Symbol/./SymbolTests/SymbolsTest.TerminateLocateExecutableSymbolFileForUnknownExecutableAndUnknownSymbolFile (1371 of 1808) PASS: lldb-shell :: SymbolFile/DWARF/split-dwarf-multiple-cu.ll (1372 of 1808) PASS: lldb-shell :: Driver/TestNoUseColor.test (1373 of 1808) PASS: lldb-shell :: SymbolFile/NativePDB/ast-methods.cpp (1374 of 1808) PASS: lldb-unit :: ObjectFile/PECOFF/./ObjectFilePECOFFTests/PECallFrameInfoTest.Chained_eh (1375 of 1808) PASS: lldb-api :: lang/cpp/dynamic-value/TestCppValueCast.py (1376 of 1808) PASS: lldb-api :: functionalities/data-formatter/data-formatter-stl/libcxx/variant/TestDataFormatterLibcxxVariant.py (1377 of 1808) PASS: lldb-api :: commands/expression/dollar-in-variable/TestDollarInVariable.py (1378 of 1808) PASS: lldb-api :: lang/objc/variadic_methods/TestVariadicMethods.py (1379 of 1808) PASS: lldb-api :: functionalities/thread/concurrent_events/TestConcurrentSignalBreak.py (1380 of 1808) PASS: lldb-api :: lang/objc/objc-property/TestObjCProperty.py (1381 of 1808) PASS: lldb-unit :: Expression/./ExpressionTests/CppModuleConfigurationTest.UnrelatedLibrary (1382 of 1808) PASS: lldb-api :: functionalities/thread/concurrent_events/TestConcurrentCrashWithWatchpointBreakpointSignal.py (1383 of 1808) PASS: lldb-unit :: Language/Highlighting/./HighlighterTests/HighlighterTest.ClangEmptyInput (1384 of 1808) PASS: lldb-shell :: Reproducer/Modules/TestModuleCXX.test (1385 of 1808) PASS: lldb-api :: macosx/queues/TestQueues.py (1386 of 1808) PASS: lldb-api :: lang/objc/global_ptrs/TestGlobalObjects.py (1387 of 1808) PASS: lldb-api :: functionalities/breakpoint/require_hw_breakpoints/TestRequireHWBreakpoints.py (1388 of 1808) PASS: lldb-unit :: Process/minidump/./LLDBMinidumpTests/MinidumpParserTest.GetMemory (1389 of 1808) PASS: lldb-unit :: Utility/./UtilityTests/ScalarTest.Scalar_512 (1390 of 1808) PASS: lldb-unit :: Host/./HostTests/SocketTest.UDPGetConnectURI (1391 of 1808) PASS: lldb-shell :: SymbolFile/DWARF/anon_class_w_and_wo_export_symbols.ll (1392 of 1808) PASS: lldb-unit :: Host/./HostTests/MainLoopTest.UnmonitoredSignal (1393 of 1808) PASS: lldb-unit :: UnwindAssembly/x86/./UnwindAssemblyx86Tests/Testx86AssemblyInspectionEngine.TestPopESI (1394 of 1808) PASS: lldb-api :: lang/objc/objc-struct-return/TestObjCStructReturn.py (1395 of 1808) PASS: lldb-unit :: Utility/./UtilityTests/RangeTest.Constructor (1396 of 1808) PASS: lldb-api :: lang/cpp/unicode-literals/TestUnicodeLiterals.py (1397 of 1808) PASS: lldb-unit :: Expression/./ExpressionTests/CppModuleConfigurationTest.IgnoreLibStdCpp (1398 of 1808) PASS: lldb-api :: lang/objc/objc-ivar-stripped/TestObjCIvarStripped.py (1399 of 1808) PASS: lldb-api :: functionalities/multiword-commands/TestMultiWordCommands.py (1400 of 1808) UNSUPPORTED: lldb-api :: benchmarks/continue/TestBenchmarkContinue.py (1401 of 1808) PASS: lldb-shell :: Unwind/trap_frame_sym_ctx.test (1402 of 1808) PASS: lldb-unit :: Utility/./UtilityTests/RangeTest.SizeTypes (1403 of 1808) PASS: lldb-unit :: Utility/./UtilityTests/ArchSpecTest.Compatibility (1404 of 1808) PASS: lldb-api :: lang/c/modules/TestCModules.py (1405 of 1808) PASS: lldb-api :: macosx/add-dsym/TestAddDsymMidExecutionCommand.py (1406 of 1808) PASS: lldb-api :: tools/lldb-server/TestGdbRemote_qThreadStopInfo.py (1407 of 1808) PASS: lldb-api :: lang/objc/foundation/TestSymbolTable.py (1408 of 1808) PASS: lldb-unit :: Host/./HostTests/File.GetWaitableHandleFileno (1409 of 1808) PASS: lldb-api :: commands/command/script/import/rdar-12586188/TestRdar12586188.py (1410 of 1808) PASS: lldb-api :: commands/frame/diagnose/virtual-method-call/TestDiagnoseDereferenceVirtualMethodCall.py (1411 of 1808) PASS: lldb-api :: lang/cpp/class_types/TestClassTypes.py (1412 of 1808) UNSUPPORTED: lldb-api :: linux/thread/create_during_instruction_step/TestCreateDuringInstructionStep.py (1413 of 1808) PASS: lldb-api :: python_api/sbvalue_const_addrof/TestSBValueConstAddrOf.py (1414 of 1808) PASS: lldb-unit :: Utility/./UtilityTests/Flags.Clear (1415 of 1808) PASS: lldb-unit :: Utility/./UtilityTests/StringLexerTest.AdvanceIf (1416 of 1808) PASS: lldb-unit :: Utility/./UtilityTests/StreamTeeTest.Constructor2Streams (1417 of 1808) PASS: lldb-api :: functionalities/data-formatter/data-formatter-stl/libcxx/forward_list/TestDataFormatterLibcxxForwardList.py (1418 of 1808) UNSUPPORTED: lldb-shell :: ObjectFile/ELF/minidebuginfo-set-and-hit-breakpoint.test (1419 of 1808) PASS: lldb-unit :: Utility/./UtilityTests/RangeTest.Equal (1420 of 1808) PASS: lldb-unit :: Expression/./ExpressionTests/CppModuleConfigurationTest.AmbiguousCLib (1421 of 1808) PASS: lldb-api :: lang/objc/objc-baseclass-sbtype/TestObjCBaseClassSBType.py (1422 of 1808) PASS: lldb-shell :: BuildScript/modes.test (1423 of 1808) PASS: lldb-api :: commands/expression/test/TestExprs2.py (1424 of 1808) PASS: lldb-unit :: Utility/./UtilityTests/RangeTest.Copy (1425 of 1808) PASS: lldb-api :: functionalities/thread/concurrent_events/TestConcurrentTwoWatchpointThreads.py (1426 of 1808) UNSUPPORTED: lldb-shell :: Process/Windows/exception_access_violation.cpp (1427 of 1808) PASS: lldb-api :: commands/expression/ignore-artificial-constructors/TestIgnoreArtificialConstructors.py (1428 of 1808) UNSUPPORTED: lldb-shell :: ExecControl/StopHook/stop-hook-threads.test (1429 of 1808) PASS: lldb-unit :: ScriptInterpreter/Python/./ScriptInterpreterPythonTests/PythonDataObjectsTest.TestPythonDictionaryManipulation (1430 of 1808) PASS: lldb-unit :: Symbol/./SymbolTests/TestClangASTContext.TemplateArguments (1431 of 1808) PASS: lldb-unit :: UnwindAssembly/x86/./UnwindAssemblyx86Tests/Testx86AssemblyInspectionEngine.TestPushRBP (1432 of 1808) PASS: lldb-api :: tools/lldb-server/TestGdbRemoteRegisterState.py (1433 of 1808) UNSUPPORTED: lldb-api :: functionalities/thread/multi_break/TestMultipleBreakpoints.py (1434 of 1808) UNSUPPORTED: lldb-shell :: Register/x86-ymm-read.test (1435 of 1808) PASS: lldb-shell :: SymbolFile/DWARF/debug_ranges-missing-section.s (1436 of 1808) PASS: lldb-unit :: Utility/./UtilityTests/ArgsTest.TestSingleQuotedArgWithSpace (1437 of 1808) PASS: lldb-unit :: Utility/./UtilityTests/OptionsWithRawTest.TerminatedQuote (1438 of 1808) UNSUPPORTED: lldb-api :: lang/objc/rdar-12408181/TestRdar12408181.py (1439 of 1808) PASS: lldb-unit :: Utility/./UtilityTests/IndexToObjectTest.ObjectForIndex (1440 of 1808) PASS: lldb-unit :: ScriptInterpreter/Python/./ScriptInterpreterPythonTests/PythonDataObjectsTest.TestPythonStringToStructuredString (1441 of 1808) PASS: lldb-unit :: Utility/./UtilityTests/UserIDResolver.GetGroupName (1442 of 1808) UNSUPPORTED: lldb-api :: functionalities/darwin_log/format/TestDarwinLogMessageFormat.py (1443 of 1808) XFAIL: lldb-shell :: Register/x86-mm-xmm-write.test (1444 of 1808) PASS: lldb-unit :: ScriptInterpreter/Python/./ScriptInterpreterPythonTests/PythonDataObjectsTest.TestPythonTupleInitializerList (1445 of 1808) PASS: lldb-api :: lang/objc/ptr_refs/TestPtrRefsObjC.py (1446 of 1808) PASS: lldb-unit :: Expression/./ExpressionTests/DiagnosticManagerTest.PutStringSeverities (1447 of 1808) PASS: lldb-unit :: Host/./HostTests/MainLoopTest.Signal (1448 of 1808) PASS: lldb-unit :: Utility/./UtilityTests/StringExtractorTest.GetHexBytesAvail (1449 of 1808) PASS: lldb-unit :: Utility/./UtilityTests/ArgsTest.ReplaceArgumentAtIndexFarOutOfRange (1450 of 1808) PASS: lldb-api :: functionalities/data-formatter/data-formatter-stl/libcxx/queue/TestDataFormatterLibcxxQueue.py (1451 of 1808) PASS: lldb-shell :: ObjectFile/PECOFF/sections.yaml (1452 of 1808) PASS: lldb-api :: functionalities/thread/concurrent_events/TestConcurrentManyWatchpoints.py (1453 of 1808) PASS: lldb-unit :: Utility/./UtilityTests/DataExtractorTest.GetMaxU64 (1454 of 1808) PASS: lldb-unit :: UnwindAssembly/x86/./UnwindAssemblyx86Tests/Testx86AssemblyInspectionEngine.TestPushR13 (1455 of 1808) UNSUPPORTED: lldb-api :: functionalities/darwin_log/filter/regex/message/TestDarwinLogFilterRegexMessage.py (1456 of 1808) PASS: lldb-unit :: Core/./LLDBCoreTests/MangledTest.EmptyForInvalidName (1457 of 1808) PASS: lldb-api :: functionalities/data-formatter/data-formatter-objc/TestDataFormatterObjCNSError.py (1458 of 1808) PASS: lldb-api :: lang/cpp/scope/TestCppScope.py (1459 of 1808) PASS: lldb-shell :: Driver/TestRepl.test (1460 of 1808) PASS: lldb-unit :: Utility/./UtilityTests/StringExtractorTest.GetHexBytesAvail_Partial (1461 of 1808) PASS: lldb-unit :: UnwindAssembly/x86/./UnwindAssemblyx86Tests/Testx86AssemblyInspectionEngine.TestSimple32bitFrameFunction (1462 of 1808) PASS: lldb-unit :: Utility/./UtilityTests/Flags.IsClear (1463 of 1808) PASS: lldb-api :: lang/objc/rdar-10967107/TestRdar10967107.py (1464 of 1808) PASS: lldb-api :: functionalities/breakpoint/serialize/TestBreakpointSerialization.py (1465 of 1808) PASS: lldb-unit :: Utility/./UtilityTests/UriParserTest.SchemeHostSeparator (1466 of 1808) PASS: lldb-unit :: Core/./LLDBCoreTests/RichManglingContextTest.SwitchProvider (1467 of 1808) PASS: lldb-unit :: Process/minidump/./LLDBMinidumpTests/MinidumpParserTest.GetArchitecture (1468 of 1808) PASS: lldb-unit :: Utility/./UtilityTests/BinaryStreamTest.PutSLEB128One (1469 of 1808) PASS: lldb-api :: functionalities/thread/concurrent_events/TestConcurrentBreakpointsDelayedBreakpointOneWatchpoint.py (1470 of 1808) PASS: lldb-unit :: ObjectFile/Breakpad/./ObjectFileBreakpadTests/FuncRecord.parse (1471 of 1808) PASS: lldb-api :: functionalities/target-new-solib-notifications/TestModuleLoadedNotifys.py (1472 of 1808) PASS: lldb-api :: functionalities/data-formatter/data-formatter-objc/nsstring/TestDataFormatterNSString.py (1473 of 1808) PASS: lldb-unit :: Utility/./UtilityTests/EnvironmentTest.EnvpConstruction (1474 of 1808) PASS: lldb-api :: functionalities/thread/concurrent_events/TestConcurrentDelaySignalBreak.py (1475 of 1808) PASS: lldb-unit :: Utility/./UtilityTests/StringListTest.ShiftStdString (1476 of 1808) PASS: lldb-api :: commands/expression/top-level/TestTopLevelExprs.py (1477 of 1808) PASS: lldb-unit :: Utility/./UtilityTests/RangeTest.ContainsRange (1478 of 1808) PASS: lldb-unit :: Utility/./UtilityTests/StreamTest.PutChar (1479 of 1808) PASS: lldb-unit :: Host/./HostTests/SocketTest.DomainListenConnectAccept (1480 of 1808) PASS: lldb-shell :: ExecControl/StopHook/stop-hook.test (1481 of 1808) PASS: lldb-api :: functionalities/thread/backtrace_all/TestBacktraceAll.py (1482 of 1808) PASS: lldb-unit :: Signals/./SignalsTests/UnixSignalsTest.Iteration (1483 of 1808) PASS: lldb-api :: functionalities/unwind/sigtramp/TestSigtrampUnwind.py (1484 of 1808) PASS: lldb-shell :: Reproducer/TestDiscard.test (1485 of 1808) PASS: lldb-unit :: Utility/./UtilityTests/OptionsWithRawTest.LeadingSpaceArgs (1486 of 1808) PASS: lldb-unit :: SymbolFile/NativePDB/./SymbolFileNativePDBTests/PDBFPOProgramToDWARFExpressionTests.UnsupportedRASearch (1487 of 1808) PASS: lldb-unit :: UnwindAssembly/x86/./UnwindAssemblyx86Tests/Testx86AssemblyInspectionEngine.TestMovRSPtoRBP (1488 of 1808) PASS: lldb-unit :: UnwindAssembly/x86/./UnwindAssemblyx86Tests/Testx86AssemblyInspectionEngine.Testi386IgnoredRegisters (1489 of 1808) PASS: lldb-api :: functionalities/thread/concurrent_events/TestConcurrentWatchpointWithDelayWatchpointThreads.py (1490 of 1808) PASS: lldb-unit :: ScriptInterpreter/Python/./ScriptInterpreterPythonTests/PythonDataObjectsTest.TestPythonListToStructuredList (1491 of 1808) UNSUPPORTED: lldb-shell :: SymbolFile/PDB/typedefs.test (1492 of 1808) PASS: lldb-shell :: ObjectFile/MachO/lc_version_min.yaml (1493 of 1808) PASS: lldb-api :: lang/c/anonymous/TestAnonymous.py (1494 of 1808) PASS: lldb-api :: functionalities/thread/concurrent_events/TestConcurrentSignalNWatchNBreak.py (1495 of 1808) PASS: lldb-unit :: Utility/./UtilityTests/CompletionRequest.TryCompleteCurrentArgBad (1496 of 1808) PASS: lldb-unit :: Symbol/./SymbolTests/TestClangASTContext.TestGetBasicTypeFromName (1497 of 1808) UNSUPPORTED: lldb-api :: commands/expression/multiline-completion/TestMultilineCompletion.py (1498 of 1808) PASS: lldb-api :: python_api/section/TestSectionAPI.py (1499 of 1808) XFAIL: lldb-shell :: Unwind/prefer-debug-over-eh-frame.test (1500 of 1808) PASS: lldb-api :: commands/expression/cast_int_to_anonymous_enum/TestCastIntToAnonymousEnum.py (1501 of 1808) PASS: lldb-unit :: Process/gdb-remote/./ProcessGdbRemoteTests/GDBRemoteCommunicationClientTest.SendGetDataPacket (1502 of 1808) PASS: lldb-unit :: Utility/./UtilityTests/ArgsTest.TestOverwriteArgs (1503 of 1808) UNSUPPORTED: lldb-shell :: SymbolFile/PDB/function-level-linking.test (1504 of 1808) PASS: lldb-api :: functionalities/inferior-crashing/TestInferiorCrashing.py (1505 of 1808) PASS: lldb-shell :: SymbolFile/DWARF/dwarf5-index-is-used.cpp (1506 of 1808) PASS: lldb-unit :: Core/./LLDBCoreTests/MangledTest.NameIndexes_FindFunctionSymbols (1507 of 1808) PASS: lldb-api :: commands/expression/ir-interpreter/TestIRInterpreter.py (1508 of 1808) UNSUPPORTED: lldb-api :: functionalities/darwin_log/filter/regex/category/TestDarwinLogFilterRegexCategory.py (1509 of 1808) UNSUPPORTED: lldb-api :: commands/watchpoints/variable_out_of_scope/TestWatchedVarHitWhenInScope.py (1510 of 1808) PASS: lldb-shell :: SymbolFile/DWARF/debug-types-basic.test (1511 of 1808) PASS: lldb-shell :: SymbolFile/DWARF/childless-compile-unit.s (1512 of 1808) UNSUPPORTED: lldb-shell :: SymbolFile/PDB/compilands.test (1513 of 1808) PASS: lldb-unit :: ObjectFile/ELF/./ObjectFileELFTests/ObjectFileELFTest.GetSymtab_NoSymEntryPointArmThumbAddressClass (1514 of 1808) UNSUPPORTED: lldb-shell :: SymbolFile/NativePDB/ast-functions-msvc.cpp (1515 of 1808) PASS: lldb-api :: functionalities/thread/backtrace_limit/TestBacktraceLimit.py (1516 of 1808) PASS: lldb-unit :: UnwindAssembly/x86/./UnwindAssemblyx86Tests/Testx86AssemblyInspectionEngine.TestPushEDI (1517 of 1808) PASS: lldb-api :: terminal/TestSTTYBeforeAndAfter.py (1518 of 1808) PASS: lldb-api :: lang/cpp/template/TestTemplateArgs.py (1519 of 1808) PASS: lldb-unit :: Utility/./UtilityTests/DataExtractorTest.GetMaxS64 (1520 of 1808) PASS: lldb-shell :: BuildScript/compiler-full-path.test (1521 of 1808) PASS: lldb-unit :: Utility/./UtilityTests/StringListTest.SplitIntoLines (1522 of 1808) XFAIL: lldb-shell :: Register/x86-64-write.test (1523 of 1808) PASS: lldb-api :: functionalities/load_unload/TestLoadUnload.py (1524 of 1808) PASS: lldb-api :: commands/expression/import-std-module/no-std-module/TestMissingStdModule.py (1525 of 1808) PASS: lldb-api :: functionalities/data-formatter/data-formatter-stl/libcxx/multiset/TestDataFormatterLibcxxMultiSet.py (1526 of 1808) PASS: lldb-api :: commands/expression/namespace_local_var_same_name_cpp_and_c/TestNamespaceLocalVarSameNameCppAndC.py (1527 of 1808) PASS: lldb-api :: functionalities/dynamic_value_child_count/TestDynamicValueChildCount.py (1528 of 1808) PASS: lldb-api :: functionalities/show_location/TestShowLocationDwarf5.py (1529 of 1808) PASS: lldb-unit :: Language/Highlighting/./HighlighterTests/HighlighterTest.DefaultHighlighterWithCursorOutOfBounds (1530 of 1808) PASS: lldb-unit :: ScriptInterpreter/Python/./ScriptInterpreterPythonTests/PythonDataObjectsTest.TestPythonListManipulation (1531 of 1808) PASS: lldb-unit :: Utility/./UtilityTests/StreamTest.PutHex16ByteOrderBig (1532 of 1808) UNSUPPORTED: lldb-shell :: Register/aarch64-gp-read.test (1533 of 1808) PASS: lldb-shell :: Breakpoint/single-file-split-dwarf.test (1534 of 1808) PASS: lldb-api :: lang/objc/objc-builtin-types/TestObjCBuiltinTypes.py (1535 of 1808) PASS: lldb-shell :: ObjectFile/ELF/aarch64-relocations.yaml (1536 of 1808) PASS: lldb-unit :: Utility/./UtilityTests/StringListTest.GetMaxStringLengthDecreasingSize (1537 of 1808) PASS: lldb-unit :: Utility/./UtilityTests/StructuredDataTest.StringDump (1538 of 1808) UNSUPPORTED: lldb-api :: tools/lldb-server/signal-filtering/TestGdbRemote_QPassSignals.py (1539 of 1808) PASS: lldb-api :: functionalities/data-formatter/data-formatter-objc/TestDataFormatterObjCKVO.py (1540 of 1808) PASS: lldb-api :: tools/lldb-server/TestLldbGdbServer.py (1541 of 1808) PASS: lldb-shell :: SymbolFile/NativePDB/function-types-builtins.cpp (1542 of 1808) PASS: lldb-shell :: SymbolFile/Breakpad/stack-cfi-parsing.test (1543 of 1808) PASS: lldb-unit :: Utility/./UtilityTests/LogChannelEnabledTest.LLDB_LOG_ERROR (1544 of 1808) PASS: lldb-api :: lang/c/struct_types/TestStructTypes.py (1545 of 1808) PASS: lldb-unit :: Utility/./UtilityTests/Flags.AnyClear (1546 of 1808) PASS: lldb-api :: functionalities/breakpoint/breakpoint_command/TestBreakpointCommand.py (1547 of 1808) PASS: lldb-api :: commands/expression/unwind_expression/TestUnwindExpression.py (1548 of 1808) PASS: lldb-shell :: SymbolFile/DWARF/find-inline-method.s (1549 of 1808) PASS: lldb-unit :: Utility/./UtilityTests/NameMatchesTest.RegularExpression (1550 of 1808) PASS: lldb-unit :: UnwindAssembly/x86/./UnwindAssemblyx86Tests/Testx86AssemblyInspectionEngine.TestPushR12 (1551 of 1808) UNSUPPORTED: lldb-api :: functionalities/darwin_log/source/debug/TestDarwinLogSourceDebug.py (1552 of 1808) PASS: lldb-unit :: Symbol/./SymbolTests/TestClangASTContext.TestBuiltinTypeForEncodingAndBitSize (1553 of 1808) PASS: lldb-api :: python_api/watchpoint/watchlocation/TestTargetWatchAddress.py (1554 of 1808) PASS: lldb-unit :: ScriptInterpreter/Python/./ScriptInterpreterPythonTests/PythonDataObjectsTest.TestGlobalNameResolutionNoDot (1555 of 1808) PASS: lldb-unit :: ScriptInterpreter/Python/./ScriptInterpreterPythonTests/PythonDataObjectsTest.TestOwnedReferences (1556 of 1808) PASS: lldb-shell :: SymbolFile/DWARF/clang-ast-from-dwarf-unamed-and-anon-structs.cpp (1557 of 1808) PASS: lldb-api :: commands/expression/pr35310/TestExprsBug35310.py (1558 of 1808) PASS: lldb-unit :: Utility/./UtilityTests/StreamTest.PutHex16ByteOrderLittle (1559 of 1808) UNSUPPORTED: lldb-shell :: SymbolFile/PDB/enums-layout.test (1560 of 1808) PASS: lldb-api :: lang/objc/self/TestObjCSelf.py (1561 of 1808) PASS: lldb-api :: functionalities/breakpoint/breakpoint_language/TestBreakpointLanguage.py (1562 of 1808) PASS: lldb-unit :: ObjectFile/PECOFF/./ObjectFilePECOFFTests/PECallFrameInfoTest.Basic_eh (1563 of 1808) UNSUPPORTED: lldb-api :: api/multiple-debuggers/TestMultipleDebuggers.py (1564 of 1808) PASS: lldb-unit :: Utility/./UtilityTests/StringListTest.GetMaxStringLengthEqualSize (1565 of 1808) PASS: lldb-unit :: Process/gdb-remote/./ProcessGdbRemoteTests/GDBRemoteCommunicationClientTest.GetModulesInfo (1566 of 1808) PASS: lldb-unit :: Utility/./UtilityTests/StringListTest.AppendListCStringArrayEmpty (1567 of 1808) PASS: lldb-unit :: Utility/./UtilityTests/StringListTest.SplitIntoLinesEmpty (1568 of 1808) PASS: lldb-unit :: Utility/./UtilityTests/StreamTest.PutCharNull (1569 of 1808) PASS: lldb-shell :: Reproducer/TestWorkingDir.test (1570 of 1808) PASS: lldb-shell :: ObjectFile/MachO/lc_build_version_notools.yaml (1571 of 1808) PASS: lldb-api :: functionalities/data-formatter/data-formatter-objc/TestDataFormatterObjCExpr.py (1572 of 1808) PASS: lldb-api :: lang/cpp/const_this/TestConstThis.py (1573 of 1808) UNSUPPORTED: lldb-shell :: SymbolFile/PDB/variables.test (1574 of 1808) PASS: lldb-api :: commands/expression/import-std-module/vector-bool/TestBoolVector.py (1575 of 1808) PASS: lldb-api :: python_api/sbvalue_persist/TestSBValuePersist.py (1576 of 1808) PASS: lldb-unit :: debugserver/./debugserverTests/RNBSocket.LoopBackListenIPv6 (1577 of 1808) PASS: lldb-api :: functionalities/jitloader_gdb/TestJITLoaderGDB.py (1578 of 1808) PASS: lldb-api :: python_api/file_handle/TestFileHandle.py (1579 of 1808) PASS: lldb-api :: commands/gui/invalid-args/TestInvalidArgsGui.py (1580 of 1808) PASS: lldb-api :: python_api/lldbutil/process/TestPrintStackTraces.py (1581 of 1808) PASS: lldb-unit :: Utility/./UtilityTests/TildeExpressionResolver.ResolveFullPath (1582 of 1808) PASS: lldb-api :: functionalities/data-formatter/data-formatter-script/TestDataFormatterScript.py (1583 of 1808) UNSUPPORTED: lldb-api :: android/platform/TestDefaultCacheLineSize.py (1584 of 1808) PASS: lldb-unit :: ScriptInterpreter/Python/./ScriptInterpreterPythonTests/PythonDataObjectsTest.TestModuleNameResolutionNoDot (1585 of 1808) PASS: lldb-api :: lang/cpp/exceptions/TestCPPExceptionBreakpoints.py (1586 of 1808) PASS: lldb-unit :: Utility/./UtilityTests/FileSpecTest.GuessPathStyle (1587 of 1808) UNSUPPORTED: lldb-shell :: SymbolFile/NativePDB/typedefs.cpp (1588 of 1808) PASS: lldb-api :: commands/watchpoints/watchpoint_on_vectors/TestValueOfVectorVariable.py (1589 of 1808) PASS: lldb-unit :: Utility/./UtilityTests/UriParserTest.BracketedHostnamePort (1590 of 1808) PASS: lldb-api :: lang/objc/conflicting-definition/TestConflictingDefinition.py (1591 of 1808) UNSUPPORTED: lldb-shell :: SymbolFile/target-symbols-add-unwind.test (1592 of 1808) PASS: lldb-unit :: Host/./HostTests/FileSystemTest.Exists (1593 of 1808) PASS: lldb-unit :: Process/gdb-remote/./ProcessGdbRemoteTests/GDBRemoteCommunicationClientTest.WriteRegister (1594 of 1808) PASS: lldb-unit :: Utility/./UtilityTests/UUIDTest.SetFromStringRef (1595 of 1808) PASS: lldb-shell :: Minidump/fb-dump.test (1596 of 1808) PASS: lldb-api :: functionalities/paths/TestPaths.py (1597 of 1808) PASS: lldb-shell :: Settings/TestModuleCacheSanity.test (1598 of 1808) PASS: lldb-unit :: Process/gdb-remote/./ProcessGdbRemoteTests/GDBRemoteCommunicationClientTest.SendSignalsToIgnore (1599 of 1808) PASS: lldb-unit :: Utility/./UtilityTests/ArgsTest.StringListConstructor (1600 of 1808) PASS: lldb-unit :: ScriptInterpreter/Python/./ScriptInterpreterPythonTests/PythonDataObjectsTest.TestPythonFile (1601 of 1808) PASS: lldb-api :: functionalities/thread/exit_during_step/TestExitDuringStep.py (1602 of 1808) PASS: lldb-api :: commands/frame/diagnose/inheritance/TestDiagnoseInheritance.py (1603 of 1808) PASS: lldb-api :: commands/frame/recognizer/TestFrameRecognizer.py (1604 of 1808) PASS: lldb-unit :: Expression/./ExpressionTests/DiagnosticManagerTest.GetStringBasic (1605 of 1808) PASS: lldb-unit :: Utility/./UtilityTests/UriParserTest.SchemeHostSeparator4 (1606 of 1808) PASS: lldb-api :: functionalities/unwind/noreturn/module-end/TestNoReturnModuleEnd.py (1607 of 1808) PASS: lldb-unit :: SymbolFile/DWARF/./SymbolFileDWARFTests/SymbolFileDWARFTests.TestAbbrevValidAttrNullForm (1608 of 1808) PASS: lldb-unit :: Utility/./UtilityTests/Flags.AllClear (1609 of 1808) PASS: lldb-shell :: ObjectFile/MachO/subsections.yaml (1610 of 1808) PASS: lldb-api :: functionalities/thread/step_until/TestStepUntil.py (1611 of 1808) PASS: lldb-unit :: Host/./HostTests/MainLoopTest.ReadObject (1612 of 1808) PASS: lldb-api :: python_api/interpreter/TestRunCommandInterpreterAPI.py (1613 of 1808) PASS: lldb-api :: lang/objc/modules-hash-mismatch/TestClangModulesHashMismatch.py (1614 of 1808) PASS: lldb-shell :: Minidump/memory-region-from-module.yaml (1615 of 1808) PASS: lldb-unit :: Process/minidump/./LLDBMinidumpTests/MinidumpParserTest.GetPidWow64 (1616 of 1808) PASS: lldb-api :: functionalities/breakpoint/address_breakpoints/TestAddressBreakpoints.py (1617 of 1808) PASS: lldb-unit :: Utility/./UtilityTests/StringListTest.GetSize (1618 of 1808) PASS: lldb-api :: commands/expression/test/TestExprs.py (1619 of 1808) UNSUPPORTED: lldb-api :: functionalities/unwind/ehframe/TestEhFrameUnwind.py (1620 of 1808) PASS: lldb-api :: commands/target/basic/TestTargetCommand.py (1621 of 1808) PASS: lldb-unit :: Utility/./UtilityTests/StringListTest.RemoveBlankLines (1622 of 1808) PASS: lldb-shell :: ObjectFile/ELF/PT_LOAD-empty.yaml (1623 of 1808) PASS: lldb-shell :: ObjectFile/Breakpad/discontiguous-sections.test (1624 of 1808) PASS: lldb-api :: commands/expression/import-std-module/basic/TestImportStdModule.py (1625 of 1808) PASS: lldb-api :: lang/c/vla/TestVLA.py (1626 of 1808) UNSUPPORTED: lldb-api :: functionalities/thread/concurrent_events/TestConcurrentManySignals.py (1627 of 1808) PASS: lldb-api :: lang/objc/objc-new-syntax/TestObjCNewSyntaxDictionary.py (1628 of 1808) PASS: lldb-unit :: Core/./LLDBCoreTests/MangledTest.ResultForBlockInvocation (1629 of 1808) PASS: lldb-api :: lang/cpp/nested-class-other-compilation-unit/TestNestedClassWithParentInAnotherCU.py (1630 of 1808) PASS: lldb-api :: tools/lldb-server/commandline/TestStubSetSID.py (1631 of 1808) PASS: lldb-unit :: Utility/./UtilityTests/StringExtractorTest.GetHexU8_Extra_NoEof (1632 of 1808) UNSUPPORTED: lldb-api :: lang/cpp/static_members/TestCPPStaticMembers.py (1633 of 1808) UNSUPPORTED: lldb-api :: arm/breakpoint-it/TestBreakpointIt.py (1634 of 1808) UNSUPPORTED: lldb-shell :: Register/x86-64-zmm-write.test (1635 of 1808) PASS: lldb-api :: functionalities/breakpoint/cpp/TestCPPBreakpointLocations.py (1636 of 1808) PASS: lldb-api :: commands/process/launch/TestProcessLaunch.py (1637 of 1808) PASS: lldb-api :: lang/cpp/accelerator-table/TestCPPAccelerator.py (1638 of 1808) PASS: lldb-api :: functionalities/data-formatter/summary-string-onfail/Test-rdar-9974002.py (1639 of 1808) PASS: lldb-unit :: Utility/./UtilityTests/StreamTeeTest.DefaultConstructor (1640 of 1808) PASS: lldb-unit :: Utility/./UtilityTests/ProcessInstanceInfoMatch.Name (1641 of 1808) PASS: lldb-api :: functionalities/data-formatter/ptr_ref_typedef/TestPtrRef2Typedef.py (1642 of 1808) PASS: lldb-unit :: Utility/./UtilityTests/StringListTest.CopyListSingle (1643 of 1808) PASS: lldb-shell :: SymbolFile/DWARF/debug-line-basic.s (1644 of 1808) PASS: lldb-api :: lang/c/function_types/TestFunctionTypes.py (1645 of 1808) PASS: lldb-unit :: Utility/./UtilityTests/DataExtractorTest.GetCStrUnterminated (1646 of 1808) PASS: lldb-api :: lang/cpp/class_static/TestStaticVariables.py (1647 of 1808) PASS: lldb-unit :: Symbol/./SymbolTests/SymbolsTest.LocateExecutableSymbolFileForUnknownExecutableAndMissingSymbolFile (1648 of 1808) PASS: lldb-api :: functionalities/thread/concurrent_events/TestConcurrentCrashWithBreak.py (1649 of 1808) PASS: lldb-shell :: Minidump/Windows/find-module.test (1650 of 1808) PASS: lldb-unit :: Process/minidump/./LLDBMinidumpTests/MinidumpParserTest.GetPidWindows (1651 of 1808) UNSUPPORTED: lldb-shell :: SymbolFile/PDB/udt-layout.test (1652 of 1808) PASS: lldb-api :: functionalities/gdb_remote_client/TestNoWatchpointSupportInfo.py (1653 of 1808) PASS: lldb-api :: functionalities/modern-type-lookup/basic/TestBasicModernTypeLookup.py (1654 of 1808) PASS: lldb-unit :: Utility/./UtilityTests/ProcessInfoTest.Constructor (1655 of 1808) PASS: lldb-unit :: Utility/./UtilityTests/EventTest.DumpEventDataBytes (1656 of 1808) PASS: lldb-unit :: Process/gdb-remote/./ProcessGdbRemoteTests/GDBRemoteClientBaseTest.SendContinueAndInterrupt2PacketBug (1657 of 1808) PASS: lldb-unit :: Utility/./UtilityTests/ArgsTest.TestUnknownEscape (1658 of 1808) PASS: lldb-api :: functionalities/breakpoint/breakpoint_command/TestRegexpBreakCommand.py (1659 of 1808) PASS: lldb-unit :: Utility/./UtilityTests/LogChannelTest.EnableOptions (1660 of 1808) UNSUPPORTED: lldb-api :: commands/expression/macros/TestMacros.py (1661 of 1808) PASS: lldb-api :: functionalities/type_completion/TestTypeCompletion.py (1662 of 1808) PASS: lldb-api :: lang/objcxx/objcxx-ivar-vector/TestIvarVector.py (1663 of 1808) PASS: lldb-api :: python_api/value/change_values/TestChangeValueAPI.py (1664 of 1808) PASS: lldb-unit :: Utility/./UtilityTests/OptionsWithRawTest.ArgsButNoDelimiter (1665 of 1808) PASS: lldb-unit :: Utility/./UtilityTests/StreamTest.PutBytesAsRawHex8ToBigEndian (1666 of 1808) PASS: lldb-shell :: Expr/TestMultilineExpr.test (1667 of 1808) PASS: lldb-unit :: Utility/./UtilityTests/UriParserTest.LongPath (1668 of 1808) PASS: lldb-shell :: ObjectFile/ELF/section-addresses.yaml (1669 of 1808) PASS: lldb-api :: python_api/watchpoint/TestWatchpointIter.py (1670 of 1808) UNSUPPORTED: lldb-api :: functionalities/asan/TestMemoryHistory.py (1671 of 1808) PASS: lldb-api :: commands/watchpoints/watchpoint_commands/condition/TestWatchpointConditionCmd.py (1672 of 1808) PASS: lldb-unit :: Language/Highlighting/./HighlighterTests/HighlighterTest.ClangCursorOutOfBounds (1673 of 1808) PASS: lldb-unit :: Breakpoint/./LLDBBreakpointTests/BreakpointIDTest.StringIsBreakpointName (1674 of 1808) PASS: lldb-unit :: Host/./HostTests/SocketTest.TCPListen0ConnectAccept (1675 of 1808) PASS: lldb-api :: tools/lldb-server/commandline/TestStubReverseConnect.py (1676 of 1808) PASS: lldb-api :: functionalities/data-formatter/varscript_formatting/TestDataFormatterVarScriptFormatting.py (1677 of 1808) PASS: lldb-unit :: Process/gdb-remote/./ProcessGdbRemoteTests/GDBRemoteClientBaseTest.SendContinueAndWait (1678 of 1808) PASS: lldb-unit :: Utility/./UtilityTests/StringExtractorTest.InitMisc (1679 of 1808) PASS: lldb-unit :: UnwindAssembly/x86/./UnwindAssemblyx86Tests/Testx86AssemblyInspectionEngine.TestPushR15 (1680 of 1808) PASS: lldb-unit :: Utility/./UtilityTests/StringExtractorTest.DecodeHexU8_InvalidHex2 (1681 of 1808) PASS: lldb-api :: commands/expression/import-std-module/shared_ptr/TestSharedPtr.py (1682 of 1808) PASS: lldb-unit :: debugserver/./debugserverTests/RNBSocket.LoopBackListenIPv4 (1683 of 1808) PASS: lldb-unit :: Utility/./UtilityTests/StringExtractorTest.DecodeHexU8_Underflow (1684 of 1808) PASS: lldb-unit :: Utility/./UtilityTests/UriParserTest.MinimalPortPath (1685 of 1808) PASS: lldb-api :: functionalities/data-formatter/data-formatter-globals/TestDataFormatterGlobals.py (1686 of 1808) PASS: lldb-unit :: SymbolFile/DWARF/./SymbolFileDWARFTests/SymbolFileDWARFTests.TestAbbrevNullAttrValidForm (1687 of 1808) PASS: lldb-api :: macosx/order/TestOrderFile.py (1688 of 1808) PASS: lldb-unit :: UnwindAssembly/x86/./UnwindAssemblyx86Tests/Testx86AssemblyInspectionEngine.TestSubESP (1689 of 1808) PASS: lldb-shell :: Minidump/Windows/broken-unwind.test (1690 of 1808) PASS: lldb-api :: functionalities/non-overlapping-index-variable-i/TestIndexVariable.py (1691 of 1808) PASS: lldb-shell :: ObjectFile/ELF/minidebuginfo-corrupt-xz.yaml (1692 of 1808) PASS: lldb-unit :: Process/gdb-remote/./ProcessGdbRemoteTests/GDBRemoteClientBaseTest.SendContinueAndLateInterrupt (1693 of 1808) PASS: lldb-unit :: Target/./TargetTests/PathMappingListTest.RelativeTests (1694 of 1808) PASS: lldb-api :: python_api/process/TestProcessAPI.py (1695 of 1808) PASS: lldb-unit :: Utility/./UtilityTests/CompletionRequest.TestCompletionOwnership (1696 of 1808) PASS: lldb-unit :: ScriptInterpreter/Python/./ScriptInterpreterPythonTests/PythonDataObjectsTest.TestExceptions (1697 of 1808) PASS: lldb-unit :: Utility/./UtilityTests/BinaryStreamTest.PutULEB128FourBytes (1698 of 1808) UNSUPPORTED: lldb-api :: linux/mix-dwo-and-regular-objects/TestMixedDwarfBinary.py (1699 of 1808) PASS: lldb-api :: functionalities/breakpoint/scripted_bkpt/TestScriptedResolver.py (1700 of 1808) PASS: lldb-api :: api/check_public_api_headers/TestPublicAPIHeaders.py (1701 of 1808) PASS: lldb-unit :: Utility/./UtilityTests/UriParserTest.Minimal (1702 of 1808) PASS: lldb-unit :: Language/Highlighting/./HighlighterTests/HighlighterTest.ClangCursorPosBeforeOtherToken (1703 of 1808) PASS: lldb-unit :: Utility/./UtilityTests/Flags.AnySet (1704 of 1808) PASS: lldb-api :: functionalities/data-formatter/data-formatter-stl/libcxx/multimap/TestDataFormatterLibccMultiMap.py (1705 of 1808) PASS: lldb-unit :: Process/gdb-remote/./ProcessGdbRemoteTests/GDBRemoteClientBaseTest.SendContinueAndInterrupt (1706 of 1808) PASS: lldb-unit :: Utility/./UtilityTests/FileSpecTest.FileAndDirectoryComponents (1707 of 1808) PASS: lldb-unit :: Utility/./UtilityTests/FileSpecTest.PrependPathComponent (1708 of 1808) UNSUPPORTED: lldb-api :: commands/watchpoints/hello_watchlocation/TestWatchLocation.py (1709 of 1808) PASS: lldb-unit :: Expression/./ExpressionTests/DiagnosticManagerTest.GetStringPreserveOrder (1710 of 1808) PASS: lldb-api :: functionalities/tail_call_frames/disambiguate_tail_call_seq/TestDisambiguateTailCallSeq.py (1711 of 1808) PASS: lldb-unit :: Utility/./UtilityTests/FileSpecTest.IsRelative (1712 of 1808) PASS: lldb-api :: commands/watchpoints/multiple_threads/TestWatchpointMultipleThreads.py (1713 of 1808) PASS: lldb-unit :: Utility/./UtilityTests/StringListTest.LongestCommonPrefixDuplicateElement (1714 of 1808) PASS: lldb-api :: commands/frame/language/TestGuessLanguage.py (1715 of 1808) PASS: lldb-api :: functionalities/data-formatter/data-formatter-stl/libcxx/string/TestDataFormatterLibcxxString.py (1716 of 1808) PASS: lldb-unit :: Utility/./UtilityTests/RangeTest.ContainsAddr (1717 of 1808) PASS: lldb-unit :: Utility/./UtilityTests/FileSpecTest.EqualDotsPosixRoot (1718 of 1808) PASS: lldb-unit :: Core/./LLDBCoreTests/StreamCallbackTest.Callback (1719 of 1808) UNSUPPORTED: lldb-api :: lang/objc/bitfield_ivars/TestBitfieldIvars.py (1720 of 1808) UNSUPPORTED: lldb-api :: commands/expression/completion-crash2/TestCompletionCrash2.py (1721 of 1808) PASS: lldb-unit :: Utility/./UtilityTests/BinaryStreamTest.PutULEB128EightBytes (1722 of 1808) PASS: lldb-unit :: Utility/./UtilityTests/SerializationRountripTest.SerializeDeserializeCString (1723 of 1808) PASS: lldb-unit :: ObjectFile/Breakpad/./ObjectFileBreakpadTests/Record.classify (1724 of 1808) PASS: lldb-api :: functionalities/data-formatter/type_summary_list_script/TestTypeSummaryListScript.py (1725 of 1808) PASS: lldb-api :: commands/platform/basic/TestPlatformCommand.py (1726 of 1808) PASS: lldb-api :: functionalities/thread/crash_during_step/TestCrashDuringStep.py (1727 of 1808) PASS: lldb-unit :: Utility/./UtilityTests/ReproducerTest.SetCapture (1728 of 1808) PASS: lldb-unit :: Utility/./UtilityTests/StringListTest.InsertStringAtIndexEnd (1729 of 1808) PASS: lldb-unit :: Process/gdb-remote/./ProcessGdbRemoteTests/GDBRemoteCommunicationClientTest.GetModulesInfo_UUID20 (1730 of 1808) PASS: lldb-api :: commands/expression/persist_objc_pointeetype/TestPersistObjCPointeeType.py (1731 of 1808) PASS: lldb-api :: functionalities/plugins/command_plugin/TestPluginCommands.py (1732 of 1808) PASS: lldb-api :: lang/cpp/type_lookup/TestCppTypeLookup.py (1733 of 1808) PASS: lldb-unit :: Utility/./UtilityTests/OptionsWithRawTest.EmptySuffixSingleWhitespace (1734 of 1808) PASS: lldb-unit :: Language/Highlighting/./HighlighterTests/HighlighterTest.ClangOperators (1735 of 1808) PASS: lldb-unit :: Utility/./UtilityTests/Predicate.WaitForValueEqualTo (1736 of 1808) PASS: lldb-unit :: UnwindAssembly/x86/./UnwindAssemblyx86Tests/Testx86AssemblyInspectionEngine.TestSpillRegToStackViaMOVi386 (1737 of 1808) PASS: lldb-unit :: Host/./HostTests/HostInfoTest.GetHostname (1738 of 1808) PASS: lldb-unit :: Utility/./UtilityTests/StreamTest.ShiftOperatorInts (1739 of 1808) PASS: lldb-api :: python_api/exprpath_synthetic/TestExprPathSynthetic.py (1740 of 1808) PASS: lldb-api :: functionalities/thread/step_out/TestThreadStepOut.py (1741 of 1808) PASS: lldb-unit :: Language/Highlighting/./HighlighterTests/HighlighterTest.ClangSquareBrackets (1742 of 1808) PASS: lldb-api :: functionalities/breakpoint/debugbreak/TestDebugBreak.py (1743 of 1808) PASS: lldb-unit :: Utility/./UtilityTests/BinaryStreamTest.PutSLEB128EightBytes (1744 of 1808) PASS: lldb-unit :: Utility/./UtilityTests/StringLexerTest.NextIfList (1745 of 1808) PASS: lldb-api :: lang/cpp/this/TestCPPThis.py (1746 of 1808) PASS: lldb-unit :: Process/minidump/./LLDBMinidumpTests/MinidumpParserTest.GetMiscInfo_no_stream (1747 of 1808) PASS: lldb-shell :: Quit/TestQuitExitCodeNonInt.test (1748 of 1808) PASS: lldb-api :: commands/expression/static-initializers/TestStaticInitializers.py (1749 of 1808) PASS: lldb-unit :: Utility/./UtilityTests/CompletionRequest.TryCompleteCurrentArgGood (1750 of 1808) UNSUPPORTED: lldb-api :: functionalities/asan/TestReportData.py (1751 of 1808) PASS: lldb-unit :: ScriptInterpreter/Python/./ScriptInterpreterPythonTests/PythonDataObjectsTest.TestExtractingUInt64ThroughStructuredData (1752 of 1808) PASS: lldb-api :: functionalities/data-formatter/data-formatter-synthtype/TestDataFormatterSynthType.py (1753 of 1808) PASS: lldb-api :: functionalities/data-formatter/data-formatter-objc/nsindexpath/TestDataFormatterNSIndexPath.py (1754 of 1808) PASS: lldb-unit :: Utility/./UtilityTests/StringListTest.GetMaxStringLengthIncreasingSize (1755 of 1808) PASS: lldb-shell :: SymbolFile/DWARF/find-method-local-struct.cpp (1756 of 1808) PASS: lldb-api :: lang/cpp/llvm-style/TestLLVMStyle.py (1757 of 1808) PASS: lldb-shell :: Settings/TestFrameFormatNoColor.test (1758 of 1808) PASS: lldb-api :: functionalities/postmortem/netbsd-core/TestNetBSDCore.py (1759 of 1808) PASS: lldb-unit :: Host/./HostTests/ProcessLaunchInfoTest.Constructor (1760 of 1808) PASS: lldb-unit :: Process/gdb-remote/./ProcessGdbRemoteTests/GDBRemoteCommunicationClientTest.SendGetTraceConfigPacket (1761 of 1808) PASS: lldb-unit :: Utility/./UtilityTests/StringLexerTest.PutBack (1762 of 1808) PASS: lldb-unit :: Utility/./UtilityTests/ArgsTest.ReplaceArgumentAtIndexShort (1763 of 1808) PASS: lldb-api :: functionalities/data-formatter/format-propagation/TestFormatPropagation.py (1764 of 1808) PASS: lldb-shell :: Reproducer/Functionalities/TestDataFormatter.test (1765 of 1808) PASS: lldb-api :: lang/cpp/template-function/TestTemplateFunctions.py (1766 of 1808) PASS: lldb-unit :: Symbol/./SymbolTests/Type.CompilerContextPattern (1767 of 1808) PASS: lldb-unit :: Process/gdb-remote/./ProcessGdbRemoteTests/GDBRemoteCommunicationServerTest.SendErrorResponse_Status (1768 of 1808) PASS: lldb-unit :: Utility/./UtilityTests/RangeTest.SetRangeBase (1769 of 1808) PASS: lldb-unit :: Utility/./UtilityTests/StatusTest.Formatv (1770 of 1808) PASS: lldb-unit :: Process/minidump/./LLDBMinidumpTests/MinidumpParserTest.GetFilteredModuleList (1771 of 1808) PASS: lldb-unit :: Utility/./UtilityTests/StringListTest.LongestCommonPrefixNoPrefix (1772 of 1808) PASS: lldb-shell :: ObjectFile/PECOFF/basic-info-arm.yaml (1773 of 1808) PASS: lldb-unit :: Utility/./UtilityTests/ListenerTest.GetEventImmediate (1774 of 1808) PASS: lldb-unit :: Target/./TargetTests/PathMappingListTest.AbsoluteTests (1775 of 1808) PASS: lldb-api :: lang/objc/orderedset/TestOrderedSet.py (1776 of 1808) PASS: lldb-shell :: ObjectFile/ELF/section-types-edgecases.yaml (1777 of 1808) PASS: lldb-shell :: ObjectFile/ELF/compressed-sections.yaml (1778 of 1808) PASS: lldb-shell :: Reproducer/TestSynchronous.test (1779 of 1808) PASS: lldb-api :: commands/quit/TestQuit.py (1780 of 1808) UNSUPPORTED: lldb-api :: functionalities/tsan/thread_leak/TestTsanThreadLeak.py (1781 of 1808) UNSUPPORTED: lldb-api :: benchmarks/libcxxmap/TestBenchmarkLibcxxMap.py (1782 of 1808) PASS: lldb-api :: python_api/findvalue_duplist/TestSBFrameFindValue.py (1783 of 1808) PASS: lldb-unit :: Utility/./UtilityTests/BinaryStreamTest.PutSLEB128SevenBytes (1784 of 1808) UNSUPPORTED: lldb-shell :: Register/x86-zmm-read.test (1785 of 1808) PASS: lldb-api :: functionalities/breakpoint/address_breakpoints/TestBadAddressBreakpoints.py (1786 of 1808) PASS: lldb-api :: functionalities/completion/TestCompletion.py (1787 of 1808) UNSUPPORTED: lldb-shell :: SymbolFile/PDB/func-symbols.test (1788 of 1808) PASS: lldb-api :: lang/objc/foundation/TestObjectDescriptionAPI.py (1789 of 1808) PASS: lldb-api :: lang/cpp/virtual/TestVirtual.py (1790 of 1808) PASS: lldb-unit :: Host/./HostTests/FileSystemTest.Resolve (1791 of 1808) PASS: lldb-api :: commands/expression/issue_11588/Test11588.py (1792 of 1808) PASS: lldb-unit :: Expression/./ExpressionTests/CppModuleConfigurationTest.LinuxLocalLibCpp (1793 of 1808) PASS: lldb-api :: lang/cpp/global_operators/TestCppGlobalOperators.py (1794 of 1808) PASS: lldb-api :: functionalities/data-formatter/type_summary_list_arg/TestTypeSummaryListArg.py (1795 of 1808) PASS: lldb-api :: lang/objc/real-definition/TestRealDefinition.py (1796 of 1808) PASS: lldb-api :: functionalities/data-formatter/language_category_updates/TestDataFormatterLanguageCategoryUpdates.py (1797 of 1808) PASS: lldb-api :: commands/expression/persistent_variables/TestPersistentVariables.py (1798 of 1808) PASS: lldb-api :: types/TestIntegerTypes.py (1799 of 1808) PASS: lldb-api :: lang/objc/objc-foundation-dictionary-empty/TestNSDictionary0.py (1800 of 1808) PASS: lldb-api :: commands/expression/po_verbosity/TestPoVerbosity.py (1801 of 1808) PASS: lldb-api :: types/TestRecursiveTypes.py (1802 of 1808) PASS: lldb-api :: commands/expression/formatters/TestFormatters.py (1803 of 1808) PASS: lldb-api :: tools/lldb-server/TestGdbRemoteThreadsInStopReply.py (1804 of 1808) PASS: lldb-api :: python_api/process/io/TestProcessIO.py (1805 of 1808) PASS: lldb-api :: functionalities/data-formatter/data-formatter-stl/libcxx/vector/TestDataFormatterLibcxxVector.py (1806 of 1808) PASS: lldb-api :: lang/cpp/namespace/TestNamespaceLookup.py (1807 of 1808) PASS: lldb-api :: lang/objc/foundation/TestFoundationDisassembly.py (1808 of 1808)

Hide Details

Testing Time: 4268.53s ******************** Failing Tests (1): lldb-api :: terminal/TestEditline.py

Hide Details

******************** Timed Out Tests (1): lldb-api :: types/TestIntegerTypesExpr.py

Hide Details

Hide Details

Slowest Tests: -------------------------------------------------------------------------- 313.84s: lldb-api :: lang/c/anonymous/TestAnonymous.py 317.76s: lldb-api :: python_api/module_section/TestModuleAndSection.py 322.24s: lldb-api :: python_api/target/TestTargetAPI.py 342.49s: lldb-api :: tools/lldb-server/TestGdbRemoteThreadsInStopReply.py 345.71s: lldb-api :: lang/objc/real-definition/TestRealDefinition.py 377.06s: lldb-api :: lang/objc/objc-new-syntax/TestObjCNewSyntaxLiteral.py 413.07s: lldb-api :: lang/objc/exceptions/TestObjCExceptions.py 424.68s: lldb-api :: lang/cpp/namespace/TestNamespace.py 435.24s: lldb-api :: lang/objc/foundation/TestFoundationDisassembly.py 447.00s: lldb-api :: commands/target/basic/TestTargetCommand.py 447.08s: lldb-api :: functionalities/return-value/TestReturnValue.py 504.53s: lldb-api :: functionalities/load_unload/TestLoadUnload.py 516.02s: lldb-api :: lang/objc/foundation/TestObjCMethods.py 539.79s: lldb-api :: api/multithreaded/TestMultithreaded.py 631.70s: lldb-api :: lang/objc/hidden-ivars/TestHiddenIvars.py 708.37s: lldb-api :: lang/cpp/enum_types/TestCPP11EnumTypes.py 719.67s: lldb-api :: lang/cpp/namespace/TestNamespaceLookup.py 856.52s: lldb-api :: tools/lldb-server/TestLldbGdbServer.py 1007.07s: lldb-api :: types/TestIntegerTypes.py 1201.19s: lldb-api :: types/TestIntegerTypesExpr.py

Hide Details

Tests Times: -------------------------------------------------------------------------- [ Range ] :: [ Percentage ] :: [ Count ] -------------------------------------------------------------------------- [ 0s, 100s) :: [*********************************** ] :: [1608/1808] [ 100s, 200s) :: [*** ] :: [ 154/1808] [ 200s, 300s) :: [ ] :: [ 19/1808] [ 300s, 400s) :: [ ] :: [ 12/1808] [ 400s, 500s) :: [ ] :: [ 6/1808] [ 500s, 600s) :: [ ] :: [ 3/1808] [ 600s, 700s) :: [ ] :: [ 1/1808] [ 700s, 800s) :: [ ] :: [ 2/1808] [ 800s, 900s) :: [ ] :: [ 0/1808] [ 900s,1000s) :: [ ] :: [ 1/1808] [1000s,1100s) :: [ ] :: [ 1/1808] [1100s,1200s) :: [ ] :: [ 0/1808] [1200s,1300s) :: [ ] :: [ 1/1808] Expected Passes : 1653 Expected Failures : 6 Unsupported Tests : 147 Unexpected Failures: 1 Individual Timeouts: 1 FAILED: tools/lldb/test/CMakeFiles/check-lldb-lit cd /Users/buildslave/jenkins/workspace/lldb-cmake-sanitized/lldb-build/tools/lldb/test && /usr/local/bin/python /Users/buildslave/jenkins/workspace/lldb-cmake-sanitized/lldb-build/./bin/llvm-lit -v --time-tests --shuffle --xunit-xml-output=/Users/buildslave/jenkins/workspace/lldb-cmake-sanitized/test/results.xml -v --timeout 1200 /Users/buildslave/jenkins/workspace/lldb-cmake-sanitized/lldb-build/tools/lldb/test ninja: build stopped: subcommand failed. Command failed: Command '['/usr/bin/env', 'TERM=vt100', '/usr/local/bin/ninja', '-v', 'check-lldb']' returned non-zero exit status 1. Command: ['/usr/bin/env', 'TERM=vt100', '/usr/local/bin/ninja', '-v', 'check-lldb'] [Pipeline] } [Pipeline] // timeout [Pipeline] } [Pipeline] // stage [Pipeline] stage [Pipeline] { (Declarative: Post Actions) [Pipeline] scanForIssues No credentials specified [Clang (LLVM based)] Sleeping for 5 seconds due to JENKINS-32191... [Clang (LLVM based)] Parsing console log (workspace: '/Users/buildslave/jenkins/workspace/lldb-cmake-sanitized') [Pipeline] junit Recording test results [Pipeline] } [Pipeline] // stage [Pipeline] } [Pipeline] // withEnv [Pipeline] } [Pipeline] // node [Pipeline] End of Pipeline [BFA] Scanning build for known causes... [BFA] Found failure cause(s): [BFA] Ninja target failed from category Compile [BFA] Regression test failed from category Test [BFA] Done. 1s ERROR: script returned exit code 1 Finished: FAILURE