FailedConsole Output

Skipping 5,157 KB.. Full Log
0/lib/darwin/libclang_rt.asan_osx_dynamic.dylib
"interceptors not installed" && 0
********************
UNRESOLVED: lldb-api :: functionalities/unwind/sigtramp/TestSigtrampUnwind.py (1605 of 1799)
******************** TEST 'lldb-api :: functionalities/unwind/sigtramp/TestSigtrampUnwind.py' FAILED ********************
Unable to find 'RESULT: PASSED' in dotest output (exit code -6):

Hide Details

lldb version 10.0.99 (http://labmaster3.local/git/llvm-project.git revision 0e0dea82681a86a09ceed0afd321367a35bfa051) clang revision c46b3a2abd38d6fecd389c97dfa7df54af77fdb9 llvm revision c46b3a2abd38d6fecd389c97dfa7df54af77fdb9 ==22487==ERROR: Interceptors are not working. This may be because AddressSanitizer is loaded too late (e.g. via dlopen). Please launch the executable with: DYLD_INSERT_LIBRARIES=/Users/buildslave/jenkins/workspace/lldb-cmake-sanitized/host-compiler/lib/clang/10.0.0/lib/darwin/libclang_rt.asan_osx_dynamic.dylib "interceptors not installed" && 0 ******************** PASS: lldb-unit :: Utility/./UtilityTests/StringExtractorTest.GetHexU8_InvalidHex_NoEof (1606 of 1799) UNRESOLVED: lldb-api :: lang/c/shared_lib_stripped_symbols/TestSharedLibStrippedSymbols.py (1607 of 1799) ******************** TEST 'lldb-api :: lang/c/shared_lib_stripped_symbols/TestSharedLibStrippedSymbols.py' FAILED ******************** Unable to find 'RESULT: PASSED' in dotest output (exit code -6):

Hide Details

lldb version 10.0.99 (http://labmaster3.local/git/llvm-project.git revision 0e0dea82681a86a09ceed0afd321367a35bfa051) clang revision c46b3a2abd38d6fecd389c97dfa7df54af77fdb9 llvm revision c46b3a2abd38d6fecd389c97dfa7df54af77fdb9 ==22493==ERROR: Interceptors are not working. This may be because AddressSanitizer is loaded too late (e.g. via dlopen). Please launch the executable with: DYLD_INSERT_LIBRARIES=/Users/buildslave/jenkins/workspace/lldb-cmake-sanitized/host-compiler/lib/clang/10.0.0/lib/darwin/libclang_rt.asan_osx_dynamic.dylib "interceptors not installed" && 0 ******************** PASS: lldb-shell :: ObjectFile/PECOFF/sections.yaml (1608 of 1799) PASS: lldb-shell :: SymbolFile/DWARF/debug-types-line-tables.s (1609 of 1799) UNRESOLVED: lldb-api :: benchmarks/startup/TestStartupDelays.py (1610 of 1799) ******************** TEST 'lldb-api :: benchmarks/startup/TestStartupDelays.py' FAILED ******************** Unable to find 'RESULT: PASSED' in dotest output (exit code -6):

Hide Details

lldb version 10.0.99 (http://labmaster3.local/git/llvm-project.git revision 0e0dea82681a86a09ceed0afd321367a35bfa051) clang revision c46b3a2abd38d6fecd389c97dfa7df54af77fdb9 llvm revision c46b3a2abd38d6fecd389c97dfa7df54af77fdb9 ==22501==ERROR: Interceptors are not working. This may be because AddressSanitizer is loaded too late (e.g. via dlopen). Please launch the executable with: DYLD_INSERT_LIBRARIES=/Users/buildslave/jenkins/workspace/lldb-cmake-sanitized/host-compiler/lib/clang/10.0.0/lib/darwin/libclang_rt.asan_osx_dynamic.dylib "interceptors not installed" && 0 ******************** PASS: lldb-unit :: Utility/./UtilityTests/StringExtractorTest.GetHexBytesAvail_OddPair (1611 of 1799) UNRESOLVED: lldb-api :: functionalities/data-formatter/data-formatter-stl/libcxx/optional/TestDataFormatterLibcxxOptional.py (1612 of 1799) ******************** TEST 'lldb-api :: functionalities/data-formatter/data-formatter-stl/libcxx/optional/TestDataFormatterLibcxxOptional.py' FAILED ******************** Unable to find 'RESULT: PASSED' in dotest output (exit code -6):

Hide Details

lldb version 10.0.99 (http://labmaster3.local/git/llvm-project.git revision 0e0dea82681a86a09ceed0afd321367a35bfa051) clang revision c46b3a2abd38d6fecd389c97dfa7df54af77fdb9 llvm revision c46b3a2abd38d6fecd389c97dfa7df54af77fdb9 ==22504==ERROR: Interceptors are not working. This may be because AddressSanitizer is loaded too late (e.g. via dlopen). Please launch the executable with: DYLD_INSERT_LIBRARIES=/Users/buildslave/jenkins/workspace/lldb-cmake-sanitized/host-compiler/lib/clang/10.0.0/lib/darwin/libclang_rt.asan_osx_dynamic.dylib "interceptors not installed" && 0 ******************** PASS: lldb-unit :: Utility/./UtilityTests/StreamTest.PutCharWhitespace (1613 of 1799) PASS: lldb-unit :: Utility/./UtilityTests/BinaryStreamTest.PutSLEB128FourBytes (1614 of 1799) PASS: lldb-shell :: SymbolFile/NativePDB/globals-bss.cpp (1615 of 1799) UNRESOLVED: lldb-api :: functionalities/thread/concurrent_events/TestConcurrentManyBreakpoints.py (1616 of 1799) ******************** TEST 'lldb-api :: functionalities/thread/concurrent_events/TestConcurrentManyBreakpoints.py' FAILED ******************** Unable to find 'RESULT: PASSED' in dotest output (exit code -6):

Hide Details

lldb version 10.0.99 (http://labmaster3.local/git/llvm-project.git revision 0e0dea82681a86a09ceed0afd321367a35bfa051) clang revision c46b3a2abd38d6fecd389c97dfa7df54af77fdb9 llvm revision c46b3a2abd38d6fecd389c97dfa7df54af77fdb9 ==22530==ERROR: Interceptors are not working. This may be because AddressSanitizer is loaded too late (e.g. via dlopen). Please launch the executable with: DYLD_INSERT_LIBRARIES=/Users/buildslave/jenkins/workspace/lldb-cmake-sanitized/host-compiler/lib/clang/10.0.0/lib/darwin/libclang_rt.asan_osx_dynamic.dylib "interceptors not installed" && 0 ******************** PASS: lldb-unit :: Utility/./UtilityTests/ArgsTest.BareSingleQuote (1617 of 1799) PASS: lldb-unit :: Host/./HostTests/SocketAddressTest.GetAddressInfo (1618 of 1799) UNRESOLVED: lldb-api :: python_api/interpreter/TestCommandInterpreterAPI.py (1619 of 1799) ******************** TEST 'lldb-api :: python_api/interpreter/TestCommandInterpreterAPI.py' FAILED ******************** Unable to find 'RESULT: PASSED' in dotest output (exit code -6):

Hide Details

lldb version 10.0.99 (http://labmaster3.local/git/llvm-project.git revision 0e0dea82681a86a09ceed0afd321367a35bfa051) clang revision c46b3a2abd38d6fecd389c97dfa7df54af77fdb9 llvm revision c46b3a2abd38d6fecd389c97dfa7df54af77fdb9 ==22547==ERROR: Interceptors are not working. This may be because AddressSanitizer is loaded too late (e.g. via dlopen). Please launch the executable with: DYLD_INSERT_LIBRARIES=/Users/buildslave/jenkins/workspace/lldb-cmake-sanitized/host-compiler/lib/clang/10.0.0/lib/darwin/libclang_rt.asan_osx_dynamic.dylib "interceptors not installed" && 0 ******************** PASS: lldb-unit :: Utility/./UtilityTests/StringLexerTest.NextIfList (1620 of 1799) UNRESOLVED: lldb-api :: commands/expression/formatters/TestFormatters.py (1621 of 1799) ******************** TEST 'lldb-api :: commands/expression/formatters/TestFormatters.py' FAILED ******************** Unable to find 'RESULT: PASSED' in dotest output (exit code -6):

Hide Details

lldb version 10.0.99 (http://labmaster3.local/git/llvm-project.git revision 0e0dea82681a86a09ceed0afd321367a35bfa051) clang revision c46b3a2abd38d6fecd389c97dfa7df54af77fdb9 llvm revision c46b3a2abd38d6fecd389c97dfa7df54af77fdb9 ==22554==ERROR: Interceptors are not working. This may be because AddressSanitizer is loaded too late (e.g. via dlopen). Please launch the executable with: DYLD_INSERT_LIBRARIES=/Users/buildslave/jenkins/workspace/lldb-cmake-sanitized/host-compiler/lib/clang/10.0.0/lib/darwin/libclang_rt.asan_osx_dynamic.dylib "interceptors not installed" && 0 ******************** PASS: lldb-unit :: Process/gdb-remote/./ProcessGdbRemoteTests/GDBRemoteCommunicationClientTest.SendGetTraceConfigPacket (1622 of 1799) UNRESOLVED: lldb-api :: functionalities/breakpoint/auto_continue/TestBreakpointAutoContinue.py (1623 of 1799) ******************** TEST 'lldb-api :: functionalities/breakpoint/auto_continue/TestBreakpointAutoContinue.py' FAILED ******************** Unable to find 'RESULT: PASSED' in dotest output (exit code -6):

Hide Details

lldb version 10.0.99 (http://labmaster3.local/git/llvm-project.git revision 0e0dea82681a86a09ceed0afd321367a35bfa051) clang revision c46b3a2abd38d6fecd389c97dfa7df54af77fdb9 llvm revision c46b3a2abd38d6fecd389c97dfa7df54af77fdb9 ==22564==ERROR: Interceptors are not working. This may be because AddressSanitizer is loaded too late (e.g. via dlopen). Please launch the executable with: DYLD_INSERT_LIBRARIES=/Users/buildslave/jenkins/workspace/lldb-cmake-sanitized/host-compiler/lib/clang/10.0.0/lib/darwin/libclang_rt.asan_osx_dynamic.dylib "interceptors not installed" && 0 ******************** UNRESOLVED: lldb-api :: lang/objc/objc-static-method/TestObjCStaticMethod.py (1624 of 1799) ******************** TEST 'lldb-api :: lang/objc/objc-static-method/TestObjCStaticMethod.py' FAILED ******************** Unable to find 'RESULT: PASSED' in dotest output (exit code -6):

Hide Details

lldb version 10.0.99 (http://labmaster3.local/git/llvm-project.git revision 0e0dea82681a86a09ceed0afd321367a35bfa051) clang revision c46b3a2abd38d6fecd389c97dfa7df54af77fdb9 llvm revision c46b3a2abd38d6fecd389c97dfa7df54af77fdb9 ==22587==ERROR: Interceptors are not working. This may be because AddressSanitizer is loaded too late (e.g. via dlopen). Please launch the executable with: DYLD_INSERT_LIBRARIES=/Users/buildslave/jenkins/workspace/lldb-cmake-sanitized/host-compiler/lib/clang/10.0.0/lib/darwin/libclang_rt.asan_osx_dynamic.dylib "interceptors not installed" && 0 ******************** UNRESOLVED: lldb-api :: lang/c/stepping/TestThreadStepping.py (1625 of 1799) ******************** TEST 'lldb-api :: lang/c/stepping/TestThreadStepping.py' FAILED ******************** Unable to find 'RESULT: PASSED' in dotest output (exit code -6):

Hide Details

lldb version 10.0.99 (http://labmaster3.local/git/llvm-project.git revision 0e0dea82681a86a09ceed0afd321367a35bfa051) clang revision c46b3a2abd38d6fecd389c97dfa7df54af77fdb9 llvm revision c46b3a2abd38d6fecd389c97dfa7df54af77fdb9 ==22584==ERROR: Interceptors are not working. This may be because AddressSanitizer is loaded too late (e.g. via dlopen). Please launch the executable with: DYLD_INSERT_LIBRARIES=/Users/buildslave/jenkins/workspace/lldb-cmake-sanitized/host-compiler/lib/clang/10.0.0/lib/darwin/libclang_rt.asan_osx_dynamic.dylib "interceptors not installed" && 0 ******************** PASS: lldb-unit :: Utility/./UtilityTests/StringExtractorTest.GetHexU8_Extra_NoEof (1626 of 1799) UNRESOLVED: lldb-api :: lang/c/find_struct_type/TestFindStructTypes.py (1627 of 1799) ******************** TEST 'lldb-api :: lang/c/find_struct_type/TestFindStructTypes.py' FAILED ******************** Unable to find 'RESULT: PASSED' in dotest output (exit code -6):

Hide Details

lldb version 10.0.99 (http://labmaster3.local/git/llvm-project.git revision 0e0dea82681a86a09ceed0afd321367a35bfa051) clang revision c46b3a2abd38d6fecd389c97dfa7df54af77fdb9 llvm revision c46b3a2abd38d6fecd389c97dfa7df54af77fdb9 ==22594==ERROR: Interceptors are not working. This may be because AddressSanitizer is loaded too late (e.g. via dlopen). Please launch the executable with: DYLD_INSERT_LIBRARIES=/Users/buildslave/jenkins/workspace/lldb-cmake-sanitized/host-compiler/lib/clang/10.0.0/lib/darwin/libclang_rt.asan_osx_dynamic.dylib "interceptors not installed" && 0 ******************** UNRESOLVED: lldb-api :: functionalities/data-formatter/nsdictionarysynth/TestNSDictionarySynthetic.py (1628 of 1799) ******************** TEST 'lldb-api :: functionalities/data-formatter/nsdictionarysynth/TestNSDictionarySynthetic.py' FAILED ******************** Unable to find 'RESULT: PASSED' in dotest output (exit code -6):

Hide Details

lldb version 10.0.99 (http://labmaster3.local/git/llvm-project.git revision 0e0dea82681a86a09ceed0afd321367a35bfa051) clang revision c46b3a2abd38d6fecd389c97dfa7df54af77fdb9 llvm revision c46b3a2abd38d6fecd389c97dfa7df54af77fdb9 ==22597==ERROR: Interceptors are not working. This may be because AddressSanitizer is loaded too late (e.g. via dlopen). Please launch the executable with: DYLD_INSERT_LIBRARIES=/Users/buildslave/jenkins/workspace/lldb-cmake-sanitized/host-compiler/lib/clang/10.0.0/lib/darwin/libclang_rt.asan_osx_dynamic.dylib "interceptors not installed" && 0 ******************** PASS: lldb-shell :: Heap/heap-cstr.test (1629 of 1799) UNRESOLVED: lldb-api :: sample_test/TestSampleInlineTest.py (1630 of 1799) ******************** TEST 'lldb-api :: sample_test/TestSampleInlineTest.py' FAILED ******************** Unable to find 'RESULT: PASSED' in dotest output (exit code -6):

Hide Details

lldb version 10.0.99 (http://labmaster3.local/git/llvm-project.git revision 0e0dea82681a86a09ceed0afd321367a35bfa051) clang revision c46b3a2abd38d6fecd389c97dfa7df54af77fdb9 llvm revision c46b3a2abd38d6fecd389c97dfa7df54af77fdb9 ==22614==ERROR: Interceptors are not working. This may be because AddressSanitizer is loaded too late (e.g. via dlopen). Please launch the executable with: DYLD_INSERT_LIBRARIES=/Users/buildslave/jenkins/workspace/lldb-cmake-sanitized/host-compiler/lib/clang/10.0.0/lib/darwin/libclang_rt.asan_osx_dynamic.dylib "interceptors not installed" && 0 ******************** PASS: lldb-shell :: ObjectFile/ELF/section-types-edgecases.yaml (1631 of 1799) PASS: lldb-unit :: UnwindAssembly/x86/./UnwindAssemblyx86Tests/Testx86AssemblyInspectionEngine.TestAddRSP (1632 of 1799) PASS: lldb-unit :: ScriptInterpreter/Python/./ScriptInterpreterPythonTests/PythonDataObjectsTest.TestPythonListToStructuredList (1633 of 1799) UNRESOLVED: lldb-api :: lang/objc/modules-incomplete/TestIncompleteModules.py (1634 of 1799) ******************** TEST 'lldb-api :: lang/objc/modules-incomplete/TestIncompleteModules.py' FAILED ******************** Unable to find 'RESULT: PASSED' in dotest output (exit code -6):

Hide Details

lldb version 10.0.99 (http://labmaster3.local/git/llvm-project.git revision 0e0dea82681a86a09ceed0afd321367a35bfa051) clang revision c46b3a2abd38d6fecd389c97dfa7df54af77fdb9 llvm revision c46b3a2abd38d6fecd389c97dfa7df54af77fdb9 ==22637==ERROR: Interceptors are not working. This may be because AddressSanitizer is loaded too late (e.g. via dlopen). Please launch the executable with: DYLD_INSERT_LIBRARIES=/Users/buildslave/jenkins/workspace/lldb-cmake-sanitized/host-compiler/lib/clang/10.0.0/lib/darwin/libclang_rt.asan_osx_dynamic.dylib "interceptors not installed" && 0 ******************** PASS: lldb-unit :: UnwindAssembly/x86/./UnwindAssemblyx86Tests/Testx86AssemblyInspectionEngine.TestSpillRegToStackViaMOVx86_64 (1635 of 1799) UNRESOLVED: lldb-api :: commands/expression/import-std-module/vector-of-vectors/TestVectorOfVectors.py (1636 of 1799) ******************** TEST 'lldb-api :: commands/expression/import-std-module/vector-of-vectors/TestVectorOfVectors.py' FAILED ******************** Unable to find 'RESULT: PASSED' in dotest output (exit code -6):

Hide Details

lldb version 10.0.99 (http://labmaster3.local/git/llvm-project.git revision 0e0dea82681a86a09ceed0afd321367a35bfa051) clang revision c46b3a2abd38d6fecd389c97dfa7df54af77fdb9 llvm revision c46b3a2abd38d6fecd389c97dfa7df54af77fdb9 ==22647==ERROR: Interceptors are not working. This may be because AddressSanitizer is loaded too late (e.g. via dlopen). Please launch the executable with: DYLD_INSERT_LIBRARIES=/Users/buildslave/jenkins/workspace/lldb-cmake-sanitized/host-compiler/lib/clang/10.0.0/lib/darwin/libclang_rt.asan_osx_dynamic.dylib "interceptors not installed" && 0 ******************** UNRESOLVED: lldb-api :: commands/watchpoints/multiple_threads/TestWatchpointMultipleThreads.py (1637 of 1799) ******************** TEST 'lldb-api :: commands/watchpoints/multiple_threads/TestWatchpointMultipleThreads.py' FAILED ******************** Unable to find 'RESULT: PASSED' in dotest output (exit code -6):

Hide Details

lldb version 10.0.99 (http://labmaster3.local/git/llvm-project.git revision 0e0dea82681a86a09ceed0afd321367a35bfa051) clang revision c46b3a2abd38d6fecd389c97dfa7df54af77fdb9 llvm revision c46b3a2abd38d6fecd389c97dfa7df54af77fdb9 ==22645==ERROR: Interceptors are not working. This may be because AddressSanitizer is loaded too late (e.g. via dlopen). Please launch the executable with: DYLD_INSERT_LIBRARIES=/Users/buildslave/jenkins/workspace/lldb-cmake-sanitized/host-compiler/lib/clang/10.0.0/lib/darwin/libclang_rt.asan_osx_dynamic.dylib "interceptors not installed" && 0 ******************** PASS: lldb-unit :: Utility/./UtilityTests/BinaryStreamTest.PutULEB128FiveBytes (1638 of 1799) UNRESOLVED: lldb-api :: lang/objc/variadic_methods/TestVariadicMethods.py (1639 of 1799) ******************** TEST 'lldb-api :: lang/objc/variadic_methods/TestVariadicMethods.py' FAILED ******************** Unable to find 'RESULT: PASSED' in dotest output (exit code -6):

Hide Details

lldb version 10.0.99 (http://labmaster3.local/git/llvm-project.git revision 0e0dea82681a86a09ceed0afd321367a35bfa051) clang revision c46b3a2abd38d6fecd389c97dfa7df54af77fdb9 llvm revision c46b3a2abd38d6fecd389c97dfa7df54af77fdb9 ==22646==ERROR: Interceptors are not working. This may be because AddressSanitizer is loaded too late (e.g. via dlopen). Please launch the executable with: DYLD_INSERT_LIBRARIES=/Users/buildslave/jenkins/workspace/lldb-cmake-sanitized/host-compiler/lib/clang/10.0.0/lib/darwin/libclang_rt.asan_osx_dynamic.dylib "interceptors not installed" && 0 ******************** UNRESOLVED: lldb-api :: functionalities/thread/concurrent_events/TestConcurrentWatchpointWithDelayWatchpointThreads.py (1640 of 1799) ******************** TEST 'lldb-api :: functionalities/thread/concurrent_events/TestConcurrentWatchpointWithDelayWatchpointThreads.py' FAILED ******************** Unable to find 'RESULT: PASSED' in dotest output (exit code -6):

Hide Details

lldb version 10.0.99 (http://labmaster3.local/git/llvm-project.git revision 0e0dea82681a86a09ceed0afd321367a35bfa051) clang revision c46b3a2abd38d6fecd389c97dfa7df54af77fdb9 llvm revision c46b3a2abd38d6fecd389c97dfa7df54af77fdb9 ==22653==ERROR: Interceptors are not working. This may be because AddressSanitizer is loaded too late (e.g. via dlopen). Please launch the executable with: DYLD_INSERT_LIBRARIES=/Users/buildslave/jenkins/workspace/lldb-cmake-sanitized/host-compiler/lib/clang/10.0.0/lib/darwin/libclang_rt.asan_osx_dynamic.dylib "interceptors not installed" && 0 ******************** UNSUPPORTED: lldb-shell :: SymbolFile/NativePDB/typedefs.cpp (1641 of 1799) PASS: lldb-shell :: Quit/TestQuitExitCode0.test (1642 of 1799) PASS: lldb-unit :: Utility/./UtilityTests/StringListTest.InsertStringAtIndexOutOfBounds (1643 of 1799) UNRESOLVED: lldb-api :: python_api/watchpoint/TestWatchpointIgnoreCount.py (1644 of 1799) ******************** TEST 'lldb-api :: python_api/watchpoint/TestWatchpointIgnoreCount.py' FAILED ******************** Unable to find 'RESULT: PASSED' in dotest output (exit code -6):

Hide Details

lldb version 10.0.99 (http://labmaster3.local/git/llvm-project.git revision 0e0dea82681a86a09ceed0afd321367a35bfa051) clang revision c46b3a2abd38d6fecd389c97dfa7df54af77fdb9 llvm revision c46b3a2abd38d6fecd389c97dfa7df54af77fdb9 ==22665==ERROR: Interceptors are not working. This may be because AddressSanitizer is loaded too late (e.g. via dlopen). Please launch the executable with: DYLD_INSERT_LIBRARIES=/Users/buildslave/jenkins/workspace/lldb-cmake-sanitized/host-compiler/lib/clang/10.0.0/lib/darwin/libclang_rt.asan_osx_dynamic.dylib "interceptors not installed" && 0 ******************** UNRESOLVED: lldb-api :: macosx/thread-names/TestInterruptThreadNames.py (1645 of 1799) ******************** TEST 'lldb-api :: macosx/thread-names/TestInterruptThreadNames.py' FAILED ******************** Unable to find 'RESULT: PASSED' in dotest output (exit code -6):

Hide Details

lldb version 10.0.99 (http://labmaster3.local/git/llvm-project.git revision 0e0dea82681a86a09ceed0afd321367a35bfa051) clang revision c46b3a2abd38d6fecd389c97dfa7df54af77fdb9 llvm revision c46b3a2abd38d6fecd389c97dfa7df54af77fdb9 ==22671==ERROR: Interceptors are not working. This may be because AddressSanitizer is loaded too late (e.g. via dlopen). Please launch the executable with: DYLD_INSERT_LIBRARIES=/Users/buildslave/jenkins/workspace/lldb-cmake-sanitized/host-compiler/lib/clang/10.0.0/lib/darwin/libclang_rt.asan_osx_dynamic.dylib "interceptors not installed" && 0 ******************** PASS: lldb-unit :: Host/./HostTests/NativeProcessProtocolTest.ReadMemoryWithoutTrap (1646 of 1799) PASS: lldb-unit :: UnwindAssembly/x86/./UnwindAssemblyx86Tests/Testx86AssemblyInspectionEngine.TestPushRBP (1647 of 1799) PASS: lldb-unit :: Utility/./UtilityTests/StringExtractorTest.GetHexU8_InvalidHex (1648 of 1799) UNRESOLVED: lldb-api :: functionalities/data-formatter/nsarraysynth/TestNSArraySynthetic.py (1649 of 1799) ******************** TEST 'lldb-api :: functionalities/data-formatter/nsarraysynth/TestNSArraySynthetic.py' FAILED ******************** Unable to find 'RESULT: PASSED' in dotest output (exit code -6):

Hide Details

lldb version 10.0.99 (http://labmaster3.local/git/llvm-project.git revision 0e0dea82681a86a09ceed0afd321367a35bfa051) clang revision c46b3a2abd38d6fecd389c97dfa7df54af77fdb9 llvm revision c46b3a2abd38d6fecd389c97dfa7df54af77fdb9 ==22706==ERROR: Interceptors are not working. This may be because AddressSanitizer is loaded too late (e.g. via dlopen). Please launch the executable with: DYLD_INSERT_LIBRARIES=/Users/buildslave/jenkins/workspace/lldb-cmake-sanitized/host-compiler/lib/clang/10.0.0/lib/darwin/libclang_rt.asan_osx_dynamic.dylib "interceptors not installed" && 0 ******************** PASS: lldb-shell :: ExecControl/StopHook/stop-hook.test (1650 of 1799) UNRESOLVED: lldb-api :: functionalities/data-formatter/boolreference/TestFormattersBoolRefPtr.py (1651 of 1799) ******************** TEST 'lldb-api :: functionalities/data-formatter/boolreference/TestFormattersBoolRefPtr.py' FAILED ******************** Unable to find 'RESULT: PASSED' in dotest output (exit code -6):

Hide Details

lldb version 10.0.99 (http://labmaster3.local/git/llvm-project.git revision 0e0dea82681a86a09ceed0afd321367a35bfa051) clang revision c46b3a2abd38d6fecd389c97dfa7df54af77fdb9 llvm revision c46b3a2abd38d6fecd389c97dfa7df54af77fdb9 ==22714==ERROR: Interceptors are not working. This may be because AddressSanitizer is loaded too late (e.g. via dlopen). Please launch the executable with: DYLD_INSERT_LIBRARIES=/Users/buildslave/jenkins/workspace/lldb-cmake-sanitized/host-compiler/lib/clang/10.0.0/lib/darwin/libclang_rt.asan_osx_dynamic.dylib "interceptors not installed" && 0 ******************** PASS: lldb-unit :: Language/Highlighting/./HighlighterTests/HighlighterTest.FallbackHighlighter (1652 of 1799) PASS: lldb-unit :: UnwindAssembly/x86/./UnwindAssemblyx86Tests/Testx86AssemblyInspectionEngine.TestPushEAX (1653 of 1799) PASS: lldb-unit :: Process/gdb-remote/./ProcessGdbRemoteTests/GDBRemoteCommunicationClientTest.SendGetMetaDataPacket (1654 of 1799) UNSUPPORTED: lldb-shell :: SymbolFile/PDB/compilands.test (1655 of 1799) PASS: lldb-unit :: Utility/./UtilityTests/StreamTeeTest.DefaultConstructor (1656 of 1799) UNRESOLVED: lldb-api :: commands/expression/import_builtin_fileid/TestImportBuiltinFileID.py (1657 of 1799) ******************** TEST 'lldb-api :: commands/expression/import_builtin_fileid/TestImportBuiltinFileID.py' FAILED ******************** Unable to find 'RESULT: PASSED' in dotest output (exit code -6):

Hide Details

lldb version 10.0.99 (http://labmaster3.local/git/llvm-project.git revision 0e0dea82681a86a09ceed0afd321367a35bfa051) clang revision c46b3a2abd38d6fecd389c97dfa7df54af77fdb9 llvm revision c46b3a2abd38d6fecd389c97dfa7df54af77fdb9 ==22732==ERROR: Interceptors are not working. This may be because AddressSanitizer is loaded too late (e.g. via dlopen). Please launch the executable with: DYLD_INSERT_LIBRARIES=/Users/buildslave/jenkins/workspace/lldb-cmake-sanitized/host-compiler/lib/clang/10.0.0/lib/darwin/libclang_rt.asan_osx_dynamic.dylib "interceptors not installed" && 0 ******************** PASS: lldb-unit :: Expression/./ExpressionTests/DiagnosticManagerTest.PutString (1658 of 1799) UNRESOLVED: lldb-api :: commands/expression/diagnostics/TestExprDiagnostics.py (1659 of 1799) ******************** TEST 'lldb-api :: commands/expression/diagnostics/TestExprDiagnostics.py' FAILED ******************** Unable to find 'RESULT: PASSED' in dotest output (exit code -6):

Hide Details

lldb version 10.0.99 (http://labmaster3.local/git/llvm-project.git revision 0e0dea82681a86a09ceed0afd321367a35bfa051) clang revision c46b3a2abd38d6fecd389c97dfa7df54af77fdb9 llvm revision c46b3a2abd38d6fecd389c97dfa7df54af77fdb9 ==22733==ERROR: Interceptors are not working. This may be because AddressSanitizer is loaded too late (e.g. via dlopen). Please launch the executable with: DYLD_INSERT_LIBRARIES=/Users/buildslave/jenkins/workspace/lldb-cmake-sanitized/host-compiler/lib/clang/10.0.0/lib/darwin/libclang_rt.asan_osx_dynamic.dylib "interceptors not installed" && 0 ******************** PASS: lldb-unit :: Utility/./UtilityTests/StringExtractorTest.GetHexBytes_Partial (1660 of 1799) PASS: lldb-unit :: Host/./HostTests/SocketTest.TCPListen0ConnectAccept (1661 of 1799) UNRESOLVED: lldb-api :: python_api/watchpoint/watchlocation/TestTargetWatchAddress.py (1662 of 1799) ******************** TEST 'lldb-api :: python_api/watchpoint/watchlocation/TestTargetWatchAddress.py' FAILED ******************** Unable to find 'RESULT: PASSED' in dotest output (exit code -6):

Hide Details

lldb version 10.0.99 (http://labmaster3.local/git/llvm-project.git revision 0e0dea82681a86a09ceed0afd321367a35bfa051) clang revision c46b3a2abd38d6fecd389c97dfa7df54af77fdb9 llvm revision c46b3a2abd38d6fecd389c97dfa7df54af77fdb9 ==22756==ERROR: Interceptors are not working. This may be because AddressSanitizer is loaded too late (e.g. via dlopen). Please launch the executable with: DYLD_INSERT_LIBRARIES=/Users/buildslave/jenkins/workspace/lldb-cmake-sanitized/host-compiler/lib/clang/10.0.0/lib/darwin/libclang_rt.asan_osx_dynamic.dylib "interceptors not installed" && 0 ******************** UNRESOLVED: lldb-api :: tools/lldb-vscode/launch/TestVSCode_launch.py (1663 of 1799) ******************** TEST 'lldb-api :: tools/lldb-vscode/launch/TestVSCode_launch.py' FAILED ******************** Unable to find 'RESULT: PASSED' in dotest output (exit code -6):

Hide Details

lldb version 10.0.99 (http://labmaster3.local/git/llvm-project.git revision 0e0dea82681a86a09ceed0afd321367a35bfa051) clang revision c46b3a2abd38d6fecd389c97dfa7df54af77fdb9 llvm revision c46b3a2abd38d6fecd389c97dfa7df54af77fdb9 ==22755==ERROR: Interceptors are not working. This may be because AddressSanitizer is loaded too late (e.g. via dlopen). Please launch the executable with: DYLD_INSERT_LIBRARIES=/Users/buildslave/jenkins/workspace/lldb-cmake-sanitized/host-compiler/lib/clang/10.0.0/lib/darwin/libclang_rt.asan_osx_dynamic.dylib "interceptors not installed" && 0 ******************** UNRESOLVED: lldb-api :: functionalities/tail_call_frames/disambiguate_paths_to_common_sink/TestDisambiguatePathsToCommonSink.py (1664 of 1799) ******************** TEST 'lldb-api :: functionalities/tail_call_frames/disambiguate_paths_to_common_sink/TestDisambiguatePathsToCommonSink.py' FAILED ******************** Unable to find 'RESULT: PASSED' in dotest output (exit code -6):

Hide Details

lldb version 10.0.99 (http://labmaster3.local/git/llvm-project.git revision 0e0dea82681a86a09ceed0afd321367a35bfa051) clang revision c46b3a2abd38d6fecd389c97dfa7df54af77fdb9 llvm revision c46b3a2abd38d6fecd389c97dfa7df54af77fdb9 ==22758==ERROR: Interceptors are not working. This may be because AddressSanitizer is loaded too late (e.g. via dlopen). Please launch the executable with: DYLD_INSERT_LIBRARIES=/Users/buildslave/jenkins/workspace/lldb-cmake-sanitized/host-compiler/lib/clang/10.0.0/lib/darwin/libclang_rt.asan_osx_dynamic.dylib "interceptors not installed" && 0 ******************** UNRESOLVED: lldb-api :: functionalities/thread/concurrent_events/TestConcurrentCrashWithWatchpointBreakpointSignal.py (1665 of 1799) ******************** TEST 'lldb-api :: functionalities/thread/concurrent_events/TestConcurrentCrashWithWatchpointBreakpointSignal.py' FAILED ******************** Unable to find 'RESULT: PASSED' in dotest output (exit code -6):

Hide Details

lldb version 10.0.99 (http://labmaster3.local/git/llvm-project.git revision 0e0dea82681a86a09ceed0afd321367a35bfa051) clang revision c46b3a2abd38d6fecd389c97dfa7df54af77fdb9 llvm revision c46b3a2abd38d6fecd389c97dfa7df54af77fdb9 ==22761==ERROR: Interceptors are not working. This may be because AddressSanitizer is loaded too late (e.g. via dlopen). Please launch the executable with: DYLD_INSERT_LIBRARIES=/Users/buildslave/jenkins/workspace/lldb-cmake-sanitized/host-compiler/lib/clang/10.0.0/lib/darwin/libclang_rt.asan_osx_dynamic.dylib "interceptors not installed" && 0 ******************** PASS: lldb-unit :: Utility/./UtilityTests/StreamTest.PutRawBytesToLittleEndian (1666 of 1799) PASS: lldb-unit :: Utility/./UtilityTests/StringListTest.GetMaxStringLengthEmpty (1667 of 1799) PASS: lldb-unit :: Expression/./ExpressionTests/DiagnosticManagerTest.AppendMessageNoDiag (1668 of 1799) PASS: lldb-unit :: UnwindAssembly/x86/./UnwindAssemblyx86Tests/Testx86AssemblyInspectionEngine.TestStackRealignMSVC_i386 (1669 of 1799) UNRESOLVED: lldb-api :: lang/objc/rdar-11355592/TestRdar11355592.py (1670 of 1799) ******************** TEST 'lldb-api :: lang/objc/rdar-11355592/TestRdar11355592.py' FAILED ******************** Unable to find 'RESULT: PASSED' in dotest output (exit code -6):

Hide Details

lldb version 10.0.99 (http://labmaster3.local/git/llvm-project.git revision 0e0dea82681a86a09ceed0afd321367a35bfa051) clang revision c46b3a2abd38d6fecd389c97dfa7df54af77fdb9 llvm revision c46b3a2abd38d6fecd389c97dfa7df54af77fdb9 ==22775==ERROR: Interceptors are not working. This may be because AddressSanitizer is loaded too late (e.g. via dlopen). Please launch the executable with: DYLD_INSERT_LIBRARIES=/Users/buildslave/jenkins/workspace/lldb-cmake-sanitized/host-compiler/lib/clang/10.0.0/lib/darwin/libclang_rt.asan_osx_dynamic.dylib "interceptors not installed" && 0 ******************** PASS: lldb-unit :: ScriptInterpreter/Python/./ScriptInterpreterPythonTests/PythonDataObjectsTest.TestPythonDictionaryToStructuredDictionary (1671 of 1799) PASS: lldb-unit :: Process/minidump/./LLDBMinidumpTests/RegisterContextMinidump.CheckRegisterContextMinidump_ARM (1672 of 1799) UNRESOLVED: lldb-api :: functionalities/breakpoint/breakpoint_hit_count/TestBreakpointHitCount.py (1673 of 1799) ******************** TEST 'lldb-api :: functionalities/breakpoint/breakpoint_hit_count/TestBreakpointHitCount.py' FAILED ******************** Unable to find 'RESULT: PASSED' in dotest output (exit code -6):

Hide Details

lldb version 10.0.99 (http://labmaster3.local/git/llvm-project.git revision 0e0dea82681a86a09ceed0afd321367a35bfa051) clang revision c46b3a2abd38d6fecd389c97dfa7df54af77fdb9 llvm revision c46b3a2abd38d6fecd389c97dfa7df54af77fdb9 ==22788==ERROR: Interceptors are not working. This may be because AddressSanitizer is loaded too late (e.g. via dlopen). Please launch the executable with: DYLD_INSERT_LIBRARIES=/Users/buildslave/jenkins/workspace/lldb-cmake-sanitized/host-compiler/lib/clang/10.0.0/lib/darwin/libclang_rt.asan_osx_dynamic.dylib "interceptors not installed" && 0 ******************** PASS: lldb-unit :: Host/./HostTests/SocketTest.DomainGetConnectURI (1674 of 1799) PASS: lldb-unit :: UnwindAssembly/x86/./UnwindAssemblyx86Tests/Testx86AssemblyInspectionEngine.TestPopR15 (1675 of 1799) PASS: lldb-unit :: UnwindAssembly/x86/./UnwindAssemblyx86Tests/Testx86AssemblyInspectionEngine.TestPopR13 (1676 of 1799) PASS: lldb-unit :: Language/CPlusPlus/./LanguageCPlusPlusTests/CPlusPlusLanguage.CPlusPlusNameParser (1677 of 1799) PASS: lldb-unit :: Process/gdb-remote/./ProcessGdbRemoteTests/GDBRemoteCommunicationClientTest.WriteRegisterNoSuffix (1678 of 1799) PASS: lldb-shell :: Settings/TestDisableColor.test (1679 of 1799) UNRESOLVED: lldb-api :: functionalities/return-value/TestReturnValue.py (1680 of 1799) ******************** TEST 'lldb-api :: functionalities/return-value/TestReturnValue.py' FAILED ******************** Unable to find 'RESULT: PASSED' in dotest output (exit code -6):

Hide Details

lldb version 10.0.99 (http://labmaster3.local/git/llvm-project.git revision 0e0dea82681a86a09ceed0afd321367a35bfa051) clang revision c46b3a2abd38d6fecd389c97dfa7df54af77fdb9 llvm revision c46b3a2abd38d6fecd389c97dfa7df54af77fdb9 ==22837==ERROR: Interceptors are not working. This may be because AddressSanitizer is loaded too late (e.g. via dlopen). Please launch the executable with: DYLD_INSERT_LIBRARIES=/Users/buildslave/jenkins/workspace/lldb-cmake-sanitized/host-compiler/lib/clang/10.0.0/lib/darwin/libclang_rt.asan_osx_dynamic.dylib "interceptors not installed" && 0 ******************** UNRESOLVED: lldb-api :: functionalities/data-formatter/data-formatter-objc/TestDataFormatterObjCNSData.py (1681 of 1799) ******************** TEST 'lldb-api :: functionalities/data-formatter/data-formatter-objc/TestDataFormatterObjCNSData.py' FAILED ******************** Unable to find 'RESULT: PASSED' in dotest output (exit code -6):

Hide Details

lldb version 10.0.99 (http://labmaster3.local/git/llvm-project.git revision 0e0dea82681a86a09ceed0afd321367a35bfa051) clang revision c46b3a2abd38d6fecd389c97dfa7df54af77fdb9 llvm revision c46b3a2abd38d6fecd389c97dfa7df54af77fdb9 ==22823==ERROR: Interceptors are not working. This may be because AddressSanitizer is loaded too late (e.g. via dlopen). Please launch the executable with: DYLD_INSERT_LIBRARIES=/Users/buildslave/jenkins/workspace/lldb-cmake-sanitized/host-compiler/lib/clang/10.0.0/lib/darwin/libclang_rt.asan_osx_dynamic.dylib "interceptors not installed" && 0 ******************** PASS: lldb-unit :: Utility/./UtilityTests/StreamTest.PutBytesAsRawHex8ToBigEndian (1682 of 1799) PASS: lldb-unit :: Host/./HostTests/FileSystemTest.EnumerateDirectory (1683 of 1799) PASS: lldb-unit :: Utility/./UtilityTests/BinaryStreamTest.PutSLEB128ThreeBytes (1684 of 1799) PASS: lldb-unit :: Utility/./UtilityTests/RangeTest.Equal (1685 of 1799) PASS: lldb-unit :: Utility/./UtilityTests/StringListTest.GetSize (1686 of 1799) UNRESOLVED: lldb-api :: functionalities/data-formatter/data-formatter-stl/libcxx/unordered/TestDataFormatterUnordered.py (1687 of 1799) ******************** TEST 'lldb-api :: functionalities/data-formatter/data-formatter-stl/libcxx/unordered/TestDataFormatterUnordered.py' FAILED ******************** Unable to find 'RESULT: PASSED' in dotest output (exit code -6):

Hide Details

lldb version 10.0.99 (http://labmaster3.local/git/llvm-project.git revision 0e0dea82681a86a09ceed0afd321367a35bfa051) clang revision c46b3a2abd38d6fecd389c97dfa7df54af77fdb9 llvm revision c46b3a2abd38d6fecd389c97dfa7df54af77fdb9 ==22851==ERROR: Interceptors are not working. This may be because AddressSanitizer is loaded too late (e.g. via dlopen). Please launch the executable with: DYLD_INSERT_LIBRARIES=/Users/buildslave/jenkins/workspace/lldb-cmake-sanitized/host-compiler/lib/clang/10.0.0/lib/darwin/libclang_rt.asan_osx_dynamic.dylib "interceptors not installed" && 0 ******************** UNRESOLVED: lldb-api :: functionalities/multiword-commands/TestMultiWordCommands.py (1688 of 1799) ******************** TEST 'lldb-api :: functionalities/multiword-commands/TestMultiWordCommands.py' FAILED ******************** Unable to find 'RESULT: PASSED' in dotest output (exit code -6):

Hide Details

lldb version 10.0.99 (http://labmaster3.local/git/llvm-project.git revision 0e0dea82681a86a09ceed0afd321367a35bfa051) clang revision c46b3a2abd38d6fecd389c97dfa7df54af77fdb9 llvm revision c46b3a2abd38d6fecd389c97dfa7df54af77fdb9 ==22853==ERROR: Interceptors are not working. This may be because AddressSanitizer is loaded too late (e.g. via dlopen). Please launch the executable with: DYLD_INSERT_LIBRARIES=/Users/buildslave/jenkins/workspace/lldb-cmake-sanitized/host-compiler/lib/clang/10.0.0/lib/darwin/libclang_rt.asan_osx_dynamic.dylib "interceptors not installed" && 0 ******************** UNRESOLVED: lldb-api :: functionalities/darwin_log/filter/exact_match/category/TestDarwinLogFilterMatchCategory.py (1689 of 1799) ******************** TEST 'lldb-api :: functionalities/darwin_log/filter/exact_match/category/TestDarwinLogFilterMatchCategory.py' FAILED ******************** Unable to find 'RESULT: PASSED' in dotest output (exit code -6):

Hide Details

lldb version 10.0.99 (http://labmaster3.local/git/llvm-project.git revision 0e0dea82681a86a09ceed0afd321367a35bfa051) clang revision c46b3a2abd38d6fecd389c97dfa7df54af77fdb9 llvm revision c46b3a2abd38d6fecd389c97dfa7df54af77fdb9 ==22849==ERROR: Interceptors are not working. This may be because AddressSanitizer is loaded too late (e.g. via dlopen). Please launch the executable with: DYLD_INSERT_LIBRARIES=/Users/buildslave/jenkins/workspace/lldb-cmake-sanitized/host-compiler/lib/clang/10.0.0/lib/darwin/libclang_rt.asan_osx_dynamic.dylib "interceptors not installed" && 0 ******************** PASS: lldb-unit :: Utility/./UtilityTests/BinaryStreamTest.PutSLEB128One (1690 of 1799) PASS: lldb-shell :: Settings/TestDisassemblyFormat.test (1691 of 1799) PASS: lldb-shell :: Quit/TestQuitExitCodeNonInt.test (1692 of 1799) UNRESOLVED: lldb-api :: commands/add-dsym/uuid/TestAddDsymCommand.py (1693 of 1799) ******************** TEST 'lldb-api :: commands/add-dsym/uuid/TestAddDsymCommand.py' FAILED ******************** Unable to find 'RESULT: PASSED' in dotest output (exit code -6):

Hide Details

lldb version 10.0.99 (http://labmaster3.local/git/llvm-project.git revision 0e0dea82681a86a09ceed0afd321367a35bfa051) clang revision c46b3a2abd38d6fecd389c97dfa7df54af77fdb9 llvm revision c46b3a2abd38d6fecd389c97dfa7df54af77fdb9 ==22879==ERROR: Interceptors are not working. This may be because AddressSanitizer is loaded too late (e.g. via dlopen). Please launch the executable with: DYLD_INSERT_LIBRARIES=/Users/buildslave/jenkins/workspace/lldb-cmake-sanitized/host-compiler/lib/clang/10.0.0/lib/darwin/libclang_rt.asan_osx_dynamic.dylib "interceptors not installed" && 0 ******************** UNRESOLVED: lldb-api :: benchmarks/expression/TestRepeatedExprs.py (1694 of 1799) ******************** TEST 'lldb-api :: benchmarks/expression/TestRepeatedExprs.py' FAILED ******************** Unable to find 'RESULT: PASSED' in dotest output (exit code -6):

Hide Details

lldb version 10.0.99 (http://labmaster3.local/git/llvm-project.git revision 0e0dea82681a86a09ceed0afd321367a35bfa051) clang revision c46b3a2abd38d6fecd389c97dfa7df54af77fdb9 llvm revision c46b3a2abd38d6fecd389c97dfa7df54af77fdb9 ==22874==ERROR: Interceptors are not working. This may be because AddressSanitizer is loaded too late (e.g. via dlopen). Please launch the executable with: DYLD_INSERT_LIBRARIES=/Users/buildslave/jenkins/workspace/lldb-cmake-sanitized/host-compiler/lib/clang/10.0.0/lib/darwin/libclang_rt.asan_osx_dynamic.dylib "interceptors not installed" && 0 ******************** PASS: lldb-unit :: UnwindAssembly/x86/./UnwindAssemblyx86Tests/Testx86AssemblyInspectionEngine.TestSubESP (1695 of 1799) PASS: lldb-unit :: Process/minidump/./LLDBMinidumpTests/MinidumpParserTest.GetMemory (1696 of 1799) PASS: lldb-unit :: Utility/./UtilityTests/StringListTest.ShiftMove (1697 of 1799) PASS: lldb-shell :: SymbolFile/DWARF/debug-types-dwo-cross-reference.cpp (1698 of 1799) UNRESOLVED: lldb-api :: lang/cpp/nested-class-other-compilation-unit/TestNestedClassWithParentInAnotherCU.py (1699 of 1799) ******************** TEST 'lldb-api :: lang/cpp/nested-class-other-compilation-unit/TestNestedClassWithParentInAnotherCU.py' FAILED ******************** Unable to find 'RESULT: PASSED' in dotest output (exit code -6):

Hide Details

lldb version 10.0.99 (http://labmaster3.local/git/llvm-project.git revision 0e0dea82681a86a09ceed0afd321367a35bfa051) clang revision c46b3a2abd38d6fecd389c97dfa7df54af77fdb9 llvm revision c46b3a2abd38d6fecd389c97dfa7df54af77fdb9 ==22926==ERROR: Interceptors are not working. This may be because AddressSanitizer is loaded too late (e.g. via dlopen). Please launch the executable with: DYLD_INSERT_LIBRARIES=/Users/buildslave/jenkins/workspace/lldb-cmake-sanitized/host-compiler/lib/clang/10.0.0/lib/darwin/libclang_rt.asan_osx_dynamic.dylib "interceptors not installed" && 0 ******************** PASS: lldb-shell :: SymbolFile/Breakpad/stack-cfi-parsing.test (1700 of 1799) UNRESOLVED: lldb-api :: python_api/symbol-context/TestSymbolContext.py (1701 of 1799) ******************** TEST 'lldb-api :: python_api/symbol-context/TestSymbolContext.py' FAILED ******************** Unable to find 'RESULT: PASSED' in dotest output (exit code -6):

Hide Details

lldb version 10.0.99 (http://labmaster3.local/git/llvm-project.git revision 0e0dea82681a86a09ceed0afd321367a35bfa051) clang revision c46b3a2abd38d6fecd389c97dfa7df54af77fdb9 llvm revision c46b3a2abd38d6fecd389c97dfa7df54af77fdb9 ==22928==ERROR: Interceptors are not working. This may be because AddressSanitizer is loaded too late (e.g. via dlopen). Please launch the executable with: DYLD_INSERT_LIBRARIES=/Users/buildslave/jenkins/workspace/lldb-cmake-sanitized/host-compiler/lib/clang/10.0.0/lib/darwin/libclang_rt.asan_osx_dynamic.dylib "interceptors not installed" && 0 ******************** UNRESOLVED: lldb-api :: lang/objcxx/class-name-clash/TestNameClash.py (1702 of 1799) ******************** TEST 'lldb-api :: lang/objcxx/class-name-clash/TestNameClash.py' FAILED ******************** Unable to find 'RESULT: PASSED' in dotest output (exit code -6):

Hide Details

lldb version 10.0.99 (http://labmaster3.local/git/llvm-project.git revision 0e0dea82681a86a09ceed0afd321367a35bfa051) clang revision c46b3a2abd38d6fecd389c97dfa7df54af77fdb9 llvm revision c46b3a2abd38d6fecd389c97dfa7df54af77fdb9 ==22935==ERROR: Interceptors are not working. This may be because AddressSanitizer is loaded too late (e.g. via dlopen). Please launch the executable with: DYLD_INSERT_LIBRARIES=/Users/buildslave/jenkins/workspace/lldb-cmake-sanitized/host-compiler/lib/clang/10.0.0/lib/darwin/libclang_rt.asan_osx_dynamic.dylib "interceptors not installed" && 0 ******************** UNRESOLVED: lldb-api :: lang/objc/modules-auto-import/TestModulesAutoImport.py (1703 of 1799) ******************** TEST 'lldb-api :: lang/objc/modules-auto-import/TestModulesAutoImport.py' FAILED ******************** Unable to find 'RESULT: PASSED' in dotest output (exit code -6):

Hide Details

lldb version 10.0.99 (http://labmaster3.local/git/llvm-project.git revision 0e0dea82681a86a09ceed0afd321367a35bfa051) clang revision c46b3a2abd38d6fecd389c97dfa7df54af77fdb9 llvm revision c46b3a2abd38d6fecd389c97dfa7df54af77fdb9 ==22942==ERROR: Interceptors are not working. This may be because AddressSanitizer is loaded too late (e.g. via dlopen). Please launch the executable with: DYLD_INSERT_LIBRARIES=/Users/buildslave/jenkins/workspace/lldb-cmake-sanitized/host-compiler/lib/clang/10.0.0/lib/darwin/libclang_rt.asan_osx_dynamic.dylib "interceptors not installed" && 0 ******************** UNRESOLVED: lldb-api :: lang/c/stepping/TestStepAndBreakpoints.py (1704 of 1799) ******************** TEST 'lldb-api :: lang/c/stepping/TestStepAndBreakpoints.py' FAILED ******************** Unable to find 'RESULT: PASSED' in dotest output (exit code -6):

Hide Details

lldb version 10.0.99 (http://labmaster3.local/git/llvm-project.git revision 0e0dea82681a86a09ceed0afd321367a35bfa051) clang revision c46b3a2abd38d6fecd389c97dfa7df54af77fdb9 llvm revision c46b3a2abd38d6fecd389c97dfa7df54af77fdb9 ==22955==ERROR: Interceptors are not working. This may be because AddressSanitizer is loaded too late (e.g. via dlopen). Please launch the executable with: DYLD_INSERT_LIBRARIES=/Users/buildslave/jenkins/workspace/lldb-cmake-sanitized/host-compiler/lib/clang/10.0.0/lib/darwin/libclang_rt.asan_osx_dynamic.dylib "interceptors not installed" && 0 ******************** PASS: lldb-unit :: UnwindAssembly/x86/./UnwindAssemblyx86Tests/Testx86AssemblyInspectionEngine.TestPushR13 (1705 of 1799) PASS: lldb-unit :: Host/./HostTests/FileSystemTest.Readable (1706 of 1799) UNRESOLVED: lldb-api :: functionalities/target_var/TestTargetVar.py (1707 of 1799) ******************** TEST 'lldb-api :: functionalities/target_var/TestTargetVar.py' FAILED ******************** Unable to find 'RESULT: PASSED' in dotest output (exit code -6):

Hide Details

lldb version 10.0.99 (http://labmaster3.local/git/llvm-project.git revision 0e0dea82681a86a09ceed0afd321367a35bfa051) clang revision c46b3a2abd38d6fecd389c97dfa7df54af77fdb9 llvm revision c46b3a2abd38d6fecd389c97dfa7df54af77fdb9 ==22958==ERROR: Interceptors are not working. This may be because AddressSanitizer is loaded too late (e.g. via dlopen). Please launch the executable with: DYLD_INSERT_LIBRARIES=/Users/buildslave/jenkins/workspace/lldb-cmake-sanitized/host-compiler/lib/clang/10.0.0/lib/darwin/libclang_rt.asan_osx_dynamic.dylib "interceptors not installed" && 0 ******************** PASS: lldb-shell :: SymbolFile/Breakpad/line-table-missing-file.test (1708 of 1799) UNRESOLVED: lldb-api :: functionalities/unwind/standard/TestStandardUnwind.py (1709 of 1799) ******************** TEST 'lldb-api :: functionalities/unwind/standard/TestStandardUnwind.py' FAILED ******************** Unable to find 'RESULT: PASSED' in dotest output (exit code -6):

Hide Details

lldb version 10.0.99 (http://labmaster3.local/git/llvm-project.git revision 0e0dea82681a86a09ceed0afd321367a35bfa051) clang revision c46b3a2abd38d6fecd389c97dfa7df54af77fdb9 llvm revision c46b3a2abd38d6fecd389c97dfa7df54af77fdb9 ==22972==ERROR: Interceptors are not working. This may be because AddressSanitizer is loaded too late (e.g. via dlopen). Please launch the executable with: DYLD_INSERT_LIBRARIES=/Users/buildslave/jenkins/workspace/lldb-cmake-sanitized/host-compiler/lib/clang/10.0.0/lib/darwin/libclang_rt.asan_osx_dynamic.dylib "interceptors not installed" && 0 ******************** PASS: lldb-unit :: Utility/./UtilityTests/NameMatchesTest.EndsWith (1710 of 1799) PASS: lldb-unit :: SymbolFile/DWARF/./SymbolFileDWARFTests/SymbolFileDWARFTests.TestAbbrevOutOfOrder (1711 of 1799) UNRESOLVED: lldb-api :: functionalities/data-formatter/data-formatter-objc/TestDataFormatterObjCCF.py (1712 of 1799) ******************** TEST 'lldb-api :: functionalities/data-formatter/data-formatter-objc/TestDataFormatterObjCCF.py' FAILED ******************** Unable to find 'RESULT: PASSED' in dotest output (exit code -6):

Hide Details

lldb version 10.0.99 (http://labmaster3.local/git/llvm-project.git revision 0e0dea82681a86a09ceed0afd321367a35bfa051) clang revision c46b3a2abd38d6fecd389c97dfa7df54af77fdb9 llvm revision c46b3a2abd38d6fecd389c97dfa7df54af77fdb9 ==22987==ERROR: Interceptors are not working. This may be because AddressSanitizer is loaded too late (e.g. via dlopen). Please launch the executable with: DYLD_INSERT_LIBRARIES=/Users/buildslave/jenkins/workspace/lldb-cmake-sanitized/host-compiler/lib/clang/10.0.0/lib/darwin/libclang_rt.asan_osx_dynamic.dylib "interceptors not installed" && 0 ******************** UNRESOLVED: lldb-api :: python_api/class_members/TestSBTypeClassMembers.py (1713 of 1799) ******************** TEST 'lldb-api :: python_api/class_members/TestSBTypeClassMembers.py' FAILED ******************** Unable to find 'RESULT: PASSED' in dotest output (exit code -6):

Hide Details

lldb version 10.0.99 (http://labmaster3.local/git/llvm-project.git revision 0e0dea82681a86a09ceed0afd321367a35bfa051) clang revision c46b3a2abd38d6fecd389c97dfa7df54af77fdb9 llvm revision c46b3a2abd38d6fecd389c97dfa7df54af77fdb9 ==23003==ERROR: Interceptors are not working. This may be because AddressSanitizer is loaded too late (e.g. via dlopen). Please launch the executable with: DYLD_INSERT_LIBRARIES=/Users/buildslave/jenkins/workspace/lldb-cmake-sanitized/host-compiler/lib/clang/10.0.0/lib/darwin/libclang_rt.asan_osx_dynamic.dylib "interceptors not installed" && 0 ******************** PASS: lldb-unit :: Process/minidump/./LLDBMinidumpTests/MinidumpParserTest.GetThreadsAndGetThreadContext (1714 of 1799) UNRESOLVED: lldb-api :: functionalities/darwin_log/filter/exact_match/activity-chain/TestDarwinLogFilterMatchActivityChain.py (1715 of 1799) ******************** TEST 'lldb-api :: functionalities/darwin_log/filter/exact_match/activity-chain/TestDarwinLogFilterMatchActivityChain.py' FAILED ******************** Unable to find 'RESULT: PASSED' in dotest output (exit code -6):

Hide Details

lldb version 10.0.99 (http://labmaster3.local/git/llvm-project.git revision 0e0dea82681a86a09ceed0afd321367a35bfa051) clang revision c46b3a2abd38d6fecd389c97dfa7df54af77fdb9 llvm revision c46b3a2abd38d6fecd389c97dfa7df54af77fdb9 ==23014==ERROR: Interceptors are not working. This may be because AddressSanitizer is loaded too late (e.g. via dlopen). Please launch the executable with: DYLD_INSERT_LIBRARIES=/Users/buildslave/jenkins/workspace/lldb-cmake-sanitized/host-compiler/lib/clang/10.0.0/lib/darwin/libclang_rt.asan_osx_dynamic.dylib "interceptors not installed" && 0 ******************** PASS: lldb-unit :: Symbol/./SymbolTests/DWARFCallFrameInfoTest.Basic_dwarf4 (1716 of 1799) UNRESOLVED: lldb-api :: source-manager/TestSourceManager.py (1717 of 1799) ******************** TEST 'lldb-api :: source-manager/TestSourceManager.py' FAILED ******************** Unable to find 'RESULT: PASSED' in dotest output (exit code -6):

Hide Details

lldb version 10.0.99 (http://labmaster3.local/git/llvm-project.git revision 0e0dea82681a86a09ceed0afd321367a35bfa051) clang revision c46b3a2abd38d6fecd389c97dfa7df54af77fdb9 llvm revision c46b3a2abd38d6fecd389c97dfa7df54af77fdb9 ==23017==ERROR: Interceptors are not working. This may be because AddressSanitizer is loaded too late (e.g. via dlopen). Please launch the executable with: DYLD_INSERT_LIBRARIES=/Users/buildslave/jenkins/workspace/lldb-cmake-sanitized/host-compiler/lib/clang/10.0.0/lib/darwin/libclang_rt.asan_osx_dynamic.dylib "interceptors not installed" && 0 ******************** PASS: lldb-shell :: Settings/TestSettingsSet.test (1718 of 1799) PASS: lldb-unit :: Utility/./UtilityTests/BinaryStreamTest.PutULEB128One (1719 of 1799) UNRESOLVED: lldb-api :: commands/expression/import-std-module/weak_ptr-dbg-info-content/TestDbgInfoContentWeakPtr.py (1720 of 1799) ******************** TEST 'lldb-api :: commands/expression/import-std-module/weak_ptr-dbg-info-content/TestDbgInfoContentWeakPtr.py' FAILED ******************** Unable to find 'RESULT: PASSED' in dotest output (exit code -6):

Hide Details

lldb version 10.0.99 (http://labmaster3.local/git/llvm-project.git revision 0e0dea82681a86a09ceed0afd321367a35bfa051) clang revision c46b3a2abd38d6fecd389c97dfa7df54af77fdb9 llvm revision c46b3a2abd38d6fecd389c97dfa7df54af77fdb9 ==23022==ERROR: Interceptors are not working. This may be because AddressSanitizer is loaded too late (e.g. via dlopen). Please launch the executable with: DYLD_INSERT_LIBRARIES=/Users/buildslave/jenkins/workspace/lldb-cmake-sanitized/host-compiler/lib/clang/10.0.0/lib/darwin/libclang_rt.asan_osx_dynamic.dylib "interceptors not installed" && 0 ******************** UNRESOLVED: lldb-api :: lang/cpp/chained-calls/TestCppChainedCalls.py (1721 of 1799) ******************** TEST 'lldb-api :: lang/cpp/chained-calls/TestCppChainedCalls.py' FAILED ******************** Unable to find 'RESULT: PASSED' in dotest output (exit code -6):

Hide Details

lldb version 10.0.99 (http://labmaster3.local/git/llvm-project.git revision 0e0dea82681a86a09ceed0afd321367a35bfa051) clang revision c46b3a2abd38d6fecd389c97dfa7df54af77fdb9 llvm revision c46b3a2abd38d6fecd389c97dfa7df54af77fdb9 ==23037==ERROR: Interceptors are not working. This may be because AddressSanitizer is loaded too late (e.g. via dlopen). Please launch the executable with: DYLD_INSERT_LIBRARIES=/Users/buildslave/jenkins/workspace/lldb-cmake-sanitized/host-compiler/lib/clang/10.0.0/lib/darwin/libclang_rt.asan_osx_dynamic.dylib "interceptors not installed" && 0 ******************** PASS: lldb-unit :: Utility/./UtilityTests/StringExtractorTest.GetU64LittleEndian (1722 of 1799) PASS: lldb-unit :: Utility/./UtilityTests/RangeTest.ContainsEndInclusiveInvalid (1723 of 1799) PASS: lldb-unit :: SymbolFile/DWARF/./SymbolFileDWARFTests/SymbolFileDWARFTests.TestAbbrevValidAttrNullForm (1724 of 1799) UNRESOLVED: lldb-api :: functionalities/darwin_log/filter/regex/subsystem/TestDarwinLogFilterRegexSubsystem.py (1725 of 1799) ******************** TEST 'lldb-api :: functionalities/darwin_log/filter/regex/subsystem/TestDarwinLogFilterRegexSubsystem.py' FAILED ******************** Unable to find 'RESULT: PASSED' in dotest output (exit code -6):

Hide Details

lldb version 10.0.99 (http://labmaster3.local/git/llvm-project.git revision 0e0dea82681a86a09ceed0afd321367a35bfa051) clang revision c46b3a2abd38d6fecd389c97dfa7df54af77fdb9 llvm revision c46b3a2abd38d6fecd389c97dfa7df54af77fdb9 ==23059==ERROR: Interceptors are not working. This may be because AddressSanitizer is loaded too late (e.g. via dlopen). Please launch the executable with: DYLD_INSERT_LIBRARIES=/Users/buildslave/jenkins/workspace/lldb-cmake-sanitized/host-compiler/lib/clang/10.0.0/lib/darwin/libclang_rt.asan_osx_dynamic.dylib "interceptors not installed" && 0 ******************** XFAIL: lldb-shell :: Unwind/prefer-debug-over-eh-frame.test (1726 of 1799) PASS: lldb-unit :: Expression/./ExpressionTests/CppModuleConfigurationTest.MissingUsrInclude (1727 of 1799) PASS: lldb-unit :: UnwindAssembly/x86/./UnwindAssemblyx86Tests/Testx86AssemblyInspectionEngine.TestDisassemblyMidFunctionEpilogues (1728 of 1799) UNRESOLVED: lldb-api :: lang/c/local_types/TestUseClosestType.py (1729 of 1799) ******************** TEST 'lldb-api :: lang/c/local_types/TestUseClosestType.py' FAILED ******************** Unable to find 'RESULT: PASSED' in dotest output (exit code -6):

Hide Details

lldb version 10.0.99 (http://labmaster3.local/git/llvm-project.git revision 0e0dea82681a86a09ceed0afd321367a35bfa051) clang revision c46b3a2abd38d6fecd389c97dfa7df54af77fdb9 llvm revision c46b3a2abd38d6fecd389c97dfa7df54af77fdb9 ==23074==ERROR: Interceptors are not working. This may be because AddressSanitizer is loaded too late (e.g. via dlopen). Please launch the executable with: DYLD_INSERT_LIBRARIES=/Users/buildslave/jenkins/workspace/lldb-cmake-sanitized/host-compiler/lib/clang/10.0.0/lib/darwin/libclang_rt.asan_osx_dynamic.dylib "interceptors not installed" && 0 ******************** UNRESOLVED: lldb-api :: macosx/universal/TestUniversal.py (1730 of 1799) ******************** TEST 'lldb-api :: macosx/universal/TestUniversal.py' FAILED ******************** Unable to find 'RESULT: PASSED' in dotest output (exit code -6):

Hide Details

lldb version 10.0.99 (http://labmaster3.local/git/llvm-project.git revision 0e0dea82681a86a09ceed0afd321367a35bfa051) clang revision c46b3a2abd38d6fecd389c97dfa7df54af77fdb9 llvm revision c46b3a2abd38d6fecd389c97dfa7df54af77fdb9 ==23062==ERROR: Interceptors are not working. This may be because AddressSanitizer is loaded too late (e.g. via dlopen). Please launch the executable with: DYLD_INSERT_LIBRARIES=/Users/buildslave/jenkins/workspace/lldb-cmake-sanitized/host-compiler/lib/clang/10.0.0/lib/darwin/libclang_rt.asan_osx_dynamic.dylib "interceptors not installed" && 0 ******************** UNRESOLVED: lldb-api :: functionalities/data-formatter/data-formatter-stl/libcxx/queue/TestDataFormatterLibcxxQueue.py (1731 of 1799) ******************** TEST 'lldb-api :: functionalities/data-formatter/data-formatter-stl/libcxx/queue/TestDataFormatterLibcxxQueue.py' FAILED ******************** Unable to find 'RESULT: PASSED' in dotest output (exit code -6):

Hide Details

lldb version 10.0.99 (http://labmaster3.local/git/llvm-project.git revision 0e0dea82681a86a09ceed0afd321367a35bfa051) clang revision c46b3a2abd38d6fecd389c97dfa7df54af77fdb9 llvm revision c46b3a2abd38d6fecd389c97dfa7df54af77fdb9 ==23075==ERROR: Interceptors are not working. This may be because AddressSanitizer is loaded too late (e.g. via dlopen). Please launch the executable with: DYLD_INSERT_LIBRARIES=/Users/buildslave/jenkins/workspace/lldb-cmake-sanitized/host-compiler/lib/clang/10.0.0/lib/darwin/libclang_rt.asan_osx_dynamic.dylib "interceptors not installed" && 0 ******************** UNRESOLVED: lldb-api :: commands/frame/diagnose/inheritance/TestDiagnoseInheritance.py (1732 of 1799) ******************** TEST 'lldb-api :: commands/frame/diagnose/inheritance/TestDiagnoseInheritance.py' FAILED ******************** Unable to find 'RESULT: PASSED' in dotest output (exit code -6):

Hide Details

lldb version 10.0.99 (http://labmaster3.local/git/llvm-project.git revision 0e0dea82681a86a09ceed0afd321367a35bfa051) clang revision c46b3a2abd38d6fecd389c97dfa7df54af77fdb9 llvm revision c46b3a2abd38d6fecd389c97dfa7df54af77fdb9 ==23079==ERROR: Interceptors are not working. This may be because AddressSanitizer is loaded too late (e.g. via dlopen). Please launch the executable with: DYLD_INSERT_LIBRARIES=/Users/buildslave/jenkins/workspace/lldb-cmake-sanitized/host-compiler/lib/clang/10.0.0/lib/darwin/libclang_rt.asan_osx_dynamic.dylib "interceptors not installed" && 0 ******************** PASS: lldb-unit :: Utility/./UtilityTests/BinaryStreamTest.PutULEB128ThreeBytes (1733 of 1799) PASS: lldb-unit :: Utility/./UtilityTests/StringListTest.AppendStringStdString (1734 of 1799) PASS: lldb-unit :: SymbolFile/NativePDB/./SymbolFileNativePDBTests/PDBFPOProgramToDWARFExpressionTests.DependencyChain (1735 of 1799) UNRESOLVED: lldb-api :: commands/watchpoints/watchpoint_disable/TestWatchpointDisable.py (1736 of 1799) ******************** TEST 'lldb-api :: commands/watchpoints/watchpoint_disable/TestWatchpointDisable.py' FAILED ******************** Unable to find 'RESULT: PASSED' in dotest output (exit code -6):

Hide Details

lldb version 10.0.99 (http://labmaster3.local/git/llvm-project.git revision 0e0dea82681a86a09ceed0afd321367a35bfa051) clang revision c46b3a2abd38d6fecd389c97dfa7df54af77fdb9 llvm revision c46b3a2abd38d6fecd389c97dfa7df54af77fdb9 ==23094==ERROR: Interceptors are not working. This may be because AddressSanitizer is loaded too late (e.g. via dlopen). Please launch the executable with: DYLD_INSERT_LIBRARIES=/Users/buildslave/jenkins/workspace/lldb-cmake-sanitized/host-compiler/lib/clang/10.0.0/lib/darwin/libclang_rt.asan_osx_dynamic.dylib "interceptors not installed" && 0 ******************** UNRESOLVED: lldb-api :: commands/expression/import-std-module/deque-dbg-info-content/TestDbgInfoContentDeque.py (1737 of 1799) ******************** TEST 'lldb-api :: commands/expression/import-std-module/deque-dbg-info-content/TestDbgInfoContentDeque.py' FAILED ******************** Unable to find 'RESULT: PASSED' in dotest output (exit code -6):

Hide Details

lldb version 10.0.99 (http://labmaster3.local/git/llvm-project.git revision 0e0dea82681a86a09ceed0afd321367a35bfa051) clang revision c46b3a2abd38d6fecd389c97dfa7df54af77fdb9 llvm revision c46b3a2abd38d6fecd389c97dfa7df54af77fdb9 ==23100==ERROR: Interceptors are not working. This may be because AddressSanitizer is loaded too late (e.g. via dlopen). Please launch the executable with: DYLD_INSERT_LIBRARIES=/Users/buildslave/jenkins/workspace/lldb-cmake-sanitized/host-compiler/lib/clang/10.0.0/lib/darwin/libclang_rt.asan_osx_dynamic.dylib "interceptors not installed" && 0 ******************** PASS: lldb-unit :: Utility/./UtilityTests/StringListTest.CopyListEmpty (1738 of 1799) PASS: lldb-shell :: ObjectFile/ELF/section-overlap.yaml (1739 of 1799) UNRESOLVED: lldb-api :: lang/objc/objc-baseclass-sbtype/TestObjCBaseClassSBType.py (1740 of 1799) ******************** TEST 'lldb-api :: lang/objc/objc-baseclass-sbtype/TestObjCBaseClassSBType.py' FAILED ******************** Unable to find 'RESULT: PASSED' in dotest output (exit code -6):

Hide Details

lldb version 10.0.99 (http://labmaster3.local/git/llvm-project.git revision 0e0dea82681a86a09ceed0afd321367a35bfa051) clang revision c46b3a2abd38d6fecd389c97dfa7df54af77fdb9 llvm revision c46b3a2abd38d6fecd389c97dfa7df54af77fdb9 ==23143==ERROR: Interceptors are not working. This may be because AddressSanitizer is loaded too late (e.g. via dlopen). Please launch the executable with: DYLD_INSERT_LIBRARIES=/Users/buildslave/jenkins/workspace/lldb-cmake-sanitized/host-compiler/lib/clang/10.0.0/lib/darwin/libclang_rt.asan_osx_dynamic.dylib "interceptors not installed" && 0 ******************** PASS: lldb-unit :: Expression/./ExpressionTests/DiagnosticManagerTest.GetStringSeverityLabels (1741 of 1799) PASS: lldb-unit :: Symbol/./SymbolTests/Type.GetTypeScopeAndBasename (1742 of 1799) UNRESOLVED: lldb-api :: commands/expression/import-std-module/empty-module/TestEmptyStdModule.py (1743 of 1799) ******************** TEST 'lldb-api :: commands/expression/import-std-module/empty-module/TestEmptyStdModule.py' FAILED ******************** Unable to find 'RESULT: PASSED' in dotest output (exit code -6):

Hide Details

lldb version 10.0.99 (http://labmaster3.local/git/llvm-project.git revision 0e0dea82681a86a09ceed0afd321367a35bfa051) clang revision c46b3a2abd38d6fecd389c97dfa7df54af77fdb9 llvm revision c46b3a2abd38d6fecd389c97dfa7df54af77fdb9 ==23151==ERROR: Interceptors are not working. This may be because AddressSanitizer is loaded too late (e.g. via dlopen). Please launch the executable with: DYLD_INSERT_LIBRARIES=/Users/buildslave/jenkins/workspace/lldb-cmake-sanitized/host-compiler/lib/clang/10.0.0/lib/darwin/libclang_rt.asan_osx_dynamic.dylib "interceptors not installed" && 0 ******************** PASS: lldb-unit :: Utility/./UtilityTests/StringExtractorTest.GetU32LittleEndian (1744 of 1799) PASS: lldb-unit :: Utility/./UtilityTests/StreamTest.PutHex16ByteOrderLittle (1745 of 1799) UNRESOLVED: lldb-api :: lang/cpp/unicode-literals/TestUnicodeLiterals.py (1746 of 1799) ******************** TEST 'lldb-api :: lang/cpp/unicode-literals/TestUnicodeLiterals.py' FAILED ******************** Unable to find 'RESULT: PASSED' in dotest output (exit code -6):

Hide Details

lldb version 10.0.99 (http://labmaster3.local/git/llvm-project.git revision 0e0dea82681a86a09ceed0afd321367a35bfa051) clang revision c46b3a2abd38d6fecd389c97dfa7df54af77fdb9 llvm revision c46b3a2abd38d6fecd389c97dfa7df54af77fdb9 ==23171==ERROR: Interceptors are not working. This may be because AddressSanitizer is loaded too late (e.g. via dlopen). Please launch the executable with: DYLD_INSERT_LIBRARIES=/Users/buildslave/jenkins/workspace/lldb-cmake-sanitized/host-compiler/lib/clang/10.0.0/lib/darwin/libclang_rt.asan_osx_dynamic.dylib "interceptors not installed" && 0 ******************** UNRESOLVED: lldb-api :: functionalities/step-avoids-no-debug/TestStepNoDebug.py (1747 of 1799) ******************** TEST 'lldb-api :: functionalities/step-avoids-no-debug/TestStepNoDebug.py' FAILED ******************** Unable to find 'RESULT: PASSED' in dotest output (exit code -6):

Hide Details

lldb version 10.0.99 (http://labmaster3.local/git/llvm-project.git revision 0e0dea82681a86a09ceed0afd321367a35bfa051) clang revision c46b3a2abd38d6fecd389c97dfa7df54af77fdb9 llvm revision c46b3a2abd38d6fecd389c97dfa7df54af77fdb9 ==23176==ERROR: Interceptors are not working. This may be because AddressSanitizer is loaded too late (e.g. via dlopen). Please launch the executable with: DYLD_INSERT_LIBRARIES=/Users/buildslave/jenkins/workspace/lldb-cmake-sanitized/host-compiler/lib/clang/10.0.0/lib/darwin/libclang_rt.asan_osx_dynamic.dylib "interceptors not installed" && 0 ******************** UNRESOLVED: lldb-api :: benchmarks/frame_variable/TestFrameVariableResponse.py (1748 of 1799) ******************** TEST 'lldb-api :: benchmarks/frame_variable/TestFrameVariableResponse.py' FAILED ******************** Unable to find 'RESULT: PASSED' in dotest output (exit code -6):

Hide Details

lldb version 10.0.99 (http://labmaster3.local/git/llvm-project.git revision 0e0dea82681a86a09ceed0afd321367a35bfa051) clang revision c46b3a2abd38d6fecd389c97dfa7df54af77fdb9 llvm revision c46b3a2abd38d6fecd389c97dfa7df54af77fdb9 ==23167==ERROR: Interceptors are not working. This may be because AddressSanitizer is loaded too late (e.g. via dlopen). Please launch the executable with: DYLD_INSERT_LIBRARIES=/Users/buildslave/jenkins/workspace/lldb-cmake-sanitized/host-compiler/lib/clang/10.0.0/lib/darwin/libclang_rt.asan_osx_dynamic.dylib "interceptors not installed" && 0 ******************** UNRESOLVED: lldb-api :: commands/expression/macros/TestMacros.py (1749 of 1799) ******************** TEST 'lldb-api :: commands/expression/macros/TestMacros.py' FAILED ******************** Unable to find 'RESULT: PASSED' in dotest output (exit code -6):

Hide Details

lldb version 10.0.99 (http://labmaster3.local/git/llvm-project.git revision 0e0dea82681a86a09ceed0afd321367a35bfa051) clang revision c46b3a2abd38d6fecd389c97dfa7df54af77fdb9 llvm revision c46b3a2abd38d6fecd389c97dfa7df54af77fdb9 ==23185==ERROR: Interceptors are not working. This may be because AddressSanitizer is loaded too late (e.g. via dlopen). Please launch the executable with: DYLD_INSERT_LIBRARIES=/Users/buildslave/jenkins/workspace/lldb-cmake-sanitized/host-compiler/lib/clang/10.0.0/lib/darwin/libclang_rt.asan_osx_dynamic.dylib "interceptors not installed" && 0 ******************** PASS: lldb-shell :: ObjectFile/ELF/short-build-id.yaml (1750 of 1799) UNRESOLVED: lldb-api :: functionalities/data-formatter/data-formatter-stl/libcxx/function/TestLibCxxFunction.py (1751 of 1799) ******************** TEST 'lldb-api :: functionalities/data-formatter/data-formatter-stl/libcxx/function/TestLibCxxFunction.py' FAILED ******************** Unable to find 'RESULT: PASSED' in dotest output (exit code -6):

Hide Details

lldb version 10.0.99 (http://labmaster3.local/git/llvm-project.git revision 0e0dea82681a86a09ceed0afd321367a35bfa051) clang revision c46b3a2abd38d6fecd389c97dfa7df54af77fdb9 llvm revision c46b3a2abd38d6fecd389c97dfa7df54af77fdb9 ==23190==ERROR: Interceptors are not working. This may be because AddressSanitizer is loaded too late (e.g. via dlopen). Please launch the executable with: DYLD_INSERT_LIBRARIES=/Users/buildslave/jenkins/workspace/lldb-cmake-sanitized/host-compiler/lib/clang/10.0.0/lib/darwin/libclang_rt.asan_osx_dynamic.dylib "interceptors not installed" && 0 ******************** UNRESOLVED: lldb-api :: lang/objc/exceptions/TestObjCExceptions.py (1752 of 1799) ******************** TEST 'lldb-api :: lang/objc/exceptions/TestObjCExceptions.py' FAILED ******************** Unable to find 'RESULT: PASSED' in dotest output (exit code -6):

Hide Details

lldb version 10.0.99 (http://labmaster3.local/git/llvm-project.git revision 0e0dea82681a86a09ceed0afd321367a35bfa051) clang revision c46b3a2abd38d6fecd389c97dfa7df54af77fdb9 llvm revision c46b3a2abd38d6fecd389c97dfa7df54af77fdb9 ==23193==ERROR: Interceptors are not working. This may be because AddressSanitizer is loaded too late (e.g. via dlopen). Please launch the executable with: DYLD_INSERT_LIBRARIES=/Users/buildslave/jenkins/workspace/lldb-cmake-sanitized/host-compiler/lib/clang/10.0.0/lib/darwin/libclang_rt.asan_osx_dynamic.dylib "interceptors not installed" && 0 ******************** PASS: lldb-unit :: ScriptInterpreter/Python/./ScriptInterpreterPythonTests/PythonDataObjectsTest.TestObjectAttributes (1753 of 1799) PASS: lldb-unit :: Utility/./UtilityTests/ArgsTest.TestQuotedTrailingBackslash (1754 of 1799) PASS: lldb-unit :: Language/Highlighting/./HighlighterTests/HighlighterTest.HighlighterSelectionPath (1755 of 1799) PASS: lldb-shell :: SymbolFile/NativePDB/nested-types.cpp (1756 of 1799) UNRESOLVED: lldb-api :: functionalities/tsan/thread_numbers/TestTsanThreadNumbers.py (1757 of 1799) ******************** TEST 'lldb-api :: functionalities/tsan/thread_numbers/TestTsanThreadNumbers.py' FAILED ******************** Unable to find 'RESULT: PASSED' in dotest output (exit code -6):

Hide Details

lldb version 10.0.99 (http://labmaster3.local/git/llvm-project.git revision 0e0dea82681a86a09ceed0afd321367a35bfa051) clang revision c46b3a2abd38d6fecd389c97dfa7df54af77fdb9 llvm revision c46b3a2abd38d6fecd389c97dfa7df54af77fdb9 ==23228==ERROR: Interceptors are not working. This may be because AddressSanitizer is loaded too late (e.g. via dlopen). Please launch the executable with: DYLD_INSERT_LIBRARIES=/Users/buildslave/jenkins/workspace/lldb-cmake-sanitized/host-compiler/lib/clang/10.0.0/lib/darwin/libclang_rt.asan_osx_dynamic.dylib "interceptors not installed" && 0 ******************** PASS: lldb-unit :: Utility/./UtilityTests/FileSpecTest.FormatFileSpec (1758 of 1799) UNRESOLVED: lldb-api :: macosx/DBGSourcePathRemapping/TestDSYMSourcePathRemapping.py (1759 of 1799) ******************** TEST 'lldb-api :: macosx/DBGSourcePathRemapping/TestDSYMSourcePathRemapping.py' FAILED ******************** Unable to find 'RESULT: PASSED' in dotest output (exit code -6):

Hide Details

lldb version 10.0.99 (http://labmaster3.local/git/llvm-project.git revision 0e0dea82681a86a09ceed0afd321367a35bfa051) clang revision c46b3a2abd38d6fecd389c97dfa7df54af77fdb9 llvm revision c46b3a2abd38d6fecd389c97dfa7df54af77fdb9 ==23236==ERROR: Interceptors are not working. This may be because AddressSanitizer is loaded too late (e.g. via dlopen). Please launch the executable with: DYLD_INSERT_LIBRARIES=/Users/buildslave/jenkins/workspace/lldb-cmake-sanitized/host-compiler/lib/clang/10.0.0/lib/darwin/libclang_rt.asan_osx_dynamic.dylib "interceptors not installed" && 0 ******************** PASS: lldb-unit :: Utility/./UtilityTests/FileSpecTest.EqualSeparator (1760 of 1799) PASS: lldb-unit :: Utility/./UtilityTests/UriParserTest.MinimalPortPath (1761 of 1799) PASS: lldb-shell :: Reproducer/TestDump.test (1762 of 1799) UNRESOLVED: lldb-api :: functionalities/data-formatter/synthupdate/TestSyntheticFilterRecompute.py (1763 of 1799) ******************** TEST 'lldb-api :: functionalities/data-formatter/synthupdate/TestSyntheticFilterRecompute.py' FAILED ******************** Unable to find 'RESULT: PASSED' in dotest output (exit code -6):

Hide Details

lldb version 10.0.99 (http://labmaster3.local/git/llvm-project.git revision 0e0dea82681a86a09ceed0afd321367a35bfa051) clang revision c46b3a2abd38d6fecd389c97dfa7df54af77fdb9 llvm revision c46b3a2abd38d6fecd389c97dfa7df54af77fdb9 ==23250==ERROR: Interceptors are not working. This may be because AddressSanitizer is loaded too late (e.g. via dlopen). Please launch the executable with: DYLD_INSERT_LIBRARIES=/Users/buildslave/jenkins/workspace/lldb-cmake-sanitized/host-compiler/lib/clang/10.0.0/lib/darwin/libclang_rt.asan_osx_dynamic.dylib "interceptors not installed" && 0 ******************** UNRESOLVED: lldb-api :: commands/expression/import-std-module/forward_list-dbg-info-content/TestDbgInfoContentForwardList.py (1764 of 1799) ******************** TEST 'lldb-api :: commands/expression/import-std-module/forward_list-dbg-info-content/TestDbgInfoContentForwardList.py' FAILED ******************** Unable to find 'RESULT: PASSED' in dotest output (exit code -6):

Hide Details

lldb version 10.0.99 (http://labmaster3.local/git/llvm-project.git revision 0e0dea82681a86a09ceed0afd321367a35bfa051) clang revision c46b3a2abd38d6fecd389c97dfa7df54af77fdb9 llvm revision c46b3a2abd38d6fecd389c97dfa7df54af77fdb9 ==23255==ERROR: Interceptors are not working. This may be because AddressSanitizer is loaded too late (e.g. via dlopen). Please launch the executable with: DYLD_INSERT_LIBRARIES=/Users/buildslave/jenkins/workspace/lldb-cmake-sanitized/host-compiler/lib/clang/10.0.0/lib/darwin/libclang_rt.asan_osx_dynamic.dylib "interceptors not installed" && 0 ******************** PASS: lldb-unit :: Host/./HostTests/FileSystemTest.GetByteSize (1765 of 1799) PASS: lldb-shell :: ObjectFile/ELF/netbsd-exec-8.99.30-amd64.yaml (1766 of 1799) PASS: lldb-unit :: Host/./HostTests/MainLoopTest.DetectsEOF (1767 of 1799) PASS: lldb-unit :: Symbol/./SymbolTests/TestClangASTContext.TestRemoveFastQualifiers (1768 of 1799) PASS: lldb-unit :: Utility/./UtilityTests/StringListTest.RemoveBlankLines (1769 of 1799) UNRESOLVED: lldb-api :: lang/cpp/namespace/TestNamespaceLookup.py (1770 of 1799) ******************** TEST 'lldb-api :: lang/cpp/namespace/TestNamespaceLookup.py' FAILED ******************** Unable to find 'RESULT: PASSED' in dotest output (exit code -6):

Hide Details

lldb version 10.0.99 (http://labmaster3.local/git/llvm-project.git revision 0e0dea82681a86a09ceed0afd321367a35bfa051) clang revision c46b3a2abd38d6fecd389c97dfa7df54af77fdb9 llvm revision c46b3a2abd38d6fecd389c97dfa7df54af77fdb9 ==23290==ERROR: Interceptors are not working. This may be because AddressSanitizer is loaded too late (e.g. via dlopen). Please launch the executable with: DYLD_INSERT_LIBRARIES=/Users/buildslave/jenkins/workspace/lldb-cmake-sanitized/host-compiler/lib/clang/10.0.0/lib/darwin/libclang_rt.asan_osx_dynamic.dylib "interceptors not installed" && 0 ******************** PASS: lldb-unit :: Utility/./UtilityTests/StringExtractorTest.DecodeHexU8_InvalidHex (1771 of 1799) UNRESOLVED: lldb-api :: functionalities/tail_call_frames/sbapi_support/TestTailCallFrameSBAPI.py (1772 of 1799) ******************** TEST 'lldb-api :: functionalities/tail_call_frames/sbapi_support/TestTailCallFrameSBAPI.py' FAILED ******************** Unable to find 'RESULT: PASSED' in dotest output (exit code -6):

Hide Details

lldb version 10.0.99 (http://labmaster3.local/git/llvm-project.git revision 0e0dea82681a86a09ceed0afd321367a35bfa051) clang revision c46b3a2abd38d6fecd389c97dfa7df54af77fdb9 llvm revision c46b3a2abd38d6fecd389c97dfa7df54af77fdb9 ==23283==ERROR: Interceptors are not working. This may be because AddressSanitizer is loaded too late (e.g. via dlopen). Please launch the executable with: DYLD_INSERT_LIBRARIES=/Users/buildslave/jenkins/workspace/lldb-cmake-sanitized/host-compiler/lib/clang/10.0.0/lib/darwin/libclang_rt.asan_osx_dynamic.dylib "interceptors not installed" && 0 ******************** PASS: lldb-shell :: Commands/CommandScriptImmediateOutput/CommandScriptImmediateOutputFile.test (1773 of 1799) PASS: lldb-unit :: Utility/./UtilityTests/OptionsWithRawTest.WhitespaceInput (1774 of 1799) PASS: lldb-unit :: Utility/./UtilityTests/UUIDTest.Validity (1775 of 1799) UNRESOLVED: lldb-api :: lang/c/unions/TestUnionMembers.py (1776 of 1799) ******************** TEST 'lldb-api :: lang/c/unions/TestUnionMembers.py' FAILED ******************** Unable to find 'RESULT: PASSED' in dotest output (exit code -6):

Hide Details

lldb version 10.0.99 (http://labmaster3.local/git/llvm-project.git revision 0e0dea82681a86a09ceed0afd321367a35bfa051) clang revision c46b3a2abd38d6fecd389c97dfa7df54af77fdb9 llvm revision c46b3a2abd38d6fecd389c97dfa7df54af77fdb9 ==23292==ERROR: Interceptors are not working. This may be because AddressSanitizer is loaded too late (e.g. via dlopen). Please launch the executable with: DYLD_INSERT_LIBRARIES=/Users/buildslave/jenkins/workspace/lldb-cmake-sanitized/host-compiler/lib/clang/10.0.0/lib/darwin/libclang_rt.asan_osx_dynamic.dylib "interceptors not installed" && 0 ******************** UNRESOLVED: lldb-api :: lang/cpp/namespace_definitions/TestNamespaceDefinitions.py (1777 of 1799) ******************** TEST 'lldb-api :: lang/cpp/namespace_definitions/TestNamespaceDefinitions.py' FAILED ******************** Unable to find 'RESULT: PASSED' in dotest output (exit code -6):

Hide Details

lldb version 10.0.99 (http://labmaster3.local/git/llvm-project.git revision 0e0dea82681a86a09ceed0afd321367a35bfa051) clang revision c46b3a2abd38d6fecd389c97dfa7df54af77fdb9 llvm revision c46b3a2abd38d6fecd389c97dfa7df54af77fdb9 ==23309==ERROR: Interceptors are not working. This may be because AddressSanitizer is loaded too late (e.g. via dlopen). Please launch the executable with: DYLD_INSERT_LIBRARIES=/Users/buildslave/jenkins/workspace/lldb-cmake-sanitized/host-compiler/lib/clang/10.0.0/lib/darwin/libclang_rt.asan_osx_dynamic.dylib "interceptors not installed" && 0 ******************** PASS: lldb-unit :: Utility/./UtilityTests/AnsiTerminal.AtEnd (1778 of 1799) UNRESOLVED: lldb-api :: lang/cpp/gmodules-templates/TestGModules.py (1779 of 1799) ******************** TEST 'lldb-api :: lang/cpp/gmodules-templates/TestGModules.py' FAILED ******************** Unable to find 'RESULT: PASSED' in dotest output (exit code -6):

Hide Details

lldb version 10.0.99 (http://labmaster3.local/git/llvm-project.git revision 0e0dea82681a86a09ceed0afd321367a35bfa051) clang revision c46b3a2abd38d6fecd389c97dfa7df54af77fdb9 llvm revision c46b3a2abd38d6fecd389c97dfa7df54af77fdb9 ==23322==ERROR: Interceptors are not working. This may be because AddressSanitizer is loaded too late (e.g. via dlopen). Please launch the executable with: DYLD_INSERT_LIBRARIES=/Users/buildslave/jenkins/workspace/lldb-cmake-sanitized/host-compiler/lib/clang/10.0.0/lib/darwin/libclang_rt.asan_osx_dynamic.dylib "interceptors not installed" && 0 ******************** UNSUPPORTED: lldb-shell :: Register/x86-64-ymm16-write.test (1780 of 1799) PASS: lldb-shell :: SymbolFile/DWARF/dwarf5_locations.s (1781 of 1799) UNRESOLVED: lldb-api :: functionalities/thread/concurrent_events/TestConcurrentTwoBreakpointsOneDelaySignal.py (1782 of 1799) ******************** TEST 'lldb-api :: functionalities/thread/concurrent_events/TestConcurrentTwoBreakpointsOneDelaySignal.py' FAILED ******************** Unable to find 'RESULT: PASSED' in dotest output (exit code -6):

Hide Details

lldb version 10.0.99 (http://labmaster3.local/git/llvm-project.git revision 0e0dea82681a86a09ceed0afd321367a35bfa051) clang revision c46b3a2abd38d6fecd389c97dfa7df54af77fdb9 llvm revision c46b3a2abd38d6fecd389c97dfa7df54af77fdb9 ==23337==ERROR: Interceptors are not working. This may be because AddressSanitizer is loaded too late (e.g. via dlopen). Please launch the executable with: DYLD_INSERT_LIBRARIES=/Users/buildslave/jenkins/workspace/lldb-cmake-sanitized/host-compiler/lib/clang/10.0.0/lib/darwin/libclang_rt.asan_osx_dynamic.dylib "interceptors not installed" && 0 ******************** PASS: lldb-unit :: Language/Highlighting/./HighlighterTests/HighlighterTest.ClangBraces (1783 of 1799) UNRESOLVED: lldb-api :: lang/objc/objc-struct-argument/TestObjCStructArgument.py (1784 of 1799) ******************** TEST 'lldb-api :: lang/objc/objc-struct-argument/TestObjCStructArgument.py' FAILED ******************** Unable to find 'RESULT: PASSED' in dotest output (exit code -6):

Hide Details

lldb version 10.0.99 (http://labmaster3.local/git/llvm-project.git revision 0e0dea82681a86a09ceed0afd321367a35bfa051) clang revision c46b3a2abd38d6fecd389c97dfa7df54af77fdb9 llvm revision c46b3a2abd38d6fecd389c97dfa7df54af77fdb9 ==23343==ERROR: Interceptors are not working. This may be because AddressSanitizer is loaded too late (e.g. via dlopen). Please launch the executable with: DYLD_INSERT_LIBRARIES=/Users/buildslave/jenkins/workspace/lldb-cmake-sanitized/host-compiler/lib/clang/10.0.0/lib/darwin/libclang_rt.asan_osx_dynamic.dylib "interceptors not installed" && 0 ******************** PASS: lldb-shell :: ObjectFile/ELF/PT_LOAD-empty.yaml (1785 of 1799) PASS: lldb-unit :: Utility/./UtilityTests/StringExtractorTest.GetNameColonValueContainsColon (1786 of 1799) PASS: lldb-unit :: Utility/./UtilityTests/StreamTest.PutBytesAsRawHex8ToMixedEndian (1787 of 1799) PASS: lldb-unit :: Utility/./UtilityTests/StringExtractorTest.InitMisc (1788 of 1799) UNRESOLVED: lldb-api :: lang/c/shared_lib/TestSharedLib.py (1789 of 1799) ******************** TEST 'lldb-api :: lang/c/shared_lib/TestSharedLib.py' FAILED ******************** Unable to find 'RESULT: PASSED' in dotest output (exit code -6):

Hide Details

lldb version 10.0.99 (http://labmaster3.local/git/llvm-project.git revision 0e0dea82681a86a09ceed0afd321367a35bfa051) clang revision c46b3a2abd38d6fecd389c97dfa7df54af77fdb9 llvm revision c46b3a2abd38d6fecd389c97dfa7df54af77fdb9 ==23362==ERROR: Interceptors are not working. This may be because AddressSanitizer is loaded too late (e.g. via dlopen). Please launch the executable with: DYLD_INSERT_LIBRARIES=/Users/buildslave/jenkins/workspace/lldb-cmake-sanitized/host-compiler/lib/clang/10.0.0/lib/darwin/libclang_rt.asan_osx_dynamic.dylib "interceptors not installed" && 0 ******************** PASS: lldb-shell :: Minidump/disassemble-no-module.yaml (1790 of 1799) PASS: lldb-unit :: Utility/./UtilityTests/ScalarTest.GetValue (1791 of 1799) UNRESOLVED: lldb-api :: python_api/sbstructureddata/TestStructuredDataAPI.py (1792 of 1799) ******************** TEST 'lldb-api :: python_api/sbstructureddata/TestStructuredDataAPI.py' FAILED ******************** Unable to find 'RESULT: PASSED' in dotest output (exit code -6):

Hide Details

lldb version 10.0.99 (http://labmaster3.local/git/llvm-project.git revision 0e0dea82681a86a09ceed0afd321367a35bfa051) clang revision c46b3a2abd38d6fecd389c97dfa7df54af77fdb9 llvm revision c46b3a2abd38d6fecd389c97dfa7df54af77fdb9 ==23374==ERROR: Interceptors are not working. This may be because AddressSanitizer is loaded too late (e.g. via dlopen). Please launch the executable with: DYLD_INSERT_LIBRARIES=/Users/buildslave/jenkins/workspace/lldb-cmake-sanitized/host-compiler/lib/clang/10.0.0/lib/darwin/libclang_rt.asan_osx_dynamic.dylib "interceptors not installed" && 0 ******************** UNRESOLVED: lldb-api :: functionalities/abbreviation/TestAbbreviations.py (1793 of 1799) ******************** TEST 'lldb-api :: functionalities/abbreviation/TestAbbreviations.py' FAILED ******************** Unable to find 'RESULT: PASSED' in dotest output (exit code -6):

Hide Details

lldb version 10.0.99 (http://labmaster3.local/git/llvm-project.git revision 0e0dea82681a86a09ceed0afd321367a35bfa051) clang revision c46b3a2abd38d6fecd389c97dfa7df54af77fdb9 llvm revision c46b3a2abd38d6fecd389c97dfa7df54af77fdb9 ==23375==ERROR: Interceptors are not working. This may be because AddressSanitizer is loaded too late (e.g. via dlopen). Please launch the executable with: DYLD_INSERT_LIBRARIES=/Users/buildslave/jenkins/workspace/lldb-cmake-sanitized/host-compiler/lib/clang/10.0.0/lib/darwin/libclang_rt.asan_osx_dynamic.dylib "interceptors not installed" && 0 ******************** UNRESOLVED: lldb-api :: python_api/module_section/TestModuleAndSection.py (1794 of 1799) ******************** TEST 'lldb-api :: python_api/module_section/TestModuleAndSection.py' FAILED ******************** Unable to find 'RESULT: PASSED' in dotest output (exit code -6):

Hide Details

lldb version 10.0.99 (http://labmaster3.local/git/llvm-project.git revision 0e0dea82681a86a09ceed0afd321367a35bfa051) clang revision c46b3a2abd38d6fecd389c97dfa7df54af77fdb9 llvm revision c46b3a2abd38d6fecd389c97dfa7df54af77fdb9 ==23387==ERROR: Interceptors are not working. This may be because AddressSanitizer is loaded too late (e.g. via dlopen). Please launch the executable with: DYLD_INSERT_LIBRARIES=/Users/buildslave/jenkins/workspace/lldb-cmake-sanitized/host-compiler/lib/clang/10.0.0/lib/darwin/libclang_rt.asan_osx_dynamic.dylib "interceptors not installed" && 0 ******************** UNRESOLVED: lldb-api :: commands/settings/TestSettings.py (1795 of 1799) ******************** TEST 'lldb-api :: commands/settings/TestSettings.py' FAILED ******************** Unable to find 'RESULT: PASSED' in dotest output (exit code -6):

Hide Details

lldb version 10.0.99 (http://labmaster3.local/git/llvm-project.git revision 0e0dea82681a86a09ceed0afd321367a35bfa051) clang revision c46b3a2abd38d6fecd389c97dfa7df54af77fdb9 llvm revision c46b3a2abd38d6fecd389c97dfa7df54af77fdb9 ==23388==ERROR: Interceptors are not working. This may be because AddressSanitizer is loaded too late (e.g. via dlopen). Please launch the executable with: DYLD_INSERT_LIBRARIES=/Users/buildslave/jenkins/workspace/lldb-cmake-sanitized/host-compiler/lib/clang/10.0.0/lib/darwin/libclang_rt.asan_osx_dynamic.dylib "interceptors not installed" && 0 ******************** UNRESOLVED: lldb-api :: functionalities/thread/concurrent_events/TestConcurrentTwoBreakpointThreads.py (1796 of 1799) ******************** TEST 'lldb-api :: functionalities/thread/concurrent_events/TestConcurrentTwoBreakpointThreads.py' FAILED ******************** Unable to find 'RESULT: PASSED' in dotest output (exit code -6):

Hide Details

lldb version 10.0.99 (http://labmaster3.local/git/llvm-project.git revision 0e0dea82681a86a09ceed0afd321367a35bfa051) clang revision c46b3a2abd38d6fecd389c97dfa7df54af77fdb9 llvm revision c46b3a2abd38d6fecd389c97dfa7df54af77fdb9 ==23406==ERROR: Interceptors are not working. This may be because AddressSanitizer is loaded too late (e.g. via dlopen). Please launch the executable with: DYLD_INSERT_LIBRARIES=/Users/buildslave/jenkins/workspace/lldb-cmake-sanitized/host-compiler/lib/clang/10.0.0/lib/darwin/libclang_rt.asan_osx_dynamic.dylib "interceptors not installed" && 0 ******************** UNRESOLVED: lldb-api :: commands/expression/inline-namespace/TestInlineNamespace.py (1797 of 1799) ******************** TEST 'lldb-api :: commands/expression/inline-namespace/TestInlineNamespace.py' FAILED ******************** Unable to find 'RESULT: PASSED' in dotest output (exit code -6):

Hide Details

lldb version 10.0.99 (http://labmaster3.local/git/llvm-project.git revision 0e0dea82681a86a09ceed0afd321367a35bfa051) clang revision c46b3a2abd38d6fecd389c97dfa7df54af77fdb9 llvm revision c46b3a2abd38d6fecd389c97dfa7df54af77fdb9 ==23399==ERROR: Interceptors are not working. This may be because AddressSanitizer is loaded too late (e.g. via dlopen). Please launch the executable with: DYLD_INSERT_LIBRARIES=/Users/buildslave/jenkins/workspace/lldb-cmake-sanitized/host-compiler/lib/clang/10.0.0/lib/darwin/libclang_rt.asan_osx_dynamic.dylib "interceptors not installed" && 0 ******************** UNRESOLVED: lldb-api :: functionalities/data-formatter/format-propagation/TestFormatPropagation.py (1798 of 1799) ******************** TEST 'lldb-api :: functionalities/data-formatter/format-propagation/TestFormatPropagation.py' FAILED ******************** Unable to find 'RESULT: PASSED' in dotest output (exit code -6):

Hide Details

lldb version 10.0.99 (http://labmaster3.local/git/llvm-project.git revision 0e0dea82681a86a09ceed0afd321367a35bfa051) clang revision c46b3a2abd38d6fecd389c97dfa7df54af77fdb9 llvm revision c46b3a2abd38d6fecd389c97dfa7df54af77fdb9 ==23430==ERROR: Interceptors are not working. This may be because AddressSanitizer is loaded too late (e.g. via dlopen). Please launch the executable with: DYLD_INSERT_LIBRARIES=/Users/buildslave/jenkins/workspace/lldb-cmake-sanitized/host-compiler/lib/clang/10.0.0/lib/darwin/libclang_rt.asan_osx_dynamic.dylib "interceptors not installed" && 0 ******************** UNRESOLVED: lldb-api :: commands/command/nested_alias/TestNestedAlias.py (1799 of 1799) ******************** TEST 'lldb-api :: commands/command/nested_alias/TestNestedAlias.py' FAILED ******************** Unable to find 'RESULT: PASSED' in dotest output (exit code -6):

Hide Details

lldb version 10.0.99 (http://labmaster3.local/git/llvm-project.git revision 0e0dea82681a86a09ceed0afd321367a35bfa051) clang revision c46b3a2abd38d6fecd389c97dfa7df54af77fdb9 llvm revision c46b3a2abd38d6fecd389c97dfa7df54af77fdb9 ==23458==ERROR: Interceptors are not working. This may be because AddressSanitizer is loaded too late (e.g. via dlopen). Please launch the executable with: DYLD_INSERT_LIBRARIES=/Users/buildslave/jenkins/workspace/lldb-cmake-sanitized/host-compiler/lib/clang/10.0.0/lib/darwin/libclang_rt.asan_osx_dynamic.dylib "interceptors not installed" && 0 ********************

Hide Details

Testing Time: 653.29s ******************** Failing Tests (1): lldb-unit :: Utility/./UtilityTests/TimerTest.CategoryTimesStats

Hide Details

******************** Unresolved Tests (767): lldb-api :: functionalities/data-formatter/data-formatter-stl/libstdcpp/list/TestDataFormatterStdList.py lldb-api :: functionalities/postmortem/netbsd-core/TestNetBSDCore.py lldb-api :: lang/cpp/template/TestTemplateArgs.py lldb-api :: lang/cpp/unsigned_types/TestUnsignedTypes.py lldb-api :: types/TestIntegerTypes.py lldb-api :: commands/expression/cast_int_to_anonymous_enum/TestCastIntToAnonymousEnum.py lldb-api :: commands/expression/radar_9673664/TestExprHelpExamples.py lldb-api :: functionalities/unwind/noreturn/TestNoreturnUnwind.py lldb-api :: lang/objc/forward-decl/TestForwardDecl.py lldb-api :: functionalities/dead-strip/TestDeadStrip.py lldb-api :: commands/command/script/import/TestImport.py lldb-api :: commands/gui/basic/TestGuiBasic.py lldb-api :: commands/command/delete/TestCommandDelete.py lldb-api :: functionalities/data-formatter/data-formatter-stl/libcxx/bitset/TestDataFormatterLibcxxBitset.py lldb-api :: lang/objc/objc++/TestObjCXX.py lldb-api :: tools/lldb-server/TestGdbRemoteKill.py lldb-api :: functionalities/load_using_paths/TestLoadUsingPaths.py lldb-api :: lang/cpp/char1632_t/TestChar1632T.py lldb-api :: types/TestFloatTypes.py lldb-api :: functionalities/dynamic_value_child_count/TestDynamicValueChildCount.py lldb-api :: python_api/disassemble-raw-data/TestDisassemble_VST1_64.py lldb-api :: commands/expression/import-std-module/list-basic/TestBasicList.py lldb-api :: lang/objc/unicode-string/TestUnicodeString.py lldb-api :: functionalities/thread/backtrace_all/TestBacktraceAll.py lldb-api :: functionalities/fat_archives/TestFatArchives.py lldb-api :: python_api/lldbutil/frame/TestFrameUtils.py lldb-api :: lang/mixed/TestMixedLanguages.py lldb-api :: lang/objc/foundation/TestObjCMethods.py lldb-api :: functionalities/breakpoint/address_breakpoints/TestAddressBreakpoints.py lldb-api :: commands/command/source/TestCommandSource.py lldb-api :: functionalities/data-formatter/data-formatter-objc/nsindexpath/TestDataFormatterNSIndexPath.py lldb-api :: functionalities/data-formatter/data-formatter-stl/libstdcpp/map/TestDataFormatterStdMap.py lldb-api :: lang/c/blocks/TestBlocks.py lldb-api :: commands/expression/persistent_ptr_update/TestPersistentPtrUpdate.py lldb-api :: commands/expression/ignore-artificial-constructors/TestIgnoreArtificialConstructors.py lldb-api :: functionalities/memory/read/TestMemoryRead.py lldb-api :: functionalities/gdb_remote_client/TestThreadSelectionBug.py lldb-api :: functionalities/thread/concurrent_events/TestConcurrentTwoWatchpointThreads.py lldb-api :: commands/expression/import-std-module/unique_ptr/TestUniquePtr.py lldb-api :: commands/frame/diagnose/complicated-expression/TestComplicatedExpression.py lldb-api :: commands/expression/call-function/TestCallStdStringFunction.py lldb-api :: types/TestRecursiveTypes.py lldb-api :: lang/c/bitfields/TestBitfields.py lldb-api :: types/TestFloatTypesExpr.py lldb-api :: driver/batch_mode/TestBatchMode.py lldb-api :: functionalities/data-formatter/data-formatter-globals/TestDataFormatterGlobals.py lldb-api :: functionalities/data-formatter/ostypeformatting/TestFormattersOsType.py lldb-api :: python_api/file_handle/TestFileHandle.py lldb-api :: functionalities/breakpoint/objc/TestObjCBreakpoints.py lldb-api :: commands/expression/issue_11588/Test11588.py lldb-api :: lang/objcxx/objcxx-ivar-vector/TestIvarVector.py lldb-api :: api/listeners/TestListener.py lldb-api :: lang/objc/objc-checker/TestObjCCheckers.py lldb-api :: commands/expression/persistent_types/TestPersistentTypes.py lldb-api :: commands/expression/call-throws/TestCallThatThrows.py lldb-api :: lang/cpp/template-function/TestTemplateFunctions.py lldb-api :: functionalities/darwin_log/basic/TestDarwinLogBasic.py lldb-api :: tools/lldb-vscode/breakpoint/TestVSCode_setExceptionBreakpoints.py lldb-api :: functionalities/deleted-executable/TestDeletedExecutable.py lldb-api :: functionalities/gdb_remote_client/TestRecognizeBreakpoint.py lldb-api :: lang/objc/objc-ivar-protocols/TestIvarProtocols.py lldb-api :: commands/expression/dont_allow_jit/TestAllowJIT.py lldb-api :: functionalities/data-formatter/data-formatter-objc/nsstring/TestDataFormatterNSString.py lldb-api :: functionalities/postmortem/elf-core/gcore/TestGCore.py lldb-api :: commands/frame/diagnose/local-variable/TestLocalVariable.py lldb-api :: python_api/symbol-context/two-files/TestSymbolContextTwoFiles.py lldb-api :: functionalities/inferior-changed/TestInferiorChanged.py lldb-api :: functionalities/signal/handle-segv/TestHandleSegv.py lldb-api :: functionalities/breakpoint/global_constructor/TestBreakpointInGlobalConstructor.py lldb-api :: commands/disassemble/basic/TestFrameDisassemble.py lldb-api :: lang/objc/orderedset/TestOrderedSet.py lldb-api :: commands/reproducer/invalid-args/TestInvalidArgsReproducer.py lldb-api :: tools/lldb-server/libraries-svr4/TestGdbRemoteLibrariesSvr4Support.py lldb-api :: functionalities/longjmp/TestLongjmp.py lldb-api :: functionalities/thread/concurrent_events/TestConcurrentTwoBreakpointsOneSignal.py lldb-api :: api/multiple-targets/TestMultipleTargets.py lldb-api :: lang/cpp/incomplete-types/TestCppIncompleteTypes.py lldb-api :: commands/watchpoints/watchpoint_commands/command/TestWatchpointCommandPython.py lldb-api :: functionalities/data-formatter/data-formatter-python-synth/TestDataFormatterPythonSynth.py lldb-api :: lang/objc/global_ptrs/TestGlobalObjects.py lldb-api :: functionalities/thread/concurrent_events/TestConcurrentSignalBreak.py lldb-api :: functionalities/breakpoint/breakpoint_by_line_and_column/TestBreakpointByLineAndColumn.py lldb-api :: macosx/add-dsym/TestAddDsymMidExecutionCommand.py lldb-api :: functionalities/darwin_log/filter/exact_match/activity/TestDarwinLogFilterMatchActivity.py lldb-api :: commands/target/create-no-such-arch/TestNoSuchArch.py lldb-api :: python_api/watchpoint/TestWatchpointIter.py lldb-api :: tools/lldb-server/TestLldbGdbServer.py lldb-api :: commands/watchpoints/hello_watchlocation/TestWatchLocation.py lldb-api :: commands/expression/save_jit_objects/TestSaveJITObjects.py lldb-api :: tools/lldb-server/TestAppleSimulatorOSType.py lldb-api :: macosx/find-dsym/deep-bundle/TestDeepBundle.py lldb-api :: python_api/exprpath_synthetic/TestExprPathSynthetic.py lldb-api :: commands/expression/no-deadlock/TestExprDoesntBlock.py lldb-api :: lang/cpp/operators/TestCppOperators.py lldb-api :: commands/register/register/intel_xtended_registers/mpx_bound_violation/TestBoundViolation.py lldb-api :: terminal/TestSTTYBeforeAndAfter.py lldb-api :: lang/objcxx/hide-runtime-values/TestObjCXXHideRuntimeValues.py lldb-api :: lang/cpp/wchar_t/TestCxxWCharT.py lldb-api :: commands/process/launch/TestProcessLaunch.py lldb-api :: functionalities/thread/concurrent_events/TestConcurrentBreakpointsDelayedBreakpointOneWatchpoint.py lldb-api :: functionalities/darwin_log/format/TestDarwinLogMessageFormat.py lldb-api :: lang/objc/foundation/TestObjCMethodsString.py lldb-api :: lang/objc/print-obj/TestPrintObj.py lldb-api :: functionalities/gdb_remote_client/TestTargetXMLArch.py lldb-api :: functionalities/tsan/thread_leak/TestTsanThreadLeak.py lldb-api :: functionalities/breakpoint/breakpoint_conditions/TestBreakpointConditions.py lldb-api :: lang/objc/modules-cache/TestClangModulesCache.py lldb-api :: commands/watchpoints/watchpoint_events/TestWatchpointEvents.py lldb-api :: functionalities/data-formatter/data-formatter-objc/TestDataFormatterObjCKVO.py lldb-api :: lang/cpp/modules-import/TestCXXModulesImport.py lldb-api :: lang/objc/objc-dyn-sbtype/TestObjCDynamicSBType.py lldb-api :: lang/cpp/trivial_abi/TestTrivialABI.py lldb-api :: functionalities/thread/concurrent_events/TestConcurrentWatchBreakDelay.py lldb-api :: lang/c/function_types/TestFunctionTypes.py lldb-api :: python_api/rdar-12481949/Test-rdar-12481949.py lldb-api :: tools/lldb-server/TestGdbRemote_qThreadStopInfo.py lldb-api :: functionalities/breakpoint/scripted_bkpt/TestScriptedResolver.py lldb-api :: lang/objc/objc-new-syntax/TestObjCNewSyntaxLiteral.py lldb-api :: lang/objcxx/cxx-bridged-po/TestObjCXXBridgedPO.py lldb-api :: commands/help/TestHelp.py lldb-api :: commands/expression/static-initializers/TestStaticInitializers.py lldb-api :: lang/cpp/operator-overload/TestOperatorOverload.py lldb-api :: functionalities/backticks/TestBackticksWithoutATarget.py lldb-api :: commands/platform/process/TestProcessList.py lldb-api :: commands/expression/completion-in-lambda-and-unnnamed-class/TestCompletionInLambdaAndUnnamedClass.py lldb-api :: lang/cpp/bool/TestCPPBool.py lldb-api :: tools/lldb-server/TestGdbRemoteHostInfo.py lldb-api :: functionalities/gdb_remote_client/TestNoWatchpointSupportInfo.py lldb-api :: lang/objc/foundation/TestObjCMethodsNSArray.py lldb-api :: python_api/target/TestTargetAPI.py lldb-api :: functionalities/memory/find/TestMemoryFind.py lldb-api :: commands/expression/dollar-in-variable/TestDollarInVariable.py lldb-api :: lang/c/unicode/TestUnicodeSymbols.py lldb-api :: functionalities/thread/concurrent_events/TestConcurrentSignalDelayWatch.py lldb-api :: lang/objc/single-entry-dictionary/TestObjCSingleEntryDictionary.py lldb-api :: functionalities/inferior-crashing/recursive-inferior/TestRecursiveInferior.py lldb-api :: lang/cpp/global_operators/TestCppGlobalOperators.py lldb-api :: lang/cpp/lambdas/TestLambdas.py lldb-api :: functionalities/thread/thread_exit/TestThreadExit.py lldb-api :: commands/register/register/intel_xtended_registers/TestMPXRegisters.py lldb-api :: commands/watchpoints/watchpoint_commands/condition/TestWatchpointConditionCmd.py lldb-api :: functionalities/type_lookup/TestTypeLookup.py lldb-api :: commands/expression/import-std-module/conflicts/TestStdModuleWithConflicts.py lldb-api :: commands/gui/invalid-args/TestInvalidArgsGui.py lldb-api :: macosx/duplicate-archive-members/TestDuplicateMembers.py lldb-api :: functionalities/thread/step_until/TestStepUntil.py lldb-api :: python_api/type/TestTypeList.py lldb-api :: lang/objc/objc-ivar-stripped/TestObjCIvarStripped.py lldb-api :: functionalities/type_completion/TestTypeCompletion.py lldb-api :: lang/cpp/limit-debug-info/TestWithLimitDebugInfo.py lldb-api :: lang/objc/foundation/TestFoundationDisassembly.py lldb-api :: tools/lldb-server/TestGdbRemoteProcessInfo.py lldb-api :: python_api/default-constructor/TestDefaultConstructorForAPIObjects.py lldb-api :: macosx/load-kext/TestLoadKext.py lldb-api :: api/log/TestAPILog.py lldb-api :: functionalities/inferior-crashing/recursive-inferior/TestRecursiveInferiorStep.py lldb-api :: functionalities/data-formatter/type_summary_list_arg/TestTypeSummaryListArg.py lldb-api :: lang/objc/objc-foundation-dictionary-empty/TestNSDictionary0.py lldb-api :: functionalities/thread/create_after_attach/TestCreateAfterAttach.py lldb-api :: functionalities/data-formatter/data-formatter-stl/libcxx/initializerlist/TestInitializerList.py lldb-api :: tools/lldb-vscode/step/TestVSCode_step.py lldb-api :: lang/c/inlines/TestRedefinitionsInInlines.py lldb-api :: lang/cpp/namespace_conflicts/TestNamespaceConflicts.py lldb-api :: macosx/indirect_symbol/TestIndirectSymbols.py lldb-api :: functionalities/data-formatter/synthcapping/TestSyntheticCapping.py lldb-api :: functionalities/thread/create_during_step/TestCreateDuringStep.py lldb-api :: tools/lldb-vscode/attach/TestVSCode_attach.py lldb-api :: python_api/value/linked_list/TestValueAPILinkedList.py lldb-api :: lang/c/tls_globals/TestTlsGlobals.py lldb-api :: benchmarks/libcxxlist/TestBenchmarkLibcxxList.py lldb-api :: commands/command/script/TestCommandScript.py lldb-api :: python_api/section/TestSectionAPI.py lldb-api :: functionalities/data-formatter/summary-string-onfail/Test-rdar-9974002.py lldb-api :: functionalities/breakpoint/require_hw_breakpoints/TestRequireHWBreakpoints.py lldb-api :: tools/lldb-server/commandline/TestStubSetSID.py lldb-api :: functionalities/postmortem/mach-core/TestMachCore.py lldb-api :: commands/frame/var/TestFrameVar.py lldb-api :: functionalities/thread/thread_specific_break_plus_condition/TestThreadSpecificBpPlusCondition.py lldb-api :: tools/lldb-server/inferior-crash/TestGdbRemoteAbort.py lldb-api :: functionalities/gdb_remote_client/TestPlatformClient.py lldb-api :: functionalities/jitloader_gdb/TestJITLoaderGDB.py lldb-api :: functionalities/gdb_remote_client/TestGDBRemoteLoad.py lldb-api :: commands/target/create-deps/TestTargetCreateDeps.py lldb-api :: lang/cpp/stl/TestStdCXXDisassembly.py lldb-api :: functionalities/breakpoint/breakpoint_options/TestBreakpointOptions.py lldb-api :: linux/builtin_trap/TestBuiltinTrap.py lldb-api :: lang/cpp/thread_local/TestThreadLocal.py lldb-api :: lang/objc/bitfield_ivars/TestBitfieldIvars.py lldb-api :: functionalities/gdb_remote_client/TestStopPCs.py lldb-api :: lang/cpp/signed_types/TestSignedTypes.py lldb-api :: lang/cpp/member-and-local-vars-with-same-name/TestMembersAndLocalsWithSameName.py lldb-api :: commands/version/TestVersion.py lldb-api :: commands/target/dump-symtab-demangle/TestDumpSymtabDemangle.py lldb-api :: lang/c/vla/TestVLA.py lldb-api :: commands/watchpoints/watchpoint_commands/command/TestWatchpointCommandLLDB.py lldb-api :: functionalities/data-formatter/data-formatter-objc/TestDataFormatterObjCNSContainer.py lldb-api :: lang/c/conflicting-symbol/TestConflictingSymbol.py lldb-api :: functionalities/breakpoint/breakpoint_set_restart/TestBreakpointSetRestart.py lldb-api :: functionalities/gdb_remote_client/TestNoGPacketSupported.py lldb-api :: commands/expression/completion-crash-incomplete-record/TestCompletionCrashIncompleteRecord.py lldb-api :: functionalities/gdb_remote_client/TestRestartBug.py lldb-api :: functionalities/data-formatter/data-formatter-synthval/TestDataFormatterSynthVal.py lldb-api :: commands/command/history/TestCommandHistory.py lldb-api :: python_api/process/io/TestProcessIO.py lldb-api :: functionalities/thread/thread_specific_break/TestThreadSpecificBreakpoint.py lldb-api :: functionalities/ptr_refs/TestPtrRefs.py lldb-api :: functionalities/thread/step_out/TestThreadStepOut.py lldb-api :: commands/expression/context-object/TestContextObject.py lldb-api :: functionalities/value_md5_crash/TestValueMD5Crash.py lldb-api :: lang/c/offsetof/TestOffsetof.py lldb-api :: functionalities/thread/exit_during_step/TestExitDuringStep.py lldb-api :: functionalities/data-formatter/nssetsynth/TestNSSetSynthetic.py lldb-api :: functionalities/rerun/TestRerun.py lldb-api :: commands/expression/import-std-module/shared_ptr/TestSharedPtr.py lldb-api :: functionalities/breakpoint/breakpoint_ids/TestBreakpointIDs.py lldb-api :: functionalities/data-formatter/data-formatter-stl/libstdcpp/string/TestDataFormatterStdString.py lldb-api :: commands/expression/import-std-module/vector-basic/TestBasicVector.py lldb-api :: functionalities/float-display/TestFloatDisplay.py lldb-api :: python_api/watchpoint/condition/TestWatchpointConditionAPI.py lldb-api :: commands/frame/diagnose/dereference-this/TestDiagnoseDereferenceThis.py lldb-api :: functionalities/thread/multi_break/TestMultipleBreakpoints.py lldb-api :: python_api/sbdata/TestSBData.py lldb-api :: lang/cpp/namespace/TestNamespace.py lldb-api :: functionalities/gdb_remote_client/TestGDBRemoteClient.py lldb-api :: commands/command/invalid-args/TestInvalidArgsCommand.py lldb-api :: commands/expression/import-std-module/no-std-module/TestMissingStdModule.py lldb-api :: functionalities/thread/concurrent_events/TestConcurrentSignalWatchBreak.py lldb-api :: commands/frame/select/TestFrameSelect.py lldb-api :: commands/apropos/basic/TestApropos.py lldb-api :: functionalities/thread/concurrent_events/TestConcurrentCrashWithBreak.py lldb-api :: commands/expression/import-std-module/vector-bool/TestBoolVector.py lldb-api :: functionalities/data-formatter/data-formatter-stl/libcxx/map/TestDataFormatterLibccMap.py lldb-api :: commands/watchpoints/step_over_watchpoint/TestStepOverWatchpoint.py lldb-api :: functionalities/data-formatter/data-formatter-ptr-to-array/TestPtrToArrayFormatting.py lldb-api :: commands/log/invalid-args/TestInvalidArgsLog.py lldb-api :: commands/expression/rdar44436068/Test128BitsInteger.py lldb-api :: macosx/safe-to-func-call/TestSafeFuncCalls.py lldb-api :: functionalities/data-formatter/data-formatter-named-summaries/TestDataFormatterNamedSummaries.py lldb-api :: functionalities/data-formatter/data-formatter-stl/libstdcpp/unique_ptr/invalid/TestDataFormatterInvalidStdUniquePtr.py lldb-api :: lang/objc/conflicting-definition/TestConflictingDefinition.py lldb-api :: commands/command/script/import/rdar-12586188/TestRdar12586188.py lldb-api :: tools/lldb-server/commandline/TestStubReverseConnect.py lldb-api :: lang/cpp/dynamic-value-same-basename/TestDynamicValueSameBase.py lldb-api :: functionalities/thread/concurrent_events/TestConcurrentNWatchNBreak.py lldb-api :: api/check_public_api_headers/TestPublicAPIHeaders.py lldb-api :: functionalities/data-formatter/var-in-aggregate-misuse/TestVarInAggregateMisuse.py lldb-api :: commands/expression/namespace_local_var_same_name_obj_c/TestNamespaceLocalVarSameNameObjC.py lldb-api :: functionalities/tsan/global_location/TestTsanGlobalLocation.py lldb-api :: lang/c/struct_types/TestStructTypes.py lldb-api :: macosx/order/TestOrderFile.py lldb-api :: functionalities/tail_call_frames/thread_step_out_message/TestArtificialFrameStepOutMessage.py lldb-api :: functionalities/breakpoint/address_breakpoints/TestBadAddressBreakpoints.py lldb-api :: functionalities/thread/concurrent_events/TestConcurrentTwoWatchpointsOneBreakpoint.py lldb-api :: functionalities/data-formatter/hexcaps/TestDataFormatterHexCaps.py lldb-api :: commands/process/attach/TestProcessAttach.py lldb-api :: python_api/interpreter/TestRunCommandInterpreterAPI.py lldb-api :: lang/cpp/class-template-parameter-pack/TestClassTemplateParameterPack.py lldb-api :: commands/expression/anonymous-struct/TestCallUserAnonTypedef.py lldb-api :: lang/objc/radar-9691614/TestObjCMethodReturningBOOL.py lldb-api :: python_api/function_symbol/TestDisasmAPI.py lldb-api :: functionalities/breakpoint/step_over_breakpoint/TestStepOverBreakpoint.py lldb-api :: commands/watchpoints/hello_watchpoint/TestMyFirstWatchpoint.py lldb-api :: python_api/objc_type/TestObjCType.py lldb-api :: commands/expression/import-std-module/basic/TestImportStdModule.py lldb-api :: functionalities/gdb_remote_client/TestWriteMemory.py lldb-api :: lang/objc/objc-struct-return/TestObjCStructReturn.py lldb-api :: commands/expression/persistent_types/TestNestedPersistentTypes.py lldb-api :: commands/expression/multiline-completion/TestMultilineCompletion.py lldb-api :: functionalities/memory/cache/TestMemoryCache.py lldb-api :: lang/objc/rdar-10967107/TestRdar10967107.py lldb-api :: functionalities/tsan/basic/TestTsanBasic.py lldb-api :: functionalities/breakpoint/source_regexp/TestSourceRegexBreakpoints.py lldb-api :: commands/expression/timeout/TestCallWithTimeout.py lldb-api :: functionalities/data-formatter/data-formatter-smart-array/TestDataFormatterSmartArray.py lldb-api :: functionalities/postmortem/elf-core/thread_crash/TestLinuxCoreThreads.py lldb-api :: lang/c/strings/TestCStrings.py lldb-api :: functionalities/thread/concurrent_events/TestConcurrentDelaySignalWatch.py lldb-api :: functionalities/thread/concurrent_events/TestConcurrentBreakpointDelayBreakpointOneSignal.py lldb-api :: commands/frame/diagnose/bad-reference/TestBadReference.py lldb-api :: lang/c/local_variables/TestLocalVariables.py lldb-api :: commands/expression/import-std-module/unique_ptr-dbg-info-content/TestUniquePtrDbgInfoContent.py lldb-api :: commands/watchpoints/multi_watchpoint_slots/TestWatchpointMultipleSlots.py lldb-api :: functionalities/data-formatter/data-formatter-stl/libcxx/variant/TestDataFormatterLibcxxVariant.py lldb-api :: tools/lldb-vscode/breakpoint/TestVSCode_setFunctionBreakpoints.py lldb-api :: commands/expression/unwind_expression/TestUnwindExpression.py lldb-api :: functionalities/thread/concurrent_events/TestConcurrentSignalNWatchNBreak.py lldb-api :: functionalities/breakpoint/move_nearest/TestMoveNearest.py lldb-api :: commands/frame/var-scope/TestFrameVariableScope.py lldb-api :: functionalities/non-overlapping-index-variable-i/TestIndexVariable.py lldb-api :: lang/objc/foundation/TestObjCMethods2.py lldb-api :: functionalities/data-formatter/varscript_formatting/TestDataFormatterVarScriptFormatting.py lldb-api :: types/TestDoubleTypesExpr.py lldb-api :: functionalities/data-formatter/dump_dynamic/TestDumpDynamic.py lldb-api :: sanity/TestModuleCacheSanity.py lldb-api :: functionalities/thread/concurrent_events/TestConcurrentWatchpointDelayWatchpointOneBreakpoint.py lldb-api :: tools/lldb-vscode/variables/TestVSCode_variables.py lldb-api :: commands/expression/options/TestExprOptions.py lldb-api :: benchmarks/libcxxmap/TestBenchmarkLibcxxMap.py lldb-api :: lang/c/forward/TestForwardDeclaration.py lldb-api :: functionalities/data-formatter/data-formatter-stl/libcxx/string/TestDataFormatterLibcxxString.py lldb-api :: functionalities/thread/concurrent_events/TestConcurrentTwoWatchpointsOneDelayBreakpoint.py lldb-api :: commands/expression/char/TestExprsChar.py lldb-api :: macosx/macabi/TestMacABImacOSFramework.py lldb-api :: commands/watchpoints/multiple_hits/TestMultipleHits.py lldb-api :: functionalities/history/TestHistoryRecall.py lldb-api :: functionalities/breakpoint/breakpoint_command/TestRegexpBreakCommand.py lldb-api :: functionalities/thread/concurrent_events/TestConcurrentDelaySignalBreak.py lldb-api :: tools/lldb-server/TestGdbRemoteAuxvSupport.py lldb-api :: arm/emulation/TestEmulations.py lldb-api :: lang/c/enum_types/TestEnumTypes.py lldb-api :: benchmarks/turnaround/TestCompileRunToBreakpointTurnaround.py lldb-api :: commands/expression/top-level/TestTopLevelExprs.py lldb-api :: functionalities/step_scripted/TestStepScripted.py lldb-api :: python_api/frame/TestFrames.py lldb-api :: commands/expression/import-std-module/forward_list-basic/TestBasicForwardList.py lldb-api :: commands/expression/entry-bp/TestExprEntryBP.py lldb-api :: macosx/version_zero/TestGetVersionZeroVersion.py lldb-api :: tools/lldb-server/TestGdbRemoteExpeditedRegisters.py lldb-api :: functionalities/asan/TestReportData.py lldb-api :: functionalities/thread/backtrace_limit/TestBacktraceLimit.py lldb-api :: lang/objc/foundation/TestObjectDescriptionAPI.py lldb-api :: functionalities/thread/concurrent_events/TestConcurrentSignalWatch.py lldb-api :: commands/settings/quoting/TestQuoting.py lldb-api :: commands/expression/calculator_mode/TestCalculatorMode.py lldb-api :: functionalities/thread/concurrent_events/TestConcurrentDelayedCrashWithBreakpointWatchpoint.py lldb-api :: tools/lldb-server/thread-name/TestGdbRemoteThreadName.py lldb-api :: python_api/frame/get-variables/TestGetVariables.py lldb-api :: lang/objc/ivar-IMP/TestObjCiVarIMP.py lldb-api :: functionalities/data-formatter/data-formatter-stl/libcxx/multimap/TestDataFormatterLibccMultiMap.py lldb-api :: functionalities/thread/concurrent_events/TestConcurrentDelayWatchBreak.py lldb-api :: functionalities/darwin_log/source/debug/TestDarwinLogSourceDebug.py lldb-api :: lang/c/set_values/TestSetValues.py lldb-api :: linux/mix-dwo-and-regular-objects/TestMixedDwarfBinary.py lldb-api :: functionalities/data-formatter/data-formatter-stl/libcxx/list/loop/TestDataFormatterLibcxxListLoop.py lldb-api :: functionalities/data-formatter/data-formatter-stl/libcxx/forward_list/TestDataFormatterLibcxxForwardList.py lldb-api :: commands/frame/language/TestGuessLanguage.py lldb-api :: functionalities/thread/concurrent_events/TestConcurrentDelayedCrashWithBreakpointSignal.py lldb-api :: functionalities/plugins/command_plugin/TestPluginCommands.py lldb-api :: functionalities/load_unload/TestLoadUnload.py lldb-api :: commands/process/launch-with-shellexpand/TestLaunchWithShellExpand.py lldb-api :: functionalities/data-formatter/vector-types/TestVectorTypesFormatting.py lldb-api :: tools/lldb-vscode/stackTrace/TestVSCode_stackTrace.py lldb-api :: functionalities/target-new-solib-notifications/TestModuleLoadedNotifys.py lldb-api :: functionalities/breakpoint/breakpoint_locations/TestBreakpointLocations.py lldb-api :: functionalities/inferior-assert/TestInferiorAssert.py lldb-api :: types/TestIntegerTypesExpr.py lldb-api :: commands/frame/recognizer/TestFrameRecognizer.py lldb-api :: commands/frame/diagnose/dereference-argument/TestDiagnoseDereferenceArgument.py lldb-api :: functionalities/data-formatter/data-formatter-stl/libstdcpp/iterator/TestDataFormatterStdIterator.py lldb-api :: lang/cpp/enum_types/TestCPP11EnumTypes.py lldb-api :: lang/c/modules/TestCModules.py lldb-api :: lang/objc/objc-dynamic-value/TestObjCDynamicValue.py lldb-api :: python_api/sblaunchinfo/TestSBLaunchInfo.py lldb-api :: functionalities/data-formatter/refpointer-recursion/TestDataFormatterRefPtrRecursion.py lldb-api :: lang/cpp/offsetof/TestOffsetofCpp.py lldb-api :: commands/expression/call-function/TestCallUserDefinedFunction.py lldb-api :: commands/expression/vector_of_enums/TestVectorOfEnums.py lldb-api :: commands/expression/context-object-objc/TestContextObjectObjc.py lldb-api :: commands/expression/completion/TestExprCompletion.py lldb-api :: functionalities/data-formatter/data-formatter-stl/libcxx/iterator/TestDataFormatterLibccIterator.py lldb-api :: python_api/breakpoint/TestBreakpointAPI.py lldb-api :: functionalities/data-formatter/typedef_array/TestTypedefArray.py lldb-api :: functionalities/memory-region/TestMemoryRegion.py lldb-api :: arm/breakpoint-it/TestBreakpointIt.py lldb-api :: api/command-return-object/TestSBCommandReturnObject.py lldb-api :: python_api/lldbutil/iter/TestRegistersIterator.py lldb-api :: commands/expression/import-std-module/sysroot/TestStdModuleSysroot.py lldb-api :: functionalities/recursion/TestValueObjectRecursion.py lldb-api :: commands/expression/call-restarts/TestCallThatRestarts.py lldb-api :: functionalities/thread/concurrent_events/TestConcurrentTwoBreakpointsOneWatchpoint.py lldb-api :: functionalities/data-formatter/data-formatter-stl/libstdcpp/vbool/TestDataFormatterStdVBool.py lldb-api :: functionalities/darwin_log/filter/regex/activity/TestDarwinLogFilterRegexActivity.py lldb-api :: lang/cpp/this/TestCPPThis.py lldb-api :: functionalities/postmortem/minidump-new/TestMiniDumpNew.py lldb-api :: commands/expression/radar_9531204/TestPrintfAfterUp.py lldb-api :: commands/frame/diagnose/virtual-method-call/TestDiagnoseDereferenceVirtualMethodCall.py lldb-api :: commands/log/basic/TestLogging.py lldb-api :: commands/watchpoints/watchpoint_size/TestWatchpointSizes.py lldb-api :: commands/frame/diagnose/array/TestArray.py lldb-api :: python_api/signals/TestSignalsAPI.py lldb-api :: lang/objc/objc-new-syntax/TestObjCNewSyntaxDictionary.py lldb-api :: python_api/value/TestValueAPI.py lldb-api :: functionalities/data-formatter/data-formatter-stl/libstdcpp/tuple/TestDataFormatterStdTuple.py lldb-api :: commands/watchpoints/watchpoint_commands/TestWatchpointCommands.py lldb-api :: functionalities/data-formatter/data-formatter-objc/TestDataFormatterObjCNSDate.py lldb-api :: commands/apropos/with-process/TestAproposWithProcess.py lldb-api :: functionalities/breakpoint/inlined_breakpoints/TestInlinedBreakpoints.py lldb-api :: macosx/function-starts/TestFunctionStarts.py lldb-api :: functionalities/testid/TestTestId.py lldb-api :: functionalities/wrong_commands/TestWrongCommands.py lldb-api :: functionalities/modern-type-lookup/basic/TestBasicModernTypeLookup.py lldb-api :: commands/expression/import-std-module/weak_ptr/TestWeakPtr.py lldb-api :: tools/lldb-vscode/breakpoint/TestVSCode_setBreakpoints.py lldb-api :: commands/statistics/basic/TestStats.py lldb-api :: functionalities/thread/concurrent_events/TestConcurrentManyWatchpoints.py lldb-api :: lang/cpp/exceptions/TestCPPExceptionBreakpoints.py lldb-api :: lang/cpp/diamond/TestDiamond.py lldb-api :: tools/lldb-server/TestGdbRemoteExitCode.py lldb-api :: functionalities/data-formatter/data-formatter-stl/libstdcpp/smart_ptr/TestDataFormatterStdSmartPtr.py lldb-api :: lang/objc/objc-optimized/TestObjcOptimized.py lldb-api :: commands/expression/import-std-module/stack/TestStack.py lldb-api :: functionalities/darwin_log/filter/regex/category/TestDarwinLogFilterRegexCategory.py lldb-api :: commands/expression/argument_passing_restrictions/TestArgumentPassingRestrictions.py lldb-api :: functionalities/data-formatter/poarray/TestPrintObjectArray.py lldb-api :: functionalities/paths/TestPaths.py lldb-api :: functionalities/data-formatter/ptr_ref_typedef/TestPtrRef2Typedef.py lldb-api :: functionalities/breakpoint/dummy_target_breakpoints/TestBreakpointsWithNoTargets.py lldb-api :: functionalities/breakpoint/cpp_exception/TestCPPExceptionBreakpoint.py lldb-api :: commands/expression/function_template_specialization_temp_args/TestFunctionTemplateSpecializationTempArgs.py lldb-api :: functionalities/thread/concurrent_events/TestConcurrentCrashWithSignal.py lldb-api :: functionalities/data-formatter/data-formatter-synthtype/TestDataFormatterSynthType.py lldb-api :: lang/objc/blocks/TestObjCIvarsInBlocks.py lldb-api :: lang/cpp/frame-var-anon-unions/TestFrameVariableAnonymousUnions.py lldb-api :: lang/objc/objc-builtin-types/TestObjCBuiltinTypes.py lldb-api :: sample_test/TestSampleTest.py lldb-api :: iohandler/completion/TestIOHandlerCompletion.py lldb-api :: functionalities/process_group/TestChangeProcessGroup.py lldb-api :: functionalities/darwin_log/filter/regex/activity-chain/TestDarwinLogFilterRegexActivityChain.py lldb-api :: lang/cpp/static_members/TestCPPStaticMembers.py lldb-api :: functionalities/tail_call_frames/ambiguous_tail_call_seq2/TestAmbiguousTailCallSeq2.py lldb-api :: functionalities/abbreviation/TestCommonShortSpellings.py lldb-api :: functionalities/thread/break_after_join/TestBreakAfterJoin.py lldb-api :: python_api/function_symbol/TestSymbolAPI.py lldb-api :: macosx/queues/TestQueues.py lldb-api :: functionalities/show_location/TestShowLocationDwarf5.py lldb-api :: commands/watchpoints/variable_out_of_scope/TestWatchedVarHitWhenInScope.py lldb-api :: commands/target/stop-hooks/TestStopHooks.py lldb-api :: python_api/lldbutil/TestSwigVersion.py lldb-api :: tools/lldb-server/register-reading/TestGdbRemoteGPacket.py lldb-api :: python_api/watchpoint/TestSetWatchpoint.py lldb-api :: lang/objc/objc-runtime-ivars/TestRuntimeIvars.py lldb-api :: python_api/sbvalue_const_addrof/TestSBValueConstAddrOf.py lldb-api :: functionalities/signal/raise/TestRaise.py lldb-api :: python_api/thread/TestThreadAPI.py lldb-api :: functionalities/breakpoint/breakpoint_ignore_count/TestBreakpointIgnoreCount.py lldb-api :: functionalities/ubsan/basic/TestUbsanBasic.py lldb-api :: commands/process/attach-resume/TestAttachResume.py lldb-api :: functionalities/data-formatter/stringprinter/TestStringPrinter.py lldb-api :: python_api/frame/inlines/TestInlinedFrame.py lldb-api :: functionalities/breakpoint/hardware_breakpoints/hardware_breakpoint_on_multiple_threads/TestHWBreakMultiThread.py lldb-api :: tools/lldb-server/TestGdbRemoteThreadsInStopReply.py lldb-api :: functionalities/darwin_log/filter/regex/message/TestDarwinLogFilterRegexMessage.py lldb-api :: lang/c/step-target/TestStepTarget.py lldb-api :: functionalities/inferior-crashing/TestInferiorCrashing.py lldb-api :: functionalities/data-formatter/data-formatter-objc/TestDataFormatterObjCNSBundle.py lldb-api :: commands/expression/ir-interpreter-phi-nodes/TestIRInterpreterPHINodes.py lldb-api :: commands/expression/radar_8638051/Test8638051.py lldb-api :: lang/objc/rdar-12408181/TestRdar12408181.py lldb-api :: android/platform/TestDefaultCacheLineSize.py lldb-api :: functionalities/pre_run_dylibs/TestPreRunDylibs.py lldb-api :: python_api/event/TestEvents.py lldb-api :: lang/objc/foundation/TestConstStrings.py lldb-api :: lang/cpp/virtual/TestVirtual.py lldb-api :: commands/expression/completion-crash2/TestCompletionCrash2.py lldb-api :: commands/watchpoints/watchpoint_set_command/TestWatchLocationWithWatchSet.py lldb-api :: lang/cpp/call-function/TestCallCPPFunction.py lldb-api :: commands/source/info/TestSourceInfo.py lldb-api :: lang/cpp/std-function-step-into-callable/TestStdFunctionStepIntoCallable.py lldb-api :: functionalities/data-formatter/data-formatter-objc/TestDataFormatterObjNSException.py lldb-api :: functionalities/modern-type-lookup/basic-objc/TestBasicObjcModernTypeLookup.py lldb-api :: functionalities/thread/concurrent_events/TestConcurrentBreakpointOneDelayBreakpointThreads.py lldb-api :: lang/objc/foundation/TestObjCMethodsNSError.py lldb-api :: lang/cpp/printf/TestPrintf.py lldb-api :: lang/cpp/static_methods/TestCPPStaticMethods.py lldb-api :: functionalities/conditional_break/TestConditionalBreak.py lldb-api :: lang/objc/objc-super/TestObjCSuper.py lldb-api :: tools/lldb-server/TestGdbRemoteAttach.py lldb-api :: commands/expression/import-std-module/list-dbg-info-content/TestDbgInfoContentList.py lldb-api :: functionalities/data-formatter/data-formatter-categories/TestDataFormatterCategories.py lldb-api :: functionalities/mtc/simple/TestMTCSimple.py lldb-api :: commands/expression/xvalue/TestXValuePrinting.py lldb-api :: commands/expression/import-std-module/queue/TestQueue.py lldb-api :: python_api/disassemble-raw-data/TestDisassembleRawData.py lldb-api :: functionalities/gdb_remote_client/TestArmRegisterDefinition.py lldb-api :: python_api/hello_world/TestHelloWorld.py lldb-api :: lang/objc/modules-inline-functions/TestModulesInlineFunctions.py lldb-api :: lang/cpp/scope/TestCppScope.py lldb-api :: functionalities/darwin_log/filter/exact_match/message/TestDarwinLogFilterMatchMessage.py lldb-api :: functionalities/thread/concurrent_events/TestConcurrentManyCrash.py lldb-api :: commands/expression/scoped_enums/TestScopedEnumType.py lldb-api :: functionalities/breakpoint/serialize/TestBreakpointSerialization.py lldb-api :: lang/cpp/extern_c/TestExternCSymbols.py lldb-api :: functionalities/thread/crash_during_step/TestCrashDuringStep.py lldb-api :: functionalities/thread/concurrent_events/TestConcurrentManySignals.py lldb-api :: python_api/formatters/TestFormattersSBAPI.py lldb-api :: functionalities/data-formatter/data-formatter-stl/libcxx/list/TestDataFormatterLibcxxList.py lldb-api :: functionalities/thread/concurrent_events/TestConcurrentCrashWithWatchpoint.py lldb-api :: functionalities/data-formatter/parray/TestPrintArray.py lldb-api :: python_api/sbtype_typeclass/TestSBTypeTypeClass.py lldb-api :: functionalities/data-formatter/data-formatter-script/TestDataFormatterScript.py lldb-api :: functionalities/data-formatter/frameformat_smallstruct/TestFrameFormatSmallStruct.py lldb-api :: functionalities/signal/handle-abrt/TestHandleAbort.py lldb-api :: python_api/sbvalue_persist/TestSBValuePersist.py lldb-api :: linux/sepdebugsymlink/TestTargetSymbolsSepDebugSymlink.py lldb-api :: commands/expression/test/TestExprs.py lldb-api :: functionalities/data-formatter/data-formatter-disabling/TestDataFormatterDisabling.py lldb-api :: python_api/lldbutil/process/TestPrintStackTraces.py lldb-api :: arm/breakpoint-thumb-codesection/TestBreakpointThumbCodesection.py lldb-api :: lang/cpp/accelerator-table/TestCPPAccelerator.py lldb-api :: lang/cpp/symbols/TestSymbols.py lldb-api :: tools/lldb-server/TestGdbRemoteRegisterState.py lldb-api :: functionalities/breakpoint/breakpoint_language/TestBreakpointLanguage.py lldb-api :: python_api/value_var_update/TestValueVarUpdate.py lldb-api :: functionalities/postmortem/minidump-new/TestMiniDumpUUID.py lldb-api :: python_api/process/read-mem-cstring/TestReadMemCString.py lldb-api :: functionalities/data-formatter/data-formatter-objc/TestDataFormatterObjCNSError.py lldb-api :: commands/expression/po_verbosity/TestPoVerbosity.py lldb-api :: lang/objc/objc-new-syntax/TestObjCNewSyntaxArray.py lldb-api :: macosx/find-app-in-bundle/TestFindAppInBundle.py lldb-api :: commands/register/register/intel_xtended_registers/mpx_offset_intersection/TestMPXOffsetIntersection.py lldb-api :: commands/frame/diagnose/dereference-function-return/TestDiagnoseDereferenceFunctionReturn.py lldb-api :: functionalities/data-formatter/data-formatter-stl/libstdcpp/vector/TestDataFormatterStdVector.py lldb-api :: functionalities/param_entry_vals/basic_entry_values_x86_64/TestBasicEntryValuesX86_64.py lldb-api :: lang/cpp/type_lookup/TestCppTypeLookup.py lldb-api :: commands/platform/basic/TestPlatformPython.py lldb-api :: lang/cpp/const_this/TestConstThis.py lldb-api :: functionalities/data-formatter/data-formatter-cpp/TestDataFormatterCpp.py lldb-api :: functionalities/data-formatter/data-formatter-enum-format/TestDataFormatterEnumFormat.py lldb-api :: functionalities/data-formatter/data-formatter-stl/libcxx/set/TestDataFormatterLibcxxSet.py lldb-api :: functionalities/data-formatter/setvaluefromcstring/TestSetValueFromCString.py lldb-api :: commands/expression/fixits/TestFixIts.py lldb-api :: functionalities/data-formatter/data-formatter-stl/libcxx/tuple/TestDataFormatterLibcxxTuple.py lldb-api :: lang/cpp/unique-types/TestUniqueTypes.py lldb-api :: functionalities/data-formatter/data-formatter-skip-summary/TestDataFormatterSkipSummary.py lldb-api :: commands/expression/invalid-args/TestInvalidArgsExpression.py lldb-api :: commands/expression/weak_symbols/TestWeakSymbols.py lldb-api :: functionalities/modern-type-lookup/objc-modules/TestObjModulesModernTypeLookup.py lldb-api :: lang/objc/modules/TestObjCModules.py lldb-api :: lang/cpp/nsimport/TestCppNsImport.py lldb-api :: types/TestDoubleTypes.py lldb-api :: functionalities/darwin_log/filter/exact_match/subsystem/TestDarwinLogFilterMatchSubsystem.py lldb-api :: functionalities/tail_call_frames/thread_step_out_or_return/TestSteppingOutWithArtificialFrames.py lldb-api :: tools/lldb-server/TestGdbRemoteSingleStep.py lldb-api :: lang/c/typedef/Testtypedef.py lldb-api :: functionalities/gdb_remote_client/TestNestedRegDefinitions.py lldb-api :: functionalities/object-file/TestImageListMultiArchitecture.py lldb-api :: python_api/findvalue_duplist/TestSBFrameFindValue.py lldb-api :: functionalities/thread/exit_during_break/TestExitDuringBreak.py lldb-api :: benchmarks/expression/TestExpressionCmd.py lldb-api :: commands/target/basic/TestTargetCommand.py lldb-api :: functionalities/tail_call_frames/ambiguous_tail_call_seq1/TestAmbiguousTailCallSeq1.py lldb-api :: commands/expression/expr-in-syscall/TestExpressionInSyscall.py lldb-api :: functionalities/signal/TestSendSignal.py lldb-api :: functionalities/data-formatter/language_category_updates/TestDataFormatterLanguageCategoryUpdates.py lldb-api :: python_api/value/change_values/TestChangeValueAPI.py lldb-api :: lang/objc/objc-stepping/TestObjCStepping.py lldb-api :: python_api/debugger/TestDebuggerAPI.py lldb-api :: functionalities/tail_call_frames/inlining_and_tail_calls/TestInliningAndTailCalls.py lldb-api :: commands/expression/import-std-module/deque-basic/TestBasicDeque.py lldb-api :: tools/lldb-server/signal-filtering/TestGdbRemote_QPassSignals.py lldb-api :: functionalities/source-map/TestTargetSourceMap.py lldb-api :: python_api/lldbutil/iter/TestLLDBIterator.py lldb-api :: functionalities/breakpoint/breakpoint_names/TestBreakpointNames.py lldb-api :: lang/cpp/gmodules/TestWithModuleDebugging.py lldb-api :: functionalities/data-formatter/data-formatter-stl/libcxx/multiset/TestDataFormatterLibcxxMultiSet.py lldb-api :: commands/expression/two-files/TestObjCTypeQueryFromOtherCompileUnit.py lldb-api :: functionalities/data-formatter/data-formatter-stl/libcxx/vbool/TestDataFormatterLibcxxVBool.py lldb-api :: functionalities/data-formatter/data-formatter-stl/libcxx/vector/TestDataFormatterLibcxxVector.py lldb-api :: functionalities/var_path/TestVarPath.py lldb-api :: commands/expression/call-function/TestCallBuiltinFunction.py lldb-api :: api/multiple-debuggers/TestMultipleDebuggers.py lldb-api :: functionalities/data-formatter/data-formatter-advanced/TestDataFormatterAdv.py lldb-api :: functionalities/breakpoint/debugbreak/TestDebugBreak.py lldb-api :: commands/expression/call-overridden-method/TestCallOverriddenMethod.py lldb-api :: functionalities/exec/TestExec.py lldb-api :: lang/cpp/breakpoint-commands/TestCPPBreakpointCommands.py lldb-api :: functionalities/postmortem/minidump/TestMiniDump.py lldb-api :: commands/expression/ir-interpreter/TestIRInterpreter.py lldb-api :: functionalities/thread/jump/TestThreadJump.py lldb-api :: functionalities/unwind/noreturn/module-end/TestNoReturnModuleEnd.py lldb-api :: lang/cpp/function-template-parameter-pack/TestFunctionTemplateParameterPack.py lldb-api :: lang/c/const_variables/TestConstVariables.py lldb-api :: lang/c/global_variables/TestGlobalVariables.py lldb-api :: lang/cpp/overloaded-functions/TestOverloadedFunctions.py lldb-api :: commands/disassemble/basic/TestDisassembleBreakpoint.py lldb-api :: functionalities/breakpoint/breakpoint_command/TestBreakpointCommand.py lldb-api :: lang/cpp/rvalue-references/TestRvalueReferences.py lldb-api :: lang/c/array_types/TestArrayTypes.py lldb-api :: functionalities/tsan/cpp_global_location/TestTsanCPPGlobalLocation.py lldb-api :: lang/cpp/global_variables/TestCPPGlobalVariables.py lldb-api :: functionalities/data-formatter/type_summary_list_script/TestTypeSummaryListScript.py lldb-api :: benchmarks/continue/TestBenchmarkContinue.py lldb-api :: lang/objc/objc-static-method-stripped/TestObjCStaticMethodStripped.py lldb-api :: functionalities/modern-type-lookup/libcxx/TestLibCxxModernTypeLookup.py lldb-api :: functionalities/tsan/multiple/TestTsanMultiple.py lldb-api :: functionalities/tail_call_frames/disambiguate_tail_call_seq/TestDisambiguateTailCallSeq.py lldb-api :: lang/cpp/char8_t/TestCxxChar8_t.py lldb-api :: lang/objc/real-definition/TestRealDefinition.py lldb-api :: python_api/process/TestProcessAPI.py lldb-api :: lang/cpp/virtual-overload/TestVirtualOverload.py lldb-api :: functionalities/data-formatter/data-formatter-objc/TestDataFormatterObjCPlain.py lldb-api :: commands/expression/test/TestExprs2.py lldb-api :: functionalities/thread/state/TestThreadStates.py lldb-api :: python_api/name_lookup/TestNameLookup.py lldb-api :: lang/cpp/auto/TestCPPAuto.py lldb-api :: functionalities/data-formatter/data-formatter-stl/libcxx/atomic/TestLibCxxAtomic.py lldb-api :: lang/objc/ptr_refs/TestPtrRefsObjC.py lldb-api :: functionalities/thread/concurrent_events/TestConcurrentSignalDelayBreak.py lldb-api :: commands/platform/basic/TestPlatformCommand.py lldb-api :: commands/expression/completion-crash1/TestCompletionCrash1.py lldb-api :: functionalities/ubsan/user-expression/TestUbsanUserExpression.py lldb-api :: functionalities/breakpoint/comp_dir_symlink/TestCompDirSymLink.py lldb-api :: functionalities/breakpoint/cpp/TestCPPBreakpointLocations.py lldb-api :: functionalities/data-formatter/data-formatter-proper-plurals/TestFormattersOneIsSingular.py lldb-api :: functionalities/multidebugger_commands/TestMultipleDebuggersCommands.py lldb-api :: commands/expression/persistent_variables/TestPersistentVariables.py lldb-api :: api/multithreaded/TestMultithreaded.py lldb-api :: lang/objc/objc-ivar-offsets/TestObjCIvarOffsets.py lldb-api :: tools/lldb-server/platform-process-connect/TestPlatformProcessConnect.py lldb-api :: macosx/lc-note/kern-ver-str/TestKernVerStrLCNOTE.py lldb-api :: commands/expression/class_template_specialization_empty_pack/TestClassTemplateSpecializationParametersHandling.py lldb-api :: commands/quit/TestQuit.py lldb-api :: functionalities/breakpoint/consecutive_breakpoints/TestConsecutiveBreakpoints.py lldb-api :: functionalities/postmortem/wow64_minidump/TestWow64MiniDump.py lldb-api :: lang/objc/foundation/TestSymbolTable.py lldb-api :: linux/thread/create_during_instruction_step/TestCreateDuringInstructionStep.py lldb-api :: lang/cpp/breakpoint_in_member_func_w_non_primitive_params/TestBreakpointInMemberFuncWNonPrimitiveParams.py lldb-api :: lang/objc/objc-property/TestObjCProperty.py lldb-api :: lang/objc/hidden-ivars/TestHiddenIvars.py lldb-api :: lang/objc/foundation/TestRuntimeTypes.py lldb-api :: functionalities/data-formatter/data-formatter-objc/TestDataFormatterObjCNSURL.py lldb-api :: functionalities/archives/TestBSDArchives.py lldb-api :: python_api/value/empty_class/TestValueAPIEmptyClass.py lldb-api :: commands/command/script_alias/TestCommandScriptAlias.py lldb-api :: lang/cpp/dynamic-value/TestCppValueCast.py lldb-api :: commands/expression/call-function/TestCallStopAndContinue.py lldb-api :: functionalities/thread/num_threads/TestNumThreads.py lldb-api :: lang/cpp/dynamic-value/TestDynamicValue.py lldb-api :: functionalities/tty/TestTerminal.py lldb-api :: functionalities/stats_api/TestStatisticsAPI.py lldb-api :: functionalities/completion/TestCompletion.py lldb-api :: functionalities/thread/concurrent_events/TestConcurrentWatchBreak.py lldb-api :: commands/expression/rdar42038760/TestScalarURem.py lldb-api :: functionalities/data-formatter/compactvectors/TestCompactVectors.py lldb-api :: commands/expression/import-std-module/shared_ptr-dbg-info-content/TestSharedPtrDbgInfoContent.py lldb-api :: lang/objc/self/TestObjCSelf.py lldb-api :: functionalities/breakpoint/breakpoint_in_delayslot/TestAvoidBreakpointInDelaySlot.py lldb-api :: commands/watchpoints/watchpoint_on_vectors/TestValueOfVectorVariable.py lldb-api :: python_api/watchpoint/watchlocation/TestSetWatchlocation.py lldb-api :: functionalities/darwin_log/source/info/TestDarwinLogSourceInfo.py lldb-api :: lang/cpp/inlines/TestInlines.py lldb-api :: functionalities/tail_call_frames/unambiguous_sequence/TestUnambiguousTailCalls.py lldb-api :: macosx/find-dsym/bundle-with-dot-in-filename/TestBundleWithDotInFilename.py lldb-api :: functionalities/tail_call_frames/disambiguate_call_site/TestDisambiguateCallSite.py lldb-api :: functionalities/avoids-fd-leak/TestFdLeak.py lldb-api :: macosx/nslog/TestDarwinNSLogOutput.py lldb-api :: functionalities/data-formatter/data-formatter-objc/TestDataFormatterObjCExpr.py lldb-api :: functionalities/inferior-crashing/TestInferiorCrashingStep.py lldb-api :: commands/expression/namespace_local_var_same_name_cpp_and_c/TestNamespaceLocalVarSameNameCppAndC.py lldb-api :: commands/expression/import-std-module/vector-dbg-info-content/TestDbgInfoContentVector.py lldb-api :: lang/cpp/class_types/TestClassTypes.py lldb-api :: functionalities/inline-stepping/TestInlineStepping.py lldb-api :: functionalities/data-formatter/data-formatter-stl/libstdcpp/unique_ptr/TestDataFormatterStdUniquePtr.py lldb-api :: linux/add-symbols/TestTargetSymbolsAddCommand.py lldb-api :: lang/cpp/stl/TestSTL.py lldb-api :: functionalities/plugins/python_os_plugin/TestPythonOSPlugin.py lldb-api :: lang/cpp/llvm-style/TestLLVMStyle.py lldb-api :: functionalities/thread/concurrent_events/TestConcurrentTwoWatchpointsOneSignal.py lldb-api :: functionalities/process_save_core/TestProcessSaveCore.py lldb-api :: tools/lldb-server/TestGdbRemote_vCont.py lldb-api :: lang/cpp/class_types/TestClassTypesDisassembly.py lldb-api :: commands/expression/persist_objc_pointeetype/TestPersistObjCPointeeType.py lldb-api :: benchmarks/stepping/TestSteppingSpeed.py lldb-api :: lang/c/register_variables/TestRegisterVariables.py lldb-api :: functionalities/unwind/ehframe/TestEhFrameUnwind.py lldb-api :: commands/register/register/register_command/TestRegisters.py lldb-api :: functionalities/data-formatter/pyobjsynthprovider/TestPyObjSynthProvider.py lldb-api :: commands/expression/pr35310/TestExprsBug35310.py lldb-api :: tools/lldb-server/TestGdbRemoteModuleInfo.py lldb-api :: tools/lldb-server/inferior-crash/TestGdbRemoteSegFault.py lldb-api :: functionalities/data-formatter/user-format-vs-summary/TestUserFormatVsSummary.py lldb-api :: lang/c/anonymous/TestAnonymous.py lldb-api :: functionalities/data-formatter/data-formatter-synth/TestDataFormatterSynth.py lldb-api :: lang/objc/objc-class-method/TestObjCClassMethod.py lldb-api :: commands/expression/unicode-in-variable/TestUnicodeInVariable.py lldb-api :: lang/cpp/class_static/TestStaticVariables.py lldb-api :: lang/cpp/function_refs/TestFunctionRefs.py lldb-api :: functionalities/postmortem/elf-core/TestLinuxCore.py lldb-api :: functionalities/set-data/TestSetData.py lldb-api :: functionalities/asan/TestMemoryHistory.py lldb-api :: functionalities/breakpoint/breakpoint_command/TestBreakpointCommandsFromPython.py lldb-api :: commands/process/attach/attach_denied/TestAttachDenied.py lldb-api :: functionalities/unwind/sigtramp/TestSigtrampUnwind.py lldb-api :: lang/c/shared_lib_stripped_symbols/TestSharedLibStrippedSymbols.py lldb-api :: benchmarks/startup/TestStartupDelays.py lldb-api :: functionalities/data-formatter/data-formatter-stl/libcxx/optional/TestDataFormatterLibcxxOptional.py lldb-api :: functionalities/thread/concurrent_events/TestConcurrentManyBreakpoints.py lldb-api :: python_api/interpreter/TestCommandInterpreterAPI.py lldb-api :: commands/expression/formatters/TestFormatters.py lldb-api :: functionalities/breakpoint/auto_continue/TestBreakpointAutoContinue.py lldb-api :: lang/c/stepping/TestThreadStepping.py lldb-api :: lang/objc/objc-static-method/TestObjCStaticMethod.py lldb-api :: lang/c/find_struct_type/TestFindStructTypes.py lldb-api :: functionalities/data-formatter/nsdictionarysynth/TestNSDictionarySynthetic.py lldb-api :: sample_test/TestSampleInlineTest.py lldb-api :: lang/objc/modules-incomplete/TestIncompleteModules.py lldb-api :: commands/watchpoints/multiple_threads/TestWatchpointMultipleThreads.py lldb-api :: lang/objc/variadic_methods/TestVariadicMethods.py lldb-api :: commands/expression/import-std-module/vector-of-vectors/TestVectorOfVectors.py lldb-api :: functionalities/thread/concurrent_events/TestConcurrentWatchpointWithDelayWatchpointThreads.py lldb-api :: python_api/watchpoint/TestWatchpointIgnoreCount.py lldb-api :: macosx/thread-names/TestInterruptThreadNames.py lldb-api :: functionalities/data-formatter/nsarraysynth/TestNSArraySynthetic.py lldb-api :: functionalities/data-formatter/boolreference/TestFormattersBoolRefPtr.py lldb-api :: commands/expression/import_builtin_fileid/TestImportBuiltinFileID.py lldb-api :: commands/expression/diagnostics/TestExprDiagnostics.py lldb-api :: tools/lldb-vscode/launch/TestVSCode_launch.py lldb-api :: python_api/watchpoint/watchlocation/TestTargetWatchAddress.py lldb-api :: functionalities/tail_call_frames/disambiguate_paths_to_common_sink/TestDisambiguatePathsToCommonSink.py lldb-api :: functionalities/thread/concurrent_events/TestConcurrentCrashWithWatchpointBreakpointSignal.py lldb-api :: lang/objc/rdar-11355592/TestRdar11355592.py lldb-api :: functionalities/breakpoint/breakpoint_hit_count/TestBreakpointHitCount.py lldb-api :: functionalities/data-formatter/data-formatter-objc/TestDataFormatterObjCNSData.py lldb-api :: functionalities/return-value/TestReturnValue.py lldb-api :: functionalities/darwin_log/filter/exact_match/category/TestDarwinLogFilterMatchCategory.py lldb-api :: functionalities/data-formatter/data-formatter-stl/libcxx/unordered/TestDataFormatterUnordered.py lldb-api :: functionalities/multiword-commands/TestMultiWordCommands.py lldb-api :: benchmarks/expression/TestRepeatedExprs.py lldb-api :: commands/add-dsym/uuid/TestAddDsymCommand.py lldb-api :: lang/cpp/nested-class-other-compilation-unit/TestNestedClassWithParentInAnotherCU.py lldb-api :: python_api/symbol-context/TestSymbolContext.py lldb-api :: lang/objcxx/class-name-clash/TestNameClash.py lldb-api :: lang/objc/modules-auto-import/TestModulesAutoImport.py lldb-api :: lang/c/stepping/TestStepAndBreakpoints.py lldb-api :: functionalities/target_var/TestTargetVar.py lldb-api :: functionalities/unwind/standard/TestStandardUnwind.py lldb-api :: functionalities/data-formatter/data-formatter-objc/TestDataFormatterObjCCF.py lldb-api :: python_api/class_members/TestSBTypeClassMembers.py lldb-api :: functionalities/darwin_log/filter/exact_match/activity-chain/TestDarwinLogFilterMatchActivityChain.py lldb-api :: source-manager/TestSourceManager.py lldb-api :: commands/expression/import-std-module/weak_ptr-dbg-info-content/TestDbgInfoContentWeakPtr.py lldb-api :: lang/cpp/chained-calls/TestCppChainedCalls.py lldb-api :: functionalities/darwin_log/filter/regex/subsystem/TestDarwinLogFilterRegexSubsystem.py lldb-api :: macosx/universal/TestUniversal.py lldb-api :: lang/c/local_types/TestUseClosestType.py lldb-api :: functionalities/data-formatter/data-formatter-stl/libcxx/queue/TestDataFormatterLibcxxQueue.py lldb-api :: commands/frame/diagnose/inheritance/TestDiagnoseInheritance.py lldb-api :: commands/watchpoints/watchpoint_disable/TestWatchpointDisable.py lldb-api :: commands/expression/import-std-module/deque-dbg-info-content/TestDbgInfoContentDeque.py lldb-api :: lang/objc/objc-baseclass-sbtype/TestObjCBaseClassSBType.py lldb-api :: commands/expression/import-std-module/empty-module/TestEmptyStdModule.py lldb-api :: benchmarks/frame_variable/TestFrameVariableResponse.py lldb-api :: lang/cpp/unicode-literals/TestUnicodeLiterals.py lldb-api :: functionalities/step-avoids-no-debug/TestStepNoDebug.py lldb-api :: commands/expression/macros/TestMacros.py lldb-api :: functionalities/data-formatter/data-formatter-stl/libcxx/function/TestLibCxxFunction.py lldb-api :: lang/objc/exceptions/TestObjCExceptions.py lldb-api :: functionalities/tsan/thread_numbers/TestTsanThreadNumbers.py lldb-api :: macosx/DBGSourcePathRemapping/TestDSYMSourcePathRemapping.py lldb-api :: functionalities/data-formatter/synthupdate/TestSyntheticFilterRecompute.py lldb-api :: commands/expression/import-std-module/forward_list-dbg-info-content/TestDbgInfoContentForwardList.py lldb-api :: functionalities/tail_call_frames/sbapi_support/TestTailCallFrameSBAPI.py lldb-api :: lang/cpp/namespace/TestNamespaceLookup.py lldb-api :: lang/c/unions/TestUnionMembers.py lldb-api :: lang/cpp/namespace_definitions/TestNamespaceDefinitions.py lldb-api :: lang/cpp/gmodules-templates/TestGModules.py lldb-api :: functionalities/thread/concurrent_events/TestConcurrentTwoBreakpointsOneDelaySignal.py lldb-api :: lang/objc/objc-struct-argument/TestObjCStructArgument.py lldb-api :: lang/c/shared_lib/TestSharedLib.py lldb-api :: python_api/sbstructureddata/TestStructuredDataAPI.py lldb-api :: functionalities/abbreviation/TestAbbreviations.py lldb-api :: python_api/module_section/TestModuleAndSection.py lldb-api :: commands/settings/TestSettings.py lldb-api :: commands/expression/inline-namespace/TestInlineNamespace.py lldb-api :: functionalities/thread/concurrent_events/TestConcurrentTwoBreakpointThreads.py lldb-api :: functionalities/data-formatter/format-propagation/TestFormatPropagation.py lldb-api :: commands/command/nested_alias/TestNestedAlias.py

Hide Details

Hide Details

Slowest Tests: -------------------------------------------------------------------------- 25.30s: lldb-shell :: Reproducer/Modules/TestModuleCXX.test 25.35s: lldb-shell :: Reproducer/Functionalities/TestStepping.test 26.46s: lldb-shell :: Process/TestEnvironment.test 27.01s: lldb-shell :: Reproducer/TestFileRepro.test 27.12s: lldb-shell :: Reproducer/Functionalities/TestExpressionEvaluation.test 31.17s: lldb-shell :: SymbolFile/DWARF/debug-types-missing-signature.test 32.04s: lldb-shell :: SymbolFile/DWARF/find-function-regex.cpp 34.45s: lldb-shell :: ObjectFile/Breakpad/breakpad-identification.test 36.58s: lldb-shell :: ExecControl/StopHook/stop-hook.test 37.78s: lldb-shell :: Reproducer/TestDump.test 39.46s: lldb-shell :: Reproducer/TestReuseDirectory.test 44.53s: lldb-shell :: SymbolFile/DWARF/debug-types-basic.test 52.23s: lldb-shell :: SymbolFile/DWARF/find-basic-namespace.cpp 54.69s: lldb-shell :: Minidump/fb-dump.test 55.63s: lldb-shell :: SymbolFile/DWARF/find-basic-type.cpp 60.57s: lldb-shell :: SymbolFile/DWARF/find-variable-file.cpp 66.22s: lldb-shell :: SymbolFile/DWARF/find-basic-variable.cpp 71.05s: lldb-shell :: Expr/TestIRMemoryMap.test 86.45s: lldb-shell :: SymbolFile/DWARF/find-basic-function.cpp 93.44s: lldb-shell :: Minidump/dump-all.test

Hide Details

Tests Times: -------------------------------------------------------------------------- [ Range ] :: [ Percentage ] :: [ Count ] -------------------------------------------------------------------------- [ 0.0s, 5.0s) :: [****************** ] :: [ 846/1799] [ 5.0s,10.0s) :: [******************* ] :: [ 863/1799] [10.0s,15.0s) :: [ ] :: [ 41/1799] [15.0s,20.0s) :: [ ] :: [ 16/1799] [20.0s,25.0s) :: [ ] :: [ 10/1799] [25.0s,30.0s) :: [ ] :: [ 8/1799] [30.0s,35.0s) :: [ ] :: [ 2/1799] [35.0s,40.0s) :: [ ] :: [ 3/1799] [40.0s,45.0s) :: [ ] :: [ 1/1799] [45.0s,50.0s) :: [ ] :: [ 1/1799] [50.0s,55.0s) :: [ ] :: [ 1/1799] [55.0s,60.0s) :: [ ] :: [ 2/1799] [60.0s,65.0s) :: [ ] :: [ 1/1799] [65.0s,70.0s) :: [ ] :: [ 1/1799] [70.0s,75.0s) :: [ ] :: [ 1/1799] [75.0s,80.0s) :: [ ] :: [ 0/1799] [80.0s,85.0s) :: [ ] :: [ 0/1799] [85.0s,90.0s) :: [ ] :: [ 1/1799] [90.0s,95.0s) :: [ ] :: [ 1/1799] Expected Passes : 974 Expected Failures : 6 Unsupported Tests : 51 Unresolved Tests : 767 Unexpected Failures: 1 FAILED: tools/lldb/test/CMakeFiles/check-lldb-lit cd /Users/buildslave/jenkins/workspace/lldb-cmake-sanitized/lldb-build/tools/lldb/test && /usr/local/bin/python /Users/buildslave/jenkins/workspace/lldb-cmake-sanitized/lldb-build/./bin/llvm-lit -v --time-tests --shuffle --xunit-xml-output=/Users/buildslave/jenkins/workspace/lldb-cmake-sanitized/test/results.xml -v --timeout 1200 /Users/buildslave/jenkins/workspace/lldb-cmake-sanitized/lldb-build/tools/lldb/test ninja: build stopped: subcommand failed. Command failed: Command '['/usr/bin/env', 'TERM=vt100', '/usr/local/bin/ninja', '-v', 'check-lldb']' returned non-zero exit status 1. Command: ['/usr/bin/env', 'TERM=vt100', '/usr/local/bin/ninja', '-v', 'check-lldb'] [Pipeline] } [Pipeline] // timeout [Pipeline] } [Pipeline] // stage [Pipeline] stage [Pipeline] { (Declarative: Post Actions) [Pipeline] scanForIssues No credentials specified [Clang (LLVM based)] Sleeping for 5 seconds due to JENKINS-32191... [Clang (LLVM based)] Parsing console log (workspace: '/Users/buildslave/jenkins/workspace/lldb-cmake-sanitized') [Pipeline] junit Recording test results [Pipeline] } [Pipeline] // stage [Pipeline] } [Pipeline] // withEnv [Pipeline] } [Pipeline] // node [Pipeline] End of Pipeline [BFA] Scanning build for known causes... [BFA] Found failure cause(s): [BFA] Ninja target failed from category Compile [BFA] Regression test failed from category Test [BFA] Done. 1s ERROR: script returned exit code 1 Finished: FAILURE