FailedConsole Output

Skipping 545 KB.. Full Log
b-api :: commands/frame/diagnose/dereference-this/TestDiagnoseDereferenceThis.py (297 of 1794)
PASS: lldb-unit :: Signals/./SignalsTests/UnixSignalsTest.Iteration (298 of 1794)
PASS: lldb-unit :: Utility/./UtilityTests/ArgsTest.StringListConstructor (299 of 1794)
PASS: lldb-shell :: Driver/TestTarget.test (300 of 1794)
PASS: lldb-unit :: Utility/./UtilityTests/StringListTest.LongestCommonPrefixEmpty (301 of 1794)
PASS: lldb-api :: lang/c/stepping/TestThreadStepping.py (302 of 1794)
PASS: lldb-api :: commands/frame/diagnose/array/TestArray.py (303 of 1794)
PASS: lldb-shell :: SymbolFile/DWARF/dwarf5-index-is-used.cpp (304 of 1794)
PASS: lldb-shell :: Quit/TestQuitExitCodeNonInt.test (305 of 1794)
PASS: lldb-unit :: UnwindAssembly/x86/./UnwindAssemblyx86Tests/Testx86AssemblyInspectionEngine.TestSimplei386ugmented (306 of 1794)
PASS: lldb-unit :: Utility/./UtilityTests/AnsiTerminal.Unknown (307 of 1794)
PASS: lldb-api :: python_api/sbvalue_const_addrof/TestSBValueConstAddrOf.py (308 of 1794)
PASS: lldb-api :: functionalities/thread/concurrent_events/TestConcurrentWatchpointDelayWatchpointOneBreakpoint.py (309 of 1794)
PASS: lldb-shell :: Breakpoint/debug_rnglist_rlestartend.test (310 of 1794)
PASS: lldb-unit :: Utility/./UtilityTests/StringExtractorTest.GetHexU8_Extra (311 of 1794)
UNSUPPORTED: lldb-api :: tools/lldb-vscode/stackTrace/TestVSCode_stackTrace.py (312 of 1794)
PASS: lldb-api :: functionalities/tail_call_frames/disambiguate_tail_call_seq/TestDisambiguateTailCallSeq.py (313 of 1794)
PASS: lldb-unit :: Utility/./UtilityTests/StringListTest.AppendListCStringArrayEmpty (314 of 1794)
PASS: lldb-api :: python_api/watchpoint/TestWatchpointIter.py (315 of 1794)
PASS: lldb-unit :: Utility/./UtilityTests/FileSpecTest.CopyByAppendingPathComponent (316 of 1794)
UNSUPPORTED: lldb-api :: functionalities/darwin_log/basic/TestDarwinLogBasic.py (317 of 1794)
PASS: lldb-api :: functionalities/data-formatter/data-formatter-stl/libcxx/initializerlist/TestInitializerList.py (318 of 1794)
PASS: lldb-unit :: Utility/./UtilityTests/ScalarTest.GetBytes (319 of 1794)
PASS: lldb-api :: commands/expression/cast_int_to_anonymous_enum/TestCastIntToAnonymousEnum.py (320 of 1794)
PASS: lldb-api :: tools/lldb-server/TestGdbRemoteExpeditedRegisters.py (321 of 1794)
PASS: lldb-unit :: SymbolFile/DWARF/./SymbolFileDWARFTests/SymbolFileDWARFTests.TestAbbrevOrder1Start1 (322 of 1794)
PASS: lldb-unit :: ScriptInterpreter/Python/./ScriptInterpreterPythonTests/PythonDataObjectsTest.TestPythonListManipulation (323 of 1794)
PASS: lldb-unit :: Process/minidump/./LLDBMinidumpTests/MinidumpParserTest.GetExceptionStream (324 of 1794)
PASS: lldb-unit :: ScriptInterpreter/Python/./ScriptInterpreterPythonTests/PythonDataObjectsTest.TestPythonString (325 of 1794)
PASS: lldb-unit :: Process/gdb-remote/./ProcessGdbRemoteTests/GDBRemoteCommunicationServerTest.SendErrorResponse_ErrorList (326 of 1794)
PASS: lldb-unit :: Utility/./UtilityTests/StringExtractorTest.GetU64LittleEndian (327 of 1794)
PASS: lldb-unit :: Language/Highlighting/./HighlighterTests/HighlighterTest.ClangEmptyInput (328 of 1794)
PASS: lldb-unit :: Host/./HostTests/NativeProcessProtocolTest.ReadCStringFromMemory_CrossPageBoundary (329 of 1794)
PASS: lldb-unit :: UnwindAssembly/x86/./UnwindAssemblyx86Tests/Testx86AssemblyInspectionEngine.Testi386IgnoredRegisters (330 of 1794)
UNSUPPORTED: lldb-api :: functionalities/data-formatter/data-formatter-stl/libstdcpp/unique_ptr/TestDataFormatterStdUniquePtr.py (331 of 1794)
UNSUPPORTED: lldb-api :: functionalities/data-formatter/data-formatter-stl/libstdcpp/list/TestDataFormatterStdList.py (332 of 1794)
PASS: lldb-api :: commands/expression/import-std-module/weak_ptr/TestWeakPtr.py (333 of 1794)
PASS: lldb-unit :: Utility/./UtilityTests/StreamTest.PutCString (334 of 1794)
PASS: lldb-unit :: Utility/./UtilityTests/StringListTest.SplitIntoLinesSingleTrailingCR (335 of 1794)
PASS: lldb-unit :: Target/./TargetTests/MemoryRegionInfoTest.Formatv (336 of 1794)
PASS: lldb-unit :: Signals/./SignalsTests/UnixSignalsTest.GetInfo (337 of 1794)
PASS: lldb-unit :: Process/minidump/./LLDBMinidumpTests/RegisterContextMinidump.CheckRegisterContextMinidump_ARM (338 of 1794)
PASS: lldb-unit :: Process/minidump/./LLDBMinidumpTests/MinidumpParserTest.GetMiscInfo_no_stream (339 of 1794)
PASS: lldb-api :: api/listeners/TestListener.py (340 of 1794)
PASS: lldb-shell :: SymbolFile/DWARF/dir-separator-no-comp-dir-relative-name.s (341 of 1794)
UNSUPPORTED: lldb-shell :: SymbolFile/PDB/ast-restore.test (342 of 1794)
PASS: lldb-api :: functionalities/breakpoint/inlined_breakpoints/TestInlinedBreakpoints.py (343 of 1794)
PASS: lldb-api :: lang/cpp/char8_t/TestCxxChar8_t.py (344 of 1794)
PASS: lldb-shell :: Breakpoint/split-dwarf5-debug-stroffsets.test (345 of 1794)
PASS: lldb-shell :: SymbolFile/Breakpad/unwind-via-stack-win.test (346 of 1794)
PASS: lldb-unit :: Utility/./UtilityTests/StringListTest.AppendListCStringArray (347 of 1794)
PASS: lldb-unit :: Utility/./UtilityTests/ConstStringTest.format_provider (348 of 1794)
UNSUPPORTED: lldb-api :: benchmarks/turnaround/TestCompileRunToBreakpointTurnaround.py (349 of 1794)
PASS: lldb-api :: python_api/lldbutil/process/TestPrintStackTraces.py (350 of 1794)
PASS: lldb-unit :: Utility/./UtilityTests/UriParserTest.BadPort2 (351 of 1794)
PASS: lldb-unit :: UnwindAssembly/x86/./UnwindAssemblyx86Tests/Testx86AssemblyInspectionEngine.TestDisassemblyJunkBytes (352 of 1794)
PASS: lldb-api :: commands/expression/namespace_local_var_same_name_obj_c/TestNamespaceLocalVarSameNameObjC.py (353 of 1794)
PASS: lldb-api :: commands/command/source/TestCommandSource.py (354 of 1794)
PASS: lldb-unit :: Utility/./UtilityTests/RangeDataVector.FindEntryThatContains_Overlap (355 of 1794)
PASS: lldb-api :: commands/expression/persistent_types/TestPersistentTypes.py (356 of 1794)
PASS: lldb-unit :: Utility/./UtilityTests/ConstStringTest.NullAndEmptyStates (357 of 1794)
PASS: lldb-unit :: UnwindAssembly/x86/./UnwindAssemblyx86Tests/Testx86AssemblyInspectionEngine.TestSubESP (358 of 1794)
PASS: lldb-api :: functionalities/inferior-crashing/recursive-inferior/TestRecursiveInferiorStep.py (359 of 1794)
PASS: lldb-unit :: Utility/./UtilityTests/ArchSpecTest.TripleComponentsWereSpecified (360 of 1794)
PASS: lldb-unit :: Utility/./UtilityTests/UUIDTest.StringConverion (361 of 1794)
PASS: lldb-unit :: ScriptInterpreter/Python/./ScriptInterpreterPythonTests/PythonExceptionStateTest.TestAcquisitionSemantics (362 of 1794)
PASS: lldb-shell :: Breakpoint/single-file-split-dwarf.test (363 of 1794)
PASS: lldb-api :: lang/cpp/stl/TestSTL.py (364 of 1794)
PASS: lldb-api :: commands/disassemble/basic/TestFrameDisassemble.py (365 of 1794)
PASS: lldb-unit :: Utility/./UtilityTests/StringListTest.LongestCommonPrefixDuplicateElement (366 of 1794)
PASS: lldb-unit :: Utility/./UtilityTests/Predicate.WaitForValueEqualTo (367 of 1794)
PASS: lldb-api :: lang/c/shared_lib/TestSharedLib.py (368 of 1794)
PASS: lldb-shell :: SymbolFile/DWARF/dir-separator-posix.s (369 of 1794)
PASS: lldb-unit :: Utility/./UtilityTests/ProcessInfoTest.Constructor (370 of 1794)
PASS: lldb-api :: python_api/name_lookup/TestNameLookup.py (371 of 1794)
PASS: lldb-unit :: Utility/./UtilityTests/StringListTest.DefaultConstructor (372 of 1794)
PASS: lldb-unit :: Utility/./UtilityTests/LogChannelEnabledTest.LLDB_LOG_ERROR (373 of 1794)
PASS: lldb-shell :: ObjectFile/ELF/PT_LOAD-overlap-PT_TLS.yaml (374 of 1794)
PASS: lldb-unit :: Utility/./UtilityTests/LogChannelEnabledTest.LogThread (375 of 1794)
PASS: lldb-unit :: Utility/./UtilityTests/BinaryStreamTest.PutSLEB128OneByte (376 of 1794)
PASS: lldb-api :: functionalities/data-formatter/data-formatter-objc/TestDataFormatterObjCKVO.py (377 of 1794)
PASS: lldb-unit :: Utility/./UtilityTests/GeneratorTest.Create (378 of 1794)
PASS: lldb-unit :: UnwindAssembly/x86/./UnwindAssemblyx86Tests/Testx86AssemblyInspectionEngine.TestPopR14 (379 of 1794)
PASS: lldb-unit :: Language/Highlighting/./HighlighterTests/HighlighterTest.ClangStringLiterals (380 of 1794)
PASS: lldb-api :: lang/cpp/breakpoint_in_member_func_w_non_primitive_params/TestBreakpointInMemberFuncWNonPrimitiveParams.py (381 of 1794)
PASS: lldb-unit :: Host/./HostTests/NativeProcessProtocolTest.ReadCStringFromMemory (382 of 1794)
PASS: lldb-unit :: Process/gdb-remote/./ProcessGdbRemoteTests/GDBRemoteCommunicationClientTest.SendStartTracePacket (383 of 1794)
PASS: lldb-unit :: Expression/./ExpressionTests/DiagnosticManagerTest.FixedExpression (384 of 1794)
PASS: lldb-unit :: Expression/./ExpressionTests/CppModuleConfigurationTest.Sysroot (385 of 1794)
PASS: lldb-unit :: Utility/./UtilityTests/FileSpecTest.FileAndDirectoryComponents (386 of 1794)
PASS: lldb-unit :: Utility/./UtilityTests/StreamTest.ChangingByteOrder (387 of 1794)
PASS: lldb-api :: functionalities/tsan/thread_leak/TestTsanThreadLeak.py (388 of 1794)
PASS: lldb-unit :: Process/gdb-remote/./ProcessGdbRemoteTests/GDBRemoteCommunicationClientTest.GetModulesInfoInvalidResponse (389 of 1794)
PASS: lldb-unit :: Utility/./UtilityTests/GeneratorTest.GetOrCreate (390 of 1794)
PASS: lldb-api :: functionalities/breakpoint/auto_continue/TestBreakpointAutoContinue.py (391 of 1794)
PASS: lldb-api :: lang/cpp/const_this/TestConstThis.py (392 of 1794)
PASS: lldb-shell :: BuildScript/compiler-full-path.test (393 of 1794)
PASS: lldb-shell :: ObjectFile/ELF/basic-info.yaml (394 of 1794)
PASS: lldb-unit :: Utility/./UtilityTests/StreamTest.PutHex64ByteOrderLittle (395 of 1794)
PASS: lldb-unit :: Target/./TargetTests/ModuleCacheTest.GetAndPutUuidExists (396 of 1794)
PASS: lldb-api :: lang/cpp/static_methods/TestCPPStaticMethods.py (397 of 1794)
PASS: lldb-api :: functionalities/data-formatter/parray/TestPrintArray.py (398 of 1794)
PASS: lldb-api :: functionalities/thread/concurrent_events/TestConcurrentDelayedCrashWithBreakpointWatchpoint.py (399 of 1794)
UNSUPPORTED: lldb-api :: tools/lldb-server/signal-filtering/TestGdbRemote_QPassSignals.py (400 of 1794)
PASS: lldb-unit :: Utility/./UtilityTests/StringListTest.ShiftMove (401 of 1794)
PASS: lldb-api :: lang/objc/objc-ivar-offsets/TestObjCIvarOffsets.py (402 of 1794)
PASS: lldb-api :: functionalities/data-formatter/vector-types/TestVectorTypesFormatting.py (403 of 1794)
PASS: lldb-shell :: Unwind/eh-frame-dwarf-unwind.test (404 of 1794)
PASS: lldb-unit :: Utility/./UtilityTests/StringListTest.InsertStringAtIndexOutOfBounds (405 of 1794)
PASS: lldb-unit :: Utility/./UtilityTests/StreamTest.ShiftOperatorUInts (406 of 1794)
PASS: lldb-unit :: UnwindAssembly/x86/./UnwindAssemblyx86Tests/Testx86AssemblyInspectionEngine.Test64bitFramelessSmallStackFrame (407 of 1794)
PASS: lldb-shell :: ObjectFile/MachO/lc_build_version.yaml (408 of 1794)
PASS: lldb-unit :: Host/./HostTests/SocketTest.UDPConnect (409 of 1794)
PASS: lldb-api :: functionalities/postmortem/elf-core/thread_crash/TestLinuxCoreThreads.py (410 of 1794)
PASS: lldb-unit :: Symbol/./SymbolTests/LineEntryTest.GetSameLineContiguousAddressRangeOneInline (411 of 1794)
PASS: lldb-unit :: ObjectFile/ELF/./ObjectFileELFTests/ObjectFileELFTest.GetModuleSpecifications_EarlySectionHeaders (412 of 1794)
PASS: lldb-unit :: Process/minidump/./LLDBMinidumpTests/MinidumpParserTest.GetMiscInfoWindows (413 of 1794)
PASS: lldb-unit :: Utility/./UtilityTests/VMRange.IsValid (414 of 1794)
PASS: lldb-unit :: Process/gdb-remote/./ProcessGdbRemoteTests/GDBRemoteClientBaseTest.SendContinueAndLateInterrupt (415 of 1794)
PASS: lldb-unit :: Utility/./UtilityTests/UriParserTest.MinimalPort (416 of 1794)
UNSUPPORTED: lldb-api :: arm/breakpoint-it/TestBreakpointIt.py (417 of 1794)
PASS: lldb-unit :: Language/Highlighting/./HighlighterTests/HighlighterTest.Colons (418 of 1794)
PASS: lldb-unit :: Expression/./ExpressionTests/DiagnosticManagerTest.AddDiagnostic (419 of 1794)
PASS: lldb-unit :: Language/Highlighting/./HighlighterTests/HighlighterTest.FallbackHighlighter (420 of 1794)
PASS: lldb-api :: lang/c/anonymous/TestAnonymous.py (421 of 1794)
PASS: lldb-unit :: Expression/./ExpressionTests/CppModuleConfigurationTest.Linux (422 of 1794)
PASS: lldb-api :: lang/objc/objc-property/TestObjCProperty.py (423 of 1794)
PASS: lldb-api :: commands/command/script/TestCommandScript.py (424 of 1794)
PASS: lldb-api :: functionalities/thread/concurrent_events/TestConcurrentTwoWatchpointThreads.py (425 of 1794)
PASS: lldb-unit :: SymbolFile/NativePDB/./SymbolFileNativePDBTests/PDBFPOProgramToDWARFExpressionTests.UnresolvedRegisterAssignmentReference (426 of 1794)
PASS: lldb-api :: commands/expression/import-std-module/shared_ptr/TestSharedPtr.py (427 of 1794)
PASS: lldb-api :: lang/objc/forward-decl/TestForwardDecl.py (428 of 1794)
PASS: lldb-unit :: Utility/./UtilityTests/ProcessInstanceInfo.Dump (429 of 1794)
PASS: lldb-api :: python_api/watchpoint/TestSetWatchpoint.py (430 of 1794)
PASS: lldb-unit :: Utility/./UtilityTests/ArgsTest.TestTrailingBackslash (431 of 1794)
PASS: lldb-unit :: Process/minidump/./LLDBMinidumpTests/MinidumpParserTest.InvalidMinidump (432 of 1794)
PASS: lldb-api :: functionalities/thread/crash_during_step/TestCrashDuringStep.py (433 of 1794)
PASS: lldb-unit :: Utility/./UtilityTests/ArgsTest.DoubleQuotedItem (434 of 1794)
PASS: lldb-api :: commands/expression/call-throws/TestCallThatThrows.py (435 of 1794)
PASS: lldb-unit :: Language/Highlighting/./HighlighterTests/HighlighterTest.Keywords (436 of 1794)
PASS: lldb-unit :: UnwindAssembly/x86/./UnwindAssemblyx86Tests/Testx86AssemblyInspectionEngine.TestSpillRegToStackViaMOVi386 (437 of 1794)
PASS: lldb-api :: functionalities/tail_call_frames/unambiguous_sequence/TestUnambiguousTailCalls.py (438 of 1794)
PASS: lldb-shell :: Settings/TestDisableColor.test (439 of 1794)
UNSUPPORTED: lldb-api :: lang/c/typedef/Testtypedef.py (440 of 1794)
PASS: lldb-unit :: Utility/./UtilityTests/LogChannelEnabledTest.LogGetLogThread (441 of 1794)
PASS: lldb-api :: lang/cpp/class_static/TestStaticVariables.py (442 of 1794)
PASS: lldb-api :: functionalities/thread/concurrent_events/TestConcurrentCrashWithWatchpoint.py (443 of 1794)
PASS: lldb-unit :: Utility/./UtilityTests/StringListTest.JoinNonSpace (444 of 1794)
PASS: lldb-api :: lang/objc/objc++/TestObjCXX.py (445 of 1794)
PASS: lldb-unit :: Utility/./UtilityTests/StringListTest.GetMaxStringLengthDecreasingSize (446 of 1794)
PASS: lldb-unit :: Process/minidump/./LLDBMinidumpTests/MinidumpParserTest.GetLinuxProcStatus_no_stream (447 of 1794)
PASS: lldb-unit :: Utility/./UtilityTests/StringExtractorTest.GetHexU8_Underflow2_NoEof (448 of 1794)
PASS: lldb-unit :: Process/gdb-remote/./ProcessGdbRemoteTests/GDBRemoteCommunicationClientTest.SendSignalsToIgnore (449 of 1794)
PASS: lldb-api :: functionalities/data-formatter/data-formatter-stl/libcxx/list/loop/TestDataFormatterLibcxxListLoop.py (450 of 1794)
PASS: lldb-api :: lang/objcxx/cxx-bridged-po/TestObjCXXBridgedPO.py (451 of 1794)
PASS: lldb-api :: functionalities/breakpoint/cpp_exception/TestCPPExceptionBreakpoint.py (452 of 1794)
PASS: lldb-unit :: SymbolFile/NativePDB/./SymbolFileNativePDBTests/PDBFPOProgramToDWARFExpressionTests.UnresolvedRegisterReference (453 of 1794)
PASS: lldb-api :: functionalities/gdb_remote_client/TestStopPCs.py (454 of 1794)
PASS: lldb-shell :: Process/TestEnvironment.test (455 of 1794)
UNSUPPORTED: lldb-shell :: BuildScript/toolchain-clang-cl.test (456 of 1794)
PASS: lldb-api :: lang/objc/real-definition/TestRealDefinition.py (457 of 1794)
PASS: lldb-unit :: Symbol/./SymbolTests/Type.GetTypeScopeAndBasename (458 of 1794)
PASS: lldb-api :: lang/cpp/incomplete-types/TestCppIncompleteTypes.py (459 of 1794)
PASS: lldb-shell :: SymbolFile/DWARF/debug_ranges.s (460 of 1794)
PASS: lldb-unit :: Utility/./UtilityTests/ArchSpecTest.MergeFrom (461 of 1794)
PASS: lldb-unit :: Utility/./UtilityTests/StreamTest.PutCStringWithStringRef (462 of 1794)
PASS: lldb-shell :: Driver/TestConvenienceVariables.test (463 of 1794)
PASS: lldb-unit :: Utility/./UtilityTests/Flags.Test (464 of 1794)
PASS: lldb-unit :: UnwindAssembly/ARM64/./Arm64InstEmulationTests/TestArm64InstEmulation.TestFramelessThreeEpilogueFunction (465 of 1794)
PASS: lldb-unit :: Utility/./UtilityTests/TimeoutTest.Format (466 of 1794)
UNSUPPORTED: lldb-shell :: Expr/TestIRMemoryMapWindows.test (467 of 1794)
PASS: lldb-api :: functionalities/dead-strip/TestDeadStrip.py (468 of 1794)
PASS: lldb-api :: functionalities/thread/concurrent_events/TestConcurrentTwoBreakpointThreads.py (469 of 1794)
PASS: lldb-api :: functionalities/inferior-changed/TestInferiorChanged.py (470 of 1794)
UNSUPPORTED: lldb-api :: tools/lldb-vscode/step/TestVSCode_step.py (471 of 1794)
PASS: lldb-api :: functionalities/postmortem/minidump-new/TestMiniDumpNew.py (472 of 1794)
PASS: lldb-unit :: Signals/./SignalsTests/UnixSignalsTest.VersionChange (473 of 1794)
PASS: lldb-unit :: Utility/./UtilityTests/UUIDTest.SetFromStringRef (474 of 1794)
PASS: lldb-unit :: Utility/./UtilityTests/UriParserTest.BracketedHostname (475 of 1794)
PASS: lldb-unit :: Expression/./ExpressionTests/DiagnosticManagerTest.HasFixits (476 of 1794)
PASS: lldb-unit :: Utility/./UtilityTests/UriParserTest.SchemeHostSeparator2 (477 of 1794)
PASS: lldb-api :: lang/cpp/overloaded-functions/TestOverloadedFunctions.py (478 of 1794)
PASS: lldb-shell :: SymbolFile/Breakpad/line-table.test (479 of 1794)
PASS: lldb-api :: linux/builtin_trap/TestBuiltinTrap.py (480 of 1794)
PASS: lldb-unit :: Utility/./UtilityTests/StringListTest.AppendStringMove (481 of 1794)
PASS: lldb-api :: functionalities/data-formatter/data-formatter-stl/libcxx/atomic/TestLibCxxAtomic.py (482 of 1794)
PASS: lldb-api :: commands/watchpoints/watchpoint_disable/TestWatchpointDisable.py (483 of 1794)
PASS: lldb-api :: functionalities/data-formatter/compactvectors/TestCompactVectors.py (484 of 1794)
PASS: lldb-shell :: SymbolFile/NativePDB/ast-methods.cpp (485 of 1794)
PASS: lldb-unit :: Utility/./UtilityTests/StreamTest.PutHex8 (486 of 1794)
PASS: lldb-api :: functionalities/data-formatter/ostypeformatting/TestFormattersOsType.py (487 of 1794)
UNSUPPORTED: lldb-api :: functionalities/breakpoint/breakpoint_in_delayslot/TestAvoidBreakpointInDelaySlot.py (488 of 1794)
PASS: lldb-unit :: Utility/./UtilityTests/ConstStringTest.FromMidOfBufferStringRef (489 of 1794)
PASS: lldb-unit :: UnwindAssembly/x86/./UnwindAssemblyx86Tests/Testx86AssemblyInspectionEngine.TestPopRBX (490 of 1794)
PASS: lldb-api :: functionalities/gdb_remote_client/TestNestedRegDefinitions.py (491 of 1794)
UNSUPPORTED: lldb-api :: lang/cpp/function-template-parameter-pack/TestFunctionTemplateParameterPack.py (492 of 1794)
PASS: lldb-unit :: Utility/./UtilityTests/UUIDTest.Validity (493 of 1794)
PASS: lldb-unit :: ScriptInterpreter/Python/./ScriptInterpreterPythonTests/PythonDataObjectsTest.TestDictionaryResolutionWithDot (494 of 1794)
PASS: lldb-unit :: Core/./LLDBCoreTests/StreamCallbackTest.Callback (495 of 1794)
PASS: lldb-api :: functionalities/data-formatter/ptr_ref_typedef/TestPtrRef2Typedef.py (496 of 1794)
PASS: lldb-shell :: SymbolFile/DWARF/debug-names-compressed.cpp (497 of 1794)
PASS: lldb-unit :: Target/./TargetTests/ExecutionContextTest.GetByteOrderProcess (498 of 1794)
PASS: lldb-api :: lang/cpp/std-function-step-into-callable/TestStdFunctionStepIntoCallable.py (499 of 1794)
UNSUPPORTED: lldb-shell :: SymbolFile/target-symbols-add-unwind.test (500 of 1794)
PASS: lldb-unit :: Utility/./UtilityTests/RecordReplayTest.InstrumentedFoo (501 of 1794)
PASS: lldb-shell :: Heap/heap-cstr.test (502 of 1794)
PASS: lldb-api :: functionalities/thread/concurrent_events/TestConcurrentDelayWatchBreak.py (503 of 1794)
PASS: lldb-api :: api/multiple-targets/TestMultipleTargets.py (504 of 1794)
PASS: lldb-api :: functionalities/thread/num_threads/TestNumThreads.py (505 of 1794)
PASS: lldb-api :: functionalities/thread/concurrent_events/TestConcurrentWatchpointWithDelayWatchpointThreads.py (506 of 1794)
PASS: lldb-api :: functionalities/thread/concurrent_events/TestConcurrentSignalWatchBreak.py (507 of 1794)
PASS: lldb-unit :: Host/./HostTests/FileSystemTest.EnumerateDirectory (508 of 1794)
PASS: lldb-api :: macosx/find-dsym/bundle-with-dot-in-filename/TestBundleWithDotInFilename.py (509 of 1794)
PASS: lldb-api :: functionalities/breakpoint/breakpoint_locations/TestBreakpointLocations.py (510 of 1794)
PASS: lldb-unit :: Utility/./UtilityTests/SerializationRountripTest.SerializeDeserializeObjectReference (511 of 1794)
PASS: lldb-api :: functionalities/plugins/command_plugin/TestPluginCommands.py (512 of 1794)
PASS: lldb-unit :: Language/Highlighting/./HighlighterTests/HighlighterTest.ClangSquareBrackets (513 of 1794)
PASS: lldb-unit :: UnwindAssembly/x86/./UnwindAssemblyx86Tests/Testx86AssemblyInspectionEngine.TestPopEDI (514 of 1794)
PASS: lldb-unit :: SymbolFile/NativePDB/./SymbolFileNativePDBTests/PDBFPOProgramToDWARFExpressionTests.MissingTargetRegister (515 of 1794)
PASS: lldb-unit :: Utility/./UtilityTests/CompletionRequest.TryCompleteCurrentArgGood (516 of 1794)
PASS: lldb-unit :: Utility/./UtilityTests/StringExtractorTest.InitEmpty (517 of 1794)
PASS: lldb-unit :: ScriptInterpreter/Python/./ScriptInterpreterPythonTests/PythonDataObjectsTest.TestPythonBoolean (518 of 1794)
PASS: lldb-api :: functionalities/non-overlapping-index-variable-i/TestIndexVariable.py (519 of 1794)
PASS: lldb-unit :: Language/Highlighting/./HighlighterTests/HighlighterTest.DefaultHighlighterWithCursorOutOfBounds (520 of 1794)
PASS: lldb-shell :: SymbolFile/DWARF/dir-separator-no-comp-dir.s (521 of 1794)
PASS: lldb-api :: functionalities/breakpoint/global_constructor/TestBreakpointInGlobalConstructor.py (522 of 1794)
PASS: lldb-unit :: Utility/./UtilityTests/CompletionRequest.Constructor (523 of 1794)
PASS: lldb-api :: python_api/frame/inlines/TestInlinedFrame.py (524 of 1794)
PASS: lldb-api :: lang/objc/ptr_refs/TestPtrRefsObjC.py (525 of 1794)
PASS: lldb-unit :: Utility/./UtilityTests/CompletionRequest.DuplicateFiltering (526 of 1794)
PASS: lldb-api :: functionalities/data-formatter/data-formatter-categories/TestDataFormatterCategories.py (527 of 1794)
PASS: lldb-shell :: SymbolFile/Breakpad/symtab.test (528 of 1794)
PASS: lldb-api :: lang/cpp/namespace/TestNamespaceLookup.py (529 of 1794)
PASS: lldb-unit :: Utility/./UtilityTests/VASprintfTest.BufferResize (530 of 1794)
PASS: lldb-api :: lang/cpp/signed_types/TestSignedTypes.py (531 of 1794)
PASS: lldb-unit :: Utility/./UtilityTests/BinaryStreamTest.PutULEB128SixBytes (532 of 1794)
PASS: lldb-api :: tools/lldb-server/TestGdbRemoteThreadsInStopReply.py (533 of 1794)
PASS: lldb-api :: commands/expression/rdar44436068/Test128BitsInteger.py (534 of 1794)
PASS: lldb-unit :: Utility/./UtilityTests/ArgsTest.GetQuotedCommandString (535 of 1794)
PASS: lldb-unit :: Utility/./UtilityTests/StringListTest.CopyListSingle (536 of 1794)
PASS: lldb-api :: commands/source/info/TestSourceInfo.py (537 of 1794)
PASS: lldb-unit :: Target/./TargetTests/ExecutionContextTest.GetByteOrder (538 of 1794)
PASS: lldb-api :: macosx/universal/TestUniversal.py (539 of 1794)
PASS: lldb-unit :: debugserver/./debugserverTests/RNBSocket.LoopBackListenIPv4 (540 of 1794)
PASS: lldb-api :: lang/objc/objc-optimized/TestObjcOptimized.py (541 of 1794)
PASS: lldb-unit :: Utility/./UtilityTests/StringExtractorTest.GetNameColonValueNoColon (542 of 1794)
PASS: lldb-api :: commands/expression/test/TestExprs.py (543 of 1794)
PASS: lldb-api :: functionalities/var_path/TestVarPath.py (544 of 1794)
UNSUPPORTED: lldb-api :: commands/watchpoints/variable_out_of_scope/TestWatchedVarHitWhenInScope.py (545 of 1794)
XFAIL: lldb-shell :: Unwind/prefer-debug-over-eh-frame.test (546 of 1794)
PASS: lldb-unit :: Utility/./UtilityTests/StringExtractorTest.GetNameColonValueContainsColon (547 of 1794)
PASS: lldb-api :: macosx/add-dsym/TestAddDsymMidExecutionCommand.py (548 of 1794)
PASS: lldb-unit :: ScriptInterpreter/Python/./ScriptInterpreterPythonTests/PythonDataObjectsTest.TestExtractingUInt64ThroughStructuredData (549 of 1794)
PASS: lldb-shell :: SymbolFile/DWARF/find-basic-namespace.cpp (550 of 1794)
PASS: lldb-api :: lang/objc/foundation/TestObjCMethods2.py (551 of 1794)
PASS: lldb-unit :: Utility/./UtilityTests/BinaryStreamTest.PutSLEB128ThreeBytes (552 of 1794)
PASS: lldb-unit :: Process/minidump/./LLDBMinidumpTests/MinidumpParserTest.MinidumpModuleOrder (553 of 1794)
PASS: lldb-unit :: Process/gdb-remote/./ProcessGdbRemoteTests/GDBRemoteClientBaseTest.SendContinueAndInterrupt (554 of 1794)
PASS: lldb-shell :: SymbolFile/DWARF/deterministic-build.cpp (555 of 1794)
PASS: lldb-api :: functionalities/data-formatter/data-formatter-objc/nsindexpath/TestDataFormatterNSIndexPath.py (556 of 1794)
PASS: lldb-unit :: Utility/./UtilityTests/NameMatchesTest.StartsWith (557 of 1794)
PASS: lldb-unit :: Utility/./UtilityTests/DataExtractorTest.GetCStrEmpty (558 of 1794)
PASS: lldb-unit :: Utility/./UtilityTests/StateTest.Formatv (559 of 1794)
PASS: lldb-unit :: Process/gdb-remote/./ProcessGdbRemoteTests/GDBRemoteCommunicationClientTest.TestPacketSpeedJSON (560 of 1794)
PASS: lldb-api :: functionalities/gdb_remote_client/TestRestartBug.py (561 of 1794)
PASS: lldb-api :: lang/cpp/inlines/TestInlines.py (562 of 1794)
PASS: lldb-shell :: SymbolFile/dissassemble-entry-point.s (563 of 1794)
PASS: lldb-api :: python_api/process/TestProcessAPI.py (564 of 1794)
PASS: lldb-shell :: Commands/command-backtrace.test (565 of 1794)
PASS: lldb-unit :: Language/Highlighting/./HighlighterTests/HighlighterTest.DefaultHighlighter (566 of 1794)
PASS: lldb-shell :: ObjectFile/PECOFF/subsections.yaml (567 of 1794)
PASS: lldb-api :: lang/c/vla/TestVLA.py (568 of 1794)
PASS: lldb-shell :: SymbolFile/NativePDB/globals-bss.cpp (569 of 1794)
PASS: lldb-shell :: Reproducer/TestWorkingDir.test (570 of 1794)
PASS: lldb-unit :: Process/gdb-remote/./ProcessGdbRemoteTests/GDBRemoteCommunicationServerTest.SendErrorResponse_Status (571 of 1794)
UNSUPPORTED: lldb-api :: tools/lldb-server/platform-process-connect/TestPlatformProcessConnect.py (572 of 1794)
PASS: lldb-unit :: Host/./HostTests/Host.GetEnvironment (573 of 1794)
PASS: lldb-api :: commands/frame/select/TestFrameSelect.py (574 of 1794)
PASS: lldb-unit :: Disassembler/./DisassemblerTests/TestArmv7Disassembly.TestCortexFPDisass (575 of 1794)
PASS: lldb-api :: functionalities/thread/concurrent_events/TestConcurrentSignalDelayWatch.py (576 of 1794)
PASS: lldb-unit :: Utility/./UtilityTests/ArgsTest.TestAppendArg (577 of 1794)
PASS: lldb-api :: functionalities/breakpoint/breakpoint_command/TestBreakpointCommandsFromPython.py (578 of 1794)
PASS: lldb-unit :: Utility/./UtilityTests/ArgsTest.AppendArguments (579 of 1794)
PASS: lldb-unit :: Host/./HostTests/NativeProcessProtocolTest.SetBreakpoint (580 of 1794)
PASS: lldb-shell :: ObjectFile/PECOFF/basic-info.yaml (581 of 1794)
UNSUPPORTED: lldb-api :: functionalities/thread/break_after_join/TestBreakAfterJoin.py (582 of 1794)
PASS: lldb-unit :: Utility/./UtilityTests/ScalarTest.Scalar_512 (583 of 1794)
PASS: lldb-api :: functionalities/modern-type-lookup/basic-objc/TestBasicObjcModernTypeLookup.py (584 of 1794)
UNSUPPORTED: lldb-api :: functionalities/thread/create_during_step/TestCreateDuringStep.py (585 of 1794)
PASS: lldb-api :: functionalities/data-formatter/data-formatter-stl/libcxx/forward_list/TestDataFormatterLibcxxForwardList.py (586 of 1794)
PASS: lldb-api :: lang/objc/foundation/TestSymbolTable.py (587 of 1794)
PASS: lldb-unit :: Utility/./UtilityTests/ListenerTest.GetEventImmediate (588 of 1794)
PASS: lldb-api :: python_api/section/TestSectionAPI.py (589 of 1794)
PASS: lldb-api :: python_api/rdar-12481949/Test-rdar-12481949.py (590 of 1794)
PASS: lldb-api :: commands/expression/scoped_enums/TestScopedEnumType.py (591 of 1794)
PASS: lldb-api :: functionalities/tsan/thread_numbers/TestTsanThreadNumbers.py (592 of 1794)
PASS: lldb-unit :: Utility/./UtilityTests/StreamTest.PutRawBytesToBigEndian (593 of 1794)
PASS: lldb-api :: lang/cpp/global_operators/TestCppGlobalOperators.py (594 of 1794)
PASS: lldb-unit :: Expression/./ExpressionTests/CppModuleConfigurationTest.AmbiguousCLib (595 of 1794)
PASS: lldb-unit :: Utility/./UtilityTests/StringExtractorTest.DecodeHexU8_Underflow2 (596 of 1794)
PASS: lldb-api :: lang/objc/modules/TestObjCModules.py (597 of 1794)
PASS: lldb-api :: functionalities/data-formatter/type_summary_list_arg/TestTypeSummaryListArg.py (598 of 1794)
PASS: lldb-shell :: SymbolFile/DWARF/compilercontext.ll (599 of 1794)
PASS: lldb-unit :: Utility/./UtilityTests/StringListTest.RemoveBlankLines (600 of 1794)
PASS: lldb-unit :: debugserver/./debugserverTests/RNBSocket.AnyListen (601 of 1794)
PASS: lldb-unit :: Utility/./UtilityTests/ConstStringTest.UpdateMangledCounterpart (602 of 1794)
PASS: lldb-unit :: Utility/./UtilityTests/StringLexerTest.NextIf (603 of 1794)
PASS: lldb-api :: commands/frame/diagnose/inheritance/TestDiagnoseInheritance.py (604 of 1794)
PASS: lldb-unit :: Utility/./UtilityTests/AnsiTerminal.AtEnd (605 of 1794)
PASS: lldb-api :: python_api/objc_type/TestObjCType.py (606 of 1794)
PASS: lldb-api :: lang/objc/objc-static-method/TestObjCStaticMethod.py (607 of 1794)
PASS: lldb-unit :: Utility/./UtilityTests/UserIDResolver.GetGroupName (608 of 1794)
PASS: lldb-unit :: Language/Highlighting/./HighlighterTests/HighlighterTest.ClangCursorPosInOtherToken (609 of 1794)
PASS: lldb-unit :: Utility/./UtilityTests/StringListTest.Assignment (610 of 1794)
PASS: lldb-api :: functionalities/data-formatter/data-formatter-stl/libcxx/variant/TestDataFormatterLibcxxVariant.py (611 of 1794)
UNSUPPORTED: lldb-shell :: Register/x86-64-ymm16-write.test (612 of 1794)
PASS: lldb-api :: functionalities/data-formatter/data-formatter-objc/TestDataFormatterObjCNSData.py (613 of 1794)
PASS: lldb-api :: functionalities/value_md5_crash/TestValueMD5Crash.py (614 of 1794)
PASS: lldb-unit :: Utility/./UtilityTests/FileSpecTest.EqualDotsPosix (615 of 1794)
PASS: lldb-api :: lang/objc/radar-9691614/TestObjCMethodReturningBOOL.py (616 of 1794)
PASS: lldb-unit :: Utility/./UtilityTests/RangeTest.NotEqualInvalid (617 of 1794)
PASS: lldb-unit :: Utility/./UtilityTests/VASprintfTest.EncodingError (618 of 1794)
PASS: lldb-unit :: SymbolFile/NativePDB/./SymbolFileNativePDBTests/PDBFPOProgramToDWARFExpressionTests.InvalidAssignmentMultiple (619 of 1794)
PASS: lldb-api :: lang/objc/objc-new-syntax/TestObjCNewSyntaxArray.py (620 of 1794)
PASS: lldb-api :: functionalities/data-formatter/data-formatter-proper-plurals/TestFormattersOneIsSingular.py (621 of 1794)
PASS: lldb-api :: commands/watchpoints/multiple_hits/TestMultipleHits.py (622 of 1794)
PASS: lldb-shell :: Reproducer/Modules/TestModuleCXX.test (623 of 1794)
PASS: lldb-shell :: ObjectFile/Breakpad/breakpad-identification.test (624 of 1794)
PASS: lldb-unit :: Utility/./UtilityTests/OptionsWithRawTest.EmptySuffix (625 of 1794)
PASS: lldb-api :: functionalities/postmortem/elf-core/TestLinuxCore.py (626 of 1794)
PASS: lldb-api :: functionalities/breakpoint/address_breakpoints/TestBadAddressBreakpoints.py (627 of 1794)
PASS: lldb-unit :: Process/minidump/./LLDBMinidumpTests/MinidumpParserTest.GetArchitectureWindows (628 of 1794)
UNSUPPORTED: lldb-api :: tools/lldb-vscode/variables/TestVSCode_variables.py (629 of 1794)
PASS: lldb-unit :: Utility/./UtilityTests/ScalarTest.ComparisonFloat (630 of 1794)
PASS: lldb-api :: lang/objcxx/objcxx-ivar-vector/TestIvarVector.py (631 of 1794)
PASS: lldb-shell :: SymbolFile/NativePDB/ast-types.cpp (632 of 1794)
UNSUPPORTED: lldb-shell :: SymbolFile/NativePDB/typedefs.cpp (633 of 1794)
PASS: lldb-api :: functionalities/load_using_paths/TestLoadUsingPaths.py (634 of 1794)
UNSUPPORTED: lldb-shell :: SymbolFile/NativePDB/local-variables.cpp (635 of 1794)
PASS: lldb-unit :: Utility/./UtilityTests/StringListTest.InsertStringAtIndexMove (636 of 1794)
PASS: lldb-unit :: Utility/./UtilityTests/StringExtractorTest.GetHexU8_Exact (637 of 1794)
PASS: lldb-unit :: Language/Highlighting/./HighlighterTests/HighlighterTest.ClangCursorPosEndOfLine (638 of 1794)
PASS: lldb-unit :: Utility/./UtilityTests/RegularExpression.Empty (639 of 1794)
PASS: lldb-api :: functionalities/breakpoint/breakpoint_command/TestRegexpBreakCommand.py (640 of 1794)
PASS: lldb-api :: commands/settings/TestSettings.py (641 of 1794)
PASS: lldb-unit :: Language/Highlighting/./HighlighterTests/HighlighterTest.ClangCursorOutOfBounds (642 of 1794)
PASS: lldb-shell :: Minidump/breakpad-symbols.test (643 of 1794)
PASS: lldb-unit :: Utility/./UtilityTests/BinaryStreamTest.PutSLEB128Zero (644 of 1794)
PASS: lldb-api :: functionalities/breakpoint/breakpoint_ignore_count/TestBreakpointIgnoreCount.py (645 of 1794)
PASS: lldb-unit :: Utility/./UtilityTests/ArgsTest.TestSingleArgWithQuotedSpace (646 of 1794)
UNSUPPORTED: lldb-shell :: SymbolFile/PDB/variables.test (647 of 1794)
PASS: lldb-api :: commands/platform/basic/TestPlatformCommand.py (648 of 1794)
PASS: lldb-api :: functionalities/inferior-crashing/TestInferiorCrashing.py (649 of 1794)
PASS: lldb-shell :: SymbolFile/NativePDB/source-list.cpp (650 of 1794)
PASS: lldb-unit :: Symbol/./SymbolTests/LineEntryTest.GetSameLineContiguousAddressRangeNestedInline (651 of 1794)
PASS: lldb-unit :: Host/./HostTests/ConnectionFileDescriptorTest.TCPGetURIv4 (652 of 1794)
PASS: lldb-unit :: debugserver/./debugserverTests/RNBSocket.LoopBackConnectIPv6 (653 of 1794)
PASS: lldb-unit :: Utility/./UtilityTests/StringLexerTest.GetUnlexed (654 of 1794)
PASS: lldb-unit :: Utility/./UtilityTests/StreamTest.PutHex16ByteOrderLittle (655 of 1794)
PASS: lldb-api :: functionalities/data-formatter/user-format-vs-summary/TestUserFormatVsSummary.py (656 of 1794)
PASS: lldb-api :: commands/frame/diagnose/local-variable/TestLocalVariable.py (657 of 1794)
PASS: lldb-unit :: Utility/./UtilityTests/DataExtractorTest.GetBitfield (658 of 1794)
UNSUPPORTED: lldb-api :: functionalities/darwin_log/filter/regex/message/TestDarwinLogFilterRegexMessage.py (659 of 1794)
UNSUPPORTED: lldb-api :: commands/watchpoints/hello_watchlocation/TestWatchLocation.py (660 of 1794)
PASS: lldb-unit :: Utility/./UtilityTests/UUIDTest.RelationalOperators (661 of 1794)
PASS: lldb-unit :: Utility/./UtilityTests/GeneratorTest.Get (662 of 1794)
PASS: lldb-api :: source-manager/TestSourceManager.py (663 of 1794)
PASS: lldb-api :: commands/frame/var/TestFrameVar.py (664 of 1794)
PASS: lldb-api :: lang/cpp/limit-debug-info/TestWithLimitDebugInfo.py (665 of 1794)
PASS: lldb-unit :: Language/Highlighting/./HighlighterTests/HighlighterTest.ClangCursorPosAfterOtherToken (666 of 1794)
PASS: lldb-api :: functionalities/inferior-crashing/TestInferiorCrashingStep.py (667 of 1794)
PASS: lldb-api :: functionalities/data-formatter/data-formatter-stl/libcxx/vbool/TestDataFormatterLibcxxVBool.py (668 of 1794)
PASS: lldb-api :: functionalities/multiword-commands/TestMultiWordCommands.py (669 of 1794)
PASS: lldb-unit :: Utility/./UtilityTests/StringListTest.PopBack (670 of 1794)
PASS: lldb-unit :: Process/minidump/./LLDBMinidumpTests/MinidumpParserTest.GetArchitecture (671 of 1794)
PASS: lldb-api :: commands/command/script/import/rdar-12586188/TestRdar12586188.py (672 of 1794)
PASS: lldb-unit :: Utility/./UtilityTests/RangeTest.Equal (673 of 1794)
PASS: lldb-shell :: ObjectFile/ELF/netbsd-exec-8.99.30-amd64.yaml (674 of 1794)
PASS: lldb-api :: python_api/hello_world/TestHelloWorld.py (675 of 1794)
PASS: lldb-api :: lang/mixed/TestMixedLanguages.py (676 of 1794)
PASS: lldb-unit :: Expression/./ExpressionTests/CppModuleConfigurationTest.MissingLibCpp (677 of 1794)
PASS: lldb-unit :: Utility/./UtilityTests/StreamTeeTest.Flush (678 of 1794)
PASS: lldb-unit :: Host/./HostTests/SocketTest.TCPListen0ConnectAccept (679 of 1794)
PASS: lldb-api :: lang/cpp/diamond/TestDiamond.py (680 of 1794)
PASS: lldb-unit :: Utility/./UtilityTests/StringListTest.AppendStringStdString (681 of 1794)
PASS: lldb-unit :: Utility/./UtilityTests/BinaryStreamTest.PutSLEB128FourBytes (682 of 1794)
PASS: lldb-unit :: Host/./HostTests/NativeProcessProtocolTest.SetBreakpointFailWrite (683 of 1794)
PASS: lldb-api :: commands/expression/call-function/TestCallBuiltinFunction.py (684 of 1794)
PASS: lldb-api :: driver/batch_mode/TestBatchMode.py (685 of 1794)
PASS: lldb-unit :: Utility/./UtilityTests/StringExtractorTest.GetHexBytesAvail_OddPair2 (686 of 1794)
PASS: lldb-api :: lang/cpp/thread_local/TestThreadLocal.py (687 of 1794)
PASS: lldb-api :: functionalities/postmortem/minidump-new/TestMiniDumpUUID.py (688 of 1794)
PASS: lldb-unit :: Utility/./UtilityTests/StringExtractorTest.GetNameColonValueNoSemicolon (689 of 1794)
PASS: lldb-unit :: Utility/./UtilityTests/StreamTest.PutRawBytesToMixedEndian (690 of 1794)
PASS: lldb-unit :: UnwindAssembly/x86/./UnwindAssemblyx86Tests/Testx86AssemblyInspectionEngine.TestPushR14 (691 of 1794)
PASS: lldb-unit :: Utility/./UtilityTests/BinaryStreamTest.PutULEB128NineBytes (692 of 1794)
PASS: lldb-unit :: Host/./HostTests/FileSystemTest.Readable (693 of 1794)
PASS: lldb-unit :: Interpreter/./InterpreterTests/OptionArgParserTest.toScriptLanguage (694 of 1794)
PASS: lldb-shell :: Commands/command-script-import.test (695 of 1794)
PASS: lldb-api :: commands/expression/multiline-completion/TestMultilineCompletion.py (696 of 1794)
PASS: lldb-api :: lang/objc/global_ptrs/TestGlobalObjects.py (697 of 1794)
PASS: lldb-unit :: Interpreter/./InterpreterTests/OptionArgParserTest.toChar (698 of 1794)
PASS: lldb-unit :: Utility/./UtilityTests/StreamTest.PutBytesAsRawHex8ToMixedEndian (699 of 1794)
PASS: lldb-shell :: SymbolFile/Breakpad/line-table-edgecases.test (700 of 1794)
PASS: lldb-api :: python_api/exprpath_synthetic/TestExprPathSynthetic.py (701 of 1794)
PASS: lldb-unit :: ObjectFile/Breakpad/./ObjectFileBreakpadTests/Record.classify (702 of 1794)
PASS: lldb-api :: functionalities/data-formatter/synthcapping/TestSyntheticCapping.py (703 of 1794)
PASS: lldb-api :: api/multithreaded/TestMultithreaded.py (704 of 1794)
PASS: lldb-unit :: UnwindAssembly/x86/./UnwindAssemblyx86Tests/Testx86AssemblyInspectionEngine.TestPushRBP (705 of 1794)
PASS: lldb-unit :: Utility/./UtilityTests/StringListTest.JoinEmpty (706 of 1794)
PASS: lldb-api :: commands/settings/quoting/TestQuoting.py (707 of 1794)
PASS: lldb-unit :: Utility/./UtilityTests/OptionsWithRawTest.WhitespaceInput (708 of 1794)
PASS: lldb-api :: functionalities/breakpoint/breakpoint_names/TestBreakpointNames.py (709 of 1794)
PASS: lldb-unit :: Utility/./UtilityTests/StringExtractorTest.GetHexU8_Exact_NoEof (710 of 1794)
PASS: lldb-unit :: Utility/./UtilityTests/StringListTest.LongestCommonPrefixNoPrefix (711 of 1794)
PASS: lldb-api :: lang/c/unicode/TestUnicodeSymbols.py (712 of 1794)
PASS: lldb-unit :: Process/minidump/./LLDBMinidumpTests/MinidumpParserTest.GetThreadContext_x86_32_wow64 (713 of 1794)
UNSUPPORTED: lldb-api :: linux/mix-dwo-and-regular-objects/TestMixedDwarfBinary.py (714 of 1794)
PASS: lldb-api :: commands/expression/import_builtin_fileid/TestImportBuiltinFileID.py (715 of 1794)
PASS: lldb-unit :: Utility/./UtilityTests/StringListTest.JoinThree (716 of 1794)
PASS: lldb-api :: functionalities/backticks/TestBackticksWithoutATarget.py (717 of 1794)
PASS: lldb-shell :: ObjectFile/ELF/section-permissions.yaml (718 of 1794)
PASS: lldb-unit :: Target/./TargetTests/PathMappingListTest.RelativeTests (719 of 1794)
PASS: lldb-unit :: Utility/./UtilityTests/RangeTest.EqualInvalid (720 of 1794)
PASS: lldb-unit :: Utility/./UtilityTests/StringListTest.InsertStringAtIndexStdString (721 of 1794)
PASS: lldb-api :: lang/c/strings/TestCStrings.py (722 of 1794)
PASS: lldb-api :: commands/expression/timeout/TestCallWithTimeout.py (723 of 1794)
PASS: lldb-unit :: Host/./HostTests/FileSystemTest.Exists (724 of 1794)
PASS: lldb-api :: functionalities/memory-region/TestMemoryRegion.py (725 of 1794)
PASS: lldb-unit :: Symbol/./SymbolTests/Type.CompilerContextPattern (726 of 1794)
PASS: lldb-shell :: Register/x86-64-ymm-read.test (727 of 1794)
PASS: lldb-unit :: Platform/./LLDBPlatformTests/PlatformDarwinTest.TestParseVersionBuildDir (728 of 1794)
UNSUPPORTED: lldb-api :: tools/lldb-vscode/attach/TestVSCode_attach.py (729 of 1794)
PASS: lldb-api :: lang/objc/modules-cache/TestClangModulesCache.py (730 of 1794)
PASS: lldb-unit :: Utility/./UtilityTests/StringExtractorTest.GetU32BigEndian (731 of 1794)
PASS: lldb-unit :: Utility/./UtilityTests/StreamTeeTest.SetStreamAtIndexOutOfBounds (732 of 1794)
PASS: lldb-unit :: UnwindAssembly/x86/./UnwindAssemblyx86Tests/Testx86AssemblyInspectionEngine.TestPopR15 (733 of 1794)
PASS: lldb-shell :: BuildScript/modes.test (734 of 1794)
PASS: lldb-unit :: Utility/./UtilityTests/Flags.GetBitSize (735 of 1794)
UNSUPPORTED: lldb-api :: functionalities/thread/state/TestThreadStates.py (736 of 1794)
PASS: lldb-unit :: SymbolFile/DWARF/./SymbolFileDWARFTests/SymbolFileDWARFTests.TestAbbrevOutOfOrder (737 of 1794)
UNSUPPORTED: lldb-api :: benchmarks/expression/TestExpressionCmd.py (738 of 1794)
PASS: lldb-shell :: SymbolFile/NativePDB/break-by-function.cpp (739 of 1794)
PASS: lldb-unit :: Language/CPlusPlus/./LanguageCPlusPlusTests/CPlusPlusLanguage.FindAlternateFunctionManglings (740 of 1794)
PASS: lldb-api :: functionalities/data-formatter/data-formatter-objc/nsstring/TestDataFormatterNSString.py (741 of 1794)
PASS: lldb-api :: lang/c/shared_lib_stripped_symbols/TestSharedLibStrippedSymbols.py (742 of 1794)
UNSUPPORTED: lldb-api :: android/platform/TestDefaultCacheLineSize.py (743 of 1794)
PASS: lldb-api :: tools/lldb-server/TestGdbRemoteAttach.py (744 of 1794)
PASS: lldb-api :: functionalities/data-formatter/data-formatter-disabling/TestDataFormatterDisabling.py (745 of 1794)
PASS: lldb-api :: functionalities/data-formatter/data-formatter-synthtype/TestDataFormatterSynthType.py (746 of 1794)
UNSUPPORTED: lldb-api :: functionalities/darwin_log/filter/regex/activity/TestDarwinLogFilterRegexActivity.py (747 of 1794)
PASS: lldb-api :: functionalities/thread/create_after_attach/TestCreateAfterAttach.py (748 of 1794)
PASS: lldb-api :: lang/cpp/llvm-style/TestLLVMStyle.py (749 of 1794)
PASS: lldb-unit :: Utility/./UtilityTests/IndexToObjectTest.ObjectForIndex (750 of 1794)
PASS: lldb-unit :: Utility/./UtilityTests/StringListTest.GetMaxStringLengthIncreasingSize (751 of 1794)
PASS: lldb-unit :: ObjectFile/Breakpad/./ObjectFileBreakpadTests/FileRecord.parse (752 of 1794)
PASS: lldb-unit :: Process/gdb-remote/./ProcessGdbRemoteTests/GDBRemoteClientBaseTest.SendContinueAndInterrupt2PacketBug (753 of 1794)
PASS: lldb-shell :: Settings/TestModuleCacheSanity.test (754 of 1794)
UNSUPPORTED: lldb-shell :: Process/Windows/exception_access_violation.cpp (755 of 1794)
PASS: lldb-unit :: Host/./HostTests/SocketTest.DecodeHostAndPort (756 of 1794)
PASS: lldb-unit :: Expression/./ExpressionTests/CppModuleConfigurationTest.MissingUsrInclude (757 of 1794)
PASS: lldb-unit :: Utility/./UtilityTests/StringListTest.ForRange (758 of 1794)
PASS: lldb-unit :: Utility/./UtilityTests/StringExtractorTest.DecodeHexU8_Exact (759 of 1794)
PASS: lldb-api :: commands/expression/import-std-module/vector-basic/TestBasicVector.py (760 of 1794)
PASS: lldb-api :: functionalities/data-formatter/summary-string-onfail/Test-rdar-9974002.py (761 of 1794)
UNSUPPORTED: lldb-shell :: Breakpoint/case-insensitive.test (762 of 1794)
PASS: lldb-shell :: ObjectFile/ELF/short-build-id.yaml (763 of 1794)
PASS: lldb-api :: python_api/module_section/TestModuleAndSection.py (764 of 1794)
PASS: lldb-unit :: ScriptInterpreter/Python/./ScriptInterpreterPythonTests/PythonDataObjectsTest.TestPythonTupleInitializerList (765 of 1794)
PASS: lldb-api :: commands/expression/persist_objc_pointeetype/TestPersistObjCPointeeType.py (766 of 1794)
PASS: lldb-unit :: Utility/./UtilityTests/SerializationRountripTest.SerializeDeserializeObjectPointer (767 of 1794)
UNSUPPORTED: lldb-api :: functionalities/thread/concurrent_events/TestConcurrentManySignals.py (768 of 1794)
PASS: lldb-api :: commands/target/basic/TestTargetCommand.py (769 of 1794)
PASS: lldb-api :: types/TestDoubleTypes.py (770 of 1794)
PASS: lldb-api :: functionalities/data-formatter/data-formatter-stl/libcxx/tuple/TestDataFormatterLibcxxTuple.py (771 of 1794)
PASS: lldb-api :: macosx/lc-note/kern-ver-str/TestKernVerStrLCNOTE.py (772 of 1794)
PASS: lldb-api :: functionalities/thread/concurrent_events/TestConcurrentSignalNWatchNBreak.py (773 of 1794)
PASS: lldb-api :: python_api/sbvalue_persist/TestSBValuePersist.py (774 of 1794)
PASS: lldb-api :: commands/expression/inline-namespace/TestInlineNamespace.py (775 of 1794)
PASS: lldb-api :: tools/lldb-server/TestGdbRemoteExitCode.py (776 of 1794)
PASS: lldb-unit :: Utility/./UtilityTests/RecordReplayTest.InstrumentedBar (777 of 1794)
PASS: lldb-api :: commands/expression/import-std-module/vector-bool/TestBoolVector.py (778 of 1794)
PASS: lldb-api :: functionalities/data-formatter/format-propagation/TestFormatPropagation.py (779 of 1794)
PASS: lldb-unit :: ScriptInterpreter/Python/./ScriptInterpreterPythonTests/PythonDataObjectsTest.TestBorrowedReferences (780 of 1794)
PASS: lldb-unit :: Utility/./UtilityTests/RangeTest.ContainsEndInclusive (781 of 1794)
PASS: lldb-shell :: Reproducer/TestGDBRemoteRepro.test (782 of 1794)
PASS: lldb-unit :: Expression/./ExpressionTests/DiagnosticManagerTest.PutString (783 of 1794)
PASS: lldb-api :: macosx/indirect_symbol/TestIndirectSymbols.py (784 of 1794)
PASS: lldb-shell :: Driver/TestNoUseColor.test (785 of 1794)
PASS: lldb-unit :: Utility/./UtilityTests/Flags.AnyClear (786 of 1794)
PASS: lldb-api :: python_api/signals/TestSignalsAPI.py (787 of 1794)
PASS: lldb-unit :: Utility/./UtilityTests/StringLexerTest.AdvanceIf (788 of 1794)
PASS: lldb-shell :: SymbolFile/sizeless-symbol.test (789 of 1794)
PASS: lldb-api :: commands/expression/import-std-module/empty-module/TestEmptyStdModule.py (790 of 1794)
PASS: lldb-api :: sanity/TestModuleCacheSanity.py (791 of 1794)
PASS: lldb-unit :: UnwindAssembly/x86/./UnwindAssemblyx86Tests/Testx86AssemblyInspectionEngine.TestPushESI (792 of 1794)
PASS: lldb-api :: macosx/duplicate-archive-members/TestDuplicateMembers.py (793 of 1794)
PASS: lldb-unit :: Utility/./UtilityTests/UriParserTest.SchemeHostSeparator4 (794 of 1794)
PASS: lldb-unit :: Utility/./UtilityTests/BinaryStreamTest.PutSLEB128One (795 of 1794)
PASS: lldb-unit :: Symbol/./SymbolTests/TestClangASTContext.TemplateArguments (796 of 1794)
PASS: lldb-unit :: ObjectFile/Breakpad/./ObjectFileBreakpadTests/FuncRecord.parse (797 of 1794)
UNSUPPORTED: lldb-api :: lang/objc/rdar-12408181/TestRdar12408181.py (798 of 1794)
PASS: lldb-shell :: SymbolFile/DWARF/debug-types-line-tables.s (799 of 1794)
PASS: lldb-api :: lang/c/local_variables/TestLocalVariables.py (800 of 1794)
PASS: lldb-unit :: ScriptInterpreter/Python/./ScriptInterpreterPythonTests/PythonDataObjectsTest.TestObjectAttributes (801 of 1794)
PASS: lldb-shell :: ObjectFile/Breakpad/uuid-matching-mac.test (802 of 1794)
PASS: lldb-unit :: Utility/./UtilityTests/StreamTest.QuotedCString (803 of 1794)
PASS: lldb-api :: functionalities/ptr_refs/TestPtrRefs.py (804 of 1794)
PASS: lldb-api :: functionalities/completion/TestCompletion.py (805 of 1794)
PASS: lldb-unit :: Utility/./UtilityTests/UriParserTest.SchemeHostSeparator (806 of 1794)
PASS: lldb-unit :: ScriptInterpreter/Python/./ScriptInterpreterPythonTests/PythonDataObjectsTest.TestPythonDictionaryManipulation (807 of 1794)
PASS: lldb-api :: functionalities/data-formatter/synthupdate/TestSyntheticFilterRecompute.py (808 of 1794)
UNSUPPORTED: lldb-shell :: SymbolFile/PDB/type-quals.test (809 of 1794)
PASS: lldb-api :: python_api/watchpoint/condition/TestWatchpointConditionAPI.py (810 of 1794)
PASS: lldb-api :: functionalities/thread/concurrent_events/TestConcurrentBreakpointOneDelayBreakpointThreads.py (811 of 1794)
PASS: lldb-unit :: Utility/./UtilityTests/ScalarTest.Comparison (812 of 1794)
PASS: lldb-api :: commands/expression/import-std-module/shared_ptr-dbg-info-content/TestSharedPtrDbgInfoContent.py (813 of 1794)
PASS: lldb-unit :: Host/./HostTests/SocketAddressTest.GetAddressInfo (814 of 1794)
PASS: lldb-unit :: Language/Highlighting/./HighlighterTests/HighlighterTest.ClangPPDirectives (815 of 1794)
PASS: lldb-unit :: ScriptInterpreter/Python/./ScriptInterpreterPythonTests/PythonDataObjectsTest.TestPythonDictionaryToStructuredDictionary (816 of 1794)
PASS: lldb-unit :: Utility/./UtilityTests/RangeTest.ContainsAddr (817 of 1794)
PASS: lldb-api :: api/check_public_api_headers/TestPublicAPIHeaders.py (818 of 1794)
PASS: lldb-shell :: Breakpoint/debug_addrx.test (819 of 1794)
PASS: lldb-api :: python_api/sbstructureddata/TestStructuredDataAPI.py (820 of 1794)
UNSUPPORTED: lldb-api :: lang/objc/objc-dynamic-value/TestObjCDynamicValue.py (821 of 1794)
UNSUPPORTED: lldb-shell :: Register/aarch64-fp-read.test (822 of 1794)
PASS: lldb-unit :: Utility/./UtilityTests/LogTest.Unregister (823 of 1794)
PASS: lldb-api :: commands/expression/call-overridden-method/TestCallOverriddenMethod.py (824 of 1794)
PASS: lldb-unit :: Utility/./UtilityTests/BinaryStreamTest.PutULEB128OneByte (825 of 1794)
PASS: lldb-api :: python_api/target/TestTargetAPI.py (826 of 1794)
PASS: lldb-unit :: ObjectFile/PECOFF/./ObjectFilePECOFFTests/PECallFrameInfoTest.Basic_eh (827 of 1794)
PASS: lldb-unit :: Utility/./UtilityTests/StringExtractorTest.GetHexU8_Underflow_NoEof (828 of 1794)
PASS: lldb-unit :: UnwindAssembly/x86/./UnwindAssemblyx86Tests/Testx86AssemblyInspectionEngine.TestPopRBPWithREX (829 of 1794)
PASS: lldb-unit :: Utility/./UtilityTests/RegularExpression.Match (830 of 1794)
PASS: lldb-api :: functionalities/data-formatter/data-formatter-cpp/TestDataFormatterCpp.py (831 of 1794)
UNSUPPORTED: lldb-shell :: Unwind/unwind-plan-dwarf-dump.test (832 of 1794)
PASS: lldb-shell :: SymbolFile/DWARF/debug-line-basic.s (833 of 1794)
UNSUPPORTED: lldb-shell :: Unwind/eh-frame-small-fde.test (834 of 1794)
PASS: lldb-unit :: Process/minidump/./LLDBMinidumpTests/MinidumpParserTest.FindMemoryRange (835 of 1794)
PASS: lldb-unit :: ObjectFile/PECOFF/./ObjectFilePECOFFTests/PECallFrameInfoTest.Chained_eh (836 of 1794)
PASS: lldb-api :: functionalities/thread/concurrent_events/TestConcurrentDelaySignalBreak.py (837 of 1794)
PASS: lldb-api :: functionalities/data-formatter/setvaluefromcstring/TestSetValueFromCString.py (838 of 1794)
PASS: lldb-api :: functionalities/data-formatter/data-formatter-objc/TestDataFormatterObjNSException.py (839 of 1794)
PASS: lldb-unit :: Utility/./UtilityTests/TimerTest.CategoryTimes (840 of 1794)
PASS: lldb-unit :: Utility/./UtilityTests/StringListTest.SetSize (841 of 1794)
PASS: lldb-api :: commands/process/launch/TestProcessLaunch.py (842 of 1794)
PASS: lldb-api :: python_api/watchpoint/TestWatchpointIgnoreCount.py (843 of 1794)
PASS: lldb-shell :: SymbolFile/DWARF/debug-types-dwo-cross-reference.cpp (844 of 1794)
PASS: lldb-api :: arm/emulation/TestEmulations.py (845 of 1794)
UNSUPPORTED: lldb-api :: functionalities/darwin_log/filter/exact_match/activity/TestDarwinLogFilterMatchActivity.py (846 of 1794)
PASS: lldb-unit :: Core/./LLDBCoreTests/MangledTest.NameIndexes_FindFunctionSymbols (847 of 1794)
PASS: lldb-unit :: Utility/./UtilityTests/VMRange.ContainsAddr (848 of 1794)
PASS: lldb-unit :: tools/lldb-server/tests/./LLDBServerTests/StandardStartupTest.TestStopReplyContainsThreadPcs (849 of 1794)
PASS: lldb-unit :: Utility/./UtilityTests/BinaryStreamTest.PutSLEB128SixBytes (850 of 1794)
PASS: lldb-unit :: Utility/./UtilityTests/BinaryStreamTest.PutSLEB128NineBytes (851 of 1794)
PASS: lldb-unit :: Symbol/./SymbolTests/TestClangASTContext.TestConvertAccessTypeToAccessSpecifier (852 of 1794)
PASS: lldb-api :: functionalities/param_entry_vals/basic_entry_values_x86_64/TestBasicEntryValuesX86_64.py (853 of 1794)
PASS: lldb-shell :: ObjectFile/PECOFF/uuid.yaml (854 of 1794)
PASS: lldb-unit :: Utility/./UtilityTests/StreamTest.PutHex32ByteOrderLittle (855 of 1794)
PASS: lldb-unit :: Editline/./EditlineTests/EditlineTestFixture.EditlineReceivesSingleLineText (856 of 1794)
PASS: lldb-api :: functionalities/type_lookup/TestTypeLookup.py (857 of 1794)
PASS: lldb-unit :: Utility/./UtilityTests/ProcessInstanceInfo.DumpTable_invalidUID (858 of 1794)
PASS: lldb-unit :: Utility/./UtilityTests/StreamTest.PutMaxHex64ByteOrderBig (859 of 1794)
PASS: lldb-api :: functionalities/load_unload/TestLoadUnload.py (860 of 1794)
PASS: lldb-api :: commands/watchpoints/watchpoint_commands/command/TestWatchpointCommandLLDB.py (861 of 1794)
PASS: lldb-unit :: Language/Highlighting/./HighlighterTests/HighlighterTest.ClangCursorPos (862 of 1794)
PASS: lldb-api :: commands/watchpoints/watchpoint_on_vectors/TestValueOfVectorVariable.py (863 of 1794)
PASS: lldb-api :: functionalities/breakpoint/debugbreak/TestDebugBreak.py (864 of 1794)
PASS: lldb-api :: functionalities/unwind/noreturn/TestNoreturnUnwind.py (865 of 1794)
PASS: lldb-api :: python_api/value/empty_class/TestValueAPIEmptyClass.py (866 of 1794)
PASS: lldb-api :: lang/objc/blocks/TestObjCIvarsInBlocks.py (867 of 1794)
PASS: lldb-unit :: Process/minidump/./LLDBMinidumpTests/RegisterContextMinidump.ConvertMinidumpContext_x86_64 (868 of 1794)
PASS: lldb-api :: lang/c/modules/TestCModules.py (869 of 1794)
PASS: lldb-api :: lang/cpp/virtual-overload/TestVirtualOverload.py (870 of 1794)
PASS: lldb-unit :: UnwindAssembly/x86/./UnwindAssemblyx86Tests/Testx86AssemblyInspectionEngine.TestPushR13 (871 of 1794)
PASS: lldb-unit :: Utility/./UtilityTests/RecordReplayTest.InstrumentedFooSameThis (872 of 1794)
PASS: lldb-api :: python_api/value/change_values/TestChangeValueAPI.py (873 of 1794)
UNSUPPORTED: lldb-api :: functionalities/darwin_log/format/TestDarwinLogMessageFormat.py (874 of 1794)
UNSUPPORTED: lldb-api :: python_api/event/TestEvents.py (875 of 1794)
PASS: lldb-api :: lang/cpp/function_refs/TestFunctionRefs.py (876 of 1794)
PASS: lldb-unit :: Utility/./UtilityTests/StreamTest.PutBytesAsRawHex8ToBigEndian (877 of 1794)
PASS: lldb-shell :: SymbolFile/DWARF/find-variable-file.cpp (878 of 1794)
UNSUPPORTED: lldb-api :: commands/expression/macros/TestMacros.py (879 of 1794)
PASS: lldb-unit :: Host/./HostTests/MainLoopTest.Signal (880 of 1794)
PASS: lldb-api :: functionalities/data-formatter/data-formatter-synth/TestDataFormatterSynth.py (881 of 1794)
PASS: lldb-shell :: Settings/TestEchoCommands.test (882 of 1794)
PASS: lldb-unit :: SymbolFile/NativePDB/./SymbolFileNativePDBTests/PDBFPOProgramToDWARFExpressionTests.UnresolvedDependentCyclicRegisterAssignmentReference (883 of 1794)
PASS: lldb-api :: functionalities/breakpoint/breakpoint_command/TestBreakpointCommand.py (884 of 1794)
PASS: lldb-api :: functionalities/thread/concurrent_events/TestConcurrentSignalWatch.py (885 of 1794)
PASS: lldb-unit :: Utility/./UtilityTests/CompletionRequest.FakeLastArg (886 of 1794)
PASS: lldb-api :: lang/cpp/this/TestCPPThis.py (887 of 1794)
PASS: lldb-unit :: Utility/./UtilityTests/BroadcasterTest.BroadcastEvent (888 of 1794)
PASS: lldb-unit :: Process/minidump/./LLDBMinidumpTests/RegisterContextMinidump.ConvertMinidumpContext_x86_32 (889 of 1794)
UNSUPPORTED: lldb-api :: functionalities/unwind/standard/TestStandardUnwind.py (890 of 1794)
PASS: lldb-api :: commands/apropos/basic/TestApropos.py (891 of 1794)
PASS: lldb-unit :: debugserver/./debugserverTests/RNBSocket.LoopBackConnectIPv4 (892 of 1794)
PASS: lldb-unit :: ScriptInterpreter/Python/./ScriptInterpreterPythonTests/PythonDataObjectsTest.TestPythonFile (893 of 1794)
PASS: lldb-unit :: Utility/./UtilityTests/StringExtractorTest.GetU64BigEndian (894 of 1794)
PASS: lldb-unit :: Utility/./UtilityTests/EnvironmentTest.EnvpConstruction (895 of 1794)
PASS: lldb-unit :: Utility/./UtilityTests/StreamTest.PutBytesAsRawHex8ToLittleEndian (896 of 1794)
PASS: lldb-unit :: Utility/./UtilityTests/RegularExpression.Invalid (897 of 1794)
PASS: lldb-unit :: Utility/./UtilityTests/EnvironmentTest.EnvpConversion (898 of 1794)
PASS: lldb-shell :: ObjectFile/ELF/aarch64-relocations.yaml (899 of 1794)
UNSUPPORTED: lldb-api :: functionalities/darwin_log/filter/exact_match/activity-chain/TestDarwinLogFilterMatchActivityChain.py (900 of 1794)
PASS: lldb-unit :: Utility/./UtilityTests/LogTest.LLDB_LOG_nullptr (901 of 1794)
PASS: lldb-unit :: Utility/./UtilityTests/StreamTest.PutHex32ByteOrderBig (902 of 1794)
PASS: lldb-api :: lang/objc/objc-ivar-protocols/TestIvarProtocols.py (903 of 1794)
PASS: lldb-api :: python_api/class_members/TestSBTypeClassMembers.py (904 of 1794)
PASS: lldb-api :: functionalities/data-formatter/data-formatter-python-synth/TestDataFormatterPythonSynth.py (905 of 1794)
PASS: lldb-api :: functionalities/data-formatter/nsarraysynth/TestNSArraySynthetic.py (906 of 1794)
PASS: lldb-api :: functionalities/show_location/TestShowLocationDwarf5.py (907 of 1794)
PASS: lldb-shell :: SymbolFile/NativePDB/nested-types.cpp (908 of 1794)
PASS: lldb-api :: commands/expression/class_template_specialization_empty_pack/TestClassTemplateSpecializationParametersHandling.py (909 of 1794)
PASS: lldb-unit :: Utility/./UtilityTests/StringListTest.JoinSingle (910 of 1794)
PASS: lldb-unit :: UnwindAssembly/ARM64/./Arm64InstEmulationTests/TestArm64InstEmulation.TestRegisterSavedTwice (911 of 1794)
PASS: lldb-unit :: Process/gdb-remote/./ProcessGdbRemoteTests/GDBRemoteClientBaseTest.SendContinueDelegateStructuredDataReceipt (912 of 1794)
PASS: lldb-api :: lang/cpp/stl/TestStdCXXDisassembly.py (913 of 1794)
PASS: lldb-unit :: Utility/./UtilityTests/FileSpecTest.GuessPathStyle (914 of 1794)
PASS: lldb-unit :: Utility/./UtilityTests/ScalarTest.ExtractBitfield (915 of 1794)
PASS: lldb-api :: lang/c/offsetof/TestOffsetof.py (916 of 1794)
PASS: lldb-api :: python_api/type/TestTypeList.py (917 of 1794)
PASS: lldb-unit :: Utility/./UtilityTests/FileSpecTest.AppendPathComponent (918 of 1794)
PASS: lldb-unit :: Utility/./UtilityTests/FileSpecTest.EqualSeparator (919 of 1794)
PASS: lldb-unit :: Utility/./UtilityTests/ArgsTest.TestQuotedTrailingBackslash (920 of 1794)
PASS: lldb-api :: functionalities/data-formatter/var-in-aggregate-misuse/TestVarInAggregateMisuse.py (921 of 1794)
PASS: lldb-unit :: Process/gdb-remote/./ProcessGdbRemoteTests/GDBRemoteCommunicationClientTest.GetMemoryRegionInfo (922 of 1794)
PASS: lldb-unit :: SymbolFile/NativePDB/./SymbolFileNativePDBTests/PDBFPOProgramToDWARFExpressionTests.InvalidOpUnary (923 of 1794)
PASS: lldb-api :: functionalities/data-formatter/poarray/TestPrintObjectArray.py (924 of 1794)
UNSUPPORTED: lldb-api :: linux/add-symbols/TestTargetSymbolsAddCommand.py (925 of 1794)
PASS: lldb-shell :: SymbolFile/DWARF/dir-separator-windows.s (926 of 1794)
PASS: lldb-unit :: ScriptInterpreter/Python/./ScriptInterpreterPythonTests/PythonDataObjectsTest.TestPythonIntegerToStructuredInteger (927 of 1794)
PASS: lldb-api :: functionalities/asan/TestMemoryHistory.py (928 of 1794)
PASS: lldb-api :: commands/version/TestVersion.py (929 of 1794)
PASS: lldb-api :: tools/lldb-server/TestAppleSimulatorOSType.py (930 of 1794)
PASS: lldb-api :: commands/expression/import-std-module/unique_ptr/TestUniquePtr.py (931 of 1794)
PASS: lldb-shell :: SymbolFile/NativePDB/break-by-line.cpp (932 of 1794)
PASS: lldb-unit :: Process/gdb-remote/./ProcessGdbRemoteTests/GDBRemoteClientBaseTest.SendContinueDelegateInterface (933 of 1794)
PASS: lldb-shell :: Driver/TestRepl.test (934 of 1794)
PASS: lldb-api :: python_api/watchpoint/watchlocation/TestSetWatchlocation.py (935 of 1794)
PASS: lldb-api :: functionalities/modern-type-lookup/basic/TestBasicModernTypeLookup.py (936 of 1794)
PASS: lldb-unit :: Utility/./UtilityTests/StringExtractorTest.GetHexBytes_OddPair2 (937 of 1794)
PASS: lldb-unit :: Utility/./UtilityTests/UriParserTest.BracketedHostnamePort (938 of 1794)
PASS: lldb-api :: lang/cpp/accelerator-table/TestCPPAccelerator.py (939 of 1794)
UNSUPPORTED: lldb-shell :: BuildScript/toolchain-msvc.test (940 of 1794)
PASS: lldb-unit :: Utility/./UtilityTests/StructuredDataTest.ParseJSONFromFile (941 of 1794)
PASS: lldb-unit :: Utility/./UtilityTests/OptionsWithRawTest.MultiWordSuffix (942 of 1794)
PASS: lldb-api :: python_api/findvalue_duplist/TestSBFrameFindValue.py (943 of 1794)
PASS: lldb-api :: functionalities/data-formatter/pyobjsynthprovider/TestPyObjSynthProvider.py (944 of 1794)
PASS: lldb-api :: functionalities/data-formatter/data-formatter-objc/TestDataFormatterObjCNSError.py (945 of 1794)
PASS: lldb-api :: commands/expression/entry-bp/TestExprEntryBP.py (946 of 1794)
PASS: lldb-unit :: Utility/./UtilityTests/NameMatchesTest.Equals (947 of 1794)
PASS: lldb-api :: lang/c/forward/TestForwardDeclaration.py (948 of 1794)
PASS: lldb-api :: commands/expression/radar_8638051/Test8638051.py (949 of 1794)
PASS: lldb-api :: commands/expression/calculator_mode/TestCalculatorMode.py (950 of 1794)
PASS: lldb-api :: lang/cpp/scope/TestCppScope.py (951 of 1794)
PASS: lldb-api :: lang/cpp/namespace_conflicts/TestNamespaceConflicts.py (952 of 1794)
PASS: lldb-api :: functionalities/rerun/TestRerun.py (953 of 1794)
UNSUPPORTED: lldb-shell :: Register/x86-zmm-read.test (954 of 1794)
UNSUPPORTED: lldb-api :: lang/cpp/static_members/TestCPPStaticMembers.py (955 of 1794)
PASS: lldb-unit :: Process/gdb-remote/./ProcessGdbRemoteTests/GDBRemoteCommunicationClientTest.GetModulesInfo_UUID20 (956 of 1794)
UNSUPPORTED: lldb-shell :: SymbolFile/PDB/function-level-linking.test (957 of 1794)
PASS: lldb-api :: functionalities/gdb_remote_client/TestGDBRemoteLoad.py (958 of 1794)
PASS: lldb-unit :: Host/./HostTests/SocketTest.TCPGetAddress (959 of 1794)
PASS: lldb-unit :: Utility/./UtilityTests/RangeTest.SizeTypes (960 of 1794)
PASS: lldb-unit :: Utility/./UtilityTests/RangeTest.ContainsRange (961 of 1794)
PASS: lldb-api :: python_api/lldbutil/frame/TestFrameUtils.py (962 of 1794)
PASS: lldb-unit :: Utility/./UtilityTests/UriParserTest.LongPath (963 of 1794)
PASS: lldb-unit :: Expression/./ExpressionTests/DiagnosticManagerTest.GetStringNoDiags (964 of 1794)
PASS: lldb-unit :: Symbol/./SymbolTests/DWARFCallFrameInfoTest.Basic_dwarf3 (965 of 1794)
PASS: lldb-unit :: ScriptInterpreter/Python/./ScriptInterpreterPythonTests/PythonDataObjectsTest.TestPythonDictionaryValueEquality (966 of 1794)
PASS: lldb-shell :: BuildScript/toolchain-clang.test (967 of 1794)
PASS: lldb-api :: macosx/safe-to-func-call/TestSafeFuncCalls.py (968 of 1794)
PASS: lldb-shell :: ObjectFile/ELF/build-id-case.yaml (969 of 1794)
PASS: lldb-shell :: Reproducer/Functionalities/TestStepping.test (970 of 1794)
PASS: lldb-shell :: SymbolFile/DWARF/debug-types-basic.test (971 of 1794)
PASS: lldb-shell :: SymbolFile/DWARF/parallel-indexing-stress.s (972 of 1794)
UNSUPPORTED: lldb-shell :: Register/x86-64-xmm16-write.test (973 of 1794)
PASS: lldb-unit :: Utility/./UtilityTests/StringLexerTest.HasAtLeast (974 of 1794)
PASS: lldb-api :: lang/objc/objc-new-syntax/TestObjCNewSyntaxDictionary.py (975 of 1794)
PASS: lldb-api :: commands/frame/var-scope/TestFrameVariableScope.py (976 of 1794)
PASS: lldb-api :: lang/objc/conflicting-definition/TestConflictingDefinition.py (977 of 1794)
PASS: lldb-unit :: Process/minidump/./LLDBMinidumpTests/MinidumpParserTest.GetMemoryRegionInfoLinuxMaps (978 of 1794)
PASS: lldb-api :: python_api/process/read-mem-cstring/TestReadMemCString.py (979 of 1794)
PASS: lldb-unit :: UnwindAssembly/x86/./UnwindAssemblyx86Tests/Testx86AssemblyInspectionEngine.TestPushEAX (980 of 1794)
PASS: lldb-api :: lang/c/global_variables/TestGlobalVariables.py (981 of 1794)
PASS: lldb-api :: lang/c/enum_types/TestEnumTypes.py (982 of 1794)
PASS: lldb-unit :: Utility/./UtilityTests/StreamTeeTest.GetStreamAtIndexOutOfBoundsEmpty (983 of 1794)
PASS: lldb-unit :: Utility/./UtilityTests/AnsiTerminal.WhiteSpace (984 of 1794)
PASS: lldb-unit :: Host/./HostTests/SocketTest.DomainGetConnectURI (985 of 1794)
PASS: lldb-shell :: Host/TestCustomShell.test (986 of 1794)
PASS: lldb-shell :: SymbolFile/NativePDB/function-types-classes.cpp (987 of 1794)
PASS: lldb-unit :: ObjectFile/Breakpad/./ObjectFileBreakpadTests/InfoRecord.parse (988 of 1794)
PASS: lldb-api :: commands/expression/context-object-objc/TestContextObjectObjc.py (989 of 1794)
UNSUPPORTED: lldb-shell :: SymbolFile/PDB/calling-conventions.test (990 of 1794)
PASS: lldb-unit :: Utility/./UtilityTests/RangeDataVector.FindEntryThatContains (991 of 1794)
PASS: lldb-shell :: SymbolFile/Breakpad/line-table-mixed-path-styles.test (992 of 1794)
PASS: lldb-api :: functionalities/data-formatter/data-formatter-script/TestDataFormatterScript.py (993 of 1794)
PASS: lldb-unit :: Host/./HostTests/FileSystemTest.FileAndDirectoryComponents (994 of 1794)
PASS: lldb-unit :: Process/gdb-remote/./ProcessGdbRemoteTests/GDBRemoteCommunicationServerTest.SendErrorResponse_UnimplementedError (995 of 1794)
PASS: lldb-api :: lang/cpp/nested-class-other-compilation-unit/TestNestedClassWithParentInAnotherCU.py (996 of 1794)
PASS: lldb-unit :: Utility/./UtilityTests/VMRange.Ordering (997 of 1794)
UNSUPPORTED: lldb-api :: functionalities/unwind/ehframe/TestEhFrameUnwind.py (998 of 1794)
PASS: lldb-unit :: ObjectFile/Breakpad/./ObjectFileBreakpadTests/LineRecord.parse (999 of 1794)
PASS: lldb-shell :: SymbolFile/DWARF/array-sizes.s (1000 of 1794)
PASS: lldb-api :: commands/gui/invalid-args/TestInvalidArgsGui.py (1001 of 1794)
UNSUPPORTED: lldb-shell :: ObjectFile/ELF/minidebuginfo-no-lzma.yaml (1002 of 1794)
PASS: lldb-api :: python_api/process/io/TestProcessIO.py (1003 of 1794)
PASS: lldb-api :: commands/expression/persistent_types/TestNestedPersistentTypes.py (1004 of 1794)
PASS: lldb-unit :: Utility/./UtilityTests/StringListTest.AppendList (1005 of 1794)
PASS: lldb-unit :: Utility/./UtilityTests/AnsiTerminal.Twice (1006 of 1794)
UNSUPPORTED: lldb-api :: commands/expression/completion-crash1/TestCompletionCrash1.py (1007 of 1794)
PASS: lldb-shell :: ObjectFile/Breakpad/sections.test (1008 of 1794)
PASS: lldb-api :: lang/cpp/call-function/TestCallCPPFunction.py (1009 of 1794)
UNSUPPORTED: lldb-shell :: SymbolFile/PDB/expressions.test (1010 of 1794)
PASS: lldb-unit :: Utility/./UtilityTests/BinaryStreamTest.PutULEB128One (1011 of 1794)
PASS: lldb-unit :: Utility/./UtilityTests/AnsiTerminal.KnownPrefix (1012 of 1794)
PASS: lldb-unit :: Utility/./UtilityTests/StringListTest.CopyList (1013 of 1794)
PASS: lldb-unit :: Utility/./UtilityTests/StreamTest.PutULEB128 (1014 of 1794)
PASS: lldb-api :: commands/expression/fixits/TestFixIts.py (1015 of 1794)
PASS: lldb-unit :: ScriptInterpreter/Python/./ScriptInterpreterPythonTests/PythonDataObjectsTest.TestModuleNameResolutionNoDot (1016 of 1794)
PASS: lldb-unit :: Utility/./UtilityTests/StringListTest.GetMaxStringLengthEmpty (1017 of 1794)
PASS: lldb-api :: lang/cpp/frame-var-anon-unions/TestFrameVariableAnonymousUnions.py (1018 of 1794)
PASS: lldb-unit :: Utility/./UtilityTests/ConstStringTest.CompareStringRef (1019 of 1794)
PASS: lldb-unit :: Utility/./UtilityTests/ArchSpecTest.MergeFromMachOUnknown (1020 of 1794)
PASS: lldb-unit :: Utility/./UtilityTests/BinaryStreamTest.PutSLEB128TwoBytes (1021 of 1794)
PASS: lldb-api :: functionalities/signal/TestSendSignal.py (1022 of 1794)
PASS: lldb-unit :: Utility/./UtilityTests/LogChannelTest.Enable (1023 of 1794)
PASS: lldb-api :: functionalities/ubsan/basic/TestUbsanBasic.py (1024 of 1794)
PASS: lldb-unit :: Expression/./ExpressionTests/CppModuleConfigurationTest.Xcode (1025 of 1794)
PASS: lldb-api :: commands/expression/vector_of_enums/TestVectorOfEnums.py (1026 of 1794)
PASS: lldb-api :: commands/expression/call-function/TestCallStdStringFunction.py (1027 of 1794)
PASS: lldb-unit :: SymbolFile/NativePDB/./SymbolFileNativePDBTests/PDBFPOProgramToDWARFExpressionTests.UnknownOp (1028 of 1794)
PASS: lldb-api :: functionalities/tail_call_frames/ambiguous_tail_call_seq2/TestAmbiguousTailCallSeq2.py (1029 of 1794)
PASS: lldb-api :: commands/expression/unicode-in-variable/TestUnicodeInVariable.py (1030 of 1794)
PASS: lldb-api :: commands/watchpoints/hello_watchpoint/TestMyFirstWatchpoint.py (1031 of 1794)
PASS: lldb-api :: functionalities/data-formatter/data-formatter-stl/libcxx/set/TestDataFormatterLibcxxSet.py (1032 of 1794)
PASS: lldb-api :: functionalities/data-formatter/data-formatter-skip-summary/TestDataFormatterSkipSummary.py (1033 of 1794)
PASS: lldb-unit :: Utility/./UtilityTests/UriParserTest.BadPort (1034 of 1794)
PASS: lldb-unit :: ScriptInterpreter/Python/./ScriptInterpreterPythonTests/PythonDataObjectsTest.TestPythonListValueEquality (1035 of 1794)
PASS: lldb-shell :: Quit/TestQuitExitCode-30.test (1036 of 1794)
UNSUPPORTED: lldb-api :: benchmarks/expression/TestRepeatedExprs.py (1037 of 1794)
PASS: lldb-unit :: Utility/./UtilityTests/StringListTest.AppendStringCString (1038 of 1794)
PASS: lldb-unit :: Utility/./UtilityTests/StringListTest.ShiftStdString (1039 of 1794)
PASS: lldb-api :: python_api/value/TestValueAPI.py (1040 of 1794)
PASS: lldb-unit :: Process/gdb-remote/./ProcessGdbRemoteTests/GDBRemoteCommunicationClientTest.SaveRestoreRegistersNoSuffix (1041 of 1794)
PASS: lldb-api :: functionalities/history/TestHistoryRecall.py (1042 of 1794)
PASS: lldb-unit :: Interpreter/./InterpreterTests/OptionArgParserTest.toBoolean (1043 of 1794)
PASS: lldb-shell :: Quit/TestQuitExitCode30.test (1044 of 1794)
PASS: lldb-api :: commands/target/create-deps/TestTargetCreateDeps.py (1045 of 1794)
PASS: lldb-unit :: Process/gdb-remote/./ProcessGdbRemoteTests/GDBRemoteClientBaseTest.SendContinueAndAsyncPacket (1046 of 1794)
PASS: lldb-unit :: Language/Highlighting/./HighlighterTests/HighlighterTest.DefaultHighlighterWithCursor (1047 of 1794)
PASS: lldb-shell :: ObjectFile/ELF/section-addresses.yaml (1048 of 1794)
PASS: lldb-unit :: Process/gdb-remote/./ProcessGdbRemoteTests/GDBRemoteClientBaseTest.SendContinueAndAsyncSignal (1049 of 1794)
PASS: lldb-unit :: ScriptInterpreter/Python/./ScriptInterpreterPythonTests/PythonDataObjectsTest.TestPythonInteger (1050 of 1794)
PASS: lldb-shell :: Settings/TestStopCommandSourceOnError.test (1051 of 1794)
PASS: lldb-unit :: Expression/./ExpressionTests/DWARFExpression.DW_OP_convert (1052 of 1794)
PASS: lldb-unit :: Utility/./UtilityTests/StringListTest.SplitIntoLinesEmpty (1053 of 1794)
PASS: lldb-unit :: Utility/./UtilityTests/StreamTeeTest.AppendStream (1054 of 1794)
PASS: lldb-api :: types/TestFloatTypes.py (1055 of 1794)
PASS: lldb-api :: functionalities/data-formatter/nsdictionarysynth/TestNSDictionarySynthetic.py (1056 of 1794)
PASS: lldb-api :: tools/lldb-server/commandline/TestStubSetSID.py (1057 of 1794)
PASS: lldb-unit :: Utility/./UtilityTests/RangeTest.Constructor (1058 of 1794)
PASS: lldb-api :: commands/process/launch-with-shellexpand/TestLaunchWithShellExpand.py (1059 of 1794)
PASS: lldb-api :: functionalities/postmortem/wow64_minidump/TestWow64MiniDump.py (1060 of 1794)
PASS: lldb-shell :: SymbolFile/DWARF/find-method-local-struct.cpp (1061 of 1794)
PASS: lldb-unit :: Utility/./UtilityTests/RangeTest.Clear (1062 of 1794)
PASS: lldb-api :: functionalities/signal/handle-abrt/TestHandleAbort.py (1063 of 1794)
PASS: lldb-unit :: Utility/./UtilityTests/StringExtractorTest.GetHexBytesAvail_OddPair (1064 of 1794)
PASS: lldb-unit :: Utility/./UtilityTests/ArgsTest.GetArgumentArrayRef (1065 of 1794)
PASS: lldb-api :: lang/cpp/unique-types/TestUniqueTypes.py (1066 of 1794)
PASS: lldb-shell :: SymbolFile/DWARF/debug_ranges-missing-section.s (1067 of 1794)
PASS: lldb-unit :: Utility/./UtilityTests/NameMatchesTest.Contains (1068 of 1794)
PASS: lldb-unit :: UnwindAssembly/x86/./UnwindAssemblyx86Tests/Testx86AssemblyInspectionEngine.TestPopR13 (1069 of 1794)
UNSUPPORTED: lldb-api :: functionalities/darwin_log/source/info/TestDarwinLogSourceInfo.py (1070 of 1794)
PASS: lldb-shell :: SymbolFile/DWARF/debug_aranges-empty-section.s (1071 of 1794)
PASS: lldb-unit :: Utility/./UtilityTests/VMRange.Clear (1072 of 1794)
PASS: lldb-unit :: Host/./HostTests/NativeProcessProtocolTest.ReadCStringFromMemory_MaxSize (1073 of 1794)
PASS: lldb-unit :: Utility/./UtilityTests/ArgsTest.TestMultipleArgs (1074 of 1794)
PASS: lldb-api :: lang/c/blocks/TestBlocks.py (1075 of 1794)
PASS: lldb-shell :: SymbolFile/NativePDB/function-types-builtins.cpp (1076 of 1794)
PASS: lldb-unit :: Utility/./UtilityTests/BinaryStreamTest.PutULEB128EightBytes (1077 of 1794)
PASS: lldb-api :: functionalities/set-data/TestSetData.py (1078 of 1794)
PASS: lldb-shell :: Breakpoint/case-sensitive.test (1079 of 1794)
XFAIL: lldb-shell :: Register/x86-mm-xmm-write.test (1080 of 1794)
PASS: lldb-api :: python_api/sbdata/TestSBData.py (1081 of 1794)
PASS: lldb-api :: commands/frame/diagnose/virtual-method-call/TestDiagnoseDereferenceVirtualMethodCall.py (1082 of 1794)
PASS: lldb-unit :: Expression/./ExpressionTests/CppModuleConfigurationTest.UnrelatedLibrary (1083 of 1794)
PASS: lldb-api :: commands/expression/import-std-module/basic/TestImportStdModule.py (1084 of 1794)
PASS: lldb-unit :: Host/./HostTests/HostInfoTest.GetHostname (1085 of 1794)
PASS: lldb-unit :: Process/gdb-remote/./ProcessGdbRemoteTests/GDBRemoteClientBaseTest.SendPacketAndReceiveResponseWithOutputSupport (1086 of 1794)
PASS: lldb-unit :: ScriptInterpreter/Python/./ScriptInterpreterPythonTests/PythonExceptionStateTest.TestAutoRestoreSemantics (1087 of 1794)
PASS: lldb-api :: commands/expression/function_template_specialization_temp_args/TestFunctionTemplateSpecializationTempArgs.py (1088 of 1794)
PASS: lldb-api :: functionalities/breakpoint/objc/TestObjCBreakpoints.py (1089 of 1794)
PASS: lldb-api :: functionalities/jitloader_gdb/TestJITLoaderGDB.py (1090 of 1794)
PASS: lldb-unit :: Utility/./UtilityTests/SerializationRountripTest.SerializeDeserializePod (1091 of 1794)
PASS: lldb-unit :: Utility/./UtilityTests/ArgsTest.TestOverwriteArgs (1092 of 1794)
PASS: lldb-shell :: Breakpoint/debug_rnglist_offset_pair.test (1093 of 1794)
PASS: lldb-api :: lang/objc/objc-struct-argument/TestObjCStructArgument.py (1094 of 1794)
PASS: lldb-unit :: UnwindAssembly/x86/./UnwindAssemblyx86Tests/Testx86AssemblyInspectionEngine.Test32bitFramelessBigStackFrame (1095 of 1794)
PASS: lldb-shell :: ObjectFile/ELF/section-overlap.yaml (1096 of 1794)
PASS: lldb-api :: functionalities/postmortem/netbsd-core/TestNetBSDCore.py (1097 of 1794)
PASS: lldb-api :: commands/command/invalid-args/TestInvalidArgsCommand.py (1098 of 1794)
PASS: lldb-api :: types/TestRecursiveTypes.py (1099 of 1794)
PASS: lldb-unit :: Utility/./UtilityTests/ReproducerTest.SetCapture (1100 of 1794)
UNSUPPORTED: lldb-api :: linux/sepdebugsymlink/TestTargetSymbolsSepDebugSymlink.py (1101 of 1794)
PASS: lldb-shell :: SymbolFile/NativePDB/s_constant.cpp (1102 of 1794)
PASS: lldb-api :: functionalities/breakpoint/breakpoint_by_line_and_column/TestBreakpointByLineAndColumn.py (1103 of 1794)
PASS: lldb-api :: functionalities/thread/concurrent_events/TestConcurrentTwoBreakpointsOneDelaySignal.py (1104 of 1794)
PASS: lldb-api :: tools/lldb-server/TestGdbRemoteHostInfo.py (1105 of 1794)
PASS: lldb-api :: functionalities/breakpoint/cpp/TestCPPBreakpointLocations.py (1106 of 1794)
UNSUPPORTED: lldb-api :: api/multiple-debuggers/TestMultipleDebuggers.py (1107 of 1794)
PASS: lldb-shell :: Settings/TestFrameFormatColor.test (1108 of 1794)
PASS: lldb-api :: functionalities/data-formatter/data-formatter-objc/TestDataFormatterObjCNSBundle.py (1109 of 1794)
PASS: lldb-api :: commands/expression/ignore-artificial-constructors/TestIgnoreArtificialConstructors.py (1110 of 1794)
PASS: lldb-api :: lang/objc/objc-stepping/TestObjCStepping.py (1111 of 1794)
UNSUPPORTED: lldb-api :: functionalities/darwin_log/filter/regex/subsystem/TestDarwinLogFilterRegexSubsystem.py (1112 of 1794)
PASS: lldb-unit :: Process/gdb-remote/./ProcessGdbRemoteTests/GDBRemoteCommunicationClientTest.SendGetMetaDataPacket (1113 of 1794)
PASS: lldb-unit :: ScriptInterpreter/Python/./ScriptInterpreterPythonTests/PythonDataObjectsTest.TestCallable (1114 of 1794)
PASS: lldb-api :: commands/watchpoints/watchpoint_commands/TestWatchpointCommands.py (1115 of 1794)
PASS: lldb-api :: lang/objc/objc-struct-return/TestObjCStructReturn.py (1116 of 1794)
PASS: lldb-api :: python_api/lldbutil/iter/TestLLDBIterator.py (1117 of 1794)
UNSUPPORTED: lldb-shell :: SymbolFile/PDB/variables-locations.test (1118 of 1794)
PASS: lldb-unit :: UnwindAssembly/x86/./UnwindAssemblyx86Tests/Testx86AssemblyInspectionEngine.TestDisassemblyMidFunctionEpilogues (1119 of 1794)
PASS: lldb-unit :: ScriptInterpreter/Python/./ScriptInterpreterPythonTests/PythonDataObjectsTest.TestPythonTupleValues (1120 of 1794)
PASS: lldb-unit :: UnwindAssembly/x86/./UnwindAssemblyx86Tests/Testx86AssemblyInspectionEngine.Test32BitOnlyInstruction (1121 of 1794)
PASS: lldb-unit :: Symbol/./SymbolTests/PostfixExpression.ParseOneExpression (1122 of 1794)
PASS: lldb-unit :: Process/minidump/./LLDBMinidumpTests/MinidumpParserTest.GetLinuxProcStatus (1123 of 1794)
PASS: lldb-api :: functionalities/data-formatter/stringprinter/TestStringPrinter.py (1124 of 1794)
PASS: lldb-unit :: ScriptInterpreter/Python/./ScriptInterpreterPythonTests/PythonDataObjectsTest.TestPythonTupleToStructuredList (1125 of 1794)
PASS: lldb-unit :: Signals/./SignalsTests/UnixSignalsTest.GetFilteredSignals (1126 of 1794)
PASS: lldb-unit :: Utility/./UtilityTests/StringListTest.InsertStringAtIndexEnd (1127 of 1794)
PASS: lldb-unit :: Utility/./UtilityTests/LogChannelEnabledTest.log_options (1128 of 1794)
UNSUPPORTED: lldb-api :: functionalities/thread/multi_break/TestMultipleBreakpoints.py (1129 of 1794)
PASS: lldb-api :: api/command-return-object/TestSBCommandReturnObject.py (1130 of 1794)
PASS: lldb-unit :: UnwindAssembly/x86/./UnwindAssemblyx86Tests/Testx86AssemblyInspectionEngine.Test32bitFramelessSmallStackFrame (1131 of 1794)
PASS: lldb-api :: commands/expression/two-files/TestObjCTypeQueryFromOtherCompileUnit.py (1132 of 1794)
PASS: lldb-unit :: Utility/./UtilityTests/FileSpecTest.RemoveLastPathComponent (1133 of 1794)
PASS: lldb-api :: functionalities/data-formatter/data-formatter-ptr-to-array/TestPtrToArrayFormatting.py (1134 of 1794)
PASS: lldb-unit :: Utility/./UtilityTests/StringExtractorTest.DecodeHexU8_Underflow (1135 of 1794)
PASS: lldb-unit :: Symbol/./SymbolTests/PostfixExpression.ToDWARF (1136 of 1794)
PASS: lldb-api :: functionalities/mtc/simple/TestMTCSimple.py (1137 of 1794)
PASS: lldb-api :: lang/objc/objc-new-syntax/TestObjCNewSyntaxLiteral.py (1138 of 1794)
PASS: lldb-unit :: Utility/./UtilityTests/SerializationRountripTest.SerializeDeserializePodPointers (1139 of 1794)
PASS: lldb-shell :: SymbolFile/DWARF/debug-types-address-ranges.s (1140 of 1794)
PASS: lldb-unit :: SymbolFile/DWARF/./SymbolFileDWARFTests/SymbolFileDWARFTests.TestAbilitiesForDWARF (1141 of 1794)
PASS: lldb-api :: commands/expression/import-std-module/no-std-module/TestMissingStdModule.py (1142 of 1794)
PASS: lldb-api :: commands/expression/save_jit_objects/TestSaveJITObjects.py (1143 of 1794)
PASS: lldb-shell :: Reproducer/TestReuseDirectory.test (1144 of 1794)
UNSUPPORTED: lldb-shell :: SymbolFile/NativePDB/ast-functions-msvc.cpp (1145 of 1794)
PASS: lldb-unit :: ScriptInterpreter/Python/./ScriptInterpreterPythonTests/PythonExceptionStateTest.TestExceptionStateChecking (1146 of 1794)
PASS: lldb-unit :: Utility/./UtilityTests/StringExtractorTest.GetHexU8_InvalidHex (1147 of 1794)
PASS: lldb-api :: lang/c/tls_globals/TestTlsGlobals.py (1148 of 1794)
PASS: lldb-api :: lang/cpp/dynamic-value/TestCppValueCast.py (1149 of 1794)
UNSUPPORTED: lldb-api :: functionalities/data-formatter/data-formatter-stl/libcxx/function/TestLibCxxFunction.py (1150 of 1794)
PASS: lldb-unit :: Utility/./UtilityTests/StringExtractorTest.GetHexBytes (1151 of 1794)
PASS: lldb-unit :: Core/./LLDBCoreTests/RichManglingContextTest.SwitchProvider (1152 of 1794)
PASS: lldb-unit :: UnwindAssembly/x86/./UnwindAssemblyx86Tests/Testx86AssemblyInspectionEngine.TestStackRealign32BitDisp_x86_64 (1153 of 1794)
PASS: lldb-unit :: Host/./HostTests/FileSystemTest.GetPermissions (1154 of 1794)
PASS: lldb-unit :: Host/./HostTests/FileActionTest.Open (1155 of 1794)
PASS: lldb-unit :: Utility/./UtilityTests/StringListTest.ForRangeEmpty (1156 of 1794)
UNSUPPORTED: lldb-shell :: SymbolFile/PDB/pointers.test (1157 of 1794)
PASS: lldb-api :: functionalities/tail_call_frames/thread_step_out_or_return/TestSteppingOutWithArtificialFrames.py (1158 of 1794)
PASS: lldb-api :: tools/lldb-server/TestLldbGdbServer.py (1159 of 1794)
PASS: lldb-shell :: Quit/TestQuitExitCodeImplicit0.test (1160 of 1794)
PASS: lldb-api :: commands/expression/radar_9531204/TestPrintfAfterUp.py (1161 of 1794)
XFAIL: lldb-shell :: Register/x86-64-ymm-write.test (1162 of 1794)
PASS: lldb-unit :: Process/minidump/./LLDBMinidumpTests/MinidumpParserTest.GetThreadContext_x86_32 (1163 of 1794)
PASS: lldb-shell :: ObjectFile/ELF/minidebuginfo-find-symbols.yaml (1164 of 1794)
PASS: lldb-shell :: Breakpoint/jitbp_elf.test (1165 of 1794)
PASS: lldb-api :: functionalities/tail_call_frames/disambiguate_paths_to_common_sink/TestDisambiguatePathsToCommonSink.py (1166 of 1794)
UNSUPPORTED: lldb-shell :: Register/x86-gp-write.test (1167 of 1794)
PASS: lldb-shell :: Register/x86-64-gp-read.test (1168 of 1794)
PASS: lldb-api :: lang/objc/foundation/TestObjCMethods.py (1169 of 1794)
PASS: lldb-unit :: Symbol/./SymbolTests/DWARFCallFrameInfoTest.Basic_eh (1170 of 1794)
PASS: lldb-api :: commands/expression/persistent_variables/TestPersistentVariables.py (1171 of 1794)
PASS: lldb-shell :: SymbolFile/DWARF/split-dwarf-multiple-cu.ll (1172 of 1794)
PASS: lldb-api :: functionalities/breakpoint/breakpoint_hit_count/TestBreakpointHitCount.py (1173 of 1794)
PASS: lldb-api :: commands/register/register/register_command/TestRegisters.py (1174 of 1794)
PASS: lldb-unit :: Utility/./UtilityTests/ArgsTest.ReplaceArgumentAtIndexLonger (1175 of 1794)
PASS: lldb-api :: functionalities/thread/concurrent_events/TestConcurrentBreakpointsDelayedBreakpointOneWatchpoint.py (1176 of 1794)
PASS: lldb-api :: python_api/function_symbol/TestDisasmAPI.py (1177 of 1794)
PASS: lldb-unit :: SymbolFile/NativePDB/./SymbolFileNativePDBTests/PDBFPOProgramToDWARFExpressionTests.MultipleDependentAssignments (1178 of 1794)
PASS: lldb-api :: functionalities/modern-type-lookup/objc-modules/TestObjModulesModernTypeLookup.py (1179 of 1794)
UNSUPPORTED: lldb-api :: tools/lldb-server/TestGdbRemoteAuxvSupport.py (1180 of 1794)
PASS: lldb-unit :: UnwindAssembly/x86/./UnwindAssemblyx86Tests/Testx86AssemblyInspectionEngine.TestPushExtended (1181 of 1794)
PASS: lldb-api :: lang/objc/objc-super/TestObjCSuper.py (1182 of 1794)
PASS: lldb-unit :: Process/gdb-remote/./ProcessGdbRemoteTests/GDBRemoteCommunicationServerTest.SendErrorResponse_StringError (1183 of 1794)
UNSUPPORTED: lldb-api :: tools/lldb-server/libraries-svr4/TestGdbRemoteLibrariesSvr4Support.py (1184 of 1794)
PASS: lldb-unit :: Utility/./UtilityTests/Flags.AnySet (1185 of 1794)
PASS: lldb-unit :: Host/./HostTests/TaskPoolTest.RunTasks (1186 of 1794)
PASS: lldb-api :: commands/expression/context-object/TestContextObject.py (1187 of 1794)
PASS: lldb-api :: functionalities/memory/cache/TestMemoryCache.py (1188 of 1794)
PASS: lldb-unit :: Utility/./UtilityTests/NameMatchesTest.Ignore (1189 of 1794)
PASS: lldb-api :: functionalities/gdb_remote_client/TestGDBRemoteClient.py (1190 of 1794)
PASS: lldb-unit :: SymbolFile/DWARF/./SymbolFileDWARFTests/SymbolFileDWARFTests.TestAbbrevOrder1Start5 (1191 of 1794)
PASS: lldb-api :: functionalities/data-formatter/data-formatter-stl/libcxx/multimap/TestDataFormatterLibccMultiMap.py (1192 of 1794)
PASS: lldb-shell :: Reproducer/Functionalities/TestDataFormatter.test (1193 of 1794)
PASS: lldb-api :: commands/log/basic/TestLogging.py (1194 of 1794)
PASS: lldb-unit :: SymbolFile/NativePDB/./SymbolFileNativePDBTests/PDBFPOProgramToDWARFExpressionTests.UnsupportedRASearch (1195 of 1794)
PASS: lldb-api :: lang/cpp/class_types/TestClassTypes.py (1196 of 1794)
PASS: lldb-unit :: Utility/./UtilityTests/StatusTest.Formatv (1197 of 1794)
PASS: lldb-unit :: Utility/./UtilityTests/TimerTest.CategoryTimesStats (1198 of 1794)
PASS: lldb-api :: commands/expression/options/TestExprOptions.py (1199 of 1794)
XFAIL: lldb-shell :: Register/x86-64-write.test (1200 of 1794)
PASS: lldb-shell :: ObjectFile/PECOFF/export-dllfunc.yaml (1201 of 1794)
PASS: lldb-api :: lang/objc/exceptions/TestObjCExceptions.py (1202 of 1794)
PASS: lldb-shell :: SymbolFile/DWARF/gnu-style-compression.cpp (1203 of 1794)
PASS: lldb-api :: lang/cpp/class_types/TestClassTypesDisassembly.py (1204 of 1794)
PASS: lldb-api :: commands/frame/diagnose/bad-reference/TestBadReference.py (1205 of 1794)
PASS: lldb-api :: commands/expression/expr-in-syscall/TestExpressionInSyscall.py (1206 of 1794)
PASS: lldb-shell :: Driver/TestFile.test (1207 of 1794)
PASS: lldb-unit :: ScriptInterpreter/Python/./ScriptInterpreterPythonTests/PythonDataObjectsTest.TestInstanceNameResolutionNoDot (1208 of 1794)
PASS: lldb-unit :: Utility/./UtilityTests/RegularExpression.Valid (1209 of 1794)
PASS: lldb-api :: lang/cpp/auto/TestCPPAuto.py (1210 of 1794)
PASS: lldb-unit :: Utility/./UtilityTests/CompletionRequest.TryCompleteCurrentArgBad (1211 of 1794)
PASS: lldb-api :: commands/expression/import-std-module/forward_list-basic/TestBasicForwardList.py (1212 of 1794)
UNSUPPORTED: lldb-api :: macosx/macabi/TestMacABImacOSFramework.py (1213 of 1794)
PASS: lldb-shell :: SymbolFile/NativePDB/tag-types.cpp (1214 of 1794)
PASS: lldb-unit :: UnwindAssembly/x86/./UnwindAssemblyx86Tests/Testx86AssemblyInspectionEngine.TestPushR12 (1215 of 1794)
PASS: lldb-api :: commands/frame/diagnose/complicated-expression/TestComplicatedExpression.py (1216 of 1794)
PASS: lldb-unit :: Target/./TargetTests/ModuleCacheTest.GetAndPutStrangeHostname (1217 of 1794)
PASS: lldb-api :: functionalities/testid/TestTestId.py (1218 of 1794)
PASS: lldb-shell :: SymbolFile/DWARF/find-basic-type.cpp (1219 of 1794)
PASS: lldb-unit :: ScriptInterpreter/Python/./ScriptInterpreterPythonTests/PythonDataObjectsTest.TestOwnedReferences (1220 of 1794)
PASS: lldb-shell :: SymbolFile/DWARF/find-inline-method.s (1221 of 1794)
PASS: lldb-unit :: Utility/./UtilityTests/ArchSpecTest.TestParseMachCPUDashSubtypeTripleSimple (1222 of 1794)
UNSUPPORTED: lldb-api :: commands/register/register/intel_xtended_registers/mpx_bound_violation/TestBoundViolation.py (1223 of 1794)
PASS: lldb-api :: types/TestDoubleTypesExpr.py (1224 of 1794)
PASS: lldb-api :: functionalities/breakpoint/serialize/TestBreakpointSerialization.py (1225 of 1794)
PASS: lldb-api :: lang/cpp/gmodules-templates/TestGModules.py (1226 of 1794)
PASS: lldb-unit :: Language/Highlighting/./HighlighterTests/HighlighterTest.ClangScalarLiterals (1227 of 1794)
PASS: lldb-api :: functionalities/data-formatter/varscript_formatting/TestDataFormatterVarScriptFormatting.py (1228 of 1794)
PASS: lldb-api :: commands/expression/import-std-module/list-basic/TestBasicList.py (1229 of 1794)
PASS: lldb-unit :: Language/Highlighting/./HighlighterTests/HighlighterTest.ClangOperators (1230 of 1794)
PASS: lldb-api :: commands/expression/completion/TestExprCompletion.py (1231 of 1794)
PASS: lldb-api :: functionalities/deleted-executable/TestDeletedExecutable.py (1232 of 1794)
PASS: lldb-unit :: Target/./TargetTests/PathMappingListTest.AbsoluteTests (1233 of 1794)
PASS: lldb-api :: lang/cpp/namespace/TestNamespace.py (1234 of 1794)
PASS: lldb-shell :: ObjectFile/ELF/compressed-sections.yaml (1235 of 1794)
PASS: lldb-api :: functionalities/data-formatter/data-formatter-stl/libcxx/optional/TestDataFormatterLibcxxOptional.py (1236 of 1794)
PASS: lldb-api :: macosx/find-app-in-bundle/TestFindAppInBundle.py (1237 of 1794)
PASS: lldb-api :: python_api/watchpoint/watchlocation/TestTargetWatchAddress.py (1238 of 1794)
PASS: lldb-unit :: Host/./HostTests/NativeProcessProtocolTest.ReadMemoryWithoutTrap (1239 of 1794)
PASS: lldb-unit :: Host/./HostTests/MainLoopTest.ReadObject (1240 of 1794)
PASS: lldb-unit :: Utility/./UtilityTests/StreamTest.PutMaxHex64ByteOrderLittle (1241 of 1794)
PASS: lldb-api :: lang/objc/objc-foundation-dictionary-empty/TestNSDictionary0.py (1242 of 1794)
PASS: lldb-api :: functionalities/multidebugger_commands/TestMultipleDebuggersCommands.py (1243 of 1794)
PASS: lldb-api :: functionalities/thread/concurrent_events/TestConcurrentTwoBreakpointsOneSignal.py (1244 of 1794)
PASS: lldb-unit :: Host/./HostTests/FileSystemTest.GetByteSize (1245 of 1794)
PASS: lldb-unit :: Utility/./UtilityTests/StringListTest.Join (1246 of 1794)
PASS: lldb-api :: lang/cpp/unsigned_types/TestUnsignedTypes.py (1247 of 1794)
PASS: lldb-unit :: Utility/./UtilityTests/ArgsTest.BareSingleQuote (1248 of 1794)
PASS: lldb-api :: lang/c/array_types/TestArrayTypes.py (1249 of 1794)
PASS: lldb-unit :: Utility/./UtilityTests/VMRange.Reset (1250 of 1794)
PASS: lldb-unit :: Breakpoint/./LLDBBreakpointTests/BreakpointIDTest.StringIsBreakpointName (1251 of 1794)
PASS: lldb-unit :: Process/minidump/./LLDBMinidumpTests/MinidumpParserTest.GetThreadContext_x86_64 (1252 of 1794)
PASS: lldb-unit :: Utility/./UtilityTests/ArgsTest.ReplaceArgumentAtIndexOutOfRange (1253 of 1794)
PASS: lldb-unit :: Host/./HostTests/MainLoopTest.TerminatesImmediately (1254 of 1794)
PASS: lldb-api :: functionalities/abbreviation/TestCommonShortSpellings.py (1255 of 1794)
PASS: lldb-unit :: Utility/./UtilityTests/AnsiTerminal.AtStart (1256 of 1794)
PASS: lldb-api :: functionalities/data-formatter/data-formatter-advanced/TestDataFormatterAdv.py (1257 of 1794)
PASS: lldb-api :: commands/process/attach/attach_denied/TestAttachDenied.py (1258 of 1794)
PASS: lldb-shell :: SymbolFile/NativePDB/global-classes.cpp (1259 of 1794)
PASS: lldb-api :: commands/watchpoints/watchpoint_commands/condition/TestWatchpointConditionCmd.py (1260 of 1794)
PASS: lldb-shell :: ObjectFile/ELF/PT_LOAD.yaml (1261 of 1794)
PASS: lldb-unit :: Utility/./UtilityTests/UriParserTest.TypicalPortPath (1262 of 1794)
PASS: lldb-api :: commands/expression/unwind_expression/TestUnwindExpression.py (1263 of 1794)
PASS: lldb-api :: lang/cpp/chained-calls/TestCppChainedCalls.py (1264 of 1794)
PASS: lldb-unit :: ScriptInterpreter/Python/./ScriptInterpreterPythonTests/PythonDataObjectsTest.TestTypeNameResolutionNoDot (1265 of 1794)
PASS: lldb-api :: functionalities/postmortem/minidump/TestMiniDump.py (1266 of 1794)
PASS: lldb-api :: commands/expression/po_verbosity/TestPoVerbosity.py (1267 of 1794)
PASS: lldb-unit :: Utility/./UtilityTests/StringLexerTest.NextIfList (1268 of 1794)
PASS: lldb-unit :: Utility/./UtilityTests/StringExtractorTest.GetHexBytesAvail (1269 of 1794)
XFAIL: lldb-shell :: Register/x86-mm-xmm-read.test (1270 of 1794)
PASS: lldb-unit :: Expression/./ExpressionTests/DiagnosticManagerTest.GetStringMultipleDiags (1271 of 1794)
PASS: lldb-unit :: ObjectFile/Breakpad/./ObjectFileBreakpadTests/StackCFIRecord.parse (1272 of 1794)
PASS: lldb-unit :: Utility/./UtilityTests/RangeTest.Union (1273 of 1794)
PASS: lldb-api :: commands/expression/top-level/TestTopLevelExprs.py (1274 of 1794)
PASS: lldb-api :: commands/command/history/TestCommandHistory.py (1275 of 1794)
PASS: lldb-unit :: Utility/./UtilityTests/DataExtractorTest.GetMaxS64 (1276 of 1794)
PASS: lldb-api :: commands/process/attach/TestProcessAttach.py (1277 of 1794)
PASS: lldb-api :: functionalities/thread/concurrent_events/TestConcurrentTwoWatchpointsOneDelayBreakpoint.py (1278 of 1794)
PASS: lldb-unit :: UnwindAssembly/x86/./UnwindAssemblyx86Tests/Testx86AssemblyInspectionEngine.TestSpArithx86_64Augmented (1279 of 1794)
PASS: lldb-unit :: UnwindAssembly/x86/./UnwindAssemblyx86Tests/Testx86AssemblyInspectionEngine.TestCALLNextInsn (1280 of 1794)
PASS: lldb-unit :: Utility/./UtilityTests/StringExtractorTest.GetHexBytesAvail_Partial (1281 of 1794)
PASS: lldb-api :: functionalities/unwind/sigtramp/TestSigtrampUnwind.py (1282 of 1794)
PASS: lldb-shell :: Quit/TestQuitExitCodeHexA.test (1283 of 1794)
PASS: lldb-api :: lang/c/inlines/TestRedefinitionsInInlines.py (1284 of 1794)
PASS: lldb-unit :: Utility/./UtilityTests/RangeTest.LessThanInvalid (1285 of 1794)
PASS: lldb-unit :: Utility/./UtilityTests/ConstStringTest.CompareConstString (1286 of 1794)
PASS: lldb-shell :: SymbolFile/NativePDB/bitfields.cpp (1287 of 1794)
PASS: lldb-api :: commands/expression/import-std-module/list-dbg-info-content/TestDbgInfoContentList.py (1288 of 1794)
PASS: lldb-unit :: Core/./LLDBCoreTests/RichManglingContextTest.IPDRealloc (1289 of 1794)
PASS: lldb-unit :: Utility/./UtilityTests/ArgsTest.ReplaceArgumentAtIndexFarOutOfRange (1290 of 1794)
PASS: lldb-api :: commands/target/create-no-such-arch/TestNoSuchArch.py (1291 of 1794)
PASS: lldb-shell :: ObjectFile/ELF/minidebuginfo-corrupt-xz.yaml (1292 of 1794)
PASS: lldb-shell :: Driver/TestCommands.test (1293 of 1794)
PASS: lldb-unit :: SymbolFile/NativePDB/./SymbolFileNativePDBTests/PDBFPOProgramToDWARFExpressionTests.InvalidOpBinary (1294 of 1794)
PASS: lldb-unit :: UnwindAssembly/x86/./UnwindAssemblyx86Tests/Testx86AssemblyInspectionEngine.TestPushEDX (1295 of 1794)
UNSUPPORTED: lldb-api :: functionalities/darwin_log/source/debug/TestDarwinLogSourceDebug.py (1296 of 1794)
PASS: lldb-unit :: Utility/./UtilityTests/OptionsWithRawTest.SingleWordSuffix (1297 of 1794)
PASS: lldb-shell :: SymbolFile/NativePDB/globals-fundamental.cpp (1298 of 1794)
PASS: lldb-api :: commands/add-dsym/uuid/TestAddDsymCommand.py (1299 of 1794)
PASS: lldb-unit :: Utility/./UtilityTests/DataExtractorTest.GetCStr (1300 of 1794)
PASS: lldb-api :: functionalities/thread/backtrace_limit/TestBacktraceLimit.py (1301 of 1794)
PASS: lldb-api :: functionalities/thread/concurrent_events/TestConcurrentDelaySignalWatch.py (1302 of 1794)
PASS: lldb-unit :: Utility/./UtilityTests/UriParserTest.PortOverflow (1303 of 1794)
PASS: lldb-unit :: UnwindAssembly/x86/./UnwindAssemblyx86Tests/Testx86AssemblyInspectionEngine.TestStackRealign8BitDisp_i386 (1304 of 1794)
UNSUPPORTED: lldb-api :: commands/watchpoints/multi_watchpoint_slots/TestWatchpointMultipleSlots.py (1305 of 1794)
PASS: lldb-unit :: Expression/./ExpressionTests/DiagnosticManagerTest.AppendMessageSubsequentDiags (1306 of 1794)
PASS: lldb-api :: lang/cpp/type_lookup/TestCppTypeLookup.py (1307 of 1794)
PASS: lldb-unit :: Utility/./UtilityTests/StringListTest.JoinMultiCharSeparator (1308 of 1794)
PASS: lldb-api :: functionalities/thread/concurrent_events/TestConcurrentCrashWithWatchpointBreakpointSignal.py (1309 of 1794)
PASS: lldb-api :: commands/expression/radar_9673664/TestExprHelpExamples.py (1310 of 1794)
PASS: lldb-api :: macosx/nslog/TestDarwinNSLogOutput.py (1311 of 1794)
PASS: lldb-api :: functionalities/tsan/cpp_global_location/TestTsanCPPGlobalLocation.py (1312 of 1794)
PASS: lldb-api :: functionalities/conditional_break/TestConditionalBreak.py (1313 of 1794)
PASS: lldb-api :: python_api/value/linked_list/TestValueAPILinkedList.py (1314 of 1794)
PASS: lldb-unit :: Utility/./UtilityTests/StreamTest.PutSLEB128 (1315 of 1794)
PASS: lldb-unit :: ScriptInterpreter/Python/./ScriptInterpreterPythonTests/PythonExceptionStateTest.TestAutoRestoreChanged (1316 of 1794)
PASS: lldb-shell :: SymbolFile/DWARF/find-method.cpp (1317 of 1794)
PASS: lldb-api :: lang/cpp/trivial_abi/TestTrivialABI.py (1318 of 1794)
PASS: lldb-api :: lang/c/const_variables/TestConstVariables.py (1319 of 1794)
PASS: lldb-unit :: SymbolFile/DWARF/./SymbolFileDWARFTests/DWARFASTParserClangTests.EnsureAllDIEsInDeclContextHaveBeenParsedParsesOnlyMatchingEntries (1320 of 1794)
PASS: lldb-api :: functionalities/thread/thread_specific_break/TestThreadSpecificBreakpoint.py (1321 of 1794)
PASS: lldb-api :: functionalities/data-formatter/data-formatter-stl/libcxx/iterator/TestDataFormatterLibccIterator.py (1322 of 1794)
PASS: lldb-unit :: Host/./HostTests/Host.WaitStatusFormat (1323 of 1794)
PASS: lldb-api :: functionalities/thread/concurrent_events/TestConcurrentTwoWatchpointsOneSignal.py (1324 of 1794)
PASS: lldb-shell :: ObjectFile/PECOFF/dep-modules.yaml (1325 of 1794)
PASS: lldb-api :: functionalities/data-formatter/data-formatter-stl/libcxx/map/TestDataFormatterLibccMap.py (1326 of 1794)
PASS: lldb-shell :: Minidump/Windows/find-module.test (1327 of 1794)
PASS: lldb-unit :: ScriptInterpreter/Python/./ScriptInterpreterPythonTests/PythonDataObjectsTest.TestPythonIntegerToStr (1328 of 1794)
PASS: lldb-api :: functionalities/thread/backtrace_all/TestBacktraceAll.py (1329 of 1794)
PASS: lldb-unit :: UnwindAssembly/x86/./UnwindAssemblyx86Tests/Testx86AssemblyInspectionEngine.TestReturnDetect (1330 of 1794)
PASS: lldb-unit :: Process/minidump/./LLDBMinidumpTests/MinidumpParserTest.GetPid (1331 of 1794)
PASS: lldb-unit :: Host/./HostTests/MainLoopTest.UnmonitoredSignal (1332 of 1794)
PASS: lldb-unit :: Utility/./UtilityTests/DeserializerTest.HasData (1333 of 1794)
PASS: lldb-unit :: Utility/./UtilityTests/StringListTest.Clear (1334 of 1794)
PASS: lldb-unit :: Utility/./UtilityTests/StringListTest.GetMaxStringLengthMixed (1335 of 1794)
PASS: lldb-shell :: SymbolFile/DWARF/debug_rnglists.s (1336 of 1794)
PASS: lldb-api :: lang/objc/rdar-11355592/TestRdar11355592.py (1337 of 1794)
UNSUPPORTED: lldb-api :: tools/lldb-vscode/launch/TestVSCode_launch.py (1338 of 1794)
PASS: lldb-unit :: Utility/./UtilityTests/StreamTest.PutNHex8 (1339 of 1794)
PASS: lldb-api :: functionalities/data-formatter/language_category_updates/TestDataFormatterLanguageCategoryUpdates.py (1340 of 1794)
UNSUPPORTED: lldb-api :: functionalities/data-formatter/data-formatter-stl/libstdcpp/string/TestDataFormatterStdString.py (1341 of 1794)
PASS: lldb-api :: functionalities/thread/concurrent_events/TestConcurrentCrashWithBreak.py (1342 of 1794)
PASS: lldb-unit :: ObjectFile/PECOFF/./ObjectFilePECOFFTests/PECallFrameInfoTest.Frame_reg_eh (1343 of 1794)
PASS: lldb-unit :: Utility/./UtilityTests/RangeTest.Slide (1344 of 1794)
PASS: lldb-unit :: Utility/./UtilityTests/Predicate.WaitForValueNotEqualTo (1345 of 1794)
PASS: lldb-unit :: Utility/./UtilityTests/ConstStringTest.MangledCounterpart (1346 of 1794)
PASS: lldb-api :: functionalities/inferior-crashing/recursive-inferior/TestRecursiveInferior.py (1347 of 1794)
PASS: lldb-unit :: Utility/./UtilityTests/RangeTest.ClearWithStarAddress (1348 of 1794)
PASS: lldb-api :: functionalities/breakpoint/address_breakpoints/TestAddressBreakpoints.py (1349 of 1794)
PASS: lldb-api :: commands/watchpoints/watchpoint_events/TestWatchpointEvents.py (1350 of 1794)
PASS: lldb-shell :: ObjectFile/ELF/many-sections.s (1351 of 1794)
PASS: lldb-api :: functionalities/data-formatter/data-formatter-stl/libcxx/unordered/TestDataFormatterUnordered.py (1352 of 1794)
PASS: lldb-unit :: Process/gdb-remote/./ProcessGdbRemoteTests/GDBRemoteClientBaseTest.SendContinueAndWait (1353 of 1794)
PASS: lldb-api :: functionalities/avoids-fd-leak/TestFdLeak.py (1354 of 1794)
PASS: lldb-api :: commands/expression/char/TestExprsChar.py (1355 of 1794)
PASS: lldb-api :: functionalities/thread/exit_during_break/TestExitDuringBreak.py (1356 of 1794)
PASS: lldb-api :: lang/c/unions/TestUnionMembers.py (1357 of 1794)
PASS: lldb-unit :: Utility/./UtilityTests/ScalarTest.Division (1358 of 1794)
PASS: lldb-unit :: Expression/./ExpressionTests/DiagnosticManagerTest.PutStringSeverities (1359 of 1794)
PASS: lldb-api :: commands/watchpoints/watchpoint_set_command/TestWatchLocationWithWatchSet.py (1360 of 1794)
PASS: lldb-shell :: Reproducer/TestFileRepro.test (1361 of 1794)
PASS: lldb-api :: functionalities/data-formatter/data-formatter-stl/libcxx/string/TestDataFormatterLibcxxString.py (1362 of 1794)
PASS: lldb-unit :: Utility/./UtilityTests/LogChannelTest.List (1363 of 1794)
PASS: lldb-api :: macosx/find-dsym/deep-bundle/TestDeepBundle.py (1364 of 1794)
PASS: lldb-unit :: ScriptInterpreter/Python/./ScriptInterpreterPythonTests/PythonExceptionStateTest.TestResetSemantics (1365 of 1794)
PASS: lldb-unit :: Host/./HostTests/NativeProcessProtocolTest.SetBreakpointFailVerify (1366 of 1794)
PASS: lldb-shell :: ObjectFile/ELF/PT_LOAD-overlap-section.yaml (1367 of 1794)
PASS: lldb-unit :: Utility/./UtilityTests/RecordReplayTest.InstrumentedBarRef (1368 of 1794)
PASS: lldb-api :: commands/expression/dollar-in-variable/TestDollarInVariable.py (1369 of 1794)
PASS: lldb-api :: iohandler/completion/TestIOHandlerCompletion.py (1370 of 1794)
PASS: lldb-shell :: SymbolFile/DWARF/find-function-regex.cpp (1371 of 1794)
PASS: lldb-unit :: SymbolFile/NativePDB/./SymbolFileNativePDBTests/PDBFPOProgramToDWARFExpressionTests.UnresolvedCyclicRegisterAssignmentReference (1372 of 1794)
PASS: lldb-unit :: Utility/./UtilityTests/FileSpecTest.FormatFileSpec (1373 of 1794)
PASS: lldb-api :: python_api/symbol-context/two-files/TestSymbolContextTwoFiles.py (1374 of 1794)
PASS: lldb-unit :: Utility/./UtilityTests/OptionsWithRawTest.TerminatedQuote (1375 of 1794)
PASS: lldb-api :: functionalities/data-formatter/data-formatter-objc/TestDataFormatterObjCNSContainer.py (1376 of 1794)
PASS: lldb-unit :: Target/./TargetTests/ExecutionContextTest.GetByteOrderTarget (1377 of 1794)
PASS: lldb-unit :: Interpreter/./InterpreterTests/CompletionTest.DirCompletionUsername (1378 of 1794)
PASS: lldb-api :: functionalities/process_group/TestChangeProcessGroup.py (1379 of 1794)
PASS: lldb-unit :: Utility/./UtilityTests/ArchSpecTest.Compatibility (1380 of 1794)
XFAIL: lldb-shell :: SymbolFile/DWARF/find-type-in-function.cpp (1381 of 1794)
UNSUPPORTED: lldb-api :: benchmarks/startup/TestStartupDelays.py (1382 of 1794)
PASS: lldb-unit :: Utility/./UtilityTests/StringExtractorTest.GetHexBytesAvail_FullString (1383 of 1794)
PASS: lldb-shell :: ObjectFile/ELF/duplicate-section.yaml (1384 of 1794)
PASS: lldb-api :: functionalities/thread/jump/TestThreadJump.py (1385 of 1794)
PASS: lldb-api :: functionalities/data-formatter/data-formatter-smart-array/TestDataFormatterSmartArray.py (1386 of 1794)
PASS: lldb-unit :: SymbolFile/NativePDB/./SymbolFileNativePDBTests/PDBFPOProgramToDWARFExpressionTests.SingleAssignmentRegisterRef (1387 of 1794)
PASS: lldb-api :: lang/c/set_values/TestSetValues.py (1388 of 1794)
PASS: lldb-api :: lang/cpp/class-template-parameter-pack/TestClassTemplateParameterPack.py (1389 of 1794)
PASS: lldb-unit :: Utility/./UtilityTests/StreamTeeTest.Constructor2Streams (1390 of 1794)
PASS: lldb-unit :: SymbolFile/DWARF/./SymbolFileDWARFTests/SymbolFileDWARFTests.TestAbbrevNullAttrValidForm (1391 of 1794)
PASS: lldb-unit :: Utility/./UtilityTests/StreamTest.ShiftOperatorPtr (1392 of 1794)
PASS: lldb-unit :: Utility/./UtilityTests/EventTest.DumpEventDataBytes (1393 of 1794)
PASS: lldb-unit :: UnwindAssembly/x86/./UnwindAssemblyx86Tests/Testx86AssemblyInspectionEngine.TestPopR12 (1394 of 1794)
PASS: lldb-api :: python_api/frame/get-variables/TestGetVariables.py (1395 of 1794)
PASS: lldb-api :: python_api/sbtype_typeclass/TestSBTypeTypeClass.py (1396 of 1794)
PASS: lldb-unit :: SymbolFile/NativePDB/./SymbolFileNativePDBTests/PDBFPOProgramToDWARFExpressionTests.InvalidAssignmentSingle (1397 of 1794)
PASS: lldb-unit :: Utility/./UtilityTests/StringExtractorTest.DecodeHexU8_Extra (1398 of 1794)
PASS: lldb-unit :: Expression/./ExpressionTests/DiagnosticManagerTest.GetStringMultiline (1399 of 1794)
PASS: lldb-api :: tools/lldb-server/inferior-crash/TestGdbRemoteAbort.py (1400 of 1794)
PASS: lldb-api :: functionalities/memory/read/TestMemoryRead.py (1401 of 1794)
PASS: lldb-unit :: Utility/./UtilityTests/StreamTest.PutStringAsRawHex8 (1402 of 1794)
PASS: lldb-unit :: Utility/./UtilityTests/ProcessInstanceInfoMatch.Name (1403 of 1794)
PASS: lldb-unit :: Utility/./UtilityTests/FileSpecTest.EqualDotsPosixRoot (1404 of 1794)
PASS: lldb-unit :: Utility/./UtilityTests/DataExtractorTest.GetCStrUnterminated (1405 of 1794)
UNSUPPORTED: lldb-api :: functionalities/data-formatter/data-formatter-stl/libstdcpp/vbool/TestDataFormatterStdVBool.py (1406 of 1794)
PASS: lldb-api :: functionalities/data-formatter/data-formatter-stl/libcxx/bitset/TestDataFormatterLibcxxBitset.py (1407 of 1794)
PASS: lldb-api :: commands/expression/no-deadlock/TestExprDoesntBlock.py (1408 of 1794)
PASS: lldb-unit :: Utility/./UtilityTests/OptionsWithRawTest.EmptySuffixSingleWhitespace (1409 of 1794)
PASS: lldb-unit :: UnwindAssembly/x86/./UnwindAssemblyx86Tests/Testx86AssemblyInspectionEngine.TestSimple64bitFrameFunction (1410 of 1794)
PASS: lldb-unit :: Process/minidump/./LLDBMinidumpTests/MinidumpParserTest.GetMemoryRegionInfo (1411 of 1794)
PASS: lldb-unit :: Utility/./UtilityTests/OptionsWithRawTest.EmptyArgsOnlySuffix (1412 of 1794)
PASS: lldb-unit :: Utility/./UtilityTests/StringListTest.LongestCommonPrefix (1413 of 1794)
PASS: lldb-api :: tools/lldb-server/TestGdbRemoteSingleStep.py (1414 of 1794)
PASS: lldb-api :: commands/expression/invalid-args/TestInvalidArgsExpression.py (1415 of 1794)
PASS: lldb-unit :: Utility/./UtilityTests/VASprintfTest.NoBufferResize (1416 of 1794)
PASS: lldb-api :: lang/objc/foundation/TestObjCMethodsNSArray.py (1417 of 1794)
PASS: lldb-api :: api/log/TestAPILog.py (1418 of 1794)
PASS: lldb-unit :: Utility/./UtilityTests/StringExtractorTest.DecodeHexU8_InvalidHex2 (1419 of 1794)
PASS: lldb-unit :: ScriptInterpreter/Python/./ScriptInterpreterPythonTests/PythonDataObjectsTest.TestPythonCallableInvoke (1420 of 1794)
PASS: lldb-shell :: Register/x86-64-read.test (1421 of 1794)
PASS: lldb-unit :: Host/./HostTests/File.GetWaitableHandleFileno (1422 of 1794)
PASS: lldb-api :: commands/expression/namespace_local_var_same_name_cpp_and_c/TestNamespaceLocalVarSameNameCppAndC.py (1423 of 1794)
PASS: lldb-unit :: Utility/./UtilityTests/FileSpecTest.IsRelative (1424 of 1794)
PASS: lldb-api :: lang/objc/rdar-10967107/TestRdar10967107.py (1425 of 1794)
PASS: lldb-unit :: Process/gdb-remote/./ProcessGdbRemoteTests/GDBRemoteCommunicationClientTest.SendGetTraceConfigPacket (1426 of 1794)
PASS: lldb-api :: commands/expression/ir-interpreter/TestIRInterpreter.py (1427 of 1794)
PASS: lldb-api :: lang/objc/objc-static-method-stripped/TestObjCStaticMethodStripped.py (1428 of 1794)
PASS: lldb-api :: lang/cpp/operator-overload/TestOperatorOverload.py (1429 of 1794)
PASS: lldb-unit :: Utility/./UtilityTests/NameMatchesTest.RegularExpression (1430 of 1794)
PASS: lldb-api :: functionalities/thread/concurrent_events/TestConcurrentManyBreakpoints.py (1431 of 1794)
PASS: lldb-unit :: Host/./HostTests/File.GetStreamFromDescriptor (1432 of 1794)
PASS: lldb-api :: lang/objc/modules-inline-functions/TestModulesInlineFunctions.py (1433 of 1794)
PASS: lldb-unit :: Utility/./UtilityTests/ScalarTest.GetValue (1434 of 1794)
PASS: lldb-api :: functionalities/source-map/TestTargetSourceMap.py (1435 of 1794)
PASS: lldb-shell :: Driver/TestProcessAttach.test (1436 of 1794)
PASS: lldb-api :: lang/c/stepping/TestStepAndBreakpoints.py (1437 of 1794)
PASS: lldb-api :: python_api/disassemble-raw-data/TestDisassemble_VST1_64.py (1438 of 1794)
UNSUPPORTED: lldb-api :: functionalities/tty/TestTerminal.py (1439 of 1794)
PASS: lldb-unit :: Utility/./UtilityTests/ArgsTest.TestSingleArg (1440 of 1794)
PASS: lldb-unit :: Language/Highlighting/./HighlighterTests/HighlighterTest.ClangComments (1441 of 1794)
PASS: lldb-api :: commands/expression/import-std-module/deque-dbg-info-content/TestDbgInfoContentDeque.py (1442 of 1794)
PASS: lldb-unit :: ObjectFile/Breakpad/./ObjectFileBreakpadTests/PublicRecord.parse (1443 of 1794)
UNSUPPORTED: lldb-api :: tools/lldb-server/thread-name/TestGdbRemoteThreadName.py (1444 of 1794)
PASS: lldb-unit :: ScriptInterpreter/Python/./ScriptInterpreterPythonTests/PythonDataObjectsTest.TestPythonByteArray (1445 of 1794)
PASS: lldb-unit :: Utility/./UtilityTests/BinaryStreamTest.PutULEB128Zero (1446 of 1794)
PASS: lldb-api :: tools/lldb-server/TestGdbRemote_vCont.py (1447 of 1794)
PASS: lldb-unit :: Process/gdb-remote/./ProcessGdbRemoteTests/GDBRemoteCommunicationClientTest.ReadRegister (1448 of 1794)
PASS: lldb-unit :: Language/Highlighting/./HighlighterTests/HighlighterTest.HighlighterSelectionPath (1449 of 1794)
PASS: lldb-api :: lang/cpp/modules-import/TestCXXModulesImport.py (1450 of 1794)
PASS: lldb-unit :: Utility/./UtilityTests/BinaryStreamTest.PutULEB128FourBytes (1451 of 1794)
PASS: lldb-api :: functionalities/data-formatter/type_summary_list_script/TestTypeSummaryListScript.py (1452 of 1794)
PASS: lldb-shell :: Breakpoint/split-dwarf-5-addrbase.test (1453 of 1794)
PASS: lldb-shell :: Reproducer/TestSynchronous.test (1454 of 1794)
PASS: lldb-api :: functionalities/data-formatter/data-formatter-objc/TestDataFormatterObjCPlain.py (1455 of 1794)
PASS: lldb-unit :: Utility/./UtilityTests/StatusTest.ErrorConstructor (1456 of 1794)
PASS: lldb-unit :: Utility/./UtilityTests/TimerTest.CategoryTimesNested (1457 of 1794)
PASS: lldb-api :: lang/cpp/wchar_t/TestCxxWCharT.py (1458 of 1794)
PASS: lldb-shell :: SymbolFile/DWARF/apple-index-is-used.cpp (1459 of 1794)
UNSUPPORTED: lldb-api :: functionalities/darwin_log/filter/exact_match/subsystem/TestDarwinLogFilterMatchSubsystem.py (1460 of 1794)
UNSUPPORTED: lldb-api :: functionalities/data-formatter/data-formatter-stl/libstdcpp/iterator/TestDataFormatterStdIterator.py (1461 of 1794)
PASS: lldb-api :: macosx/load-kext/TestLoadKext.py (1462 of 1794)
PASS: lldb-shell :: SymbolFile/Breakpad/unwind-via-raSearch.test (1463 of 1794)
PASS: lldb-unit :: Utility/./UtilityTests/StreamTest.PutChar (1464 of 1794)
PASS: lldb-shell :: Reproducer/TestDriverOptions.test (1465 of 1794)
UNSUPPORTED: lldb-shell :: Register/x86-ymm-write.test (1466 of 1794)
PASS: lldb-api :: functionalities/tail_call_frames/disambiguate_call_site/TestDisambiguateCallSite.py (1467 of 1794)
PASS: lldb-api :: commands/expression/ir-interpreter-phi-nodes/TestIRInterpreterPHINodes.py (1468 of 1794)
PASS: lldb-unit :: Utility/./UtilityTests/StringLexerTest.Next (1469 of 1794)
PASS: lldb-unit :: Utility/./UtilityTests/StatusTest.ErrorConversion (1470 of 1794)
PASS: lldb-unit :: Utility/./UtilityTests/VMRange.Comparison (1471 of 1794)
PASS: lldb-unit :: Utility/./UtilityTests/StringExtractorTest.GetHexBytesAvail_Underflow (1472 of 1794)
PASS: lldb-shell :: SymbolFile/DWARF/split-dwarf-inlining.cpp (1473 of 1794)
PASS: lldb-unit :: Utility/./UtilityTests/ScalarTest.Promotion (1474 of 1794)
PASS: lldb-shell :: SymbolFile/DWARF/find-basic-variable.cpp (1475 of 1794)
PASS: lldb-api :: functionalities/tail_call_frames/inlining_and_tail_calls/TestInliningAndTailCalls.py (1476 of 1794)
PASS: lldb-unit :: Utility/./UtilityTests/NameMatchesTest.EndsWith (1477 of 1794)
PASS: lldb-api :: commands/expression/import-std-module/sysroot/TestStdModuleSysroot.py (1478 of 1794)
PASS: lldb-api :: functionalities/breakpoint/scripted_bkpt/TestScriptedResolver.py (1479 of 1794)
PASS: lldb-shell :: Driver/LocalLLDBInit.test (1480 of 1794)
PASS: lldb-api :: tools/lldb-server/TestGdbRemoteRegisterState.py (1481 of 1794)
PASS: lldb-api :: functionalities/recursion/TestValueObjectRecursion.py (1482 of 1794)
PASS: lldb-unit :: Utility/./UtilityTests/StringExtractorTest.GetHexBytes_FullString (1483 of 1794)
PASS: lldb-api :: macosx/order/TestOrderFile.py (1484 of 1794)
UNSUPPORTED: lldb-shell :: SymbolFile/PDB/class-layout.test (1485 of 1794)
PASS: lldb-unit :: Utility/./UtilityTests/StreamTest.PutHex16ByteOrderBig (1486 of 1794)
PASS: lldb-unit :: UnwindAssembly/ARM64/./Arm64InstEmulationTests/TestArm64InstEmulation.TestMediumDarwinFunction (1487 of 1794)
PASS: lldb-api :: functionalities/stats_api/TestStatisticsAPI.py (1488 of 1794)
PASS: lldb-api :: lang/cpp/enum_types/TestCPP11EnumTypes.py (1489 of 1794)
PASS: lldb-shell :: Settings/TestSettingsWrite.test (1490 of 1794)
PASS: lldb-unit :: ScriptInterpreter/Python/./ScriptInterpreterPythonTests/PythonDataObjectsTest.TestGlobalNameResolutionNoDot (1491 of 1794)
PASS: lldb-unit :: UnwindAssembly/x86/./UnwindAssemblyx86Tests/Testx86AssemblyInspectionEngine.TestPushRBPWithREX (1492 of 1794)
PASS: lldb-unit :: Utility/./UtilityTests/StreamTest.PutPtr (1493 of 1794)
PASS: lldb-api :: commands/expression/issue_11588/Test11588.py (1494 of 1794)
PASS: lldb-api :: lang/objc/objc-ivar-stripped/TestObjCIvarStripped.py (1495 of 1794)
PASS: lldb-unit :: UnwindAssembly/x86/./UnwindAssemblyx86Tests/Testx86AssemblyInspectionEngine.TestAddESP (1496 of 1794)
PASS: lldb-api :: lang/c/bitfields/TestBitfields.py (1497 of 1794)
PASS: lldb-shell :: SymbolFile/DWARF/dwarf5-partial-index.cpp (1498 of 1794)
PASS: lldb-unit :: Utility/./UtilityTests/StringExtractorTest.GetHexU8_Underflow2 (1499 of 1794)
PASS: lldb-api :: functionalities/thread/concurrent_events/TestConcurrentSignalDelayBreak.py (1500 of 1794)
PASS: lldb-unit :: Utility/./UtilityTests/ArgsTest.TestQuotedUnknownEscape (1501 of 1794)
PASS: lldb-unit :: ScriptInterpreter/Python/./ScriptInterpreterPythonTests/PythonDataObjectsTest.TestPythonTupleSize (1502 of 1794)
PASS: lldb-unit :: ScriptInterpreter/Python/./ScriptInterpreterPythonTests/PythonDataObjectsTest.TestPythonStringToStr (1503 of 1794)
PASS: lldb-unit :: Host/./HostTests/MainLoopTest.DetectsEOF (1504 of 1794)
PASS: lldb-api :: commands/expression/import-std-module/unique_ptr-dbg-info-content/TestUniquePtrDbgInfoContent.py (1505 of 1794)
PASS: lldb-api :: commands/gui/basic/TestGuiBasic.py (1506 of 1794)
PASS: lldb-api :: functionalities/thread/concurrent_events/TestConcurrentCrashWithSignal.py (1507 of 1794)
PASS: lldb-api :: functionalities/data-formatter/data-formatter-stl/libcxx/multiset/TestDataFormatterLibcxxMultiSet.py (1508 of 1794)
PASS: lldb-unit :: Utility/./UtilityTests/VMRange.SetEndAddress (1509 of 1794)
PASS: lldb-shell :: Driver/TestSingleQuote.test (1510 of 1794)
PASS: lldb-api :: tools/lldb-server/commandline/TestStubReverseConnect.py (1511 of 1794)
PASS: lldb-api :: functionalities/paths/TestPaths.py (1512 of 1794)
PASS: lldb-api :: functionalities/data-formatter/data-formatter-stl/libcxx/vector/TestDataFormatterLibcxxVector.py (1513 of 1794)
PASS: lldb-shell :: SymbolFile/DWARF/debug_loc.s (1514 of 1794)
PASS: lldb-unit :: Utility/./UtilityTests/ArchSpecTest.TestSetTriple (1515 of 1794)
PASS: lldb-api :: commands/expression/import-std-module/forward_list-dbg-info-content/TestDbgInfoContentForwardList.py (1516 of 1794)
PASS: lldb-unit :: Host/./HostTests/TaskPoolTest.TaskMap (1517 of 1794)
PASS: lldb-api :: functionalities/thread/concurrent_events/TestConcurrentManyCrash.py (1518 of 1794)
PASS: lldb-api :: functionalities/thread/concurrent_events/TestConcurrentTwoBreakpointsOneWatchpoint.py (1519 of 1794)
PASS: lldb-unit :: Utility/./UtilityTests/StringExtractorTest.GetNameColonValueSuccess (1520 of 1794)
PASS: lldb-api :: functionalities/breakpoint/breakpoint_options/TestBreakpointOptions.py (1521 of 1794)
PASS: lldb-unit :: Expression/./ExpressionTests/DiagnosticManagerTest.GetStringPreserveOrder (1522 of 1794)
UNSUPPORTED: lldb-shell :: SymbolFile/PDB/typedefs.test (1523 of 1794)
PASS: lldb-shell :: ObjectFile/MachO/lc_version_min.yaml (1524 of 1794)
UNSUPPORTED: lldb-shell :: SymbolFile/DWARF/debug-types-expressions.test (1525 of 1794)
PASS: lldb-api :: functionalities/archives/TestBSDArchives.py (1526 of 1794)
PASS: lldb-shell :: SymbolFile/DWARF/debug-types-dwarf5.s (1527 of 1794)
UNSUPPORTED: lldb-api :: benchmarks/frame_variable/TestFrameVariableResponse.py (1528 of 1794)
PASS: lldb-unit :: Utility/./UtilityTests/RangeTest.DoesIntersect (1529 of 1794)
PASS: lldb-unit :: Utility/./UtilityTests/OptionsWithRawTest.UnterminatedQuote (1530 of 1794)
PASS: lldb-api :: lang/objc/single-entry-dictionary/TestObjCSingleEntryDictionary.py (1531 of 1794)
PASS: lldb-api :: commands/watchpoints/step_over_watchpoint/TestStepOverWatchpoint.py (1532 of 1794)
PASS: lldb-unit :: Host/./HostTests/FileSystemTest.MakeAbsolute (1533 of 1794)
PASS: lldb-unit :: Utility/./UtilityTests/VMRange.ContainsRange (1534 of 1794)
UNSUPPORTED: lldb-api :: commands/expression/completion-crash-incomplete-record/TestCompletionCrashIncompleteRecord.py (1535 of 1794)
PASS: lldb-unit :: Process/gdb-remote/./ProcessGdbRemoteTests/GDBRemoteCommunicationTest.ReadPacket_checksum (1536 of 1794)
PASS: lldb-unit :: Utility/./UtilityTests/CompletionRequest.DuplicateFilteringWithComments (1537 of 1794)
UNSUPPORTED: lldb-api :: benchmarks/libcxxmap/TestBenchmarkLibcxxMap.py (1538 of 1794)
PASS: lldb-shell :: Breakpoint/debug_rnglist_basic.test (1539 of 1794)
PASS: lldb-shell :: SymbolFile/DWARF/childless-compile-unit.s (1540 of 1794)
PASS: lldb-api :: commands/expression/anonymous-struct/TestCallUserAnonTypedef.py (1541 of 1794)
PASS: lldb-api :: functionalities/gdb_remote_client/TestTargetXMLArch.py (1542 of 1794)
PASS: lldb-unit :: Utility/./UtilityTests/LogChannelEnabledTest.LogVerboseThread (1543 of 1794)
PASS: lldb-unit :: Utility/./UtilityTests/TildeExpressionResolver.ResolveFullPath (1544 of 1794)
PASS: lldb-unit :: Utility/./UtilityTests/ReproducerTest.SetReplay (1545 of 1794)
PASS: lldb-unit :: Symbol/./SymbolTests/TestClangASTContext.TestUnifyAccessSpecifiers (1546 of 1794)
PASS: lldb-shell :: ObjectFile/MachO/lc_build_version_notools.yaml (1547 of 1794)
PASS: lldb-api :: lang/objc/objc-builtin-types/TestObjCBuiltinTypes.py (1548 of 1794)
PASS: lldb-api :: commands/frame/diagnose/dereference-argument/TestDiagnoseDereferenceArgument.py (1549 of 1794)
PASS: lldb-unit :: debugserver/./debugserverTests/RNBSocket.LoopBackListenIPv6 (1550 of 1794)
PASS: lldb-unit :: Utility/./UtilityTests/ArgsTest.EscapeLLDBCommandArgument (1551 of 1794)
PASS: lldb-api :: functionalities/data-formatter/data-formatter-synthval/TestDataFormatterSynthVal.py (1552 of 1794)
PASS: lldb-api :: commands/expression/completion-in-lambda-and-unnnamed-class/TestCompletionInLambdaAndUnnamedClass.py (1553 of 1794)
UNSUPPORTED: lldb-shell :: SymbolFile/PDB/compilands.test (1554 of 1794)
PASS: lldb-shell :: Expr/TestIRMemoryMap.test (1555 of 1794)
PASS: lldb-unit :: Utility/./UtilityTests/RangeTest.DefaultConstructor (1556 of 1794)
PASS: lldb-api :: functionalities/thread/concurrent_events/TestConcurrentSignalBreak.py (1557 of 1794)
PASS: lldb-api :: lang/cpp/dynamic-value-same-basename/TestDynamicValueSameBase.py (1558 of 1794)
PASS: lldb-unit :: Process/gdb-remote/./ProcessGdbRemoteTests/GDBRemoteCommunicationClientTest.GetModulesInfo (1559 of 1794)
PASS: lldb-shell :: SymbolFile/DWARF/find-qualified-variable.cpp (1560 of 1794)
PASS: lldb-unit :: Expression/./ExpressionTests/DiagnosticManagerTest.PutStringMultiple (1561 of 1794)
PASS: lldb-unit :: Symbol/./SymbolTests/TestClangASTContext.TestGetBasicTypeFromName (1562 of 1794)
PASS: lldb-api :: commands/watchpoints/watchpoint_commands/command/TestWatchpointCommandPython.py (1563 of 1794)
PASS: lldb-api :: tools/lldb-server/register-reading/TestGdbRemoteGPacket.py (1564 of 1794)
UNSUPPORTED: lldb-shell :: SymbolFile/PDB/vbases.test (1565 of 1794)
PASS: lldb-unit :: Process/minidump/./LLDBMinidumpTests/MinidumpParserTest.MinidumpDuplicateModuleMinAddress (1566 of 1794)
PASS: lldb-shell :: Settings/TestFrameFormatNoColor.test (1567 of 1794)
PASS: lldb-api :: commands/reproducer/invalid-args/TestInvalidArgsReproducer.py (1568 of 1794)
PASS: lldb-unit :: Host/./HostTests/ProcessLaunchInfoTest.Constructor (1569 of 1794)
UNSUPPORTED: lldb-api :: linux/thread/create_during_instruction_step/TestCreateDuringInstructionStep.py (1570 of 1794)
PASS: lldb-shell :: Settings/TestSettingsSet.test (1571 of 1794)
PASS: lldb-unit :: Utility/./UtilityTests/ArchSpecTest.TestParseMachCPUDashSubtypeTripleExtra (1572 of 1794)
PASS: lldb-api :: lang/cpp/symbols/TestSymbols.py (1573 of 1794)
PASS: lldb-unit :: Utility/./UtilityTests/StringListTest.GetMaxStringLengthEqualSize (1574 of 1794)
PASS: lldb-unit :: UnwindAssembly/x86/./UnwindAssemblyx86Tests/Testx86AssemblyInspectionEngine.TestPopEBP (1575 of 1794)
PASS: lldb-unit :: Utility/./UtilityTests/UriParserTest.MinimalPortPath (1576 of 1794)
PASS: lldb-api :: functionalities/ubsan/user-expression/TestUbsanUserExpression.py (1577 of 1794)
PASS: lldb-shell :: ObjectFile/PECOFF/basic-info-arm.yaml (1578 of 1794)
PASS: lldb-api :: functionalities/gdb_remote_client/TestNoWatchpointSupportInfo.py (1579 of 1794)
PASS: lldb-unit :: ObjectFile/ELF/./ObjectFileELFTests/ObjectFileELFTest.GetSymtab_NoSymEntryPointArmThumbAddressClass (1580 of 1794)
PASS: lldb-api :: functionalities/breakpoint/move_nearest/TestMoveNearest.py (1581 of 1794)
PASS: lldb-api :: commands/quit/TestQuit.py (1582 of 1794)
PASS: lldb-api :: python_api/interpreter/TestRunCommandInterpreterAPI.py (1583 of 1794)
PASS: lldb-unit :: Utility/./UtilityTests/BinaryStreamTest.PutSLEB128MaxValue (1584 of 1794)
PASS: lldb-api :: commands/expression/test/TestExprs2.py (1585 of 1794)
PASS: lldb-unit :: Core/./LLDBCoreTests/UniqueCStringMap.NoDefaultConstructor (1586 of 1794)
PASS: lldb-unit :: Interpreter/./InterpreterTests/CompletionTest.DirCompletionAbsolute (1587 of 1794)
PASS: lldb-api :: lang/cpp/template-function/TestTemplateFunctions.py (1588 of 1794)
PASS: lldb-unit :: Utility/./UtilityTests/StreamTeeTest.DefaultConstructor (1589 of 1794)
PASS: lldb-unit :: UnwindAssembly/x86/./UnwindAssemblyx86Tests/Testx86AssemblyInspectionEngine.TestPushEDI (1590 of 1794)
PASS: lldb-api :: commands/target/stop-hooks/TestStopHooks.py (1591 of 1794)
PASS: lldb-unit :: Utility/./UtilityTests/ArgsTest.ReplaceArgumentAtIndexEqual (1592 of 1794)
PASS: lldb-unit :: Utility/./UtilityTests/DataExtractorTest.GetMaxU64 (1593 of 1794)
PASS: lldb-api :: functionalities/asan/TestReportData.py (1594 of 1794)
PASS: lldb-api :: python_api/frame/TestFrames.py (1595 of 1794)
PASS: lldb-unit :: Utility/./UtilityTests/Flags.Reset (1596 of 1794)
PASS: lldb-api :: functionalities/memory/find/TestMemoryFind.py (1597 of 1794)
PASS: lldb-unit :: UnwindAssembly/x86/./UnwindAssemblyx86Tests/Testx86AssemblyInspectionEngine.TestPushECX (1598 of 1794)
PASS: lldb-api :: functionalities/plugins/python_os_plugin/TestPythonOSPlugin.py (1599 of 1794)
PASS: lldb-unit :: Utility/./UtilityTests/DataExtractorTest.GetCStrAtEnd (1600 of 1794)
PASS: lldb-unit :: Utility/./UtilityTests/UriParserTest.MinimalPath (1601 of 1794)
PASS: lldb-unit :: Symbol/./SymbolTests/LineEntryTest.GetSameLineContiguousAddressRangeNoInlines (1602 of 1794)
PASS: lldb-unit :: Utility/./UtilityTests/StructuredDataTest.StringDump (1603 of 1794)
PASS: lldb-unit :: Utility/./UtilityTests/LogTest.Register (1604 of 1794)
PASS: lldb-unit :: Utility/./UtilityTests/StringExtractorTest.GetHexBytes_OddPair (1605 of 1794)
PASS: lldb-unit :: Process/gdb-remote/./ProcessGdbRemoteTests/GDBRemoteCommunicationClientTest.SyncThreadState (1606 of 1794)
PASS: lldb-unit :: ObjectFile/Breakpad/./ObjectFileBreakpadTests/StackWinRecord.parse (1607 of 1794)
PASS: lldb-unit :: Utility/./UtilityTests/OptionsWithRawTest.SingleWhitespaceInput (1608 of 1794)
PASS: lldb-unit :: Utility/./UtilityTests/LogChannelTest.EnableOptions (1609 of 1794)
PASS: lldb-shell :: SymbolFile/Breakpad/symtab-macho.test (1610 of 1794)
PASS: lldb-shell :: Quit/TestQuitExitCodeTooManyArgs.test (1611 of 1794)
UNSUPPORTED: lldb-shell :: ExecControl/StopHook/stop-hook-threads.test (1612 of 1794)
PASS: lldb-shell :: Commands/command-regex-delete.test (1613 of 1794)
PASS: lldb-unit :: UnwindAssembly/x86/./UnwindAssemblyx86Tests/Testx86AssemblyInspectionEngine.TestPopESI (1614 of 1794)
PASS: lldb-shell :: SymbolFile/DWARF/find-basic-function.cpp (1615 of 1794)
PASS: lldb-api :: lang/c/step-target/TestStepTarget.py (1616 of 1794)
PASS: lldb-unit :: ScriptInterpreter/Python/./ScriptInterpreterPythonTests/PythonDataObjectsTest.TestResetting (1617 of 1794)
PASS: lldb-api :: lang/objc/modules-incomplete/TestIncompleteModules.py (1618 of 1794)
UNSUPPORTED: lldb-api :: commands/expression/call-restarts/TestCallThatRestarts.py (1619 of 1794)
PASS: lldb-shell :: Commands/CommandScriptImmediateOutput/CommandScriptImmediateOutputFile.test (1620 of 1794)
PASS: lldb-api :: lang/objc/ivar-IMP/TestObjCiVarIMP.py (1621 of 1794)
PASS: lldb-api :: commands/log/invalid-args/TestInvalidArgsLog.py (1622 of 1794)
PASS: lldb-unit :: Process/gdb-remote/./ProcessGdbRemoteTests/GDBRemoteCommunicationClientTest.SendGetDataPacket (1623 of 1794)
PASS: lldb-unit :: Core/./LLDBCoreTests/MangledTest.ResultForValidName (1624 of 1794)
PASS: lldb-api :: python_api/file_handle/TestFileHandle.py (1625 of 1794)
PASS: lldb-api :: python_api/sblaunchinfo/TestSBLaunchInfo.py (1626 of 1794)
PASS: lldb-api :: python_api/breakpoint/TestBreakpointAPI.py (1627 of 1794)
PASS: lldb-api :: functionalities/data-formatter/nssetsynth/TestNSSetSynthetic.py (1628 of 1794)
PASS: lldb-api :: lang/cpp/breakpoint-commands/TestCPPBreakpointCommands.py (1629 of 1794)
PASS: lldb-unit :: Utility/./UtilityTests/StreamTest.PutHex64ByteOrderBig (1630 of 1794)
PASS: lldb-shell :: Commands/command-regex-unalias.test (1631 of 1794)
PASS: lldb-api :: functionalities/data-formatter/data-formatter-objc/TestDataFormatterObjCNSDate.py (1632 of 1794)
PASS: lldb-unit :: Utility/./UtilityTests/StringExtractorTest.InitMisc (1633 of 1794)
UNSUPPORTED: lldb-api :: functionalities/darwin_log/filter/exact_match/category/TestDarwinLogFilterMatchCategory.py (1634 of 1794)
PASS: lldb-unit :: Expression/./ExpressionTests/DiagnosticManagerTest.AppendMessageNoDiag (1635 of 1794)
UNSUPPORTED: lldb-api :: commands/expression/completion-crash2/TestCompletionCrash2.py (1636 of 1794)
PASS: lldb-api :: functionalities/breakpoint/step_over_breakpoint/TestStepOverBreakpoint.py (1637 of 1794)
UNSUPPORTED: lldb-shell :: SymbolFile/PDB/enums-layout.test (1638 of 1794)
PASS: lldb-api :: lang/objc/foundation/TestConstStrings.py (1639 of 1794)
PASS: lldb-api :: functionalities/data-formatter/hexcaps/TestDataFormatterHexCaps.py (1640 of 1794)
PASS: lldb-unit :: tools/lldb-server/tests/./LLDBServerTests/TestBase.DebugserverEnv (1641 of 1794)
PASS: lldb-api :: python_api/formatters/TestFormattersSBAPI.py (1642 of 1794)
PASS: lldb-api :: functionalities/thread/step_until/TestStepUntil.py (1643 of 1794)
PASS: lldb-api :: lang/cpp/lambdas/TestLambdas.py (1644 of 1794)
PASS: lldb-unit :: Utility/./UtilityTests/ProcessInstanceInfo.DumpTable (1645 of 1794)
PASS: lldb-api :: functionalities/tail_call_frames/sbapi_support/TestTailCallFrameSBAPI.py (1646 of 1794)
PASS: lldb-unit :: Language/Highlighting/./HighlighterTests/HighlighterTest.HighlighterSelectionType (1647 of 1794)
PASS: lldb-unit :: Symbol/./SymbolTests/DWARFCallFrameInfoTest.Basic_dwarf4 (1648 of 1794)
PASS: lldb-unit :: UnwindAssembly/x86/./UnwindAssemblyx86Tests/Testx86AssemblyInspectionEngine.TestPopEBX (1649 of 1794)
PASS: lldb-unit :: Symbol/./SymbolTests/SymbolsTest.LocateExecutableSymbolFileForUnknownExecutableAndMissingSymbolFile (1650 of 1794)
PASS: lldb-unit :: SymbolFile/DWARF/./SymbolFileDWARFTests/SymbolFileDWARFTests.TestAbbrevValidAttrNullForm (1651 of 1794)
PASS: lldb-api :: python_api/interpreter/TestCommandInterpreterAPI.py (1652 of 1794)
PASS: lldb-api :: functionalities/thread/concurrent_events/TestConcurrentTwoWatchpointsOneBreakpoint.py (1653 of 1794)
UNSUPPORTED: lldb-shell :: Register/x86-64-zmm-read.test (1654 of 1794)
PASS: lldb-unit :: Utility/./UtilityTests/RangeTest.ContainsAddrInvalid (1655 of 1794)
PASS: lldb-unit :: UnwindAssembly/ARM64/./Arm64InstEmulationTests/TestArm64InstEmulation.TestSimpleDarwinFunction (1656 of 1794)
PASS: lldb-api :: lang/objc/foundation/TestRuntimeTypes.py (1657 of 1794)
UNSUPPORTED: lldb-api :: functionalities/data-formatter/data-formatter-stl/libstdcpp/tuple/TestDataFormatterStdTuple.py (1658 of 1794)
PASS: lldb-api :: commands/expression/diagnostics/TestExprDiagnostics.py (1659 of 1794)
PASS: lldb-api :: lang/cpp/extern_c/TestExternCSymbols.py (1660 of 1794)
PASS: lldb-api :: lang/cpp/dynamic-value/TestDynamicValue.py (1661 of 1794)
PASS: lldb-api :: python_api/symbol-context/TestSymbolContext.py (1662 of 1794)
PASS: lldb-api :: lang/objc/modules-auto-import/TestModulesAutoImport.py (1663 of 1794)
PASS: lldb-unit :: Utility/./UtilityTests/BinaryStreamTest.PutSLEB128SevenBytes (1664 of 1794)
UNSUPPORTED: lldb-shell :: Register/x86-ymm-read.test (1665 of 1794)
PASS: lldb-api :: lang/objc/print-obj/TestPrintObj.py (1666 of 1794)
PASS: lldb-unit :: Utility/./UtilityTests/OptionsWithRawTest.LeadingSpaceArgs (1667 of 1794)
PASS: lldb-api :: functionalities/thread/concurrent_events/TestConcurrentWatchBreakDelay.py (1668 of 1794)
UNSUPPORTED: lldb-api :: tools/lldb-vscode/breakpoint/TestVSCode_setFunctionBreakpoints.py (1669 of 1794)
PASS: lldb-unit :: Process/minidump/./LLDBMinidumpTests/MinidumpParserTest.GetPidWow64 (1670 of 1794)
PASS: lldb-shell :: ObjectFile/Breakpad/discontiguous-sections.test (1671 of 1794)
PASS: lldb-unit :: Host/./HostTests/FileSystemTest.Resolve (1672 of 1794)
PASS: lldb-unit :: Utility/./UtilityTests/TimeoutTest.Construction (1673 of 1794)
PASS: lldb-api :: commands/expression/import-std-module/vector-dbg-info-content/TestDbgInfoContentVector.py (1674 of 1794)
PASS: lldb-api :: lang/objc/foundation/TestObjCMethodsNSError.py (1675 of 1794)
UNSUPPORTED: lldb-shell :: ObjectFile/ELF/minidebuginfo-set-and-hit-breakpoint.test (1676 of 1794)
PASS: lldb-unit :: UnwindAssembly/x86/./UnwindAssemblyx86Tests/Testx86AssemblyInspectionEngine.TestStackRealignMSVC_i386 (1677 of 1794)
UNSUPPORTED: lldb-api :: arm/breakpoint-thumb-codesection/TestBreakpointThumbCodesection.py (1678 of 1794)
UNSUPPORTED: lldb-api :: lang/cpp/printf/TestPrintf.py (1679 of 1794)
PASS: lldb-unit :: Utility/./UtilityTests/StringExtractorTest.GetHexU8_Underflow (1680 of 1794)
PASS: lldb-unit :: Utility/./UtilityTests/BroadcasterTest.EventTypeHasListeners (1681 of 1794)
PASS: lldb-api :: functionalities/breakpoint/dummy_target_breakpoints/TestBreakpointsWithNoTargets.py (1682 of 1794)
PASS: lldb-api :: commands/process/attach-resume/TestAttachResume.py (1683 of 1794)
PASS: lldb-unit :: Host/./HostTests/FileSystemTest.OpenErrno (1684 of 1794)
PASS: lldb-api :: functionalities/data-formatter/data-formatter-named-summaries/TestDataFormatterNamedSummaries.py (1685 of 1794)
PASS: lldb-unit :: Utility/./UtilityTests/RegisterValueTest.GetSet8 (1686 of 1794)
PASS: lldb-api :: python_api/lldbutil/iter/TestRegistersIterator.py (1687 of 1794)
PASS: lldb-api :: functionalities/tsan/global_location/TestTsanGlobalLocation.py (1688 of 1794)
UNSUPPORTED: lldb-api :: benchmarks/stepping/TestSteppingSpeed.py (1689 of 1794)
PASS: lldb-api :: lang/objc/foundation/TestObjectDescriptionAPI.py (1690 of 1794)
PASS: lldb-api :: lang/objc/unicode-string/TestUnicodeString.py (1691 of 1794)
UNSUPPORTED: lldb-shell :: SymbolFile/PDB/func-symbols.test (1692 of 1794)
PASS: lldb-api :: lang/objcxx/class-name-clash/TestNameClash.py (1693 of 1794)
PASS: lldb-unit :: Utility/./UtilityTests/Flags.AllClear (1694 of 1794)
PASS: lldb-api :: lang/objc/orderedset/TestOrderedSet.py (1695 of 1794)
PASS: lldb-unit :: Utility/./UtilityTests/DataExtractorTest.GetMaxU64_unchecked (1696 of 1794)
PASS: lldb-api :: functionalities/signal/raise/TestRaise.py (1697 of 1794)
PASS: lldb-unit :: Utility/./UtilityTests/DataExtractorTest.GetCStrAtNullOffset (1698 of 1794)
PASS: lldb-api :: lang/cpp/member-and-local-vars-with-same-name/TestMembersAndLocalsWithSameName.py (1699 of 1794)
PASS: lldb-unit :: Utility/./UtilityTests/StreamTeeTest.Write (1700 of 1794)
PASS: lldb-api :: commands/expression/argument_passing_restrictions/TestArgumentPassingRestrictions.py (1701 of 1794)
PASS: lldb-shell :: Driver/TestCore.test (1702 of 1794)
PASS: lldb-unit :: UnwindAssembly/x86/./UnwindAssemblyx86Tests/Testx86AssemblyInspectionEngine.Test64bitFramelessBigStackFrame (1703 of 1794)
PASS: lldb-api :: python_api/default-constructor/TestDefaultConstructorForAPIObjects.py (1704 of 1794)
UNSUPPORTED: lldb-shell :: Register/aarch64-gp-read.test (1705 of 1794)
PASS: lldb-unit :: Process/minidump/./LLDBMinidumpTests/MinidumpParserTest.FindMemoryRangeWithFullMemoryMinidump (1706 of 1794)
PASS: lldb-unit :: Language/Highlighting/./HighlighterTests/HighlighterTest.ClangBraces (1707 of 1794)
PASS: lldb-unit :: Utility/./UtilityTests/BinaryStreamTest.PutULEB128SevenBytes (1708 of 1794)
PASS: lldb-unit :: Utility/./UtilityTests/UriParserTest.SchemeHostSeparator3 (1709 of 1794)
PASS: lldb-api :: lang/objc/objc-runtime-ivars/TestRuntimeIvars.py (1710 of 1794)
PASS: lldb-api :: functionalities/breakpoint/breakpoint_language/TestBreakpointLanguage.py (1711 of 1794)
PASS: lldb-unit :: Expression/./ExpressionTests/ClangHostTest.MacOSX (1712 of 1794)
PASS: lldb-unit :: Utility/./UtilityTests/StreamTest.PutRawBytesToLittleEndian (1713 of 1794)
UNSUPPORTED: lldb-shell :: Register/x86-zmm-write.test (1714 of 1794)
PASS: lldb-unit :: Utility/./UtilityTests/ArgsTest.TestArgv (1715 of 1794)
PASS: lldb-unit :: Utility/./UtilityTests/StreamTest.ShiftOperatorStrings (1716 of 1794)
PASS: lldb-unit :: Utility/./UtilityTests/Flags.IsClear (1717 of 1794)
PASS: lldb-unit :: Expression/./ExpressionTests/CppModuleConfigurationTest.AmbiguousLibCpp (1718 of 1794)
PASS: lldb-api :: lang/cpp/gmodules/TestWithModuleDebugging.py (1719 of 1794)
PASS: lldb-api :: functionalities/modern-type-lookup/libcxx/TestLibCxxModernTypeLookup.py (1720 of 1794)
PASS: lldb-api :: lang/cpp/char1632_t/TestChar1632T.py (1721 of 1794)
UNSUPPORTED: lldb-shell :: Register/x86-64-ymm16-read.test (1722 of 1794)
PASS: lldb-unit :: UnwindAssembly/x86/./UnwindAssemblyx86Tests/Testx86AssemblyInspectionEngine.TestPushEBX (1723 of 1794)
PASS: lldb-unit :: Utility/./UtilityTests/OptionsWithRawTest.WhitespaceSuffix (1724 of 1794)
PASS: lldb-shell :: Minidump/fb-dump.test (1725 of 1794)
PASS: lldb-unit :: UnwindAssembly/x86/./UnwindAssemblyx86Tests/Testx86AssemblyInspectionEngine.TestSimple32bitFrameFunction (1726 of 1794)
PASS: lldb-unit :: Utility/./UtilityTests/AnsiTerminal.Basic (1727 of 1794)
PASS: lldb-api :: commands/expression/rdar42038760/TestScalarURem.py (1728 of 1794)
PASS: lldb-unit :: Host/./HostTests/TaskPoolTest.AddTask (1729 of 1794)
UNSUPPORTED: lldb-api :: functionalities/data-formatter/data-formatter-stl/libstdcpp/map/TestDataFormatterStdMap.py (1730 of 1794)
PASS: lldb-api :: lang/objc/objc-dyn-sbtype/TestObjCDynamicSBType.py (1731 of 1794)
PASS: lldb-unit :: Utility/./UtilityTests/StringExtractorTest.GetHexBytes_Underflow (1732 of 1794)
PASS: lldb-shell :: Minidump/disassemble-no-module.yaml (1733 of 1794)
PASS: lldb-unit :: Process/minidump/./LLDBMinidumpTests/MinidumpParserTest.GetPidWindows (1734 of 1794)
PASS: lldb-unit :: Utility/./UtilityTests/TimerTest.CategoryTimes2 (1735 of 1794)
PASS: lldb-unit :: Utility/./UtilityTests/ArgsTest.TestSingleQuotedArgWithSpace (1736 of 1794)
PASS: lldb-unit :: ScriptInterpreter/Python/./ScriptInterpreterPythonTests/PythonDataObjectsTest.TestGlobalNameResolutionWithDot (1737 of 1794)
PASS: lldb-api :: lang/cpp/bool/TestCPPBool.py (1738 of 1794)
PASS: lldb-api :: functionalities/breakpoint/consecutive_breakpoints/TestConsecutiveBreakpoints.py (1739 of 1794)
PASS: lldb-shell :: Minidump/Windows/Sigsegv/sigsegv.test (1740 of 1794)
PASS: lldb-unit :: Utility/./UtilityTests/ArchSpecTest.OperatorBool (1741 of 1794)
PASS: lldb-api :: commands/expression/persistent_ptr_update/TestPersistentPtrUpdate.py (1742 of 1794)
PASS: lldb-shell :: SymbolFile/DWARF/debug-types-signature-loop.s (1743 of 1794)
PASS: lldb-api :: functionalities/return-value/TestReturnValue.py (1744 of 1794)
PASS: lldb-shell :: ObjectFile/ELF/PT_LOAD-empty.yaml (1745 of 1794)
PASS: lldb-api :: functionalities/breakpoint/source_regexp/TestSourceRegexBreakpoints.py (1746 of 1794)
PASS: lldb-unit :: Symbol/./SymbolTests/TestClangASTContext.TestIsClangType (1747 of 1794)
PASS: lldb-api :: lang/objc/variadic_methods/TestVariadicMethods.py (1748 of 1794)
PASS: lldb-unit :: Utility/./UtilityTests/StringListTest.GetSize (1749 of 1794)
PASS: lldb-shell :: Watchpoint/SetErrorCases.test (1750 of 1794)
PASS: lldb-unit :: Utility/./UtilityTests/BinaryStreamTest.PutULEB128ThreeBytes (1751 of 1794)
PASS: lldb-api :: lang/cpp/virtual/TestVirtual.py (1752 of 1794)
PASS: lldb-shell :: Quit/TestQuitExitCode0.test (1753 of 1794)
PASS: lldb-unit :: Utility/./UtilityTests/OptionsWithRawTest.QuotedSuffix (1754 of 1794)
PASS: lldb-shell :: ObjectFile/PECOFF/sections-names.yaml (1755 of 1794)
PASS: lldb-shell :: ObjectFile/ELF/PT_TLS-overlap-PT_LOAD.yaml (1756 of 1794)
PASS: lldb-api :: functionalities/step_scripted/TestStepScripted.py (1757 of 1794)
PASS: lldb-api :: functionalities/unwind/noreturn/module-end/TestNoReturnModuleEnd.py (1758 of 1794)
UNSUPPORTED: lldb-api :: benchmarks/libcxxlist/TestBenchmarkLibcxxList.py (1759 of 1794)
PASS: lldb-shell :: Commands/CommandScriptImmediateOutput/CommandScriptImmediateOutputConsole.test (1760 of 1794)
PASS: lldb-shell :: Quit/TestQuitExitCodeHex0.test (1761 of 1794)
PASS: lldb-unit :: Utility/./UtilityTests/ScalarTest.APIntConstructor (1762 of 1794)
PASS: lldb-shell :: ObjectFile/ELF/section-types-edgecases.yaml (1763 of 1794)
UNSUPPORTED: lldb-api :: lang/objc/bitfield_ivars/TestBitfieldIvars.py (1764 of 1794)
PASS: lldb-unit :: Symbol/./SymbolTests/TestClangASTContext.TestGetBasicTypeFromEnum (1765 of 1794)
PASS: lldb-unit :: Expression/./ExpressionTests/CppModuleConfigurationTest.LinuxLocalLibCpp (1766 of 1794)
PASS: lldb-api :: functionalities/pre_run_dylibs/TestPreRunDylibs.py (1767 of 1794)
PASS: lldb-shell :: Minidump/dump-all.test (1768 of 1794)
PASS: lldb-api :: python_api/value_var_update/TestValueVarUpdate.py (1769 of 1794)
PASS: lldb-api :: lang/cpp/operators/TestCppOperators.py (1770 of 1794)
PASS: lldb-api :: commands/disassemble/basic/TestDisassembleBreakpoint.py (1771 of 1794)
UNSUPPORTED: lldb-api :: functionalities/darwin_log/filter/regex/category/TestDarwinLogFilterRegexCategory.py (1772 of 1794)
PASS: lldb-api :: functionalities/tail_call_frames/thread_step_out_message/TestArtificialFrameStepOutMessage.py (1773 of 1794)
PASS: lldb-api :: functionalities/step-avoids-no-debug/TestStepNoDebug.py (1774 of 1794)
PASS: lldb-api :: functionalities/data-formatter/data-formatter-globals/TestDataFormatterGlobals.py (1775 of 1794)
PASS: lldb-api :: tools/lldb-server/TestGdbRemoteKill.py (1776 of 1794)
PASS: lldb-api :: lang/cpp/rvalue-references/TestRvalueReferences.py (1777 of 1794)
PASS: lldb-api :: sample_test/TestSampleInlineTest.py (1778 of 1794)
PASS: lldb-api :: functionalities/tsan/multiple/TestTsanMultiple.py (1779 of 1794)
PASS: lldb-api :: functionalities/breakpoint/breakpoint_ids/TestBreakpointIDs.py (1780 of 1794)
PASS: lldb-api :: lang/cpp/unicode-literals/TestUnicodeLiterals.py (1781 of 1794)
PASS: lldb-api :: lang/c/register_variables/TestRegisterVariables.py (1782 of 1794)
PASS: lldb-api :: tools/lldb-server/TestGdbRemote_qThreadStopInfo.py (1783 of 1794)
PASS: lldb-api :: commands/expression/formatters/TestFormatters.py (1784 of 1794)
PASS: lldb-api :: lang/objcxx/hide-runtime-values/TestObjCXXHideRuntimeValues.py (1785 of 1794)
PASS: lldb-api :: functionalities/thread/exit_during_step/TestExitDuringStep.py (1786 of 1794)
PASS: lldb-api :: functionalities/inline-stepping/TestInlineStepping.py (1787 of 1794)
PASS: lldb-api :: python_api/thread/TestThreadAPI.py (1788 of 1794)
PASS: lldb-api :: functionalities/breakpoint/breakpoint_conditions/TestBreakpointConditions.py (1789 of 1794)
PASS: lldb-api :: lang/objc/hidden-ivars/TestHiddenIvars.py (1790 of 1794)
PASS: lldb-api :: lang/objc/foundation/TestObjCMethodsString.py (1791 of 1794)
PASS: lldb-api :: types/TestIntegerTypesExpr.py (1792 of 1794)
PASS: lldb-api :: lang/objc/foundation/TestFoundationDisassembly.py (1793 of 1794)
PASS: lldb-api :: types/TestIntegerTypes.py (1794 of 1794)
Testing Time: 333.76s
********************
Failing Tests (1):
    lldb-api :: functionalities/exec/TestExec.py

Hide Details

Hide Details

Slowest Tests: -------------------------------------------------------------------------- 36.55s: lldb-api :: lang/objc/forward-decl/TestForwardDecl.py 41.68s: lldb-api :: python_api/module_section/TestModuleAndSection.py 43.26s: lldb-api :: lang/objc/foundation/TestObjCMethodsNSError.py 44.86s: lldb-api :: commands/watchpoints/watchpoint_set_command/TestWatchLocationWithWatchSet.py 45.09s: lldb-api :: python_api/watchpoint/watchlocation/TestTargetWatchAddress.py 45.26s: lldb-api :: lang/objc/objc-new-syntax/TestObjCNewSyntaxArray.py 45.93s: lldb-api :: lang/objc/objc-new-syntax/TestObjCNewSyntaxDictionary.py 49.07s: lldb-api :: functionalities/recursion/TestValueObjectRecursion.py 49.25s: lldb-api :: lang/objc/real-definition/TestRealDefinition.py 53.71s: lldb-api :: lang/objc/exceptions/TestObjCExceptions.py 59.76s: lldb-api :: lang/objc/objc-new-syntax/TestObjCNewSyntaxLiteral.py 64.65s: lldb-api :: lang/cpp/namespace/TestNamespaceLookup.py 70.32s: lldb-api :: api/multithreaded/TestMultithreaded.py 71.34s: lldb-api :: lang/objc/hidden-ivars/TestHiddenIvars.py 78.15s: lldb-api :: lang/objc/foundation/TestObjCMethods.py 78.58s: lldb-api :: types/TestIntegerTypes.py 83.89s: lldb-api :: lang/cpp/enum_types/TestCPP11EnumTypes.py 94.42s: lldb-api :: tools/lldb-server/TestLldbGdbServer.py 114.19s: lldb-api :: types/TestIntegerTypesExpr.py 133.36s: lldb-api :: lang/objc/foundation/TestFoundationDisassembly.py

Hide Details

Tests Times: -------------------------------------------------------------------------- [ Range ] :: [ Percentage ] :: [ Count ] -------------------------------------------------------------------------- [ 0s, 10s) :: [*********************************** ] :: [1585/1794] [ 10s, 20s) :: [*** ] :: [ 148/1794] [ 20s, 30s) :: [ ] :: [ 37/1794] [ 30s, 40s) :: [ ] :: [ 5/1794] [ 40s, 50s) :: [ ] :: [ 6/1794] [ 50s, 60s) :: [ ] :: [ 3/1794] [ 60s, 70s) :: [ ] :: [ 2/1794] [ 70s, 80s) :: [ ] :: [ 2/1794] [ 80s, 90s) :: [ ] :: [ 3/1794] [ 90s,100s) :: [ ] :: [ 1/1794] [100s,110s) :: [ ] :: [ 0/1794] [110s,120s) :: [ ] :: [ 1/1794] [120s,130s) :: [ ] :: [ 0/1794] [130s,140s) :: [ ] :: [ 1/1794] Expected Passes : 1652 Expected Failures : 6 Unsupported Tests : 135 Unexpected Failures: 1 FAILED: tools/lldb/test/CMakeFiles/check-lldb-lit cd /Users/buildslave/jenkins/workspace/lldb-cmake/lldb-build/tools/lldb/test && /usr/local/Cellar/python/3.7.0/bin/python3.7 /Users/buildslave/jenkins/workspace/lldb-cmake/lldb-build/./bin/llvm-lit -v --time-tests --shuffle --xunit-xml-output=/Users/buildslave/jenkins/workspace/lldb-cmake/test/results.xml -v /Users/buildslave/jenkins/workspace/lldb-cmake/lldb-build/tools/lldb/test ninja: build stopped: subcommand failed. Command failed Command: ['/usr/bin/env', 'TERM=vt100', '/usr/local/bin/ninja', '-v', 'check-lldb'] [Pipeline] } [Pipeline] // timeout [Pipeline] } [Pipeline] // stage [Pipeline] stage [Pipeline] { (Declarative: Post Actions) [Pipeline] scanForIssues No credentials specified [Clang (LLVM based)] Sleeping for 5 seconds due to JENKINS-32191... [Clang (LLVM based)] Parsing console log (workspace: '/Users/buildslave/jenkins/workspace/lldb-cmake') [Clang (LLVM based)] [-ERROR-] Git blame errors: [Clang (LLVM based)] [-ERROR-] - no blame results for request <llvm-project/llvm/include/llvm/Analysis/ScalarEvolution.h - [1702]>.

Hide Details

[Clang (LLVM based)] Post processing issues on 'green-dragon-24' with source code encoding 'UTF-8' [Clang (LLVM based)] Resolving absolute file names for all issues in workspace '/Users/buildslave/jenkins/workspace/lldb-cmake' [Clang (LLVM based)] -> 0 resolved, 0 unresolved, 1 already resolved [Clang (LLVM based)] Copying affected files to Jenkins' build folder '/Users/Shared/Jenkins/Home/jobs/lldb-cmake/builds/2800/files-with-issues' [Clang (LLVM based)] -> 1 copied, 0 not in workspace, 0 not-found, 0 with I/O error [Clang (LLVM based)] Resolving module names from module definitions (build.xml, pom.xml, or Manifest.mf files) [Clang (LLVM based)] -> resolved module names for 1 issues [Clang (LLVM based)] Resolving package names (or namespaces) by parsing the affected files [Clang (LLVM based)] -> resolved package names of 1 affected files [Clang (LLVM based)] No filter has been set, publishing all 1 issues [Clang (LLVM based)] Creating fingerprints for all affected code blocks to track issues over different builds [Clang (LLVM based)] -> created fingerprints for 1 issues [Clang (LLVM based)] Invoking Git blamer to create author and commit information for all affected files [Clang (LLVM based)] GIT_COMMIT env = 'HEAD' [Clang (LLVM based)] Git working tree = '/Users/buildslave/jenkins/workspace/lldb-cmake' [Clang (LLVM based)] Git commit ID = '7774c4da0ada8aad6524d2e5722c0014fedfd6c0' [Clang (LLVM based)] Job workspace = '/Users/buildslave/jenkins/workspace/lldb-cmake' [Clang (LLVM based)] Created blame requests for 1 files - invoking Git blame on agent for each of the requests [Clang (LLVM based)] -> blamed authors of issues in 1 files
[Pipeline] junit Recording test results [BFA] Scanning build for known causes... [Pipeline] emailext [BFA] Found failure cause(s): [BFA] Ninja target failed from category Compile [BFA] Regression test failed from category Test [BFA] Done. 0s Not sending mail to unregistered user craig.topper@intel.com because your SCM claimed this was associated with a user ID ‘craig.topper' which your security realm does not recognize; you may need changes in your SCM plugin Not sending mail to unregistered user craig.topper@intel.com because your SCM claimed this was associated with a user ID ‘craig.topper' which your security realm does not recognize; you may need changes in your SCM plugin

Hide Details

Begin Pre-Send Script... javax.mail.internet.AddressException: Missing '>' in string ``Bruno Lopes <blopes@apple.com'' at position 29 at javax.mail.internet.InternetAddress.parse(InternetAddress.java:811) at javax.mail.internet.InternetAddress.parse(InternetAddress.java:633) at javax.mail.internet.InternetAddress.<init>(InternetAddress.java:111) at sun.reflect.GeneratedConstructorAccessor411.newInstance(Unknown Source) at sun.reflect.DelegatingConstructorAccessorImpl.newInstance(DelegatingConstructorAccessorImpl.java:45) at java.lang.reflect.Constructor.newInstance(Constructor.java:423) at org.codehaus.groovy.reflection.CachedConstructor.invoke(CachedConstructor.java:83) at org.codehaus.groovy.runtime.callsite.ConstructorSite$ConstructorSiteNoUnwrapNoCoerce.callConstructor(ConstructorSite.java:105) at org.codehaus.groovy.runtime.callsite.CallSiteArray.defaultCallConstructor(CallSiteArray.java:60) at org.codehaus.groovy.runtime.callsite.AbstractCallSite.callConstructor(AbstractCallSite.java:235) at org.kohsuke.groovy.sandbox.impl.Checker$3.call(Checker.java:203) at org.kohsuke.groovy.sandbox.impl.Checker.checkedConstructor(Checker.java:205) at org.kohsuke.groovy.sandbox.impl.Checker$checkedConstructor$3.callStatic(Unknown Source) at org.codehaus.groovy.runtime.callsite.CallSiteArray.defaultCallStatic(CallSiteArray.java:56) at org.codehaus.groovy.runtime.callsite.AbstractCallSite.callStatic(AbstractCallSite.java:194) at org.codehaus.groovy.runtime.callsite.AbstractCallSite.callStatic(AbstractCallSite.java:214) at Script1.run(Script1.groovy:66) at hudson.plugins.emailext.ExtendedEmailPublisher.executeScript(ExtendedEmailPublisher.java:623) at hudson.plugins.emailext.ExtendedEmailPublisher.executePresendScript(ExtendedEmailPublisher.java:573) at hudson.plugins.emailext.ExtendedEmailPublisher.sendMail(ExtendedEmailPublisher.java:456) at hudson.plugins.emailext.EmailExtStep$EmailExtStepExecution.run(EmailExtStep.java:224) at hudson.plugins.emailext.EmailExtStep$EmailExtStepExecution.run(EmailExtStep.java:163) at org.jenkinsci.plugins.workflow.steps.AbstractSynchronousNonBlockingStepExecution$1$1.call(AbstractSynchronousNonBlockingStepExecution.java:47) at hudson.security.ACL.impersonate(ACL.java:290) at org.jenkinsci.plugins.workflow.steps.AbstractSynchronousNonBlockingStepExecution$1.run(AbstractSynchronousNonBlockingStepExecution.java:44) at java.util.concurrent.Executors$RunnableAdapter.call(Executors.java:511) at java.util.concurrent.FutureTask.run(FutureTask.java:266) at java.util.concurrent.ThreadPoolExecutor.runWorker(ThreadPoolExecutor.java:1149) at java.util.concurrent.ThreadPoolExecutor$Worker.run(ThreadPoolExecutor.java:624) at java.lang.Thread.run(Thread.java:748)

Hide Details

Sending email to: mschifer@apple.com
> git rev-parse HEAD^{commit} # timeout=10 [Pipeline] } [Pipeline] // stage [Pipeline] } [Pipeline] // withEnv [Pipeline] } [Pipeline] // node [Pipeline] End of Pipeline ERROR: script returned exit code 1 Finished: FAILURE