FailedConsole Output

Skipping 16,920 KB.. Full Log
w value: 0x0000000000000063
    hw_index = 0  hit_count = 2     ignore_count = 0   

Hide Details

Hide Details

Expecting sub string: hit_count = 2 Matched

Hide Details

runCmd: thread backtrace all output: thread #1, queue = 'com.apple.main-thread' frame #0: 0x00007fff6af4f36a libsystem_kernel.dylib`__ulock_wait + 10 frame #1: 0x00007fff6b00a70b libsystem_pthread.dylib`_pthread_join + 356 frame #2: 0x00007fff68534978 libc++.1.dylib`std::__1::thread::join() + 24 frame #3: 0x000000010000127f a.out`main(argc=1, argv=0x00007ffeefbff580) at main.cpp:110:16 frame #4: 0x00007fff6ae14085 libdyld.dylib`start + 1 thread #2, stop reason = watchpoint 1 frame #0: 0x0000000100000d92 a.out`do_bad_thing_with_location(index=7, char_ptr="", new_val='c') at main.cpp:36:1 frame #1: 0x0000000100000e4e a.out`access_pool(flag=true) at main.cpp:53:9 frame #2: 0x0000000100000f35 a.out`thread_func(thread_index=0) at main.cpp:80:19 frame #3: 0x00000001000027c4 a.out`decltype(__f=0x00000001004001a8, __args=0x00000001004001b0)(unsigned int)>(fp)(std::__1::forward<long>(fp0))) std::__1::__invoke<void (*)(unsigned int), long>(void (*&&)(unsigned int), long&&) at type_traits:3529:1 frame #4: 0x000000010000270e a.out`void std::__1::__thread_execute<std::__1::unique_ptr<std::__1::__thread_struct, std::__1::default_delete<std::__1::__thread_struct> >, void (*)(unsigned int), long, 2ul>(__t=size=3, (null)=__tuple_indices<2> @ 0x0000700005084eb8)(unsigned int), long>&, std::__1::__tuple_indices<2ul>) at thread:273:5 frame #5: 0x0000000100001f16 a.out`void* std::__1::__thread_proxy<std::__1::tuple<std::__1::unique_ptr<std::__1::__thread_struct, std::__1::default_delete<std::__1::__thread_struct> >, void (*)(unsigned int), long> >(__vp=0x00000001004001a0) at thread:283:5 frame #6: 0x00007fff6b00633d libsystem_pthread.dylib`_pthread_body + 126 frame #7: 0x00007fff6b0092a7 libsystem_pthread.dylib`_pthread_start + 70 frame #8: 0x00007fff6b005425 libsystem_pthread.dylib`thread_start + 13 thread #3 frame #0: 0x00007fff6af50aa6 libsystem_kernel.dylib`__write_nocancel + 10 frame #1: 0x00007fff6aea2920 libsystem_c.dylib`_swrite + 87 frame #2: 0x00007fff6ae9b4e3 libsystem_c.dylib`__sflush + 87 frame #3: 0x00007fff6ae9dc0f libsystem_c.dylib`__sfvwrite + 798 frame #4: 0x00007fff6aea7a3a libsystem_c.dylib`__vfprintf + 16604 frame #5: 0x00007fff6aecc13b libsystem_c.dylib`__v2printf + 475 frame #6: 0x00007fff6aea3882 libsystem_c.dylib`vfprintf_l + 54 frame #7: 0x00007fff6aea199a libsystem_c.dylib`printf + 174 frame #8: 0x0000000100000d81 a.out`do_bad_thing_with_location(index=7, char_ptr="", new_val='c') at main.cpp:34:5 frame #9: 0x0000000100000e4e a.out`access_pool(flag=true) at main.cpp:53:9 frame #10: 0x0000000100000f35 a.out`thread_func(thread_index=1) at main.cpp:80:19 frame #11: 0x00000001000027c4 a.out`decltype(__f=0x00000001004001f8, __args=0x0000000100400200)(unsigned int)>(fp)(std::__1::forward<long>(fp0))) std::__1::__invoke<void (*)(unsigned int), long>(void (*&&)(unsigned int), long&&) at type_traits:3529:1 frame #12: 0x000000010000270e a.out`void std::__1::__thread_execute<std::__1::unique_ptr<std::__1::__thread_struct, std::__1::default_delete<std::__1::__thread_struct> >, void (*)(unsigned int), long, 2ul>(__t=size=3, (null)=__tuple_indices<2> @ 0x0000700005107eb8)(unsigned int), long>&, std::__1::__tuple_indices<2ul>) at thread:273:5 frame #13: 0x0000000100001f16 a.out`void* std::__1::__thread_proxy<std::__1::tuple<std::__1::unique_ptr<std::__1::__thread_struct, std::__1::default_delete<std::__1::__thread_struct> >, void (*)(unsigned int), long> >(__vp=0x00000001004001f0) at thread:283:5 frame #14: 0x00007fff6b00633d libsystem_pthread.dylib`_pthread_body + 126 frame #15: 0x00007fff6b0092a7 libsystem_pthread.dylib`_pthread_start + 70 frame #16: 0x00007fff6b005425 libsystem_pthread.dylib`thread_start + 13 * thread #4, stop reason = watchpoint 1 * frame #0: 0x0000000100000d92 a.out`do_bad_thing_with_location(index=7, char_ptr="", new_val='c') at main.cpp:36:1 frame #1: 0x0000000100000e4e a.out`access_pool(flag=true) at main.cpp:53:9 frame #2: 0x0000000100000f35 a.out`thread_func(thread_index=2) at main.cpp:80:19 frame #3: 0x00000001000027c4 a.out`decltype(__f=0x0000000100400258, __args=0x0000000100400260)(unsigned int)>(fp)(std::__1::forward<long>(fp0))) std::__1::__invoke<void (*)(unsigned int), long>(void (*&&)(unsigned int), long&&) at type_traits:3529:1 frame #4: 0x000000010000270e a.out`void std::__1::__thread_execute<std::__1::unique_ptr<std::__1::__thread_struct, std::__1::default_delete<std::__1::__thread_struct> >, void (*)(unsigned int), long, 2ul>(__t=size=3, (null)=__tuple_indices<2> @ 0x000070000518aeb8)(unsigned int), long>&, std::__1::__tuple_indices<2ul>) at thread:273:5 frame #5: 0x0000000100001f16 a.out`void* std::__1::__thread_proxy<std::__1::tuple<std::__1::unique_ptr<std::__1::__thread_struct, std::__1::default_delete<std::__1::__thread_struct> >, void (*)(unsigned int), long> >(__vp=0x0000000100400250) at thread:283:5 frame #6: 0x00007fff6b00633d libsystem_pthread.dylib`_pthread_body + 126 frame #7: 0x00007fff6b0092a7 libsystem_pthread.dylib`_pthread_start + 70 frame #8: 0x00007fff6b005425 libsystem_pthread.dylib`thread_start + 13

Hide Details

Hide Details

<bound method SBProcess.Kill of <lldb.SBProcess; proxy of <Swig Object of type 'lldb::SBProcess *' at 0x107190b10> >>: success

Hide Details

PASS: LLDB (/Users/buildslave/jenkins/workspace/lldb-cmake/lldb-build/bin/clang-10-x86_64) :: test_watchlocation_using_watchpoint_set_dsym (TestWatchLocationWithWatchSet.WatchLocationUsingWatchpointSetTestCase) runCmd: settings set symbols.enable-external-lookup false output:

Hide Details

runCmd: settings set plugin.process.gdb-remote.packet-timeout 60 output:

Hide Details

runCmd: settings set symbols.clang-modules-cache-path "/Users/buildslave/jenkins/workspace/lldb-cmake/lldb-build/tools/lldb/lldb-test-build.noindex/module-cache-lldb/lldb-api" output:

Hide Details

runCmd: settings set use-color false output:

Hide Details

runCmd: file /Users/buildslave/jenkins/workspace/lldb-cmake/lldb-build/tools/lldb/lldb-test-build.noindex/commands/watchpoints/watchpoint_set_command/TestWatchLocationWithWatchSet.test_watchlocation_using_watchpoint_set_dwarf/a.out output: Current executable set to '/Users/buildslave/jenkins/workspace/lldb-cmake/lldb-build/tools/lldb/lldb-test-build.noindex/commands/watchpoints/watchpoint_set_command/TestWatchLocationWithWatchSet.test_watchlocation_using_watchpoint_set_dwarf/a.out' (x86_64).

Hide Details

Hide Details

runCmd: breakpoint set -l 105 output: Breakpoint 1: where = a.out`main + 391 at main.cpp:105:5, address = 0x0000000100001207

Hide Details

Hide Details

Expecting pattern: ^Breakpoint (?P<bpno>[0-9]+): (?P<num_locations>[0-9]+) locations\.$ Not matched

Hide Details

Expecting pattern: ^Breakpoint (?P<bpno>[0-9]+): (?P<num_locations>no) locations \(pending\)\. Not matched

Hide Details

Expecting pattern: ^Breakpoint (?P<bpno>[0-9]+): where = (?P<module>.*)`(?P<symbol>[+\-]{0,1}[^+]+)( \+ (?P<offset>[0-9]+)){0,1}( \[inlined\] (?P<inline_symbol>.*)){0,1} at (?P<file>[^:]+):(?P<line_no>[0-9]+)(?P<column>(:[0-9]+)?), address = (?P<address>0x[0-9a-fA-F]+)$ Matched

Hide Details

runCmd: run output: Process 58787 stopped * thread #1, queue = 'com.apple.main-thread', stop reason = breakpoint 1.1 frame #0: 0x0000000100001207 a.out`main(argc=1, argv=0x00007ffeefbff580) at main.cpp:105:5 102 int c; 103 } MyAggregateDataType; 104 -> 105 printf ("Before turning all three threads loose...\n"); // Set break point at this line. ^ 106 barrier_wait(); 107 108 // Join all of our threads

Hide Details

Process 58787 launched: '/Users/buildslave/jenkins/workspace/lldb-cmake/lldb-build/tools/lldb/lldb-test-build.noindex/commands/watchpoints/watchpoint_set_command/TestWatchLocationWithWatchSet.test_watchlocation_using_watchpoint_set_dwarf/a.out' (x86_64)

Hide Details

Hide Details

runCmd: thread list output: Process 58787 stopped * thread #1: tid = 0x1b3a01b, 0x0000000100001207 a.out`main(argc=1, argv=0x00007ffeefbff580) at main.cpp:105:5, queue = 'com.apple.main-thread', stop reason = breakpoint 1.1 thread #2: tid = 0x1b3a19c, 0x00007fff6af50aa6 libsystem_kernel.dylib`__write_nocancel + 10 thread #3: tid = 0x1b3a19d, 0x00007fff6af4f872 libsystem_kernel.dylib`__psynch_mutexwait + 10 thread #4: tid = 0x1b3a19e, 0x00007fff6af4f872 libsystem_kernel.dylib`__psynch_mutexwait + 10

Hide Details

Hide Details

Expecting sub string: stopped Matched

Hide Details

Expecting sub string: stop reason = breakpoint Matched

Hide Details

runCmd: watchpoint set expression -w write -s 1 -- g_char_ptr + 7 output: Watchpoint created: Watchpoint 1: addr = 0x100400087 size = 1 state = enabled type = w new value: 0x0000000000000000

Hide Details

Hide Details

Expecting sub string: Watchpoint created Matched

Hide Details

Expecting sub string: size = 1 Matched

Hide Details

Expecting sub string: type = w Matched

Hide Details

runCmd: expr unsigned val = g_char_ptr[7]; val output: (unsigned int) $1 = 0

Hide Details

Hide Details

looking at: (unsigned int) $1 = 0

Hide Details

Expecting end string: = 0 Matched

Hide Details

runCmd: watchpoint list -v output: Number of supported hardware watchpoints: 4 Current watchpoints: Watchpoint 1: addr = 0x100400087 size = 1 state = enabled type = w new value: 0x0000000000000000 hw_index = -1 hit_count = 0 ignore_count = 0

Hide Details

Hide Details

Expecting sub string: hit_count = 0 Matched

Hide Details

runCmd: process continue output: Process 58787 resuming Process 58787 stopped * thread #2, stop reason = watchpoint 1 frame #0: 0x0000000100000d92 a.out`do_bad_thing_with_location(index=7, char_ptr="", new_val='c') at main.cpp:36:1 33 unsigned what = new_val; 34 printf("new value written to array(%p) and index(%u) = %u\n", char_ptr, index, what); 35 char_ptr[index] = new_val; -> 36 } ^ 37 38 uint32_t 39 access_pool (bool flag = false) thread #3, stop reason = watchpoint 1 frame #0: 0x0000000100000d92 a.out`do_bad_thing_with_location(index=7, char_ptr="", new_val='c') at main.cpp:36:1 33 unsigned what = new_val; 34 printf("new value written to array(%p) and index(%u) = %u\n", char_ptr, index, what); 35 char_ptr[index] = new_val; -> 36 } ^ 37 38 uint32_t 39 access_pool (bool flag = false)

Hide Details

Hide Details

Hide Details

runCmd: thread list output: Process 58787 stopped thread #1: tid = 0x1b3a01b, 0x00007fff6af4f36a libsystem_kernel.dylib`__ulock_wait + 10, queue = 'com.apple.main-thread' * thread #2: tid = 0x1b3a19c, 0x0000000100000d92 a.out`do_bad_thing_with_location(index=7, char_ptr="", new_val='c') at main.cpp:36:1, stop reason = watchpoint 1 thread #3: tid = 0x1b3a19d, 0x0000000100000d92 a.out`do_bad_thing_with_location(index=7, char_ptr="", new_val='c') at main.cpp:36:1, stop reason = watchpoint 1 thread #4: tid = 0x1b3a19e, 0x00007fff6af50aa6 libsystem_kernel.dylib`__write_nocancel + 10

Hide Details

Hide Details

Expecting sub string: stopped Matched

Hide Details

Expecting sub string: stop reason = watchpoint Matched

Hide Details

Expecting sub string: do_bad_thing_with_location Matched

Hide Details

runCmd: thread list output: Process 58787 stopped thread #1: tid = 0x1b3a01b, 0x00007fff6af4f36a libsystem_kernel.dylib`__ulock_wait + 10, queue = 'com.apple.main-thread' * thread #2: tid = 0x1b3a19c, 0x0000000100000d92 a.out`do_bad_thing_with_location(index=7, char_ptr="", new_val='c') at main.cpp:36:1, stop reason = watchpoint 1 thread #3: tid = 0x1b3a19d, 0x0000000100000d92 a.out`do_bad_thing_with_location(index=7, char_ptr="", new_val='c') at main.cpp:36:1, stop reason = watchpoint 1 thread #4: tid = 0x1b3a19e, 0x00007fff6af50aa6 libsystem_kernel.dylib`__write_nocancel + 10

Hide Details

Hide Details

runCmd: thread select 2 output:

Hide Details

runCmd: thread select 3 output:

Hide Details

runCmd: thread backtrace output: * thread #3, stop reason = watchpoint 1 * frame #0: 0x0000000100000d92 a.out`do_bad_thing_with_location(index=7, char_ptr="", new_val='c') at main.cpp:36:1 frame #1: 0x0000000100000e4e a.out`access_pool(flag=true) at main.cpp:53:9 frame #2: 0x0000000100000f35 a.out`thread_func(thread_index=1) at main.cpp:80:19 frame #3: 0x00000001000027c4 a.out`decltype(__f=0x00000001004001f8, __args=0x0000000100400200)(unsigned int)>(fp)(std::__1::forward<long>(fp0))) std::__1::__invoke<void (*)(unsigned int), long>(void (*&&)(unsigned int), long&&) at type_traits:3529:1 frame #4: 0x000000010000270e a.out`void std::__1::__thread_execute<std::__1::unique_ptr<std::__1::__thread_struct, std::__1::default_delete<std::__1::__thread_struct> >, void (*)(unsigned int), long, 2ul>(__t=size=3, (null)=__tuple_indices<2> @ 0x0000700002675eb8)(unsigned int), long>&, std::__1::__tuple_indices<2ul>) at thread:273:5 frame #5: 0x0000000100001f16 a.out`void* std::__1::__thread_proxy<std::__1::tuple<std::__1::unique_ptr<std::__1::__thread_struct, std::__1::default_delete<std::__1::__thread_struct> >, void (*)(unsigned int), long> >(__vp=0x00000001004001f0) at thread:283:5 frame #6: 0x00007fff6b00633d libsystem_pthread.dylib`_pthread_body + 126 frame #7: 0x00007fff6b0092a7 libsystem_pthread.dylib`_pthread_start + 70 frame #8: 0x00007fff6b005425 libsystem_pthread.dylib`thread_start + 13

Hide Details

Hide Details

runCmd: expr unsigned val = g_char_ptr[7]; val output: (unsigned int) $2 = 99

Hide Details

Hide Details

looking at: (unsigned int) $2 = 99

Hide Details

Expecting end string: = 99 Matched

Hide Details

runCmd: watchpoint list -v output: Number of supported hardware watchpoints: 4 Current watchpoints: Watchpoint 1: addr = 0x100400087 size = 1 state = enabled type = w old value: 0x0000000000000063 new value: 0x0000000000000063 hw_index = 0 hit_count = 2 ignore_count = 0

Hide Details

Hide Details

Expecting sub string: hit_count = 2 Matched

Hide Details

runCmd: thread backtrace all output: thread #1, queue = 'com.apple.main-thread' frame #0: 0x00007fff6af4f36a libsystem_kernel.dylib`__ulock_wait + 10 frame #1: 0x00007fff6b00a70b libsystem_pthread.dylib`_pthread_join + 356 frame #2: 0x00007fff68534978 libc++.1.dylib`std::__1::thread::join() + 24 frame #3: 0x000000010000127f a.out`main(argc=1, argv=0x00007ffeefbff580) at main.cpp:110:16 frame #4: 0x00007fff6ae14085 libdyld.dylib`start + 1 thread #2, stop reason = watchpoint 1 frame #0: 0x0000000100000d92 a.out`do_bad_thing_with_location(index=7, char_ptr="", new_val='c') at main.cpp:36:1 frame #1: 0x0000000100000e4e a.out`access_pool(flag=true) at main.cpp:53:9 frame #2: 0x0000000100000f35 a.out`thread_func(thread_index=0) at main.cpp:80:19 frame #3: 0x00000001000027c4 a.out`decltype(__f=0x00000001004001a8, __args=0x00000001004001b0)(unsigned int)>(fp)(std::__1::forward<long>(fp0))) std::__1::__invoke<void (*)(unsigned int), long>(void (*&&)(unsigned int), long&&) at type_traits:3529:1 frame #4: 0x000000010000270e a.out`void std::__1::__thread_execute<std::__1::unique_ptr<std::__1::__thread_struct, std::__1::default_delete<std::__1::__thread_struct> >, void (*)(unsigned int), long, 2ul>(__t=size=3, (null)=__tuple_indices<2> @ 0x00007000025f2eb8)(unsigned int), long>&, std::__1::__tuple_indices<2ul>) at thread:273:5 frame #5: 0x0000000100001f16 a.out`void* std::__1::__thread_proxy<std::__1::tuple<std::__1::unique_ptr<std::__1::__thread_struct, std::__1::default_delete<std::__1::__thread_struct> >, void (*)(unsigned int), long> >(__vp=0x00000001004001a0) at thread:283:5 frame #6: 0x00007fff6b00633d libsystem_pthread.dylib`_pthread_body + 126 frame #7: 0x00007fff6b0092a7 libsystem_pthread.dylib`_pthread_start + 70 frame #8: 0x00007fff6b005425 libsystem_pthread.dylib`thread_start + 13 * thread #3, stop reason = watchpoint 1 * frame #0: 0x0000000100000d92 a.out`do_bad_thing_with_location(index=7, char_ptr="", new_val='c') at main.cpp:36:1 frame #1: 0x0000000100000e4e a.out`access_pool(flag=true) at main.cpp:53:9 frame #2: 0x0000000100000f35 a.out`thread_func(thread_index=1) at main.cpp:80:19 frame #3: 0x00000001000027c4 a.out`decltype(__f=0x00000001004001f8, __args=0x0000000100400200)(unsigned int)>(fp)(std::__1::forward<long>(fp0))) std::__1::__invoke<void (*)(unsigned int), long>(void (*&&)(unsigned int), long&&) at type_traits:3529:1 frame #4: 0x000000010000270e a.out`void std::__1::__thread_execute<std::__1::unique_ptr<std::__1::__thread_struct, std::__1::default_delete<std::__1::__thread_struct> >, void (*)(unsigned int), long, 2ul>(__t=size=3, (null)=__tuple_indices<2> @ 0x0000700002675eb8)(unsigned int), long>&, std::__1::__tuple_indices<2ul>) at thread:273:5 frame #5: 0x0000000100001f16 a.out`void* std::__1::__thread_proxy<std::__1::tuple<std::__1::unique_ptr<std::__1::__thread_struct, std::__1::default_delete<std::__1::__thread_struct> >, void (*)(unsigned int), long> >(__vp=0x00000001004001f0) at thread:283:5 frame #6: 0x00007fff6b00633d libsystem_pthread.dylib`_pthread_body + 126 frame #7: 0x00007fff6b0092a7 libsystem_pthread.dylib`_pthread_start + 70 frame #8: 0x00007fff6b005425 libsystem_pthread.dylib`thread_start + 13 thread #4 frame #0: 0x00007fff6af50aa6 libsystem_kernel.dylib`__write_nocancel + 10 frame #1: 0x00007fff6aea2920 libsystem_c.dylib`_swrite + 87 frame #2: 0x00007fff6ae9b4e3 libsystem_c.dylib`__sflush + 87 frame #3: 0x00007fff6ae9dc0f libsystem_c.dylib`__sfvwrite + 798 frame #4: 0x00007fff6aea7a3a libsystem_c.dylib`__vfprintf + 16604 frame #5: 0x00007fff6aecc13b libsystem_c.dylib`__v2printf + 475 frame #6: 0x00007fff6aea3882 libsystem_c.dylib`vfprintf_l + 54 frame #7: 0x00007fff6aea199a libsystem_c.dylib`printf + 174 frame #8: 0x0000000100000d81 a.out`do_bad_thing_with_location(index=7, char_ptr="", new_val='c') at main.cpp:34:5 frame #9: 0x0000000100000e4e a.out`access_pool(flag=true) at main.cpp:53:9 frame #10: 0x0000000100000f35 a.out`thread_func(thread_index=2) at main.cpp:80:19 frame #11: 0x00000001000027c4 a.out`decltype(__f=0x0000000100400258, __args=0x0000000100400260)(unsigned int)>(fp)(std::__1::forward<long>(fp0))) std::__1::__invoke<void (*)(unsigned int), long>(void (*&&)(unsigned int), long&&) at type_traits:3529:1 frame #12: 0x000000010000270e a.out`void std::__1::__thread_execute<std::__1::unique_ptr<std::__1::__thread_struct, std::__1::default_delete<std::__1::__thread_struct> >, void (*)(unsigned int), long, 2ul>(__t=size=3, (null)=__tuple_indices<2> @ 0x00007000026f8eb8)(unsigned int), long>&, std::__1::__tuple_indices<2ul>) at thread:273:5 frame #13: 0x0000000100001f16 a.out`void* std::__1::__thread_proxy<std::__1::tuple<std::__1::unique_ptr<std::__1::__thread_struct, std::__1::default_delete<std::__1::__thread_struct> >, void (*)(unsigned int), long> >(__vp=0x0000000100400250) at thread:283:5 frame #14: 0x00007fff6b00633d libsystem_pthread.dylib`_pthread_body + 126 frame #15: 0x00007fff6b0092a7 libsystem_pthread.dylib`_pthread_start + 70 frame #16: 0x00007fff6b005425 libsystem_pthread.dylib`thread_start + 13

Hide Details

Hide Details

<bound method SBProcess.Kill of <lldb.SBProcess; proxy of <Swig Object of type 'lldb::SBProcess *' at 0x1071a10f0> >>: success

Hide Details

PASS: LLDB (/Users/buildslave/jenkins/workspace/lldb-cmake/lldb-build/bin/clang-10-x86_64) :: test_watchlocation_using_watchpoint_set_dwarf (TestWatchLocationWithWatchSet.WatchLocationUsingWatchpointSetTestCase) UNSUPPORTED: LLDB (/Users/buildslave/jenkins/workspace/lldb-cmake/lldb-build/bin/clang-10-x86_64) :: test_watchlocation_using_watchpoint_set_dwo (TestWatchLocationWithWatchSet.WatchLocationUsingWatchpointSetTestCase) (test case does not fall in any category of interest for this run) runCmd: settings set symbols.enable-external-lookup false output:

Hide Details

runCmd: settings set plugin.process.gdb-remote.packet-timeout 60 output:

Hide Details

runCmd: settings set symbols.clang-modules-cache-path "/Users/buildslave/jenkins/workspace/lldb-cmake/lldb-build/tools/lldb/lldb-test-build.noindex/module-cache-lldb/lldb-api" output:

Hide Details

runCmd: settings set use-color false output:

Hide Details

runCmd: file /Users/buildslave/jenkins/workspace/lldb-cmake/lldb-build/tools/lldb/lldb-test-build.noindex/commands/watchpoints/watchpoint_set_command/TestWatchLocationWithWatchSet.test_watchlocation_using_watchpoint_set_gmodules/a.out output: Current executable set to '/Users/buildslave/jenkins/workspace/lldb-cmake/lldb-build/tools/lldb/lldb-test-build.noindex/commands/watchpoints/watchpoint_set_command/TestWatchLocationWithWatchSet.test_watchlocation_using_watchpoint_set_gmodules/a.out' (x86_64).

Hide Details

Hide Details

runCmd: breakpoint set -l 105 output: Breakpoint 1: where = a.out`main + 391 at main.cpp:105:5, address = 0x0000000100001207

Hide Details

Hide Details

Expecting pattern: ^Breakpoint (?P<bpno>[0-9]+): (?P<num_locations>[0-9]+) locations\.$ Not matched

Hide Details

Expecting pattern: ^Breakpoint (?P<bpno>[0-9]+): (?P<num_locations>no) locations \(pending\)\. Not matched

Hide Details

Expecting pattern: ^Breakpoint (?P<bpno>[0-9]+): where = (?P<module>.*)`(?P<symbol>[+\-]{0,1}[^+]+)( \+ (?P<offset>[0-9]+)){0,1}( \[inlined\] (?P<inline_symbol>.*)){0,1} at (?P<file>[^:]+):(?P<line_no>[0-9]+)(?P<column>(:[0-9]+)?), address = (?P<address>0x[0-9a-fA-F]+)$ Matched

Hide Details

runCmd: run output: Process 63861 stopped * thread #1, queue = 'com.apple.main-thread', stop reason = breakpoint 1.1 frame #0: 0x0000000100001207 a.out`main(argc=1, argv=0x00007ffeefbff578) at main.cpp:105:5 102 int c; 103 } MyAggregateDataType; 104 -> 105 printf ("Before turning all three threads loose...\n"); // Set break point at this line. ^ 106 barrier_wait(); 107 108 // Join all of our threads

Hide Details

Process 63861 launched: '/Users/buildslave/jenkins/workspace/lldb-cmake/lldb-build/tools/lldb/lldb-test-build.noindex/commands/watchpoints/watchpoint_set_command/TestWatchLocationWithWatchSet.test_watchlocation_using_watchpoint_set_gmodules/a.out' (x86_64)

Hide Details

Hide Details

runCmd: thread list output: Process 63861 stopped * thread #1: tid = 0x1b3c3bb, 0x0000000100001207 a.out`main(argc=1, argv=0x00007ffeefbff578) at main.cpp:105:5, queue = 'com.apple.main-thread', stop reason = breakpoint 1.1 thread #2: tid = 0x1b3c5c0, 0x00007fff6af4f872 libsystem_kernel.dylib`__psynch_mutexwait + 10 thread #3: tid = 0x1b3c5c1, 0x00007fff6ae930ff libsystem_c.dylib`localeconv_l + 89 thread #4: tid = 0x1b3c5c2, 0x00007fff6af4f872 libsystem_kernel.dylib`__psynch_mutexwait + 10

Hide Details

Hide Details

Expecting sub string: stopped Matched

Hide Details

Expecting sub string: stop reason = breakpoint Matched

Hide Details

runCmd: watchpoint set expression -w write -s 1 -- g_char_ptr + 7 runCmd failed! error: expression evaluation of address to watch failed expression evaluated: g_char_ptr + 7

Hide Details

Hide Details

FAIL: LLDB (/Users/buildslave/jenkins/workspace/lldb-cmake/lldb-build/bin/clang-10-x86_64) :: test_watchlocation_using_watchpoint_set_gmodules (TestWatchLocationWithWatchSet.WatchLocationUsingWatchpointSetTestCase) <bound method SBProcess.Kill of <lldb.SBProcess; proxy of <Swig Object of type 'lldb::SBProcess *' at 0x10de868d0> >>: success

Hide Details

Restore dir to: /Users/buildslave/jenkins/workspace/lldb-cmake/lldb-build/tools/lldb/test ====================================================================== FAIL: test_watchlocation_using_watchpoint_set_gmodules (TestWatchLocationWithWatchSet.WatchLocationUsingWatchpointSetTestCase) Test watching a location with 'watchpoint set expression -w write -s size' option. ---------------------------------------------------------------------- Traceback (most recent call last): File "/Users/buildslave/jenkins/workspace/lldb-cmake/llvm-project/lldb/packages/Python/lldbsuite/test/lldbtest.py", line 1748, in test_method return attrvalue(self) File "/Users/buildslave/jenkins/workspace/lldb-cmake/llvm-project/lldb/packages/Python/lldbsuite/test/decorators.py", line 111, in wrapper func(*args, **kwargs) File "/Users/buildslave/jenkins/workspace/lldb-cmake/llvm-project/lldb/packages/Python/lldbsuite/test/decorators.py", line 111, in wrapper func(*args, **kwargs) File "/Users/buildslave/jenkins/workspace/lldb-cmake/llvm-project/lldb/packages/Python/lldbsuite/test/commands/watchpoints/watchpoint_set_command/TestWatchLocationWithWatchSet.py", line 69, in test_watchlocation_using_watchpoint_set 'type = w']) File "/Users/buildslave/jenkins/workspace/lldb-cmake/llvm-project/lldb/packages/Python/lldbsuite/test/lldbtest.py", line 2309, in expect inHistory=inHistory) File "/Users/buildslave/jenkins/workspace/lldb-cmake/llvm-project/lldb/packages/Python/lldbsuite/test/lldbtest.py", line 2068, in runCmd msg if (msg) else CMD_MSG(cmd)) AssertionError: False is not True : Watchpoint created successfully Error output: error: expression evaluation of address to watch failed expression evaluated: g_char_ptr + 7

Hide Details

Config=x86_64-/Users/buildslave/jenkins/workspace/lldb-cmake/lldb-build/bin/clang-10 ---------------------------------------------------------------------- Ran 4 tests in 52.042s

Hide Details

RESULT: FAILED (2 passes, 1 failures, 0 errors, 1 skipped, 0 expected failures, 0 unexpected successes)

Hide Details

******************** PASS: lldb-unit :: ScriptInterpreter/Python/./ScriptInterpreterPythonTests/PythonDataObjectsTest.TestPythonCallableCheck (729 of 1796) PASS: lldb-api :: commands/expression/import-std-module/forward_list-dbg-info-content/TestDbgInfoContentForwardList.py (730 of 1796) PASS: lldb-unit :: Process/minidump/./LLDBMinidumpTests/MinidumpParserTest.InvalidMinidump (731 of 1796) PASS: lldb-unit :: Utility/./UtilityTests/ConstStringTest.CompareStringRef (732 of 1796) PASS: lldb-unit :: Host/./HostTests/FileSystemTest.Readable (733 of 1796) PASS: lldb-api :: python_api/file_handle/TestFileHandle.py (734 of 1796) PASS: lldb-unit :: Process/gdb-remote/./ProcessGdbRemoteTests/GDBRemoteClientBaseTest.InterruptNoResponse (735 of 1796) PASS: lldb-unit :: Utility/./UtilityTests/UserIDResolver.GetGroupName (736 of 1796) PASS: lldb-unit :: Utility/./UtilityTests/BinaryStreamTest.PutSLEB128EightBytes (737 of 1796) PASS: lldb-unit :: SymbolFile/NativePDB/./SymbolFileNativePDBTests/PDBFPOProgramToDWARFExpressionTests.MultipleIndependentAssignments (738 of 1796) PASS: lldb-unit :: Process/gdb-remote/./ProcessGdbRemoteTests/GDBRemoteClientBaseTest.SendContinueAndAsyncSignal (739 of 1796) PASS: lldb-api :: lang/cpp/template/TestTemplateArgs.py (740 of 1796) PASS: lldb-api :: functionalities/deleted-executable/TestDeletedExecutable.py (741 of 1796) PASS: lldb-api :: functionalities/data-formatter/nssetsynth/TestNSSetSynthetic.py (742 of 1796) PASS: lldb-unit :: ObjectFile/PECOFF/./ObjectFilePECOFFTests/PECallFrameInfoTest.Frame_reg_eh (743 of 1796) PASS: lldb-shell :: SymbolFile/DWARF/dir-separator-no-comp-dir-relative-name.s (744 of 1796) PASS: lldb-unit :: Host/./HostTests/NativeProcessProtocolTest.ReadCStringFromMemory_CrossPageBoundary (745 of 1796) PASS: lldb-unit :: Utility/./UtilityTests/CompletionRequest.DuplicateFilteringWithComments (746 of 1796) UNSUPPORTED: lldb-shell :: Register/x86-ymm-read.test (747 of 1796) PASS: lldb-api :: functionalities/tail_call_frames/thread_step_out_or_return/TestSteppingOutWithArtificialFrames.py (748 of 1796) PASS: lldb-api :: lang/cpp/stl/TestStdCXXDisassembly.py (749 of 1796) PASS: lldb-shell :: ObjectFile/ELF/compressed-sections.yaml (750 of 1796) PASS: lldb-unit :: Host/./HostTests/MainLoopTest.ReadObject (751 of 1796) PASS: lldb-unit :: Target/./TargetTests/PathMappingListTest.AbsoluteTests (752 of 1796) PASS: lldb-api :: functionalities/data-formatter/stringprinter/TestStringPrinter.py (753 of 1796) UNSUPPORTED: lldb-api :: functionalities/thread/thread_specific_break_plus_condition/TestThreadSpecificBpPlusCondition.py (754 of 1796) PASS: lldb-api :: functionalities/var_path/TestVarPath.py (755 of 1796) PASS: lldb-api :: commands/expression/unicode-in-variable/TestUnicodeInVariable.py (756 of 1796) PASS: lldb-api :: types/TestRecursiveTypes.py (757 of 1796) PASS: lldb-shell :: SymbolFile/Breakpad/stack-cfi-parsing.test (758 of 1796) PASS: lldb-api :: functionalities/plugins/python_os_plugin/TestPythonOSPlugin.py (759 of 1796) PASS: lldb-api :: functionalities/unwind/noreturn/module-end/TestNoReturnModuleEnd.py (760 of 1796) UNSUPPORTED: lldb-api :: commands/expression/completion-crash-incomplete-record/TestCompletionCrashIncompleteRecord.py (761 of 1796) PASS: lldb-unit :: Utility/./UtilityTests/StringListTest.GetMaxStringLengthDecreasingSize (762 of 1796) PASS: lldb-api :: lang/cpp/wchar_t/TestCxxWCharT.py (763 of 1796) PASS: lldb-api :: lang/cpp/std-function-step-into-callable/TestStdFunctionStepIntoCallable.py (764 of 1796) PASS: lldb-api :: commands/expression/call-function/TestCallBuiltinFunction.py (765 of 1796) PASS: lldb-unit :: Utility/./UtilityTests/RangeDataVector.FindEntryThatContains (766 of 1796) PASS: lldb-unit :: Target/./TargetTests/ExecutionContextTest.GetByteOrderTarget (767 of 1796) PASS: lldb-unit :: Utility/./UtilityTests/StreamTeeTest.AppendStream (768 of 1796) PASS: lldb-api :: python_api/module_section/TestModuleAndSection.py (769 of 1796) PASS: lldb-shell :: ObjectFile/ELF/PT_TLS-overlap-PT_LOAD.yaml (770 of 1796) PASS: lldb-unit :: Utility/./UtilityTests/StreamTest.ShiftOperatorPtr (771 of 1796) PASS: lldb-unit :: Utility/./UtilityTests/StringExtractorTest.GetHexBytes (772 of 1796) PASS: lldb-unit :: Interpreter/./InterpreterTests/CompletionTest.FileCompletionAbsolute (773 of 1796) UNSUPPORTED: lldb-shell :: SymbolFile/PDB/class-layout.test (774 of 1796) PASS: lldb-api :: commands/platform/process/TestProcessList.py (775 of 1796) PASS: lldb-api :: functionalities/breakpoint/debugbreak/TestDebugBreak.py (776 of 1796) PASS: lldb-unit :: UnwindAssembly/x86/./UnwindAssemblyx86Tests/Testx86AssemblyInspectionEngine.TestPush0 (777 of 1796) PASS: lldb-unit :: ScriptInterpreter/Python/./ScriptInterpreterPythonTests/PythonDataObjectsTest.TestPythonString (778 of 1796) PASS: lldb-unit :: Utility/./UtilityTests/ArchSpecTest.MergeFromMachOUnknown (779 of 1796) PASS: lldb-api :: functionalities/param_entry_vals/basic_entry_values_x86_64/TestBasicEntryValuesX86_64.py (780 of 1796) PASS: lldb-unit :: Process/gdb-remote/./ProcessGdbRemoteTests/GDBRemoteCommunicationClientTest.GetMemoryRegionInfo (781 of 1796) PASS: lldb-api :: functionalities/gdb_remote_client/TestWriteMemory.py (782 of 1796) PASS: lldb-unit :: Utility/./UtilityTests/TimerTest.CategoryTimesNested (783 of 1796) PASS: lldb-unit :: Utility/./UtilityTests/RegisterValueTest.GetSet8 (784 of 1796) PASS: lldb-api :: lang/c/const_variables/TestConstVariables.py (785 of 1796) PASS: lldb-api :: functionalities/thread/concurrent_events/TestConcurrentTwoWatchpointsOneDelayBreakpoint.py (786 of 1796) PASS: lldb-unit :: Target/./TargetTests/ModuleCacheTest.GetAndPutUuidExists (787 of 1796) PASS: lldb-unit :: ScriptInterpreter/Python/./ScriptInterpreterPythonTests/PythonDataObjectsTest.TestPythonBoolean (788 of 1796) PASS: lldb-api :: functionalities/tail_call_frames/inlining_and_tail_calls/TestInliningAndTailCalls.py (789 of 1796) PASS: lldb-api :: commands/expression/import-std-module/vector-basic/TestBasicVector.py (790 of 1796) PASS: lldb-unit :: Utility/./UtilityTests/BinaryStreamTest.PutSLEB128MaxValue (791 of 1796) PASS: lldb-api :: sample_test/TestSampleInlineTest.py (792 of 1796) PASS: lldb-unit :: Utility/./UtilityTests/RecordReplayTest.InstrumentedBarRef (793 of 1796) PASS: lldb-api :: lang/objc/objc-ivar-protocols/TestIvarProtocols.py (794 of 1796) PASS: lldb-api :: api/check_public_api_headers/TestPublicAPIHeaders.py (795 of 1796) PASS: lldb-unit :: Utility/./UtilityTests/StringExtractorTest.GetHexU8_Exact (796 of 1796) PASS: lldb-api :: lang/mixed/TestMixedLanguages.py (797 of 1796) PASS: lldb-api :: lang/c/function_types/TestFunctionTypes.py (798 of 1796) PASS: lldb-api :: commands/log/invalid-args/TestInvalidArgsLog.py (799 of 1796) PASS: lldb-shell :: Python/crashlog.test (800 of 1796) UNSUPPORTED: lldb-api :: arm/breakpoint-thumb-codesection/TestBreakpointThumbCodesection.py (801 of 1796) PASS: lldb-api :: functionalities/thread/jump/TestThreadJump.py (802 of 1796) PASS: lldb-unit :: UnwindAssembly/x86/./UnwindAssemblyx86Tests/Testx86AssemblyInspectionEngine.TestSimplei386ugmented (803 of 1796) PASS: lldb-api :: python_api/thread/TestThreadAPI.py (804 of 1796) PASS: lldb-api :: functionalities/thread/step_out/TestThreadStepOut.py (805 of 1796) PASS: lldb-unit :: Utility/./UtilityTests/ArgsTest.StringListConstructor (806 of 1796) PASS: lldb-api :: functionalities/thread/concurrent_events/TestConcurrentCrashWithWatchpoint.py (807 of 1796) PASS: lldb-unit :: Symbol/./SymbolTests/Type.GetTypeScopeAndBasename (808 of 1796) PASS: lldb-unit :: UnwindAssembly/x86/./UnwindAssemblyx86Tests/Testx86AssemblyInspectionEngine.Testi386IgnoredRegisters (809 of 1796) PASS: lldb-api :: lang/cpp/static_methods/TestCPPStaticMethods.py (810 of 1796) UNSUPPORTED: lldb-shell :: SymbolFile/NativePDB/typedefs.cpp (811 of 1796) PASS: lldb-unit :: Utility/./UtilityTests/OptionsWithRawTest.SingleWhitespaceInput (812 of 1796) PASS: lldb-shell :: ObjectFile/ELF/PT_LOAD-empty.yaml (813 of 1796) PASS: lldb-unit :: Utility/./UtilityTests/FileSpecTest.GetNormalizedPath (814 of 1796) PASS: lldb-api :: commands/process/attach-resume/TestAttachResume.py (815 of 1796) PASS: lldb-unit :: Symbol/./SymbolTests/TestClangASTContext.TestConvertAccessTypeToAccessSpecifier (816 of 1796) PASS: lldb-api :: python_api/breakpoint/TestBreakpointAPI.py (817 of 1796) PASS: lldb-api :: functionalities/stats_api/TestStatisticsAPI.py (818 of 1796) UNSUPPORTED: lldb-api :: functionalities/data-formatter/data-formatter-stl/libcxx/function/TestLibCxxFunction.py (819 of 1796) UNSUPPORTED: lldb-shell :: SymbolFile/PDB/variables.test (820 of 1796) PASS: lldb-unit :: Host/./HostTests/NativeProcessProtocolTest.SetBreakpointFailVerify (821 of 1796) PASS: lldb-api :: functionalities/memory/find/TestMemoryFind.py (822 of 1796) PASS: lldb-unit :: UnwindAssembly/x86/./UnwindAssemblyx86Tests/Testx86AssemblyInspectionEngine.TestPushR12 (823 of 1796) PASS: lldb-api :: lang/cpp/namespace_definitions/TestNamespaceDefinitions.py (824 of 1796) PASS: lldb-api :: lang/c/shared_lib/TestSharedLib.py (825 of 1796) PASS: lldb-unit :: Utility/./UtilityTests/VMRange.IsValid (826 of 1796) UNSUPPORTED: lldb-api :: commands/register/register/intel_xtended_registers/TestMPXRegisters.py (827 of 1796) PASS: lldb-shell :: SymbolFile/NativePDB/global-classes.cpp (828 of 1796) PASS: lldb-api :: types/TestDoubleTypesExpr.py (829 of 1796) PASS: lldb-api :: commands/expression/multiline-completion/TestMultilineCompletion.py (830 of 1796) PASS: lldb-unit :: SymbolFile/NativePDB/./SymbolFileNativePDBTests/PDBFPOProgramToDWARFExpressionTests.SingleAssignmentRegisterRef (831 of 1796) PASS: lldb-unit :: Utility/./UtilityTests/BinaryStreamTest.PutULEB128NineBytes (832 of 1796) PASS: lldb-shell :: SymbolFile/DWARF/forward-declarations.s (833 of 1796) PASS: lldb-unit :: Host/./HostTests/SocketTest.UDPGetConnectURI (834 of 1796) PASS: lldb-shell :: SymbolFile/NativePDB/disassembly.cpp (835 of 1796) PASS: lldb-unit :: Utility/./UtilityTests/StringExtractorTest.GetHexU8_Extra (836 of 1796) PASS: lldb-unit :: Utility/./UtilityTests/StringListTest.JoinThree (837 of 1796) PASS: lldb-unit :: Process/minidump/./LLDBMinidumpTests/RegisterContextMinidump.ConvertMinidumpContext_x86_64 (838 of 1796) PASS: lldb-unit :: Utility/./UtilityTests/StringListTest.LongestCommonPrefixEmpty (839 of 1796) PASS: lldb-api :: lang/objc/objc-new-syntax/TestObjCNewSyntaxDictionary.py (840 of 1796) PASS: lldb-api :: lang/cpp/function_refs/TestFunctionRefs.py (841 of 1796) PASS: lldb-unit :: ScriptInterpreter/Python/./ScriptInterpreterPythonTests/PythonDataObjectsTest.TestPythonTupleSize (842 of 1796) PASS: lldb-api :: lang/cpp/virtual/TestVirtual.py (843 of 1796) PASS: lldb-unit :: Utility/./UtilityTests/StringExtractorTest.GetHexBytes_OddPair2 (844 of 1796) PASS: lldb-unit :: Utility/./UtilityTests/ScalarTest.APIntConstructor (845 of 1796) PASS: lldb-api :: lang/objc/variadic_methods/TestVariadicMethods.py (846 of 1796) PASS: lldb-unit :: Language/Highlighting/./HighlighterTests/HighlighterTest.HighlighterSelectionPath (847 of 1796) PASS: lldb-shell :: Breakpoint/jitbp_elf.test (848 of 1796) PASS: lldb-unit :: Utility/./UtilityTests/CompletionRequest.ShiftArguments (849 of 1796) PASS: lldb-unit :: Utility/./UtilityTests/OptionsWithRawTest.SingleWordSuffix (850 of 1796) XFAIL: lldb-shell :: Register/x86-64-write.test (851 of 1796) PASS: lldb-unit :: Utility/./UtilityTests/BinaryStreamTest.PutSLEB128ThreeBytes (852 of 1796) PASS: lldb-api :: functionalities/memory/read/TestMemoryRead.py (853 of 1796) PASS: lldb-shell :: SymbolFile/DWARF/find-method.cpp (854 of 1796) UNSUPPORTED: lldb-api :: functionalities/signal/handle-segv/TestHandleSegv.py (855 of 1796) PASS: lldb-api :: functionalities/inferior-changed/TestInferiorChanged.py (856 of 1796) PASS: lldb-unit :: Utility/./UtilityTests/BinaryStreamTest.PutSLEB128SixBytes (857 of 1796) PASS: lldb-api :: functionalities/data-formatter/data-formatter-cpp/TestDataFormatterCpp.py (858 of 1796) UNSUPPORTED: lldb-shell :: BuildScript/toolchain-clang-cl.test (859 of 1796) PASS: lldb-unit :: Utility/./UtilityTests/VMRange.ContainsAddr (860 of 1796) PASS: lldb-unit :: Utility/./UtilityTests/GeneratorTest.GetOrCreate (861 of 1796) PASS: lldb-api :: functionalities/data-formatter/data-formatter-stl/libcxx/forward_list/TestDataFormatterLibcxxForwardList.py (862 of 1796) PASS: lldb-api :: macosx/add-dsym/TestAddDsymMidExecutionCommand.py (863 of 1796) PASS: lldb-api :: functionalities/modern-type-lookup/objc-modules/TestObjModulesModernTypeLookup.py (864 of 1796) PASS: lldb-api :: macosx/version_zero/TestGetVersionZeroVersion.py (865 of 1796) PASS: lldb-unit :: Utility/./UtilityTests/DeserializerTest.HasData (866 of 1796) PASS: lldb-unit :: ScriptInterpreter/Python/./ScriptInterpreterPythonTests/PythonDataObjectsTest.TestGlobalNameResolutionWithDot (867 of 1796) PASS: lldb-unit :: Process/gdb-remote/./ProcessGdbRemoteTests/GDBRemoteCommunicationClientTest.GetModulesInfoInvalidResponse (868 of 1796) PASS: lldb-api :: python_api/class_members/TestSBTypeClassMembers.py (869 of 1796) PASS: lldb-api :: lang/cpp/unique-types/TestUniqueTypes.py (870 of 1796) PASS: lldb-api :: commands/watchpoints/multiple_hits/TestMultipleHits.py (871 of 1796) PASS: lldb-unit :: Utility/./UtilityTests/ScalarTest.SetValueFromCString (872 of 1796) PASS: lldb-unit :: UnwindAssembly/x86/./UnwindAssemblyx86Tests/Testx86AssemblyInspectionEngine.Test64bitFramelessBigStackFrame (873 of 1796) PASS: lldb-unit :: Language/CPlusPlus/./LanguageCPlusPlusTests/CPlusPlusLanguage.ExtractContextAndIdentifier (874 of 1796) UNSUPPORTED: lldb-api :: functionalities/darwin_log/format/TestDarwinLogMessageFormat.py (875 of 1796) PASS: lldb-unit :: Symbol/./SymbolTests/SymbolsTest.LocateExecutableSymbolFileForUnknownExecutableAndMissingSymbolFile (876 of 1796) PASS: lldb-api :: commands/expression/save_jit_objects/TestSaveJITObjects.py (877 of 1796) PASS: lldb-unit :: Utility/./UtilityTests/Predicate.WaitForValueNotEqualTo (878 of 1796) PASS: lldb-api :: functionalities/breakpoint/cpp/TestCPPBreakpointLocations.py (879 of 1796) PASS: lldb-unit :: UnwindAssembly/x86/./UnwindAssemblyx86Tests/Testx86AssemblyInspectionEngine.TestPopEDI (880 of 1796) PASS: lldb-api :: functionalities/avoids-fd-leak/TestFdLeak.py (881 of 1796) PASS: lldb-api :: commands/expression/formatters/TestFormatters.py (882 of 1796) PASS: lldb-unit :: Host/./HostTests/ConnectionFileDescriptorTest.TCPGetURIv6 (883 of 1796) UNSUPPORTED: lldb-shell :: Unwind/unwind-plan-dwarf-dump.test (884 of 1796) PASS: lldb-unit :: Symbol/./SymbolTests/LineEntryTest.GetSameLineContiguousAddressRangeNoInlines (885 of 1796) PASS: lldb-unit :: UnwindAssembly/x86/./UnwindAssemblyx86Tests/Testx86AssemblyInspectionEngine.TestSpillRegToStackViaMOVi386 (886 of 1796) PASS: lldb-shell :: Driver/TestSingleQuote.test (887 of 1796) UNSUPPORTED: lldb-shell :: Register/x86-gp-read.test (888 of 1796) UNSUPPORTED: lldb-shell :: SymbolFile/PDB/pointers.test (889 of 1796) PASS: lldb-api :: commands/frame/diagnose/complicated-expression/TestComplicatedExpression.py (890 of 1796) PASS: lldb-shell :: Quit/TestQuitExitCodeNonInt.test (891 of 1796) PASS: lldb-api :: lang/c/vla/TestVLA.py (892 of 1796) PASS: lldb-shell :: SymbolFile/DWARF/debug_ranges.s (893 of 1796) PASS: lldb-unit :: Utility/./UtilityTests/RangeTest.ContainsEndInclusive (894 of 1796) PASS: lldb-api :: commands/expression/rdar44436068/Test128BitsInteger.py (895 of 1796) PASS: lldb-unit :: Host/./HostTests/Host.WaitStatusFormat (896 of 1796) PASS: lldb-unit :: Utility/./UtilityTests/AnsiTerminal.AtStart (897 of 1796) PASS: lldb-api :: functionalities/thread/concurrent_events/TestConcurrentSignalNWatchNBreak.py (898 of 1796) PASS: lldb-unit :: UnwindAssembly/x86/./UnwindAssemblyx86Tests/Testx86AssemblyInspectionEngine.TestAddESP (899 of 1796) PASS: lldb-unit :: Expression/./ExpressionTests/CppModuleConfigurationTest.AmbiguousLibCpp (900 of 1796) PASS: lldb-shell :: Driver/TestNoUseColor.test (901 of 1796) PASS: lldb-unit :: Host/./HostTests/FileSystemTest.FileAndDirectoryComponents (902 of 1796) UNSUPPORTED: lldb-shell :: Register/arm-gp-read.test (903 of 1796) PASS: lldb-api :: commands/expression/unwind_expression/TestUnwindExpression.py (904 of 1796) PASS: lldb-api :: commands/expression/calculator_mode/TestCalculatorMode.py (905 of 1796) UNSUPPORTED: lldb-shell :: Expr/TestIRMemoryMapWindows.test (906 of 1796) PASS: lldb-api :: commands/expression/pr35310/TestExprsBug35310.py (907 of 1796) PASS: lldb-api :: lang/cpp/unsigned_types/TestUnsignedTypes.py (908 of 1796) PASS: lldb-unit :: Language/Highlighting/./HighlighterTests/HighlighterTest.ClangCursorPosAfterOtherToken (909 of 1796) UNSUPPORTED: lldb-api :: python_api/event/TestEvents.py (910 of 1796) PASS: lldb-api :: functionalities/set-data/TestSetData.py (911 of 1796) PASS: lldb-api :: functionalities/pre_run_dylibs/TestPreRunDylibs.py (912 of 1796) PASS: lldb-unit :: Process/minidump/./LLDBMinidumpTests/MinidumpParserTest.GetMemoryRegionInfoLinuxMaps (913 of 1796) PASS: lldb-unit :: Language/Highlighting/./HighlighterTests/HighlighterTest.ClangCursorPosEndOfLine (914 of 1796) PASS: lldb-api :: lang/cpp/class-template-parameter-pack/TestClassTemplateParameterPack.py (915 of 1796) PASS: lldb-api :: lang/c/set_values/TestSetValues.py (916 of 1796) PASS: lldb-unit :: Utility/./UtilityTests/BinaryStreamTest.PutULEB128SixBytes (917 of 1796) PASS: lldb-unit :: ScriptInterpreter/Python/./ScriptInterpreterPythonTests/PythonDataObjectsTest.TestPythonListManipulation (918 of 1796) PASS: lldb-unit :: Utility/./UtilityTests/RangeTest.NotEqual (919 of 1796) PASS: lldb-api :: lang/objc/objc-dyn-sbtype/TestObjCDynamicSBType.py (920 of 1796) PASS: lldb-api :: python_api/type/TestTypeList.py (921 of 1796) UNSUPPORTED: lldb-shell :: SymbolFile/PDB/enums-layout.test (922 of 1796) PASS: lldb-api :: functionalities/data-formatter/data-formatter-stl/libstdcpp/unique_ptr/invalid/TestDataFormatterInvalidStdUniquePtr.py (923 of 1796) PASS: lldb-unit :: Utility/./UtilityTests/ArchSpecTest.OperatorBool (924 of 1796) PASS: lldb-shell :: SymbolFile/NativePDB/source-list.cpp (925 of 1796) PASS: lldb-unit :: Process/minidump/./LLDBMinidumpTests/MinidumpParserTest.GetArchitectureWindows (926 of 1796) PASS: lldb-unit :: Utility/./UtilityTests/ScalarTest.Equality (927 of 1796) UNSUPPORTED: lldb-api :: commands/expression/completion-crash1/TestCompletionCrash1.py (928 of 1796) PASS: lldb-api :: functionalities/data-formatter/ptr_ref_typedef/TestPtrRef2Typedef.py (929 of 1796) PASS: lldb-api :: commands/gui/invalid-args/TestInvalidArgsGui.py (930 of 1796) PASS: lldb-api :: functionalities/type_completion/TestTypeCompletion.py (931 of 1796) PASS: lldb-api :: commands/expression/dollar-in-variable/TestDollarInVariable.py (932 of 1796) PASS: lldb-unit :: Utility/./UtilityTests/ListenerTest.GetEventImmediate (933 of 1796) PASS: lldb-api :: commands/expression/entry-bp/TestExprEntryBP.py (934 of 1796) PASS: lldb-api :: functionalities/breakpoint/source_regexp/TestSourceRegexBreakpoints.py (935 of 1796) PASS: lldb-shell :: SymbolFile/DWARF/childless-compile-unit.s (936 of 1796) PASS: lldb-unit :: UnwindAssembly/x86/./UnwindAssemblyx86Tests/Testx86AssemblyInspectionEngine.TestPushR13 (937 of 1796) UNSUPPORTED: lldb-api :: linux/add-symbols/TestTargetSymbolsAddCommand.py (938 of 1796) PASS: lldb-api :: functionalities/unwind/sigtramp/TestSigtrampUnwind.py (939 of 1796) PASS: lldb-unit :: Utility/./UtilityTests/DataExtractorTest.GetMaxS64 (940 of 1796) UNSUPPORTED: lldb-shell :: SymbolFile/PDB/expressions.test (941 of 1796) PASS: lldb-api :: lang/objcxx/class-name-clash/TestNameClash.py (942 of 1796) PASS: lldb-unit :: Expression/./ExpressionTests/DiagnosticManagerTest.AppendMessageSubsequentDiags (943 of 1796) PASS: lldb-unit :: Utility/./UtilityTests/StringListTest.GetMaxStringLengthEqualSize (944 of 1796) PASS: lldb-shell :: Quit/TestQuitExitCode0.test (945 of 1796) PASS: lldb-unit :: Utility/./UtilityTests/StreamTest.ShiftOperatorChars (946 of 1796) PASS: lldb-api :: commands/quit/TestQuit.py (947 of 1796) PASS: lldb-api :: commands/expression/import-std-module/weak_ptr-dbg-info-content/TestDbgInfoContentWeakPtr.py (948 of 1796) PASS: lldb-api :: lang/cpp/chained-calls/TestCppChainedCalls.py (949 of 1796) PASS: lldb-unit :: Utility/./UtilityTests/StreamTeeTest.SetStreamAtIndexOverwrite (950 of 1796) PASS: lldb-api :: functionalities/type_lookup/TestTypeLookup.py (951 of 1796) UNSUPPORTED: lldb-api :: functionalities/unwind/standard/TestStandardUnwind.py (952 of 1796) PASS: lldb-unit :: SymbolFile/NativePDB/./SymbolFileNativePDBTests/PDBFPOProgramToDWARFExpressionTests.UnresolvedDependentCyclicRegisterAssignmentReference (953 of 1796) PASS: lldb-api :: functionalities/return-value/TestReturnValue.py (954 of 1796) PASS: lldb-api :: lang/objc/objc-foundation-dictionary-empty/TestNSDictionary0.py (955 of 1796) PASS: lldb-api :: lang/objc/objc-new-syntax/TestObjCNewSyntaxLiteral.py (956 of 1796) PASS: lldb-api :: commands/expression/completion-in-lambda-and-unnnamed-class/TestCompletionInLambdaAndUnnamedClass.py (957 of 1796) PASS: lldb-unit :: Utility/./UtilityTests/ReproducerTest.SetReplay (958 of 1796) UNSUPPORTED: lldb-api :: functionalities/data-formatter/data-formatter-stl/libstdcpp/iterator/TestDataFormatterStdIterator.py (959 of 1796) PASS: lldb-api :: commands/expression/argument_passing_restrictions/TestArgumentPassingRestrictions.py (960 of 1796) PASS: lldb-unit :: Utility/./UtilityTests/FileSpecTest.RemoveLastPathComponent (961 of 1796) PASS: lldb-unit :: ScriptInterpreter/Python/./ScriptInterpreterPythonTests/PythonDataObjectsTest.TestPythonDictionaryToStructuredDictionary (962 of 1796) PASS: lldb-unit :: Utility/./UtilityTests/ArgsTest.ReplaceArgumentAtIndexFarOutOfRange (963 of 1796) PASS: lldb-unit :: Utility/./UtilityTests/ArgsTest.TestSingleQuotedArgWithSpace (964 of 1796) PASS: lldb-api :: functionalities/gdb_remote_client/TestArmRegisterDefinition.py (965 of 1796) PASS: lldb-api :: commands/command/history/TestCommandHistory.py (966 of 1796) PASS: lldb-unit :: debugserver/./debugserverTests/RNBSocket.LoopBackConnectIPv6 (967 of 1796) UNSUPPORTED: lldb-api :: tools/lldb-vscode/breakpoint/TestVSCode_setBreakpoints.py (968 of 1796) PASS: lldb-unit :: Utility/./UtilityTests/StreamTest.QuotedCString (969 of 1796) PASS: lldb-unit :: Utility/./UtilityTests/StringListTest.InsertStringAtIndexMove (970 of 1796) PASS: lldb-api :: functionalities/gdb_remote_client/TestGDBRemoteLoad.py (971 of 1796) PASS: lldb-unit :: Utility/./UtilityTests/RangeTest.DoesIntersect (972 of 1796) PASS: lldb-unit :: Utility/./UtilityTests/RangeTest.SlideZero (973 of 1796) PASS: lldb-unit :: Language/Highlighting/./HighlighterTests/HighlighterTest.ClangCursorOutOfBounds (974 of 1796) PASS: lldb-api :: commands/expression/cast_int_to_anonymous_enum/TestCastIntToAnonymousEnum.py (975 of 1796) PASS: lldb-unit :: Signals/./SignalsTests/UnixSignalsTest.GetInfo (976 of 1796) PASS: lldb-api :: commands/expression/no-deadlock/TestExprDoesntBlock.py (977 of 1796) UNSUPPORTED: lldb-shell :: Register/x86-zmm-write.test (978 of 1796) PASS: lldb-api :: lang/cpp/breakpoint_in_member_func_w_non_primitive_params/TestBreakpointInMemberFuncWNonPrimitiveParams.py (979 of 1796) UNSUPPORTED: lldb-shell :: SymbolFile/PDB/typedefs.test (980 of 1796) PASS: lldb-unit :: Language/Highlighting/./HighlighterTests/HighlighterTest.ClangCursorPosBeforeOtherToken (981 of 1796) PASS: lldb-api :: functionalities/data-formatter/nsdictionarysynth/TestNSDictionarySynthetic.py (982 of 1796) PASS: lldb-shell :: SymbolFile/DWARF/debug-types-basic.test (983 of 1796) PASS: lldb-shell :: Minidump/Windows/find-module.test (984 of 1796) PASS: lldb-api :: lang/objc/hidden-ivars/TestHiddenIvars.py (985 of 1796) PASS: lldb-unit :: Disassembler/./DisassemblerTests/TestArmv7Disassembly.TestCortexFPDisass (986 of 1796) PASS: lldb-shell :: Driver/LocalLLDBInit.test (987 of 1796) PASS: lldb-api :: functionalities/thread/concurrent_events/TestConcurrentWatchBreakDelay.py (988 of 1796) PASS: lldb-unit :: Utility/./UtilityTests/StringListTest.AppendList (989 of 1796) PASS: lldb-api :: functionalities/data-formatter/data-formatter-smart-array/TestDataFormatterSmartArray.py (990 of 1796) PASS: lldb-unit :: Expression/./ExpressionTests/CppModuleConfigurationTest.Linux (991 of 1796) PASS: lldb-unit :: Utility/./UtilityTests/Flags.AnySet (992 of 1796) PASS: lldb-api :: lang/cpp/signed_types/TestSignedTypes.py (993 of 1796) PASS: lldb-unit :: Utility/./UtilityTests/SerializationRountripTest.SerializeDeserializeObjectPointer (994 of 1796) PASS: lldb-api :: linux/builtin_trap/TestBuiltinTrap.py (995 of 1796) PASS: lldb-api :: functionalities/asan/TestMemoryHistory.py (996 of 1796) PASS: lldb-unit :: Utility/./UtilityTests/CompletionRequest.TryCompleteCurrentArgMode (997 of 1796) PASS: lldb-unit :: UnwindAssembly/x86/./UnwindAssemblyx86Tests/Testx86AssemblyInspectionEngine.TestStackRealign8BitDisp_i386 (998 of 1796) PASS: lldb-unit :: Utility/./UtilityTests/StructuredDataTest.ParseJSONFromFile (999 of 1796) PASS: lldb-api :: tools/lldb-server/inferior-crash/TestGdbRemoteSegFault.py (1000 of 1796) PASS: lldb-api :: functionalities/multidebugger_commands/TestMultipleDebuggersCommands.py (1001 of 1796) PASS: lldb-shell :: SymbolFile/NativePDB/ast-functions.cpp (1002 of 1796) PASS: lldb-api :: commands/frame/diagnose/local-variable/TestLocalVariable.py (1003 of 1796) PASS: lldb-api :: types/TestFloatTypesExpr.py (1004 of 1796) PASS: lldb-api :: functionalities/tsan/thread_numbers/TestTsanThreadNumbers.py (1005 of 1796) PASS: lldb-api :: commands/frame/diagnose/dereference-function-return/TestDiagnoseDereferenceFunctionReturn.py (1006 of 1796) PASS: lldb-api :: commands/expression/import-std-module/weak_ptr/TestWeakPtr.py (1007 of 1796) PASS: lldb-api :: commands/expression/call-function/TestCallStdStringFunction.py (1008 of 1796) PASS: lldb-unit :: Host/./HostTests/NativeProcessProtocolTest.ReadCStringFromMemory (1009 of 1796) PASS: lldb-unit :: Expression/./ExpressionTests/CppModuleConfigurationTest.UnknownLibCppFile (1010 of 1796) PASS: lldb-shell :: SymbolFile/DWARF/find-inline-method.s (1011 of 1796) PASS: lldb-api :: lang/c/array_types/TestArrayTypes.py (1012 of 1796) PASS: lldb-unit :: Utility/./UtilityTests/ArchSpecTest.Compatibility (1013 of 1796) PASS: lldb-unit :: Utility/./UtilityTests/BinaryStreamTest.PutSLEB128TwoBytes (1014 of 1796) PASS: lldb-api :: lang/cpp/template-function/TestTemplateFunctions.py (1015 of 1796) PASS: lldb-unit :: Utility/./UtilityTests/ArgsTest.ReplaceArgumentAtIndexEqual (1016 of 1796) PASS: lldb-unit :: Utility/./UtilityTests/OptionsWithRawTest.EmptyInput (1017 of 1796) PASS: lldb-api :: lang/objc/radar-9691614/TestObjCMethodReturningBOOL.py (1018 of 1796) PASS: lldb-unit :: Editline/./EditlineTests/EditlineTestFixture.EditlineReceivesSingleLineText (1019 of 1796) PASS: lldb-api :: lang/cpp/accelerator-table/TestCPPAccelerator.py (1020 of 1796) PASS: lldb-unit :: ScriptInterpreter/Python/./ScriptInterpreterPythonTests/PythonDataObjectsTest.TestPythonStringToStr (1021 of 1796) UNSUPPORTED: lldb-api :: tools/lldb-server/libraries-svr4/TestGdbRemoteLibrariesSvr4Support.py (1022 of 1796) PASS: lldb-unit :: Process/gdb-remote/./ProcessGdbRemoteTests/GDBRemoteCommunicationClientTest.SendGetDataPacket (1023 of 1796) PASS: lldb-shell :: Settings/TestStopCommandSourceOnError.test (1024 of 1796) PASS: lldb-shell :: ObjectFile/Breakpad/sections-trailing-func.test (1025 of 1796) UNSUPPORTED: lldb-shell :: SymbolFile/PDB/func-symbols.test (1026 of 1796) PASS: lldb-api :: functionalities/thread/concurrent_events/TestConcurrentDelaySignalWatch.py (1027 of 1796) PASS: lldb-api :: lang/objc/ptr_refs/TestPtrRefsObjC.py (1028 of 1796) PASS: lldb-api :: commands/watchpoints/watchpoint_events/TestWatchpointEvents.py (1029 of 1796) PASS: lldb-unit :: Utility/./UtilityTests/BinaryStreamTest.PutSLEB128NineBytes (1030 of 1796) PASS: lldb-api :: lang/objc/objc-builtin-types/TestObjCBuiltinTypes.py (1031 of 1796) PASS: lldb-unit :: Host/./HostTests/FileSystemTest.Resolve (1032 of 1796) PASS: lldb-unit :: SymbolFile/NativePDB/./SymbolFileNativePDBTests/PDBFPOProgramToDWARFExpressionTests.InvalidAssignmentMultiple (1033 of 1796) PASS: lldb-api :: lang/objc/conflicting-definition/TestConflictingDefinition.py (1034 of 1796) PASS: lldb-unit :: Host/./HostTests/FileSystemTest.MakeAbsolute (1035 of 1796) PASS: lldb-unit :: Language/CPlusPlus/./LanguageCPlusPlusTests/CPlusPlusLanguage.CPlusPlusNameParser (1036 of 1796) PASS: lldb-unit :: ScriptInterpreter/Python/./ScriptInterpreterPythonTests/PythonDataObjectsTest.TestPythonTupleInitializerList (1037 of 1796) PASS: lldb-unit :: UnwindAssembly/x86/./UnwindAssemblyx86Tests/Testx86AssemblyInspectionEngine.TestPushRBP (1038 of 1796) PASS: lldb-unit :: ObjectFile/ELF/./ObjectFileELFTests/ObjectFileELFTest.GetModuleSpecifications_EarlySectionHeaders (1039 of 1796) UNSUPPORTED: lldb-shell :: Register/x86-64-zmm-read.test (1040 of 1796) PASS: lldb-unit :: Utility/./UtilityTests/DataExtractorTest.PeekData (1041 of 1796) PASS: lldb-shell :: SymbolFile/NativePDB/break-by-line.cpp (1042 of 1796) PASS: lldb-unit :: Utility/./UtilityTests/RecordReplayTest.InstrumentedBar (1043 of 1796) PASS: lldb-unit :: Signals/./SignalsTests/UnixSignalsTest.GetFilteredSignals (1044 of 1796) PASS: lldb-api :: commands/expression/two-files/TestObjCTypeQueryFromOtherCompileUnit.py (1045 of 1796) PASS: lldb-unit :: Utility/./UtilityTests/StringListTest.ShiftCString (1046 of 1796) PASS: lldb-shell :: SymbolFile/DWARF/dwarf5_locations.s (1047 of 1796) PASS: lldb-unit :: Utility/./UtilityTests/BinaryStreamTest.PutULEB128One (1048 of 1796) PASS: lldb-shell :: ObjectFile/MachO/lc_build_version_notools.yaml (1049 of 1796) PASS: lldb-unit :: Process/minidump/./LLDBMinidumpTests/MinidumpParserTest.GetArchitecture (1050 of 1796) UNSUPPORTED: lldb-shell :: ExecControl/StopHook/stop-hook-threads.test (1051 of 1796) PASS: lldb-unit :: Expression/./ExpressionTests/DiagnosticManagerTest.FixedExpression (1052 of 1796) PASS: lldb-api :: commands/command/script_alias/TestCommandScriptAlias.py (1053 of 1796) PASS: lldb-unit :: UnwindAssembly/x86/./UnwindAssemblyx86Tests/Testx86AssemblyInspectionEngine.TestReturnDetect (1054 of 1796) PASS: lldb-unit :: Utility/./UtilityTests/LogChannelEnabledTest.LLDB_LOG_ERROR (1055 of 1796) PASS: lldb-unit :: Utility/./UtilityTests/StringExtractorTest.GetNameColonValueNoColon (1056 of 1796) PASS: lldb-unit :: Utility/./UtilityTests/StringListTest.LongestCommonPrefixNoPrefix (1057 of 1796) PASS: lldb-unit :: Utility/./UtilityTests/StringExtractorTest.GetNameColonValueNoSemicolon (1058 of 1796) PASS: lldb-shell :: Quit/TestQuitExitCodeHexA.test (1059 of 1796) PASS: lldb-unit :: Utility/./UtilityTests/LogChannelEnabledTest.log_options (1060 of 1796) PASS: lldb-unit :: Process/gdb-remote/./ProcessGdbRemoteTests/GDBRemoteClientBaseTest.SendContinueAndAsyncPacket (1061 of 1796) PASS: lldb-unit :: ScriptInterpreter/Python/./ScriptInterpreterPythonTests/PythonExceptionStateTest.TestAutoRestoreChanged (1062 of 1796) UNSUPPORTED: lldb-api :: functionalities/process_save_core/TestProcessSaveCore.py (1063 of 1796) PASS: lldb-api :: lang/objc/rdar-10967107/TestRdar10967107.py (1064 of 1796) PASS: lldb-api :: functionalities/thread/concurrent_events/TestConcurrentCrashWithWatchpointBreakpointSignal.py (1065 of 1796) UNSUPPORTED: lldb-api :: benchmarks/turnaround/TestCompileRunToBreakpointTurnaround.py (1066 of 1796) PASS: lldb-unit :: Utility/./UtilityTests/UUIDTest.StringConverion (1067 of 1796) PASS: lldb-api :: commands/statistics/basic/TestStats.py (1068 of 1796) PASS: lldb-unit :: SymbolFile/DWARF/./SymbolFileDWARFTests/SymbolFileDWARFTests.TestAbbrevNullAttrValidForm (1069 of 1796) PASS: lldb-unit :: UnwindAssembly/ARM64/./Arm64InstEmulationTests/TestArm64InstEmulation.TestSimpleDarwinFunction (1070 of 1796) PASS: lldb-api :: functionalities/postmortem/minidump/TestMiniDump.py (1071 of 1796) PASS: lldb-api :: functionalities/object-file/TestImageListMultiArchitecture.py (1072 of 1796) PASS: lldb-api :: commands/expression/call-overridden-method/TestCallOverriddenMethod.py (1073 of 1796) PASS: lldb-shell :: ObjectFile/PECOFF/basic-info-arm.yaml (1074 of 1796) PASS: lldb-api :: tools/lldb-server/TestLldbGdbServer.py (1075 of 1796) PASS: lldb-api :: python_api/sbtype_typeclass/TestSBTypeTypeClass.py (1076 of 1796) PASS: lldb-unit :: Utility/./UtilityTests/StringExtractorTest.GetNameColonValueSuccess (1077 of 1796) PASS: lldb-shell :: Breakpoint/debug_rnglist_basic.test (1078 of 1796) PASS: lldb-api :: functionalities/data-formatter/data-formatter-ptr-to-array/TestPtrToArrayFormatting.py (1079 of 1796) PASS: lldb-api :: commands/expression/anonymous-struct/TestCallUserAnonTypedef.py (1080 of 1796) PASS: lldb-api :: functionalities/data-formatter/format-propagation/TestFormatPropagation.py (1081 of 1796) PASS: lldb-api :: lang/cpp/dynamic-value/TestDynamicValue.py (1082 of 1796) PASS: lldb-unit :: UnwindAssembly/x86/./UnwindAssemblyx86Tests/Testx86AssemblyInspectionEngine.TestPushESI (1083 of 1796) PASS: lldb-shell :: Quit/TestQuitExitCode30.test (1084 of 1796) PASS: lldb-api :: functionalities/postmortem/minidump-new/TestMiniDumpUUID.py (1085 of 1796) PASS: lldb-api :: functionalities/breakpoint/dummy_target_breakpoints/TestBreakpointsWithNoTargets.py (1086 of 1796) PASS: lldb-unit :: Utility/./UtilityTests/StreamTest.PutMaxHex64ByteOrderLittle (1087 of 1796) UNSUPPORTED: lldb-api :: commands/watchpoints/hello_watchlocation/TestWatchLocation.py (1088 of 1796) PASS: lldb-unit :: Utility/./UtilityTests/BinaryStreamTest.PutULEB128EightBytes (1089 of 1796) PASS: lldb-unit :: Utility/./UtilityTests/StateTest.Formatv (1090 of 1796) PASS: lldb-api :: lang/cpp/gmodules/TestWithModuleDebugging.py (1091 of 1796) PASS: lldb-api :: functionalities/ubsan/user-expression/TestUbsanUserExpression.py (1092 of 1796) PASS: lldb-api :: lang/cpp/rvalue-references/TestRvalueReferences.py (1093 of 1796) PASS: lldb-unit :: Utility/./UtilityTests/VMRange.ContainsRange (1094 of 1796) PASS: lldb-api :: python_api/disassemble-raw-data/TestDisassemble_VST1_64.py (1095 of 1796) PASS: lldb-api :: iohandler/completion/TestIOHandlerCompletion.py (1096 of 1796) UNSUPPORTED: lldb-api :: commands/expression/completion-crash2/TestCompletionCrash2.py (1097 of 1796) PASS: lldb-api :: commands/expression/vector_of_enums/TestVectorOfEnums.py (1098 of 1796) PASS: lldb-unit :: ScriptInterpreter/Python/./ScriptInterpreterPythonTests/PythonDataObjectsTest.TestPythonTupleInitializerList2 (1099 of 1796) PASS: lldb-unit :: Host/./HostTests/SocketTest.TCPListen0ConnectAccept (1100 of 1796) PASS: lldb-api :: functionalities/breakpoint/require_hw_breakpoints/TestRequireHWBreakpoints.py (1101 of 1796) PASS: lldb-api :: python_api/symbol-context/two-files/TestSymbolContextTwoFiles.py (1102 of 1796) PASS: lldb-unit :: Utility/./UtilityTests/StringExtractorTest.GetHexBytes_FullString (1103 of 1796) PASS: lldb-api :: functionalities/thread/concurrent_events/TestConcurrentSignalWatchBreak.py (1104 of 1796) UNSUPPORTED: lldb-api :: functionalities/data-formatter/data-formatter-stl/libstdcpp/map/TestDataFormatterStdMap.py (1105 of 1796) PASS: lldb-api :: commands/expression/import-std-module/conflicts/TestStdModuleWithConflicts.py (1106 of 1796) PASS: lldb-api :: functionalities/thread/concurrent_events/TestConcurrentSignalBreak.py (1107 of 1796) PASS: lldb-api :: macosx/function-starts/TestFunctionStarts.py (1108 of 1796) PASS: lldb-api :: lang/cpp/frame-var-anon-unions/TestFrameVariableAnonymousUnions.py (1109 of 1796) PASS: lldb-api :: functionalities/thread/concurrent_events/TestConcurrentManyWatchpoints.py (1110 of 1796) PASS: lldb-shell :: Breakpoint/split-dwarf5-debug-stroffsets.test (1111 of 1796) PASS: lldb-api :: lang/objcxx/hide-runtime-values/TestObjCXXHideRuntimeValues.py (1112 of 1796) PASS: lldb-api :: functionalities/gdb_remote_client/TestRecognizeBreakpoint.py (1113 of 1796) PASS: lldb-shell :: SymbolFile/NativePDB/function-types-builtins.cpp (1114 of 1796) UNSUPPORTED: lldb-api :: commands/watchpoints/variable_out_of_scope/TestWatchedVarHitWhenInScope.py (1115 of 1796) PASS: lldb-unit :: ObjectFile/PECOFF/./ObjectFilePECOFFTests/PECallFrameInfoTest.Chained_eh (1116 of 1796) UNSUPPORTED: lldb-api :: linux/thread/create_during_instruction_step/TestCreateDuringInstructionStep.py (1117 of 1796) PASS: lldb-api :: lang/cpp/char1632_t/TestChar1632T.py (1118 of 1796) PASS: lldb-unit :: Process/minidump/./LLDBMinidumpTests/MinidumpParserTest.GetPid (1119 of 1796) PASS: lldb-unit :: ScriptInterpreter/Python/./ScriptInterpreterPythonTests/PythonExceptionStateTest.TestManualRestoreSemantics (1120 of 1796) PASS: lldb-unit :: Process/minidump/./LLDBMinidumpTests/MinidumpParserTest.GetThreadsAndGetThreadContext (1121 of 1796) PASS: lldb-api :: api/listeners/TestListener.py (1122 of 1796) PASS: lldb-api :: commands/expression/import-std-module/unique_ptr-dbg-info-content/TestUniquePtrDbgInfoContent.py (1123 of 1796) PASS: lldb-unit :: Host/./HostTests/SocketTest.TCPGetConnectURI (1124 of 1796) PASS: lldb-shell :: Reproducer/TestFileRepro.test (1125 of 1796) PASS: lldb-api :: functionalities/archives/TestBSDArchives.py (1126 of 1796) PASS: lldb-unit :: Utility/./UtilityTests/StringListTest.LongestCommonPrefix (1127 of 1796) XFAIL: lldb-shell :: Register/x86-mm-xmm-read.test (1128 of 1796) PASS: lldb-api :: lang/objc/foundation/TestFoundationDisassembly.py (1129 of 1796) PASS: lldb-api :: tools/lldb-server/TestGdbRemoteThreadsInStopReply.py (1130 of 1796) PASS: lldb-unit :: Utility/./UtilityTests/UriParserTest.SchemeHostSeparator2 (1131 of 1796) PASS: lldb-api :: functionalities/data-formatter/data-formatter-objc/TestDataFormatterObjCNSURL.py (1132 of 1796) PASS: lldb-unit :: Utility/./UtilityTests/StreamTest.PutPtr (1133 of 1796) PASS: lldb-unit :: Utility/./UtilityTests/StringExtractorTest.GetHexU8_Underflow_NoEof (1134 of 1796) PASS: lldb-api :: lang/objc/rdar-11355592/TestRdar11355592.py (1135 of 1796) PASS: lldb-shell :: Quit/TestQuitExitCode-30.test (1136 of 1796) PASS: lldb-unit :: Utility/./UtilityTests/ArchSpecTest.TestParseMachCPUDashSubtypeTripleSimple (1137 of 1796) PASS: lldb-unit :: ScriptInterpreter/Python/./ScriptInterpreterPythonTests/PythonDataObjectsTest.TestCallable (1138 of 1796) PASS: lldb-api :: commands/expression/persistent_types/TestNestedPersistentTypes.py (1139 of 1796) PASS: lldb-api :: commands/expression/context-object/TestContextObject.py (1140 of 1796) PASS: lldb-api :: functionalities/data-formatter/parray/TestPrintArray.py (1141 of 1796) PASS: lldb-unit :: Utility/./UtilityTests/UriParserTest.BracketedHostnamePort (1142 of 1796) PASS: lldb-unit :: Editline/./EditlineTests/EditlineTestFixture.EditlineReceivesMultiLineText (1143 of 1796) PASS: lldb-api :: lang/objc/objc-checker/TestObjCCheckers.py (1144 of 1796) PASS: lldb-api :: functionalities/show_location/TestShowLocationDwarf5.py (1145 of 1796) PASS: lldb-unit :: ObjectFile/Breakpad/./ObjectFileBreakpadTests/FileRecord.parse (1146 of 1796) PASS: lldb-api :: lang/objc/real-definition/TestRealDefinition.py (1147 of 1796) PASS: lldb-api :: functionalities/data-formatter/data-formatter-stl/libcxx/multimap/TestDataFormatterLibccMultiMap.py (1148 of 1796) PASS: lldb-api :: commands/process/attach/TestProcessAttach.py (1149 of 1796) PASS: lldb-unit :: Utility/./UtilityTests/StringExtractorTest.GetHexBytes_Partial (1150 of 1796) UNSUPPORTED: lldb-api :: tools/lldb-vscode/stackTrace/TestVSCode_stackTrace.py (1151 of 1796) PASS: lldb-unit :: Utility/./UtilityTests/ScalarTest.Division (1152 of 1796) PASS: lldb-api :: commands/watchpoints/watchpoint_size/TestWatchpointSizes.py (1153 of 1796) PASS: lldb-unit :: Utility/./UtilityTests/GeneratorTest.Get (1154 of 1796) PASS: lldb-unit :: SymbolFile/NativePDB/./SymbolFileNativePDBTests/PDBFPOProgramToDWARFExpressionTests.InvalidAssignmentSingle (1155 of 1796) PASS: lldb-api :: commands/expression/import-std-module/no-std-module/TestMissingStdModule.py (1156 of 1796) PASS: lldb-api :: tools/lldb-server/register-reading/TestGdbRemoteGPacket.py (1157 of 1796) PASS: lldb-shell :: Quit/TestQuitExitCodeHex0.test (1158 of 1796) PASS: lldb-unit :: Expression/./ExpressionTests/DiagnosticManagerTest.GetStringMultipleDiags (1159 of 1796) PASS: lldb-unit :: Utility/./UtilityTests/StreamTeeTest.Write (1160 of 1796) PASS: lldb-api :: functionalities/data-formatter/var-in-aggregate-misuse/TestVarInAggregateMisuse.py (1161 of 1796) PASS: lldb-api :: functionalities/data-formatter/data-formatter-enum-format/TestDataFormatterEnumFormat.py (1162 of 1796) PASS: lldb-api :: functionalities/thread/concurrent_events/TestConcurrentDelaySignalBreak.py (1163 of 1796) PASS: lldb-api :: lang/cpp/modules-import/TestCXXModulesImport.py (1164 of 1796) PASS: lldb-api :: functionalities/tail_call_frames/ambiguous_tail_call_seq2/TestAmbiguousTailCallSeq2.py (1165 of 1796) PASS: lldb-unit :: Utility/./UtilityTests/UriParserTest.BadPort (1166 of 1796) UNSUPPORTED: lldb-shell :: SymbolFile/PDB/ast-restore.test (1167 of 1796) PASS: lldb-api :: functionalities/thread/concurrent_events/TestConcurrentTwoBreakpointsOneWatchpoint.py (1168 of 1796) PASS: lldb-api :: commands/expression/weak_symbols/TestWeakSymbols.py (1169 of 1796) PASS: lldb-unit :: ObjectFile/Breakpad/./ObjectFileBreakpadTests/ModuleRecord.parse (1170 of 1796) PASS: lldb-unit :: UnwindAssembly/x86/./UnwindAssemblyx86Tests/Testx86AssemblyInspectionEngine.TestPushExtended (1171 of 1796) PASS: lldb-api :: tools/lldb-server/TestGdbRemote_vCont.py (1172 of 1796) PASS: lldb-unit :: Utility/./UtilityTests/RangeTest.Copy (1173 of 1796) PASS: lldb-shell :: Commands/command-regex-unalias.test (1174 of 1796) PASS: lldb-unit :: Utility/./UtilityTests/GeneratorTest.Create (1175 of 1796) PASS: lldb-shell :: SymbolFile/Breakpad/unwind-via-raSearch.test (1176 of 1796) PASS: lldb-unit :: Interpreter/./InterpreterTests/CompletionTest.DirCompletionUsername (1177 of 1796) PASS: lldb-unit :: Utility/./UtilityTests/AnsiTerminal.Empty (1178 of 1796) PASS: lldb-unit :: Utility/./UtilityTests/FileSpecTest.EqualSeparator (1179 of 1796) PASS: lldb-unit :: UnwindAssembly/x86/./UnwindAssemblyx86Tests/Testx86AssemblyInspectionEngine.TestSubRSP (1180 of 1796) PASS: lldb-unit :: Utility/./UtilityTests/RegularExpression.Empty (1181 of 1796) PASS: lldb-unit :: ScriptInterpreter/Python/./ScriptInterpreterPythonTests/PythonExceptionStateTest.TestDiscardSemantics (1182 of 1796) PASS: lldb-shell :: SymbolFile/DWARF/dir-separator-windows.s (1183 of 1796) PASS: lldb-api :: functionalities/data-formatter/data-formatter-stl/libcxx/queue/TestDataFormatterLibcxxQueue.py (1184 of 1796) UNSUPPORTED: lldb-api :: functionalities/darwin_log/source/info/TestDarwinLogSourceInfo.py (1185 of 1796) PASS: lldb-unit :: ScriptInterpreter/Python/./ScriptInterpreterPythonTests/PythonDataObjectsTest.TestPythonBytes (1186 of 1796) PASS: lldb-unit :: Process/gdb-remote/./ProcessGdbRemoteTests/GDBRemoteCommunicationClientTest.SendStopTracePacket (1187 of 1796) PASS: lldb-api :: functionalities/thread/concurrent_events/TestConcurrentDelayWatchBreak.py (1188 of 1796) PASS: lldb-api :: functionalities/modern-type-lookup/basic-objc/TestBasicObjcModernTypeLookup.py (1189 of 1796) PASS: lldb-unit :: Utility/./UtilityTests/OptionsWithRawTest.TerminatedQuote (1190 of 1796) PASS: lldb-unit :: Expression/./ExpressionTests/CppModuleConfigurationTest.Xcode (1191 of 1796) PASS: lldb-unit :: Utility/./UtilityTests/OptionsWithRawTest.WhitespaceSuffix (1192 of 1796) PASS: lldb-unit :: Utility/./UtilityTests/StreamTest.PutHex32ByteOrderBig (1193 of 1796) PASS: lldb-api :: lang/cpp/gmodules-templates/TestGModules.py (1194 of 1796) PASS: lldb-unit :: SymbolFile/DWARF/./SymbolFileDWARFTests/SymbolFileDWARFTests.TestAbbrevInvalidNULLTag (1195 of 1796) PASS: lldb-api :: functionalities/tail_call_frames/disambiguate_paths_to_common_sink/TestDisambiguatePathsToCommonSink.py (1196 of 1796) PASS: lldb-unit :: Host/./HostTests/FileSystemTest.OpenErrno (1197 of 1796) PASS: lldb-shell :: Settings/TestEchoCommands.test (1198 of 1796) UNSUPPORTED: lldb-api :: functionalities/data-formatter/data-formatter-stl/libstdcpp/string/TestDataFormatterStdString.py (1199 of 1796) PASS: lldb-unit :: tools/lldb-server/tests/./LLDBServerTests/TestBase.DebugserverEnv (1200 of 1796) PASS: lldb-unit :: debugserver/./debugserverTests/RNBSocket.LoopBackListenIPv4 (1201 of 1796) UNSUPPORTED: lldb-api :: functionalities/darwin_log/filter/exact_match/activity/TestDarwinLogFilterMatchActivity.py (1202 of 1796) PASS: lldb-unit :: Utility/./UtilityTests/StringLexerTest.AdvanceIf (1203 of 1796) PASS: lldb-api :: functionalities/breakpoint/consecutive_breakpoints/TestConsecutiveBreakpoints.py (1204 of 1796) PASS: lldb-api :: functionalities/data-formatter/data-formatter-proper-plurals/TestFormattersOneIsSingular.py (1205 of 1796) PASS: lldb-unit :: UnwindAssembly/x86/./UnwindAssemblyx86Tests/Testx86AssemblyInspectionEngine.TestSimplex86_64Augmented (1206 of 1796) PASS: lldb-unit :: Utility/./UtilityTests/StreamTest.PutBytesAsRawHex8ToLittleEndian (1207 of 1796) PASS: lldb-shell :: ExecControl/StopHook/stop-hook.test (1208 of 1796) PASS: lldb-unit :: UnwindAssembly/x86/./UnwindAssemblyx86Tests/Testx86AssemblyInspectionEngine.Test32bitFramelessSmallStackFrame (1209 of 1796) PASS: lldb-unit :: Utility/./UtilityTests/VASprintfTest.EncodingError (1210 of 1796) PASS: lldb-api :: commands/command/nested_alias/TestNestedAlias.py (1211 of 1796) PASS: lldb-shell :: Reproducer/TestDriverOptions.test (1212 of 1796) PASS: lldb-api :: functionalities/paths/TestPaths.py (1213 of 1796) PASS: lldb-api :: commands/target/create-deps/TestTargetCreateDeps.py (1214 of 1796) PASS: lldb-unit :: Utility/./UtilityTests/ArgsTest.TestUnknownEscape (1215 of 1796) PASS: lldb-api :: commands/source/info/TestSourceInfo.py (1216 of 1796) PASS: lldb-unit :: Utility/./UtilityTests/StringListTest.SplitIntoLines (1217 of 1796) PASS: lldb-unit :: Process/minidump/./LLDBMinidumpTests/MinidumpParserTest.FindMemoryRangeWithFullMemoryMinidump (1218 of 1796) PASS: lldb-api :: commands/command/script/import/rdar-12586188/TestRdar12586188.py (1219 of 1796) PASS: lldb-api :: lang/objc/objc-super/TestObjCSuper.py (1220 of 1796) PASS: lldb-unit :: Utility/./UtilityTests/TimerTest.CategoryTimes2 (1221 of 1796) PASS: lldb-unit :: Utility/./UtilityTests/UriParserTest.SchemeHostSeparator (1222 of 1796) PASS: lldb-api :: functionalities/signal/raise/TestRaise.py (1223 of 1796) PASS: lldb-unit :: Utility/./UtilityTests/StreamTest.PutChar (1224 of 1796) UNSUPPORTED: lldb-api :: arm/breakpoint-it/TestBreakpointIt.py (1225 of 1796) PASS: lldb-unit :: Host/./HostTests/FileSystemTest.GetByteSize (1226 of 1796) PASS: lldb-api :: python_api/value/change_values/TestChangeValueAPI.py (1227 of 1796) PASS: lldb-api :: commands/expression/invalid-args/TestInvalidArgsExpression.py (1228 of 1796) PASS: lldb-unit :: SymbolFile/NativePDB/./SymbolFileNativePDBTests/PDBFPOProgramToDWARFExpressionTests.InvalidOpUnary (1229 of 1796) PASS: lldb-api :: lang/c/enum_types/TestEnumTypes.py (1230 of 1796) PASS: lldb-unit :: Expression/./ExpressionTests/ClangHostTest.MacOSX (1231 of 1796) PASS: lldb-api :: tools/lldb-server/TestGdbRemoteRegisterState.py (1232 of 1796) PASS: lldb-shell :: ObjectFile/Breakpad/uuid-matching-mac.test (1233 of 1796) XFAIL: lldb-shell :: Unwind/prefer-debug-over-eh-frame.test (1234 of 1796) PASS: lldb-unit :: Utility/./UtilityTests/ScalarTest.CastOperations (1235 of 1796) PASS: lldb-shell :: SymbolFile/DWARF/find-function-regex.cpp (1236 of 1796) PASS: lldb-unit :: Utility/./UtilityTests/ScalarTest.RightShiftOperator (1237 of 1796) PASS: lldb-shell :: ObjectFile/PECOFF/uuid.yaml (1238 of 1796) PASS: lldb-unit :: Utility/./UtilityTests/AnsiTerminal.Unknown (1239 of 1796) UNSUPPORTED: lldb-shell :: Register/x86-ymm-write.test (1240 of 1796) PASS: lldb-api :: functionalities/mtc/simple/TestMTCSimple.py (1241 of 1796) PASS: lldb-unit :: Utility/./UtilityTests/RangeTest.DoesAdjoinOrIntersect (1242 of 1796) PASS: lldb-api :: lang/objc/foundation/TestConstStrings.py (1243 of 1796) PASS: lldb-api :: lang/c/unions/TestUnionMembers.py (1244 of 1796) PASS: lldb-api :: functionalities/data-formatter/data-formatter-objc/TestDataFormatterObjCExpr.py (1245 of 1796) UNSUPPORTED: lldb-api :: tools/lldb-server/signal-filtering/TestGdbRemote_QPassSignals.py (1246 of 1796) PASS: lldb-shell :: Breakpoint/debug_rnglist_rlestartend.test (1247 of 1796) PASS: lldb-shell :: SymbolFile/DWARF/debug-types-signature-loop.s (1248 of 1796) UNSUPPORTED: lldb-api :: functionalities/unwind/ehframe/TestEhFrameUnwind.py (1249 of 1796) PASS: lldb-shell :: SymbolFile/DWARF/find-basic-namespace.cpp (1250 of 1796) PASS: lldb-unit :: ScriptInterpreter/Python/./ScriptInterpreterPythonTests/PythonDataObjectsTest.TestPythonInteger (1251 of 1796) UNSUPPORTED: lldb-shell :: Register/x86-64-xmm16-read.test (1252 of 1796) PASS: lldb-unit :: Utility/./UtilityTests/ArgsTest.DoubleQuotedItem (1253 of 1796) PASS: lldb-unit :: Process/minidump/./LLDBMinidumpTests/RegisterContextMinidump.CheckRegisterContextMinidump_ARM (1254 of 1796) PASS: lldb-unit :: Utility/./UtilityTests/StringListTest.ForRange (1255 of 1796) PASS: lldb-api :: functionalities/thread/concurrent_events/TestConcurrentWatchBreak.py (1256 of 1796) PASS: lldb-shell :: SymbolFile/DWARF/find-qualified-variable.cpp (1257 of 1796) PASS: lldb-api :: functionalities/data-formatter/data-formatter-objc/nsstring/TestDataFormatterNSString.py (1258 of 1796) UNSUPPORTED: lldb-api :: api/multiple-debuggers/TestMultipleDebuggers.py (1259 of 1796) PASS: lldb-api :: functionalities/data-formatter/type_summary_list_arg/TestTypeSummaryListArg.py (1260 of 1796) PASS: lldb-api :: api/multithreaded/TestMultithreaded.py (1261 of 1796) PASS: lldb-unit :: Utility/./UtilityTests/StringListTest.Join (1262 of 1796) PASS: lldb-shell :: ObjectFile/MachO/symtab.yaml (1263 of 1796) PASS: lldb-api :: lang/cpp/overloaded-functions/TestOverloadedFunctions.py (1264 of 1796) PASS: lldb-unit :: ObjectFile/Breakpad/./ObjectFileBreakpadTests/InfoRecord.parse (1265 of 1796) PASS: lldb-unit :: Utility/./UtilityTests/UriParserTest.SchemeHostSeparator4 (1266 of 1796) PASS: lldb-api :: commands/expression/ir-interpreter-phi-nodes/TestIRInterpreterPHINodes.py (1267 of 1796) PASS: lldb-api :: functionalities/thread/concurrent_events/TestConcurrentWatchpointWithDelayWatchpointThreads.py (1268 of 1796) PASS: lldb-shell :: Breakpoint/debug_rnglist_offset_pair.test (1269 of 1796) UNSUPPORTED: lldb-shell :: Unwind/eh-frame-small-fde.test (1270 of 1796) PASS: lldb-api :: functionalities/tail_call_frames/sbapi_support/TestTailCallFrameSBAPI.py (1271 of 1796) PASS: lldb-shell :: SymbolFile/Breakpad/unwind-via-stack-win.test (1272 of 1796) PASS: lldb-unit :: Utility/./UtilityTests/AnsiTerminal.Basic (1273 of 1796) PASS: lldb-unit :: Utility/./UtilityTests/EnvironmentTest.EnvpConversion (1274 of 1796) PASS: lldb-unit :: Utility/./UtilityTests/ArgsTest.TestSingleArgWithQuotedSpace (1275 of 1796) PASS: lldb-shell :: ObjectFile/Breakpad/sections.test (1276 of 1796) PASS: lldb-unit :: Language/Highlighting/./HighlighterTests/HighlighterTest.DefaultHighlighter (1277 of 1796) PASS: lldb-unit :: Utility/./UtilityTests/StringListTest.AppendStringCString (1278 of 1796) PASS: lldb-shell :: Minidump/dump-all.test (1279 of 1796) PASS: lldb-shell :: SymbolFile/dissassemble-entry-point.s (1280 of 1796) UNSUPPORTED: lldb-api :: functionalities/data-formatter/data-formatter-stl/libstdcpp/vector/TestDataFormatterStdVector.py (1281 of 1796) PASS: lldb-unit :: Utility/./UtilityTests/StreamTest.ShiftOperatorStrings (1282 of 1796) PASS: lldb-api :: tools/lldb-server/TestGdbRemoteExitCode.py (1283 of 1796) PASS: lldb-unit :: Process/gdb-remote/./ProcessGdbRemoteTests/GDBRemoteCommunicationServerTest.SendErrorResponse_ErrorNumber (1284 of 1796) PASS: lldb-api :: macosx/order/TestOrderFile.py (1285 of 1796) UNSUPPORTED: lldb-api :: functionalities/thread/state/TestThreadStates.py (1286 of 1796) PASS: lldb-api :: functionalities/signal/handle-abrt/TestHandleAbort.py (1287 of 1796) PASS: lldb-unit :: Utility/./UtilityTests/VASprintfTest.NoBufferResize (1288 of 1796) PASS: lldb-shell :: Driver/TestProcessAttach.test (1289 of 1796) PASS: lldb-api :: lang/cpp/incomplete-types/TestCppIncompleteTypes.py (1290 of 1796) UNSUPPORTED: lldb-api :: commands/register/register/intel_xtended_registers/mpx_bound_violation/TestBoundViolation.py (1291 of 1796) PASS: lldb-api :: commands/expression/import-std-module/forward_list-basic/TestBasicForwardList.py (1292 of 1796) PASS: lldb-unit :: Utility/./UtilityTests/Flags.AnyClear (1293 of 1796) PASS: lldb-api :: functionalities/data-formatter/data-formatter-objc/TestDataFormatterObjCKVO.py (1294 of 1796) PASS: lldb-api :: sanity/TestModuleCacheSanity.py (1295 of 1796) PASS: lldb-unit :: Utility/./UtilityTests/OptionsWithRawTest.EmptySuffixSingleWhitespace (1296 of 1796) PASS: lldb-api :: functionalities/gdb_remote_client/TestGDBRemoteClient.py (1297 of 1796) PASS: lldb-unit :: Core/./LLDBCoreTests/MangledTest.ResultForValidName (1298 of 1796) PASS: lldb-api :: functionalities/thread/crash_during_step/TestCrashDuringStep.py (1299 of 1796) PASS: lldb-api :: commands/expression/import-std-module/queue/TestQueue.py (1300 of 1796) PASS: lldb-api :: commands/expression/call-function/TestCallUserDefinedFunction.py (1301 of 1796) PASS: lldb-unit :: Utility/./UtilityTests/StreamTest.PutHex64ByteOrderBig (1302 of 1796) PASS: lldb-shell :: Breakpoint/debug_rnglistx_rlex.test (1303 of 1796) PASS: lldb-api :: commands/expression/persistent_ptr_update/TestPersistentPtrUpdate.py (1304 of 1796) PASS: lldb-api :: functionalities/value_md5_crash/TestValueMD5Crash.py (1305 of 1796) PASS: lldb-shell :: Unwind/eh-frame-dwarf-unwind.test (1306 of 1796) PASS: lldb-unit :: Utility/./UtilityTests/UserIDResolver.GetUserName (1307 of 1796) PASS: lldb-unit :: Utility/./UtilityTests/FileSpecTest.PrependPathComponent (1308 of 1796) PASS: lldb-api :: macosx/safe-to-func-call/TestSafeFuncCalls.py (1309 of 1796) PASS: lldb-api :: functionalities/data-formatter/language_category_updates/TestDataFormatterLanguageCategoryUpdates.py (1310 of 1796) UNSUPPORTED: lldb-shell :: SymbolFile/DWARF/debug-types-expressions.test (1311 of 1796) PASS: lldb-unit :: UnwindAssembly/x86/./UnwindAssemblyx86Tests/Testx86AssemblyInspectionEngine.TestMovRSPtoRBP (1312 of 1796) PASS: lldb-shell :: ObjectFile/ELF/section-types-edgecases.yaml (1313 of 1796) PASS: lldb-unit :: Utility/./UtilityTests/RecordReplayTest.InstrumentedBarPtr (1314 of 1796) PASS: lldb-unit :: Utility/./UtilityTests/UUIDTest.SetFromStringRef (1315 of 1796) PASS: lldb-unit :: Utility/./UtilityTests/BinaryStreamTest.PutULEB128FiveBytes (1316 of 1796) UNSUPPORTED: lldb-shell :: SymbolFile/PDB/function-nested-block.test (1317 of 1796) PASS: lldb-unit :: Utility/./UtilityTests/StringExtractorTest.GetHexU8_Extra_NoEof (1318 of 1796) UNSUPPORTED: lldb-api :: commands/expression/macros/TestMacros.py (1319 of 1796) PASS: lldb-api :: lang/cpp/this/TestCPPThis.py (1320 of 1796) PASS: lldb-shell :: SymbolFile/DWARF/find-method-local-struct.cpp (1321 of 1796) PASS: lldb-api :: python_api/formatters/TestFormattersSBAPI.py (1322 of 1796) PASS: lldb-api :: functionalities/thread/thread_exit/TestThreadExit.py (1323 of 1796) PASS: lldb-unit :: Symbol/./SymbolTests/PostfixExpression.ParseOneExpression (1324 of 1796) PASS: lldb-unit :: Utility/./UtilityTests/RecordReplayTest.InstrumentedFoo (1325 of 1796) UNSUPPORTED: lldb-api :: tools/lldb-server/TestGdbRemoteAuxvSupport.py (1326 of 1796) PASS: lldb-api :: commands/expression/persistent_types/TestPersistentTypes.py (1327 of 1796) PASS: lldb-unit :: Language/Highlighting/./HighlighterTests/HighlighterTest.HighlighterSelectionType (1328 of 1796) PASS: lldb-api :: lang/cpp/nsimport/TestCppNsImport.py (1329 of 1796) PASS: lldb-unit :: UnwindAssembly/x86/./UnwindAssemblyx86Tests/Testx86AssemblyInspectionEngine.TestPushImm (1330 of 1796) PASS: lldb-api :: commands/watchpoints/watchpoint_on_vectors/TestValueOfVectorVariable.py (1331 of 1796) PASS: lldb-unit :: Expression/./ExpressionTests/CppModuleConfigurationTest.Sysroot (1332 of 1796) PASS: lldb-unit :: Symbol/./SymbolTests/PostfixExpression.ToDWARF (1333 of 1796) PASS: lldb-unit :: Host/./HostTests/NativeProcessProtocolTest.SetBreakpointFailRead (1334 of 1796) PASS: lldb-api :: python_api/watchpoint/TestWatchpointIgnoreCount.py (1335 of 1796) PASS: lldb-unit :: Utility/./UtilityTests/StringListTest.SplitIntoLinesEmpty (1336 of 1796) PASS: lldb-unit :: Utility/./UtilityTests/FileSpecTest.FileAndDirectoryComponents (1337 of 1796) PASS: lldb-unit :: Host/./HostTests/HostInfoTest.GetAugmentedArchSpec (1338 of 1796) PASS: lldb-shell :: ObjectFile/ELF/build-id-case.yaml (1339 of 1796) PASS: lldb-api :: commands/apropos/basic/TestApropos.py (1340 of 1796) PASS: lldb-api :: functionalities/ptr_refs/TestPtrRefs.py (1341 of 1796) PASS: lldb-shell :: SymbolFile/DWARF/debug-types-line-tables.s (1342 of 1796) PASS: lldb-unit :: Utility/./UtilityTests/StringExtractorTest.GetU32BigEndian (1343 of 1796) PASS: lldb-unit :: ObjectFile/Breakpad/./ObjectFileBreakpadTests/Record.classify (1344 of 1796) PASS: lldb-unit :: Utility/./UtilityTests/RangeTest.ContainsRange (1345 of 1796) PASS: lldb-api :: functionalities/non-overlapping-index-variable-i/TestIndexVariable.py (1346 of 1796) PASS: lldb-shell :: SymbolFile/DWARF/debug_rnglists.s (1347 of 1796) PASS: lldb-unit :: Expression/./ExpressionTests/DiagnosticManagerTest.GetStringSeverityLabels (1348 of 1796) PASS: lldb-unit :: Utility/./UtilityTests/LogTest.Register (1349 of 1796) PASS: lldb-api :: lang/objc/foundation/TestObjCMethodsNSArray.py (1350 of 1796) PASS: lldb-shell :: Minidump/Windows/Sigsegv/sigsegv.test (1351 of 1796) PASS: lldb-api :: functionalities/breakpoint/breakpoint_by_line_and_column/TestBreakpointByLineAndColumn.py (1352 of 1796) PASS: lldb-api :: functionalities/breakpoint/breakpoint_conditions/TestBreakpointConditions.py (1353 of 1796) PASS: lldb-shell :: ObjectFile/PECOFF/sections-names.yaml (1354 of 1796) PASS: lldb-api :: commands/settings/quoting/TestQuoting.py (1355 of 1796) PASS: lldb-unit :: Host/./HostTests/Host.GetEnvironment (1356 of 1796) PASS: lldb-unit :: Utility/./UtilityTests/ProcessInstanceInfo.DumpTable (1357 of 1796) UNSUPPORTED: lldb-shell :: SymbolFile/PDB/type-quals.test (1358 of 1796) PASS: lldb-shell :: ObjectFile/PECOFF/basic-info-arm64.yaml (1359 of 1796) PASS: lldb-api :: lang/c/bitfields/TestBitfields.py (1360 of 1796) PASS: lldb-api :: python_api/interpreter/TestRunCommandInterpreterAPI.py (1361 of 1796) PASS: lldb-unit :: Utility/./UtilityTests/ScalarTest.ComparisonFloat (1362 of 1796) PASS: lldb-shell :: Settings/TestDisassemblyFormat.test (1363 of 1796) PASS: lldb-api :: lang/objc/modules-auto-import/TestModulesAutoImport.py (1364 of 1796) PASS: lldb-api :: python_api/watchpoint/TestSetWatchpoint.py (1365 of 1796) UNSUPPORTED: lldb-api :: lang/objc/rdar-12408181/TestRdar12408181.py (1366 of 1796) PASS: lldb-api :: functionalities/breakpoint/serialize/TestBreakpointSerialization.py (1367 of 1796) PASS: lldb-api :: functionalities/data-formatter/data-formatter-objc/TestDataFormatterObjCCF.py (1368 of 1796) PASS: lldb-api :: functionalities/dead-strip/TestDeadStrip.py (1369 of 1796) PASS: lldb-unit :: Utility/./UtilityTests/SerializationRountripTest.SerializeDeserializePodPointers (1370 of 1796) PASS: lldb-unit :: Utility/./UtilityTests/ArgsTest.GetQuotedCommandString (1371 of 1796) PASS: lldb-api :: commands/expression/fixits/TestFixIts.py (1372 of 1796) PASS: lldb-unit :: Utility/./UtilityTests/DataExtractorTest.GetCStr (1373 of 1796) PASS: lldb-api :: functionalities/thread/concurrent_events/TestConcurrentBreakpointOneDelayBreakpointThreads.py (1374 of 1796) PASS: lldb-api :: functionalities/data-formatter/data-formatter-stl/libcxx/vbool/TestDataFormatterLibcxxVBool.py (1375 of 1796) PASS: lldb-unit :: Utility/./UtilityTests/StreamTeeTest.Constructor1Stream (1376 of 1796) PASS: lldb-api :: functionalities/data-formatter/data-formatter-objc/TestDataFormatterObjCNSContainer.py (1377 of 1796) PASS: lldb-api :: python_api/default-constructor/TestDefaultConstructorForAPIObjects.py (1378 of 1796) PASS: lldb-api :: types/TestIntegerTypes.py (1379 of 1796) PASS: lldb-unit :: Utility/./UtilityTests/RangeTest.ClearWithStarAddress (1380 of 1796) PASS: lldb-unit :: Utility/./UtilityTests/StringExtractorTest.DecodeHexU8_Extra (1381 of 1796) PASS: lldb-unit :: Utility/./UtilityTests/RangeTest.ContainsAddr (1382 of 1796) PASS: lldb-unit :: Language/Highlighting/./HighlighterTests/HighlighterTest.ClangScalarLiterals (1383 of 1796) PASS: lldb-unit :: Utility/./UtilityTests/ScalarTest.Scalar_512 (1384 of 1796) PASS: lldb-api :: commands/expression/completion/TestExprCompletion.py (1385 of 1796) PASS: lldb-unit :: Core/./LLDBCoreTests/RichManglingContextTest.IPDRealloc (1386 of 1796) PASS: lldb-shell :: SymbolFile/DWARF/gnu-style-compression.cpp (1387 of 1796) PASS: lldb-unit :: SymbolFile/NativePDB/./SymbolFileNativePDBTests/PDBFPOProgramToDWARFExpressionTests.UnresolvedRegisterReference (1388 of 1796) PASS: lldb-unit :: Language/Highlighting/./HighlighterTests/HighlighterTest.Colons (1389 of 1796) PASS: lldb-api :: lang/objcxx/cxx-bridged-po/TestObjCXXBridgedPO.py (1390 of 1796) PASS: lldb-unit :: Utility/./UtilityTests/AnsiTerminal.Incomplete (1391 of 1796) PASS: lldb-shell :: SymbolFile/Breakpad/line-table-mixed-path-styles.test (1392 of 1796) PASS: lldb-unit :: Process/minidump/./LLDBMinidumpTests/MinidumpParserTest.GetMemoryRegionInfoFromMemoryList (1393 of 1796) PASS: lldb-api :: functionalities/thread/concurrent_events/TestConcurrentSignalWatch.py (1394 of 1796) PASS: lldb-unit :: Utility/./UtilityTests/TimeoutTest.Construction (1395 of 1796) PASS: lldb-unit :: Utility/./UtilityTests/BinaryStreamTest.PutULEB128TwoBytes (1396 of 1796) PASS: lldb-shell :: SymbolFile/NativePDB/function-types-calling-conv.cpp (1397 of 1796) PASS: lldb-unit :: Utility/./UtilityTests/OptionsWithRawTest.ArgsButNoLeadingDash (1398 of 1796) PASS: lldb-api :: python_api/function_symbol/TestDisasmAPI.py (1399 of 1796) PASS: lldb-api :: lang/objc/exceptions/TestObjCExceptions.py (1400 of 1796) PASS: lldb-unit :: ScriptInterpreter/Python/./ScriptInterpreterPythonTests/PythonDataObjectsTest.TestPythonListValueEquality (1401 of 1796) PASS: lldb-api :: python_api/sbdata/TestSBData.py (1402 of 1796) PASS: lldb-api :: macosx/duplicate-archive-members/TestDuplicateMembers.py (1403 of 1796) PASS: lldb-unit :: Utility/./UtilityTests/ConstStringTest.MangledCounterpart (1404 of 1796) PASS: lldb-api :: commands/platform/basic/TestPlatformCommand.py (1405 of 1796) PASS: lldb-api :: functionalities/breakpoint/address_breakpoints/TestAddressBreakpoints.py (1406 of 1796) PASS: lldb-unit :: Utility/./UtilityTests/CompletionRequest.FakeLastArg (1407 of 1796) PASS: lldb-api :: python_api/process/io/TestProcessIO.py (1408 of 1796) PASS: lldb-shell :: Breakpoint/ppc64-localentry.test (1409 of 1796) PASS: lldb-unit :: Utility/./UtilityTests/TimeoutTest.Format (1410 of 1796) PASS: lldb-api :: commands/process/attach/attach_denied/TestAttachDenied.py (1411 of 1796) PASS: lldb-api :: functionalities/dynamic_value_child_count/TestDynamicValueChildCount.py (1412 of 1796) PASS: lldb-unit :: Utility/./UtilityTests/ArgsTest.TestTrailingBackslash (1413 of 1796) PASS: lldb-unit :: UnwindAssembly/ARM64/./Arm64InstEmulationTests/TestArm64InstEmulation.TestRegisterDoubleSpills (1414 of 1796) PASS: lldb-api :: commands/watchpoints/watchpoint_commands/condition/TestWatchpointConditionCmd.py (1415 of 1796) PASS: lldb-unit :: UnwindAssembly/x86/./UnwindAssemblyx86Tests/Testx86AssemblyInspectionEngine.TestPopR13 (1416 of 1796) PASS: lldb-shell :: Process/TestEnvironment.test (1417 of 1796) PASS: lldb-api :: commands/expression/import-std-module/shared_ptr/TestSharedPtr.py (1418 of 1796) PASS: lldb-shell :: SymbolFile/DWARF/debug-line-basic.s (1419 of 1796) PASS: lldb-unit :: Language/Highlighting/./HighlighterTests/HighlighterTest.ClangCommas (1420 of 1796) PASS: lldb-api :: functionalities/data-formatter/data-formatter-categories/TestDataFormatterCategories.py (1421 of 1796) PASS: lldb-shell :: ObjectFile/ELF/netbsd-exec-8.99.30-amd64.yaml (1422 of 1796) PASS: lldb-api :: functionalities/thread/concurrent_events/TestConcurrentTwoWatchpointThreads.py (1423 of 1796) UNSUPPORTED: lldb-api :: functionalities/thread/create_during_step/TestCreateDuringStep.py (1424 of 1796) PASS: lldb-shell :: Minidump/disassemble-no-module.yaml (1425 of 1796) PASS: lldb-api :: lang/objc/foundation/TestSymbolTable.py (1426 of 1796) PASS: lldb-api :: functionalities/testid/TestTestId.py (1427 of 1796) PASS: lldb-api :: lang/cpp/thread_local/TestThreadLocal.py (1428 of 1796) PASS: lldb-api :: lang/objc/objc-struct-return/TestObjCStructReturn.py (1429 of 1796) PASS: lldb-unit :: Utility/./UtilityTests/StringExtractorTest.GetHexBytes_OddPair (1430 of 1796) PASS: lldb-unit :: Utility/./UtilityTests/StringListTest.JoinNonSpace (1431 of 1796) PASS: lldb-shell :: SymbolFile/NativePDB/ast-methods.cpp (1432 of 1796) PASS: lldb-api :: functionalities/tsan/thread_leak/TestTsanThreadLeak.py (1433 of 1796) PASS: lldb-shell :: Settings/TestDisableColor.test (1434 of 1796) PASS: lldb-unit :: Utility/./UtilityTests/RangeTest.Union (1435 of 1796) PASS: lldb-api :: functionalities/thread/exit_during_step/TestExitDuringStep.py (1436 of 1796) PASS: lldb-unit :: Symbol/./SymbolTests/Type.CompilerContextPattern (1437 of 1796) PASS: lldb-api :: functionalities/data-formatter/data-formatter-objc/TestDataFormatterObjCNSError.py (1438 of 1796) PASS: lldb-api :: lang/cpp/type_lookup/TestCppTypeLookup.py (1439 of 1796) PASS: lldb-api :: functionalities/data-formatter/setvaluefromcstring/TestSetValueFromCString.py (1440 of 1796) PASS: lldb-unit :: Utility/./UtilityTests/OptionsWithRawTest.QuotedSuffix (1441 of 1796) PASS: lldb-shell :: ObjectFile/ELF/PT_LOAD-overlap-PT_TLS.yaml (1442 of 1796) PASS: lldb-unit :: Expression/./ExpressionTests/DiagnosticManagerTest.GetStringBasic (1443 of 1796) PASS: lldb-api :: functionalities/data-formatter/data-formatter-synthval/TestDataFormatterSynthVal.py (1444 of 1796) PASS: lldb-api :: commands/expression/import-std-module/basic/TestImportStdModule.py (1445 of 1796) PASS: lldb-api :: functionalities/thread/concurrent_events/TestConcurrentNWatchNBreak.py (1446 of 1796) PASS: lldb-api :: commands/command/source/TestCommandSource.py (1447 of 1796) PASS: lldb-api :: functionalities/data-formatter/data-formatter-stl/libcxx/set/TestDataFormatterLibcxxSet.py (1448 of 1796) PASS: lldb-unit :: Core/./LLDBCoreTests/RichManglingContextTest.FromCxxMethodName (1449 of 1796) PASS: lldb-unit :: Process/gdb-remote/./ProcessGdbRemoteTests/GDBRemoteCommunicationClientTest.SendSignalsToIgnore (1450 of 1796) PASS: lldb-api :: commands/expression/top-level/TestTopLevelExprs.py (1451 of 1796) PASS: lldb-unit :: Utility/./UtilityTests/Flags.Clear (1452 of 1796) PASS: lldb-unit :: ObjectFile/ELF/./ObjectFileELFTests/ObjectFileELFTest.GetSymtab_NoSymEntryPointArmAddressClass (1453 of 1796) PASS: lldb-unit :: Utility/./UtilityTests/BinaryStreamTest.PutULEB128OneByte (1454 of 1796) PASS: lldb-unit :: Language/Highlighting/./HighlighterTests/HighlighterTest.ClangUnterminatedString (1455 of 1796) PASS: lldb-shell :: ObjectFile/ELF/section-overlap.yaml (1456 of 1796) PASS: lldb-unit :: Utility/./UtilityTests/Flags.Reset (1457 of 1796) PASS: lldb-unit :: Utility/./UtilityTests/SerializationRountripTest.SerializeDeserializeCString (1458 of 1796) PASS: lldb-api :: functionalities/data-formatter/synthupdate/TestSyntheticFilterRecompute.py (1459 of 1796) PASS: lldb-unit :: Host/./HostTests/ConnectionFileDescriptorTest.TCPGetURIv4 (1460 of 1796) PASS: lldb-api :: commands/expression/import-std-module/vector-bool/TestBoolVector.py (1461 of 1796) PASS: lldb-shell :: ObjectFile/ELF/many-sections.s (1462 of 1796) PASS: lldb-unit :: Utility/./UtilityTests/StringExtractorTest.GetHexBytesAvail_FullString (1463 of 1796) PASS: lldb-api :: lang/objc/single-entry-dictionary/TestObjCSingleEntryDictionary.py (1464 of 1796) PASS: lldb-api :: commands/add-dsym/uuid/TestAddDsymCommand.py (1465 of 1796) PASS: lldb-shell :: Breakpoint/debug_addrx.test (1466 of 1796) PASS: lldb-api :: lang/objc/objc-optimized/TestObjcOptimized.py (1467 of 1796) PASS: lldb-unit :: ScriptInterpreter/Python/./ScriptInterpreterPythonTests/PythonDataObjectsTest.TestPythonListToStructuredList (1468 of 1796) PASS: lldb-api :: functionalities/abbreviation/TestAbbreviations.py (1469 of 1796) PASS: lldb-api :: lang/cpp/const_this/TestConstThis.py (1470 of 1796) PASS: lldb-unit :: SymbolFile/DWARF/./SymbolFileDWARFTests/SymbolFileDWARFTests.TestAbbrevOrder1Start5 (1471 of 1796) PASS: lldb-api :: functionalities/modern-type-lookup/basic/TestBasicModernTypeLookup.py (1472 of 1796) PASS: lldb-unit :: Utility/./UtilityTests/StringExtractorTest.GetHexBytesAvail (1473 of 1796) PASS: lldb-shell :: BuildScript/modes.test (1474 of 1796) PASS: lldb-unit :: Utility/./UtilityTests/NameMatchesTest.Equals (1475 of 1796) PASS: lldb-unit :: Expression/./ExpressionTests/DiagnosticManagerTest.AddDiagnostic (1476 of 1796) PASS: lldb-api :: python_api/objc_type/TestObjCType.py (1477 of 1796) PASS: lldb-shell :: SymbolFile/DWARF/apple-index-is-used.cpp (1478 of 1796) PASS: lldb-unit :: Core/./LLDBCoreTests/MangledTest.NameIndexes_FindFunctionSymbols (1479 of 1796) UNSUPPORTED: lldb-shell :: BuildScript/toolchain-msvc.test (1480 of 1796) PASS: lldb-shell :: Quit/TestQuitExitCodeImplicit0.test (1481 of 1796) PASS: lldb-api :: commands/help/TestHelp.py (1482 of 1796) UNSUPPORTED: lldb-shell :: SymbolFile/PDB/function-level-linking.test (1483 of 1796) PASS: lldb-api :: lang/objc/ivar-IMP/TestObjCiVarIMP.py (1484 of 1796) PASS: lldb-unit :: Utility/./UtilityTests/StringExtractorTest.GetHexBytesAvail_Underflow (1485 of 1796) PASS: lldb-unit :: Utility/./UtilityTests/ProcessInstanceInfo.DumpTable_invalidUID (1486 of 1796) PASS: lldb-api :: functionalities/postmortem/elf-core/TestLinuxCore.py (1487 of 1796) UNSUPPORTED: lldb-api :: lang/objc/objc-dynamic-value/TestObjCDynamicValue.py (1488 of 1796) PASS: lldb-unit :: UnwindAssembly/x86/./UnwindAssemblyx86Tests/Testx86AssemblyInspectionEngine.TestDisassemblyJunkBytes (1489 of 1796) PASS: lldb-shell :: ObjectFile/PECOFF/subsections.yaml (1490 of 1796) PASS: lldb-api :: lang/objc/global_ptrs/TestGlobalObjects.py (1491 of 1796) PASS: lldb-unit :: Utility/./UtilityTests/ConstStringTest.NullAndEmptyStates (1492 of 1796) UNSUPPORTED: lldb-api :: lang/cpp/function-template-parameter-pack/TestFunctionTemplateParameterPack.py (1493 of 1796) PASS: lldb-api :: lang/cpp/global_variables/TestCPPGlobalVariables.py (1494 of 1796) PASS: lldb-shell :: ObjectFile/MachO/lc_version_min.yaml (1495 of 1796) PASS: lldb-unit :: Utility/./UtilityTests/FileSpecTest.CopyByAppendingPathComponent (1496 of 1796) UNSUPPORTED: lldb-api :: tools/lldb-vscode/step/TestVSCode_step.py (1497 of 1796) PASS: lldb-unit :: Utility/./UtilityTests/StreamTest.PutHex64ByteOrderLittle (1498 of 1796) PASS: lldb-unit :: ScriptInterpreter/Python/./ScriptInterpreterPythonTests/PythonDataObjectsTest.TestPythonFile (1499 of 1796) PASS: lldb-unit :: Utility/./UtilityTests/NameMatchesTest.RegularExpression (1500 of 1796) PASS: lldb-api :: lang/cpp/dynamic-value-same-basename/TestDynamicValueSameBase.py (1501 of 1796) PASS: lldb-unit :: Utility/./UtilityTests/RangeTest.SizeTypes (1502 of 1796) PASS: lldb-unit :: Symbol/./SymbolTests/TestClangASTContext.TestRemoveFastQualifiers (1503 of 1796) PASS: lldb-shell :: SymbolFile/DWARF/find-variable-dwo.cpp (1504 of 1796) PASS: lldb-api :: commands/frame/diagnose/array/TestArray.py (1505 of 1796) PASS: lldb-unit :: Utility/./UtilityTests/StringListTest.ShiftStdString (1506 of 1796) PASS: lldb-api :: python_api/value_var_update/TestValueVarUpdate.py (1507 of 1796) PASS: lldb-unit :: Utility/./UtilityTests/StringListTest.InsertStringAtIndexEnd (1508 of 1796) PASS: lldb-api :: lang/objc/modules-inline-functions/TestModulesInlineFunctions.py (1509 of 1796) PASS: lldb-unit :: Utility/./UtilityTests/StringExtractorTest.GetU64LittleEndian (1510 of 1796) PASS: lldb-unit :: Core/./LLDBCoreTests/UniqueCStringMap.NoDefaultConstructor (1511 of 1796) PASS: lldb-api :: python_api/process/read-mem-cstring/TestReadMemCString.py (1512 of 1796) PASS: lldb-api :: functionalities/data-formatter/compactvectors/TestCompactVectors.py (1513 of 1796) PASS: lldb-api :: lang/c/local_variables/TestLocalVariables.py (1514 of 1796) PASS: lldb-unit :: ScriptInterpreter/Python/./ScriptInterpreterPythonTests/PythonDataObjectsTest.TestPythonIntegerToStr (1515 of 1796) PASS: lldb-api :: functionalities/data-formatter/data-formatter-stl/libcxx/tuple/TestDataFormatterLibcxxTuple.py (1516 of 1796) PASS: lldb-unit :: Signals/./SignalsTests/UnixSignalsTest.VersionChange (1517 of 1796) PASS: lldb-unit :: Utility/./UtilityTests/StreamTeeTest.GetStreamAtIndexOutOfBounds (1518 of 1796) PASS: lldb-unit :: Utility/./UtilityTests/StringExtractorTest.GetHexBytesAvail_OddPair (1519 of 1796) PASS: lldb-api :: functionalities/gdb_remote_client/TestTargetXMLArch.py (1520 of 1796) PASS: lldb-api :: lang/objc/self/TestObjCSelf.py (1521 of 1796) PASS: lldb-unit :: Language/Highlighting/./HighlighterTests/HighlighterTest.DefaultHighlighterWithCursorOutOfBounds (1522 of 1796) PASS: lldb-unit :: UnwindAssembly/x86/./UnwindAssemblyx86Tests/Testx86AssemblyInspectionEngine.TestSpArithx86_64Augmented (1523 of 1796) PASS: lldb-unit :: debugserver/./debugserverTests/RNBSocket.LoopBackConnectIPv4 (1524 of 1796) PASS: lldb-api :: functionalities/data-formatter/data-formatter-synth/TestDataFormatterSynth.py (1525 of 1796) PASS: lldb-api :: python_api/symbol-context/TestSymbolContext.py (1526 of 1796) PASS: lldb-unit :: Process/minidump/./LLDBMinidumpTests/MinidumpParserTest.GetMemoryRegionInfo (1527 of 1796) PASS: lldb-api :: commands/watchpoints/hello_watchpoint/TestMyFirstWatchpoint.py (1528 of 1796) PASS: lldb-unit :: UnwindAssembly/x86/./UnwindAssemblyx86Tests/Testx86AssemblyInspectionEngine.TestPushR15 (1529 of 1796) PASS: lldb-api :: functionalities/postmortem/netbsd-core/TestNetBSDCore.py (1530 of 1796) PASS: lldb-unit :: Utility/./UtilityTests/UriParserTest.LongPath (1531 of 1796) PASS: lldb-api :: functionalities/gdb_remote_client/TestStopPCs.py (1532 of 1796) PASS: lldb-unit :: UnwindAssembly/x86/./UnwindAssemblyx86Tests/Testx86AssemblyInspectionEngine.TestSimple32bitFrameFunction (1533 of 1796) PASS: lldb-unit :: Target/./TargetTests/ModuleCacheTest.GetAndPut (1534 of 1796) PASS: lldb-unit :: Utility/./UtilityTests/RecordReplayTest.InstrumentedFooSameThis (1535 of 1796) PASS: lldb-api :: lang/cpp/stl/TestSTL.py (1536 of 1796) PASS: lldb-shell :: ObjectFile/ELF/section-addresses.yaml (1537 of 1796) PASS: lldb-unit :: UnwindAssembly/x86/./UnwindAssemblyx86Tests/Testx86AssemblyInspectionEngine.TestPushRBX (1538 of 1796) XFAIL: lldb-shell :: SymbolFile/DWARF/find-type-in-function.cpp (1539 of 1796) PASS: lldb-shell :: Reproducer/TestSynchronous.test (1540 of 1796) PASS: lldb-unit :: Target/./TargetTests/ModuleCacheTest.GetAndPutStrangeHostname (1541 of 1796) PASS: lldb-api :: functionalities/gdb_remote_client/TestPlatformClient.py (1542 of 1796) PASS: lldb-unit :: UnwindAssembly/x86/./UnwindAssemblyx86Tests/Testx86AssemblyInspectionEngine.Test64bitFramelessSmallStackFrame (1543 of 1796) UNSUPPORTED: lldb-shell :: SymbolFile/PDB/variables-locations.test (1544 of 1796) PASS: lldb-unit :: ScriptInterpreter/Python/./ScriptInterpreterPythonTests/PythonDataObjectsTest.TestPythonTupleValues (1545 of 1796) PASS: lldb-api :: functionalities/thread/num_threads/TestNumThreads.py (1546 of 1796) PASS: lldb-unit :: Utility/./UtilityTests/ArgsTest.BareSingleQuote (1547 of 1796) PASS: lldb-unit :: Process/minidump/./LLDBMinidumpTests/MinidumpParserTest.GetMiscInfoWindows (1548 of 1796) PASS: lldb-unit :: Utility/./UtilityTests/StringListTest.InsertStringAtIndexStart (1549 of 1796) PASS: lldb-unit :: Utility/./UtilityTests/StringListTest.Assignment (1550 of 1796) PASS: lldb-unit :: Platform/./LLDBPlatformTests/PlatformDarwinTest.TestParseVersionBuildDir (1551 of 1796) PASS: lldb-api :: functionalities/multiword-commands/TestMultiWordCommands.py (1552 of 1796) PASS: lldb-api :: python_api/section/TestSectionAPI.py (1553 of 1796) PASS: lldb-unit :: Utility/./UtilityTests/RangeTest.ContainsEndInclusiveInvalid (1554 of 1796) PASS: lldb-shell :: Commands/command-backtrace.test (1555 of 1796) PASS: lldb-unit :: Process/minidump/./LLDBMinidumpTests/MinidumpParserTest.GetThreadContext_x86_32 (1556 of 1796) PASS: lldb-unit :: SymbolFile/DWARF/./SymbolFileDWARFTests/SymbolFileDWARFTests.TestAbbrevValidAttrNullForm (1557 of 1796) PASS: lldb-api :: commands/command/invalid-args/TestInvalidArgsCommand.py (1558 of 1796) PASS: lldb-unit :: SymbolFile/DWARF/./SymbolFileDWARFTests/DWARFASTParserClangTests.EnsureAllDIEsInDeclContextHaveBeenParsedParsesOnlyMatchingEntries (1559 of 1796) PASS: lldb-shell :: Commands/CommandScriptImmediateOutput/CommandScriptImmediateOutputFile.test (1560 of 1796) UNSUPPORTED: lldb-api :: functionalities/data-formatter/data-formatter-stl/libstdcpp/list/TestDataFormatterStdList.py (1561 of 1796) PASS: lldb-unit :: Utility/./UtilityTests/BinaryStreamTest.PutSLEB128OneByte (1562 of 1796) PASS: lldb-shell :: Breakpoint/split-dwarf-5-addrbase.test (1563 of 1796) PASS: lldb-unit :: Utility/./UtilityTests/CompletionRequest.TryCompleteCurrentArgGood (1564 of 1796) PASS: lldb-api :: python_api/hello_world/TestHelloWorld.py (1565 of 1796) PASS: lldb-api :: functionalities/data-formatter/user-format-vs-summary/TestUserFormatVsSummary.py (1566 of 1796) PASS: lldb-unit :: Utility/./UtilityTests/Flags.AllSet (1567 of 1796) PASS: lldb-api :: functionalities/breakpoint/scripted_bkpt/TestScriptedResolver.py (1568 of 1796) PASS: lldb-unit :: UnwindAssembly/x86/./UnwindAssemblyx86Tests/Testx86AssemblyInspectionEngine.TestPushEBX (1569 of 1796) UNSUPPORTED: lldb-api :: functionalities/darwin_log/filter/regex/message/TestDarwinLogFilterRegexMessage.py (1570 of 1796) PASS: lldb-unit :: Utility/./UtilityTests/EnvironmentTest.EnvpConstruction (1571 of 1796) PASS: lldb-api :: macosx/find-dsym/bundle-with-dot-in-filename/TestBundleWithDotInFilename.py (1572 of 1796) PASS: lldb-unit :: Utility/./UtilityTests/EventTest.DumpEventDataBytes (1573 of 1796) UNSUPPORTED: lldb-shell :: Process/Windows/exception_access_violation.cpp (1574 of 1796) PASS: lldb-unit :: Utility/./UtilityTests/StreamTeeTest.Assignment (1575 of 1796) PASS: lldb-shell :: ObjectFile/ELF/section-permissions.yaml (1576 of 1796) PASS: lldb-unit :: Utility/./UtilityTests/StructuredDataTest.StringDump (1577 of 1796) PASS: lldb-unit :: Utility/./UtilityTests/StringLexerTest.PutBack (1578 of 1796) PASS: lldb-unit :: Utility/./UtilityTests/StringListTest.RemoveBlankLines (1579 of 1796) PASS: lldb-shell :: ObjectFile/ELF/duplicate-section.yaml (1580 of 1796) UNSUPPORTED: lldb-api :: functionalities/darwin_log/source/debug/TestDarwinLogSourceDebug.py (1581 of 1796) PASS: lldb-api :: functionalities/data-formatter/data-formatter-named-summaries/TestDataFormatterNamedSummaries.py (1582 of 1796) PASS: lldb-unit :: Language/Highlighting/./HighlighterTests/HighlighterTest.ClangComments (1583 of 1796) UNSUPPORTED: lldb-api :: tools/lldb-vscode/breakpoint/TestVSCode_setExceptionBreakpoints.py (1584 of 1796) PASS: lldb-unit :: Symbol/./SymbolTests/TestClangASTContext.TestGetBasicTypeFromEnum (1585 of 1796) PASS: lldb-unit :: Host/./HostTests/HostInfoTest.GetHostname (1586 of 1796) PASS: lldb-unit :: Language/Highlighting/./HighlighterTests/HighlighterTest.Keywords (1587 of 1796) PASS: lldb-api :: lang/c/inlines/TestRedefinitionsInInlines.py (1588 of 1796) PASS: lldb-shell :: Settings/TestFrameFormatNoColor.test (1589 of 1796) PASS: lldb-unit :: Utility/./UtilityTests/UriParserTest.Empty (1590 of 1796) PASS: lldb-unit :: Symbol/./SymbolTests/DWARFCallFrameInfoTest.Basic_dwarf4 (1591 of 1796) PASS: lldb-api :: functionalities/breakpoint/inlined_breakpoints/TestInlinedBreakpoints.py (1592 of 1796) UNSUPPORTED: lldb-shell :: Register/x86-64-zmm-write.test (1593 of 1796) PASS: lldb-api :: functionalities/data-formatter/data-formatter-stl/libcxx/map/TestDataFormatterLibccMap.py (1594 of 1796) PASS: lldb-api :: functionalities/thread/concurrent_events/TestConcurrentSignalDelayBreak.py (1595 of 1796) PASS: lldb-unit :: Process/minidump/./LLDBMinidumpTests/MinidumpParserTest.GetThreadContext_x86_32_wow64 (1596 of 1796) PASS: lldb-api :: commands/process/launch/TestProcessLaunch.py (1597 of 1796) PASS: lldb-api :: lang/objc/foundation/TestObjCMethods2.py (1598 of 1796) PASS: lldb-api :: lang/cpp/diamond/TestDiamond.py (1599 of 1796) PASS: lldb-api :: python_api/watchpoint/TestWatchpointIter.py (1600 of 1796) PASS: lldb-api :: functionalities/thread/concurrent_events/TestConcurrentDelayedCrashWithBreakpointSignal.py (1601 of 1796) PASS: lldb-unit :: Process/minidump/./LLDBMinidumpTests/MinidumpParserTest.MinidumpDuplicateModuleMinAddress (1602 of 1796) PASS: lldb-api :: functionalities/inline-stepping/TestInlineStepping.py (1603 of 1796) PASS: lldb-shell :: Reproducer/TestRelativePath.test (1604 of 1796) PASS: lldb-unit :: Utility/./UtilityTests/StringListTest.InsertStringAtIndexStdString (1605 of 1796) PASS: lldb-api :: functionalities/plugins/command_plugin/TestPluginCommands.py (1606 of 1796) PASS: lldb-api :: lang/objc/objc-runtime-ivars/TestRuntimeIvars.py (1607 of 1796) PASS: lldb-unit :: ObjectFile/Breakpad/./ObjectFileBreakpadTests/StackCFIRecord.parse (1608 of 1796) PASS: lldb-unit :: Process/gdb-remote/./ProcessGdbRemoteTests/GDBRemoteCommunicationClientTest.SendGetMetaDataPacket (1609 of 1796) UNSUPPORTED: lldb-api :: tools/lldb-server/thread-name/TestGdbRemoteThreadName.py (1610 of 1796) PASS: lldb-api :: commands/expression/test/TestExprs2.py (1611 of 1796) UNSUPPORTED: lldb-api :: functionalities/thread/concurrent_events/TestConcurrentManySignals.py (1612 of 1796) PASS: lldb-api :: functionalities/postmortem/elf-core/gcore/TestGCore.py (1613 of 1796) PASS: lldb-api :: functionalities/data-formatter/varscript_formatting/TestDataFormatterVarScriptFormatting.py (1614 of 1796) PASS: lldb-api :: commands/frame/diagnose/virtual-method-call/TestDiagnoseDereferenceVirtualMethodCall.py (1615 of 1796) PASS: lldb-unit :: ScriptInterpreter/Python/./ScriptInterpreterPythonTests/PythonExceptionStateTest.TestResetSemantics (1616 of 1796) PASS: lldb-unit :: Utility/./UtilityTests/RangeTest.SetRangeBase (1617 of 1796) UNSUPPORTED: lldb-api :: functionalities/breakpoint/hardware_breakpoints/hardware_breakpoint_on_multiple_threads/TestHWBreakMultiThread.py (1618 of 1796) PASS: lldb-unit :: Process/gdb-remote/./ProcessGdbRemoteTests/GDBRemoteClientBaseTest.SendContinueAndWait (1619 of 1796) PASS: lldb-api :: python_api/interpreter/TestCommandInterpreterAPI.py (1620 of 1796) PASS: lldb-unit :: Language/Highlighting/./HighlighterTests/HighlighterTest.ClangSquareBrackets (1621 of 1796) PASS: lldb-api :: lang/objc/objc-property/TestObjCProperty.py (1622 of 1796) PASS: lldb-api :: commands/expression/import-std-module/unique_ptr/TestUniquePtr.py (1623 of 1796) PASS: lldb-unit :: Utility/./UtilityTests/RegularExpression.CopyAssignment (1624 of 1796) PASS: lldb-unit :: Utility/./UtilityTests/StringListTest.ShiftMove (1625 of 1796) PASS: lldb-shell :: ObjectFile/ELF/PT_LOAD.yaml (1626 of 1796) UNSUPPORTED: lldb-api :: lang/cpp/static_members/TestCPPStaticMembers.py (1627 of 1796) PASS: lldb-unit :: Process/gdb-remote/./ProcessGdbRemoteTests/GDBRemoteCommunicationServerTest.SendErrorResponse_ErrorList (1628 of 1796) UNSUPPORTED: lldb-shell :: Register/x86-gp-write.test (1629 of 1796) PASS: lldb-unit :: Utility/./UtilityTests/ConstStringTest.format_provider (1630 of 1796) PASS: lldb-api :: functionalities/breakpoint/breakpoint_command/TestBreakpointCommand.py (1631 of 1796) UNSUPPORTED: lldb-api :: lang/cpp/printf/TestPrintf.py (1632 of 1796) PASS: lldb-api :: commands/expression/inline-namespace/TestInlineNamespace.py (1633 of 1796) PASS: lldb-api :: python_api/frame/TestFrames.py (1634 of 1796) PASS: lldb-api :: commands/expression/persist_objc_pointeetype/TestPersistObjCPointeeType.py (1635 of 1796) PASS: lldb-unit :: Utility/./UtilityTests/StringListTest.LongestCommonPrefixSingleElement (1636 of 1796) PASS: lldb-api :: functionalities/float-display/TestFloatDisplay.py (1637 of 1796) PASS: lldb-api :: python_api/value/TestValueAPI.py (1638 of 1796) PASS: lldb-unit :: Utility/./UtilityTests/OptionsWithRawTest.LeadingSpaceArgs (1639 of 1796) PASS: lldb-api :: macosx/find-app-in-bundle/TestFindAppInBundle.py (1640 of 1796) PASS: lldb-shell :: Register/x86-64-ymm-read.test (1641 of 1796) PASS: lldb-api :: functionalities/data-formatter/data-formatter-stl/libcxx/iterator/TestDataFormatterLibccIterator.py (1642 of 1796) PASS: lldb-api :: commands/expression/import-std-module/sysroot/TestStdModuleSysroot.py (1643 of 1796) PASS: lldb-api :: lang/objc/foundation/TestObjCMethods.py (1644 of 1796) PASS: lldb-api :: python_api/sblaunchinfo/TestSBLaunchInfo.py (1645 of 1796) PASS: lldb-unit :: ScriptInterpreter/Python/./ScriptInterpreterPythonTests/PythonExceptionStateTest.TestAutoRestoreSemantics (1646 of 1796) PASS: lldb-api :: api/command-return-object/TestSBCommandReturnObject.py (1647 of 1796) PASS: lldb-api :: functionalities/tail_call_frames/disambiguate_call_site/TestDisambiguateCallSite.py (1648 of 1796) PASS: lldb-unit :: Interpreter/./InterpreterTests/OptionArgParserTest.toBoolean (1649 of 1796) PASS: lldb-unit :: Process/gdb-remote/./ProcessGdbRemoteTests/GDBRemoteCommunicationTest.ReadPacket_checksum (1650 of 1796) PASS: lldb-shell :: Minidump/fb-dump.test (1651 of 1796) PASS: lldb-unit :: Process/minidump/./LLDBMinidumpTests/RegisterContextMinidump.ConvertMinidumpContext_x86_32 (1652 of 1796) PASS: lldb-api :: functionalities/unwind/noreturn/TestNoreturnUnwind.py (1653 of 1796) PASS: lldb-unit :: Utility/./UtilityTests/StringListTest.SplitIntoLinesSingleTrailingCR (1654 of 1796) PASS: lldb-api :: lang/cpp/namespace/TestNamespaceLookup.py (1655 of 1796) PASS: lldb-shell :: ObjectFile/ELF/PT_LOAD-overlap.yaml (1656 of 1796) PASS: lldb-unit :: UnwindAssembly/x86/./UnwindAssemblyx86Tests/Testx86AssemblyInspectionEngine.TestPopR12 (1657 of 1796) PASS: lldb-unit :: Host/./HostTests/NativeProcessProtocolTest.ReadCStringFromMemory_MaxSize (1658 of 1796) PASS: lldb-api :: commands/expression/namespace_local_var_same_name_obj_c/TestNamespaceLocalVarSameNameObjC.py (1659 of 1796) PASS: lldb-unit :: Host/./HostTests/SocketTest.TCPGetAddress (1660 of 1796) PASS: lldb-unit :: Utility/./UtilityTests/ArgsTest.TestMultipleArgs (1661 of 1796) PASS: lldb-unit :: Process/gdb-remote/./ProcessGdbRemoteTests/GDBRemoteCommunicationClientTest.GetModulesInfo_UUID20 (1662 of 1796) PASS: lldb-unit :: Process/gdb-remote/./ProcessGdbRemoteTests/GDBRemoteClientBaseTest.SendPacketAndReceiveResponseWithOutputSupport (1663 of 1796) PASS: lldb-unit :: Process/gdb-remote/./ProcessGdbRemoteTests/GDBRemoteCommunicationServerTest.SendErrorResponse_Status (1664 of 1796) UNSUPPORTED: lldb-api :: benchmarks/libcxxlist/TestBenchmarkLibcxxList.py (1665 of 1796) PASS: lldb-api :: tools/lldb-server/TestGdbRemoteExpeditedRegisters.py (1666 of 1796) PASS: lldb-unit :: Utility/./UtilityTests/StringLexerTest.NextIf (1667 of 1796) PASS: lldb-api :: functionalities/breakpoint/cpp_exception/TestCPPExceptionBreakpoint.py (1668 of 1796) PASS: lldb-shell :: Unwind/trap_frame_sym_ctx.test (1669 of 1796) PASS: lldb-unit :: Host/./HostTests/MainLoopTest.Signal (1670 of 1796) PASS: lldb-unit :: Expression/./ExpressionTests/DiagnosticManagerTest.HasFixits (1671 of 1796) PASS: lldb-unit :: Process/gdb-remote/./ProcessGdbRemoteTests/GDBRemoteCommunicationClientTest.TestPacketSpeedJSON (1672 of 1796) PASS: lldb-unit :: Interpreter/./InterpreterTests/CompletionTest.DirCompletionAbsolute (1673 of 1796) PASS: lldb-api :: functionalities/data-formatter/frameformat_smallstruct/TestFrameFormatSmallStruct.py (1674 of 1796) PASS: lldb-api :: commands/expression/test/TestExprs.py (1675 of 1796) UNSUPPORTED: lldb-shell :: Register/x86-64-gp-write.test (1676 of 1796) PASS: lldb-unit :: SymbolFile/DWARF/./SymbolFileDWARFTests/SymbolFileDWARFTests.TestAbbrevOrder1Start1 (1677 of 1796) PASS: lldb-unit :: Language/CPlusPlus/./LanguageCPlusPlusTests/CPlusPlusLanguage.MethodNameParsing (1678 of 1796) PASS: lldb-unit :: Utility/./UtilityTests/StreamTest.PutBytesAsRawHex8ToMixedEndian (1679 of 1796) PASS: lldb-unit :: Utility/./UtilityTests/UUIDTest.Validity (1680 of 1796) PASS: lldb-unit :: Utility/./UtilityTests/AnsiTerminal.AtEnd (1681 of 1796) PASS: lldb-unit :: tools/lldb-server/tests/./LLDBServerTests/StandardStartupTest.TestStopReplyContainsThreadPcs (1682 of 1796) PASS: lldb-api :: commands/expression/import-std-module/deque-basic/TestBasicDeque.py (1683 of 1796) PASS: lldb-unit :: Utility/./UtilityTests/StreamTest.PutStringAsRawHex8 (1684 of 1796) PASS: lldb-shell :: Reproducer/TestGDBRemoteRepro.test (1685 of 1796) PASS: lldb-unit :: Utility/./UtilityTests/Predicate.WaitForValueEqualTo (1686 of 1796) PASS: lldb-api :: lang/objc/objc-class-method/TestObjCClassMethod.py (1687 of 1796) PASS: lldb-unit :: Host/./HostTests/NativeProcessProtocolTest.SetBreakpointFailWrite (1688 of 1796) PASS: lldb-unit :: Host/./HostTests/SocketTest.UDPConnect (1689 of 1796) PASS: lldb-unit :: Signals/./SignalsTests/UnixSignalsTest.Iteration (1690 of 1796) PASS: lldb-unit :: Host/./HostTests/FileSystemTest.GetPermissions (1691 of 1796) PASS: lldb-api :: functionalities/memory-region/TestMemoryRegion.py (1692 of 1796) PASS: lldb-unit :: Utility/./UtilityTests/OptionsWithRawTest.EmptySuffix (1693 of 1796) PASS: lldb-unit :: Utility/./UtilityTests/StatusTest.Formatv (1694 of 1796) PASS: lldb-unit :: tools/lldb-server/tests/./LLDBServerTests/TestBase.LaunchModePreservesEnvironment (1695 of 1796) PASS: lldb-unit :: Interpreter/./InterpreterTests/OptionArgParserTest.toScriptLanguage (1696 of 1796) PASS: lldb-api :: functionalities/postmortem/wow64_minidump/TestWow64MiniDump.py (1697 of 1796) PASS: lldb-api :: commands/frame/var-scope/TestFrameVariableScope.py (1698 of 1796) PASS: lldb-unit :: ScriptInterpreter/Python/./ScriptInterpreterPythonTests/PythonDataObjectsTest.TestPythonIntegerToStructuredInteger (1699 of 1796) PASS: lldb-api :: python_api/lldbutil/frame/TestFrameUtils.py (1700 of 1796) PASS: lldb-api :: functionalities/thread/concurrent_events/TestConcurrentTwoBreakpointsOneDelaySignal.py (1701 of 1796) PASS: lldb-unit :: Utility/./UtilityTests/RangeTest.Slide (1702 of 1796) PASS: lldb-unit :: Utility/./UtilityTests/BroadcasterTest.EventTypeHasListeners (1703 of 1796) PASS: lldb-unit :: Utility/./UtilityTests/StreamTest.PutCStringWithStringRef (1704 of 1796) PASS: lldb-unit :: Utility/./UtilityTests/FileSpecTest.AppendPathComponent (1705 of 1796) PASS: lldb-unit :: Process/minidump/./LLDBMinidumpTests/MinidumpParserTest.GetExceptionStream (1706 of 1796) UNSUPPORTED: lldb-api :: lang/objc/bitfield_ivars/TestBitfieldIvars.py (1707 of 1796) PASS: lldb-api :: commands/frame/var/TestFrameVar.py (1708 of 1796) PASS: lldb-shell :: SymbolFile/DWARF/deterministic-build.cpp (1709 of 1796) PASS: lldb-shell :: SymbolFile/Breakpad/symtab.test (1710 of 1796) PASS: lldb-shell :: SymbolFile/DWARF/find-variable-file.cpp (1711 of 1796) PASS: lldb-api :: functionalities/thread/thread_specific_break/TestThreadSpecificBreakpoint.py (1712 of 1796) PASS: lldb-unit :: Utility/./UtilityTests/UriParserTest.Minimal (1713 of 1796) PASS: lldb-unit :: Utility/./UtilityTests/ProcessInfoTest.Constructor (1714 of 1796) PASS: lldb-shell :: ObjectFile/ELF/base-address.yaml (1715 of 1796) PASS: lldb-shell :: Driver/TestFile.test (1716 of 1796) PASS: lldb-unit :: Utility/./UtilityTests/Flags.GetBitSize (1717 of 1796) PASS: lldb-unit :: Expression/./ExpressionTests/CppModuleConfigurationTest.AmbiguousCLib (1718 of 1796) PASS: lldb-api :: functionalities/postmortem/elf-core/thread_crash/TestLinuxCoreThreads.py (1719 of 1796) PASS: lldb-unit :: Utility/./UtilityTests/ScalarTest.GetValue (1720 of 1796) PASS: lldb-api :: lang/cpp/namespace_conflicts/TestNamespaceConflicts.py (1721 of 1796) PASS: lldb-unit :: SymbolFile/NativePDB/./SymbolFileNativePDBTests/PDBFPOProgramToDWARFExpressionTests.UnresolvedRegisterAssignmentReference (1722 of 1796) PASS: lldb-unit :: Utility/./UtilityTests/FileSpecTest.EqualDotsWindows (1723 of 1796) PASS: lldb-unit :: SymbolFile/DWARF/./SymbolFileDWARFTests/SymbolFileDWARFTests.TestAbbrevOutOfOrder (1724 of 1796) PASS: lldb-shell :: Reproducer/TestWorkingDir.test (1725 of 1796) PASS: lldb-api :: functionalities/load_unload/TestLoadUnload.py (1726 of 1796) PASS: lldb-api :: commands/disassemble/basic/TestFrameDisassemble.py (1727 of 1796) PASS: lldb-unit :: Utility/./UtilityTests/BinaryStreamTest.PutULEB128ThreeBytes (1728 of 1796) PASS: lldb-api :: commands/watchpoints/watchpoint_commands/TestWatchpointCommands.py (1729 of 1796) PASS: lldb-api :: functionalities/thread/concurrent_events/TestConcurrentCrashWithSignal.py (1730 of 1796) PASS: lldb-api :: commands/expression/import-std-module/stack/TestStack.py (1731 of 1796) PASS: lldb-unit :: Utility/./UtilityTests/VMRange.CollectionContains (1732 of 1796) PASS: lldb-unit :: Utility/./UtilityTests/RangeTest.Clear (1733 of 1796) PASS: lldb-api :: commands/expression/namespace_local_var_same_name_cpp_and_c/TestNamespaceLocalVarSameNameCppAndC.py (1734 of 1796) PASS: lldb-unit :: UnwindAssembly/PPC64/./PPC64InstEmulationTests/TestPPC64InstEmulation.TestSimpleFunction (1735 of 1796) PASS: lldb-unit :: Symbol/./SymbolTests/PostfixExpression.ParseFPOProgram (1736 of 1796) PASS: lldb-api :: lang/objc/foundation/TestObjectDescriptionAPI.py (1737 of 1796) PASS: lldb-unit :: Utility/./UtilityTests/StringLexerTest.Peek (1738 of 1796) PASS: lldb-api :: macosx/indirect_symbol/TestIndirectSymbols.py (1739 of 1796) PASS: lldb-api :: driver/batch_mode/TestBatchMode.py (1740 of 1796) PASS: lldb-unit :: Process/gdb-remote/./ProcessGdbRemoteTests/GDBRemoteCommunicationClientTest.SaveRestoreRegistersNoSuffix (1741 of 1796) PASS: lldb-api :: functionalities/abbreviation/TestCommonShortSpellings.py (1742 of 1796) PASS: lldb-unit :: Process/gdb-remote/./ProcessGdbRemoteTests/GDBRemoteCommunicationClientTest.ReadRegister (1743 of 1796) PASS: lldb-shell :: Host/TestCustomShell.test (1744 of 1796) PASS: lldb-api :: macosx/find-dsym/deep-bundle/TestDeepBundle.py (1745 of 1796) PASS: lldb-unit :: Utility/./UtilityTests/StatusTest.ErrorConversion (1746 of 1796) PASS: lldb-api :: macosx/nslog/TestDarwinNSLogOutput.py (1747 of 1796) PASS: lldb-shell :: Driver/TestTarget.test (1748 of 1796) PASS: lldb-api :: python_api/sbvalue_persist/TestSBValuePersist.py (1749 of 1796) PASS: lldb-unit :: ScriptInterpreter/Python/./ScriptInterpreterPythonTests/PythonDataObjectsTest.TestExtractingUInt64ThroughStructuredData (1750 of 1796) PASS: lldb-unit :: Target/./TargetTests/ExecutionContextTest.GetByteOrderProcess (1751 of 1796) PASS: lldb-shell :: SymbolFile/NativePDB/ast-types.cpp (1752 of 1796) PASS: lldb-api :: functionalities/breakpoint/breakpoint_names/TestBreakpointNames.py (1753 of 1796) PASS: lldb-unit :: SymbolFile/DWARF/./SymbolFileDWARFTests/SymbolFileDWARFTests.TestAbilitiesForDWARF (1754 of 1796) PASS: lldb-api :: python_api/lldbutil/process/TestPrintStackTraces.py (1755 of 1796) PASS: lldb-api :: commands/reproducer/invalid-args/TestInvalidArgsReproducer.py (1756 of 1796) PASS: lldb-unit :: Host/./HostTests/MainLoopTest.DetectsEOF (1757 of 1796) PASS: lldb-api :: functionalities/breakpoint/auto_continue/TestBreakpointAutoContinue.py (1758 of 1796) PASS: lldb-unit :: Utility/./UtilityTests/LogTest.Unregister (1759 of 1796) PASS: lldb-api :: functionalities/data-formatter/hexcaps/TestDataFormatterHexCaps.py (1760 of 1796) PASS: lldb-api :: lang/c/strings/TestCStrings.py (1761 of 1796) PASS: lldb-unit :: Utility/./UtilityTests/Flags.IsClear (1762 of 1796) PASS: lldb-shell :: Heap/heap-cstr.test (1763 of 1796) PASS: lldb-unit :: ScriptInterpreter/Python/./ScriptInterpreterPythonTests/PythonDataObjectsTest.TestModuleNameResolutionNoDot (1764 of 1796) PASS: lldb-unit :: Utility/./UtilityTests/VMRange.SetEndAddress (1765 of 1796) PASS: lldb-unit :: Utility/./UtilityTests/RangeTest.EqualInvalid (1766 of 1796) PASS: lldb-api :: functionalities/thread/concurrent_events/TestConcurrentTwoWatchpointsOneSignal.py (1767 of 1796) PASS: lldb-unit :: ScriptInterpreter/Python/./ScriptInterpreterPythonTests/PythonDataObjectsTest.TestInstanceNameResolutionNoDot (1768 of 1796) UNSUPPORTED: lldb-api :: functionalities/breakpoint/breakpoint_in_delayslot/TestAvoidBreakpointInDelaySlot.py (1769 of 1796) PASS: lldb-api :: functionalities/thread/backtrace_limit/TestBacktraceLimit.py (1770 of 1796) PASS: lldb-unit :: Symbol/./SymbolTests/DWARFCallFrameInfoTest.Basic_dwarf3 (1771 of 1796) PASS: lldb-unit :: Utility/./UtilityTests/OptionsWithRawTest.WhitespaceInput (1772 of 1796) PASS: lldb-unit :: Utility/./UtilityTests/RegularExpression.Valid (1773 of 1796) PASS: lldb-api :: functionalities/ubsan/basic/TestUbsanBasic.py (1774 of 1796) PASS: lldb-api :: commands/expression/function_template_specialization_temp_args/TestFunctionTemplateSpecializationTempArgs.py (1775 of 1796) PASS: lldb-api :: commands/expression/ir-interpreter/TestIRInterpreter.py (1776 of 1796) PASS: lldb-api :: lang/objc/modules/TestObjCModules.py (1777 of 1796) PASS: lldb-api :: functionalities/data-formatter/data-formatter-objc/nsindexpath/TestDataFormatterNSIndexPath.py (1778 of 1796) PASS: lldb-api :: lang/cpp/inlines/TestInlines.py (1779 of 1796) PASS: lldb-api :: python_api/lldbutil/iter/TestRegistersIterator.py (1780 of 1796) PASS: lldb-api :: functionalities/data-formatter/synthcapping/TestSyntheticCapping.py (1781 of 1796) PASS: lldb-api :: functionalities/data-formatter/dump_dynamic/TestDumpDynamic.py (1782 of 1796) PASS: lldb-api :: commands/watchpoints/watchpoint_commands/command/TestWatchpointCommandPython.py (1783 of 1796) PASS: lldb-api :: lang/cpp/dynamic-value/TestCppValueCast.py (1784 of 1796) PASS: lldb-api :: commands/gui/basic/TestGuiBasic.py (1785 of 1796) PASS: lldb-api :: commands/expression/diagnostics/TestExprDiagnostics.py (1786 of 1796) PASS: lldb-api :: commands/expression/po_verbosity/TestPoVerbosity.py (1787 of 1796) PASS: lldb-api :: lang/objc/objc-static-method/TestObjCStaticMethod.py (1788 of 1796) PASS: lldb-api :: functionalities/data-formatter/data-formatter-stl/libcxx/unordered/TestDataFormatterUnordered.py (1789 of 1796) PASS: lldb-api :: functionalities/step-avoids-no-debug/TestStepNoDebug.py (1790 of 1796) PASS: lldb-api :: functionalities/thread/backtrace_all/TestBacktraceAll.py (1791 of 1796) PASS: lldb-api :: python_api/exprpath_synthetic/TestExprPathSynthetic.py (1792 of 1796) PASS: lldb-api :: commands/expression/expr-in-syscall/TestExpressionInSyscall.py (1793 of 1796) PASS: lldb-api :: commands/register/register/register_command/TestRegisters.py (1794 of 1796) PASS: lldb-api :: lang/objc/foundation/TestObjCMethodsString.py (1795 of 1796) PASS: lldb-api :: types/TestIntegerTypesExpr.py (1796 of 1796) Testing Time: 352.03s ******************** Failing Tests (1): lldb-api :: commands/watchpoints/watchpoint_set_command/TestWatchLocationWithWatchSet.py

Hide Details

Hide Details

Slowest Tests: -------------------------------------------------------------------------- 39.07s: lldb-api :: python_api/watchpoint/watchlocation/TestSetWatchlocation.py 39.10s: lldb-api :: python_api/module_section/TestModuleAndSection.py 43.70s: lldb-api :: lang/objc/objc-new-syntax/TestObjCNewSyntaxArray.py 44.03s: lldb-api :: lang/objc/foundation/TestObjCMethodsNSError.py 46.41s: lldb-api :: lang/objc/objc-new-syntax/TestObjCNewSyntaxDictionary.py 46.97s: lldb-api :: functionalities/recursion/TestValueObjectRecursion.py 47.15s: lldb-api :: python_api/watchpoint/watchlocation/TestTargetWatchAddress.py 50.27s: lldb-api :: lang/objc/real-definition/TestRealDefinition.py 52.70s: lldb-api :: commands/watchpoints/watchpoint_set_command/TestWatchLocationWithWatchSet.py 55.53s: lldb-api :: lang/objc/exceptions/TestObjCExceptions.py 60.41s: lldb-api :: lang/objc/objc-new-syntax/TestObjCNewSyntaxLiteral.py 65.15s: lldb-api :: lang/cpp/namespace/TestNamespaceLookup.py 71.05s: lldb-api :: api/multithreaded/TestMultithreaded.py 80.02s: lldb-api :: lang/objc/foundation/TestObjCMethods.py 81.66s: lldb-api :: lang/cpp/enum_types/TestCPP11EnumTypes.py 81.89s: lldb-api :: lang/objc/hidden-ivars/TestHiddenIvars.py 94.96s: lldb-api :: tools/lldb-server/TestLldbGdbServer.py 105.19s: lldb-api :: types/TestIntegerTypesExpr.py 110.09s: lldb-api :: types/TestIntegerTypes.py 180.93s: lldb-api :: lang/objc/foundation/TestFoundationDisassembly.py

Hide Details

Tests Times: -------------------------------------------------------------------------- [ Range ] :: [ Percentage ] :: [ Count ] -------------------------------------------------------------------------- [ 0s, 10s) :: [*********************************** ] :: [1589/1796] [ 10s, 20s) :: [*** ] :: [ 143/1796] [ 20s, 30s) :: [ ] :: [ 38/1796] [ 30s, 40s) :: [ ] :: [ 6/1796] [ 40s, 50s) :: [ ] :: [ 7/1796] [ 50s, 60s) :: [ ] :: [ 3/1796] [ 60s, 70s) :: [ ] :: [ 2/1796] [ 70s, 80s) :: [ ] :: [ 1/1796] [ 80s, 90s) :: [ ] :: [ 3/1796] [ 90s,100s) :: [ ] :: [ 1/1796] [100s,110s) :: [ ] :: [ 0/1796] [110s,120s) :: [ ] :: [ 2/1796] [120s,130s) :: [ ] :: [ 0/1796] [130s,140s) :: [ ] :: [ 0/1796] [140s,150s) :: [ ] :: [ 0/1796] [150s,160s) :: [ ] :: [ 0/1796] [160s,170s) :: [ ] :: [ 0/1796] [170s,180s) :: [ ] :: [ 0/1796] [180s,190s) :: [ ] :: [ 1/1796] Expected Passes : 1652 Expected Failures : 6 Unsupported Tests : 137 Unexpected Failures: 1 FAILED: tools/lldb/test/CMakeFiles/check-lldb-lit cd /Users/buildslave/jenkins/workspace/lldb-cmake/lldb-build/tools/lldb/test && /usr/local/Cellar/python/3.7.0/bin/python3.7 /Users/buildslave/jenkins/workspace/lldb-cmake/lldb-build/./bin/llvm-lit -v --time-tests --shuffle --xunit-xml-output=/Users/buildslave/jenkins/workspace/lldb-cmake/test/results.xml -v /Users/buildslave/jenkins/workspace/lldb-cmake/lldb-build/tools/lldb/test ninja: build stopped: subcommand failed. Command failed Command: ['/usr/bin/env', 'TERM=vt100', '/usr/local/bin/ninja', '-v', 'check-lldb'] [Pipeline] } [Pipeline] // timeout [Pipeline] } [Pipeline] // stage [Pipeline] stage [Pipeline] { (Declarative: Post Actions) [Pipeline] scanForIssues No credentials specified [Clang (LLVM based)] Sleeping for 5 seconds due to JENKINS-32191... [Clang (LLVM based)] Parsing console log (workspace: '/Users/buildslave/jenkins/workspace/lldb-cmake') > git rev-parse HEAD^{commit} # timeout=10 [Clang (LLVM based)] [-ERROR-] Can't create blame requests for some affected files: [Clang (LLVM based)] [-ERROR-] - Skipping non-workspace file /usr/local/include/lzma/index_hash.h [Clang (LLVM based)] [-ERROR-] - Skipping non-workspace file /usr/local/include/lzma/hardware.h [Clang (LLVM based)] [-ERROR-] Git blame errors: [Clang (LLVM based)] [-ERROR-] - no blame results for request <llvm-project/clang/include/clang/AST/ExprCXX.h - [265, 266]>.

Hide Details

[Clang (LLVM based)] [-ERROR-] Git blame errors: [Clang (LLVM based)] [-ERROR-] - no blame results for request <llvm-project/lldb/include/lldb/Target/Process.h - [1394, 2375, 523, 717, 1725, 2174]>.

Hide Details

[Clang (LLVM based)] [-ERROR-] Git blame errors: [Clang (LLVM based)] [-ERROR-] - no blame results for request <llvm-project/lldb/include/lldb/Host/common/NativeProcessProtocol.h - [387, 390]>.

Hide Details

[Clang (LLVM based)] [-ERROR-] Git blame errors: [Clang (LLVM based)] [-ERROR-] - no blame results for request <llvm-project/lldb/include/lldb/Utility/ConstString.h - [337, 149, 168, 330, 191]>.

Hide Details

[Clang (LLVM based)] [-ERROR-] Git blame errors: [Clang (LLVM based)] [-ERROR-] - no blame results for request <llvm-project/lldb/include/lldb/Utility/Broadcaster.h - [272, 352, 371, 264, 312, 393, 268]>.

Hide Details

[Clang (LLVM based)] [-ERROR-] Git blame errors: [Clang (LLVM based)] [-ERROR-] - no blame results for request <llvm-project/lldb/include/lldb/Expression/ExpressionParser.h - [32]>.

Hide Details

[Clang (LLVM based)] [-ERROR-] Git blame errors: [Clang (LLVM based)] [-ERROR-] - no blame results for request <llvm-project/lldb/source/Plugins/ExpressionParser/Clang/ASTResultSynthesizer.h - [148, 141]>.

Hide Details

[Clang (LLVM based)] [-ERROR-] Git blame errors: [Clang (LLVM based)] [-ERROR-] - no blame results for request <llvm-project/lldb/include/lldb/Symbol/Declaration.h - [104]>.

Hide Details

[Clang (LLVM based)] [-ERROR-] Git blame errors: [Clang (LLVM based)] [-ERROR-] - no blame results for request <llvm-project/lldb/include/lldb/Host/PseudoTerminal.h - [64, 68, 168, 107, 139, 172, 143]>.

Hide Details

[Clang (LLVM based)] [-ERROR-] Git blame errors: [Clang (LLVM based)] [-ERROR-] - no blame results for request <llvm-project/lldb/include/lldb/Expression/UtilityFunction.h - [67]>.

Hide Details

[Clang (LLVM based)] [-ERROR-] Git blame errors: [Clang (LLVM based)] [-ERROR-] - no blame results for request <llvm-project/lldb/include/lldb/Target/StackFrame.h - [102, 294, 409, 426, 302]>.

Hide Details

[Clang (LLVM based)] [-ERROR-] Git blame errors: [Clang (LLVM based)] [-ERROR-] - no blame results for request <llvm-project/lldb/source/Plugins/InstrumentationRuntime/MainThreadChecker/MainThreadCheckerRuntime.cpp - [156]>.

Hide Details

[Clang (LLVM based)] [-ERROR-] Git blame errors: [Clang (LLVM based)] [-ERROR-] - no blame results for request <llvm-project/lldb/source/Plugins/ExpressionParser/Clang/ClangExpressionDeclMap.h - [256, 66, 259, 280, 474, 490, 300, 444, 253]>.

Hide Details

[Clang (LLVM based)] [-ERROR-] Git blame errors: [Clang (LLVM based)] [-ERROR-] - no blame results for request <llvm-project/lldb/include/lldb/Utility/Flags.h - [32]>.

Hide Details

[Clang (LLVM based)] [-ERROR-] Git blame errors: [Clang (LLVM based)] [-ERROR-] - no blame results for request <llvm-project/lldb/include/lldb/Host/HostProcess.h - [15]>.

Hide Details

[Clang (LLVM based)] [-ERROR-] Git blame errors: [Clang (LLVM based)] [-ERROR-] - no blame results for request <llvm-project/lldb/include/lldb/Core/SearchFilter.h - [355, 309, 358, 87, 105, 410, 413]>.

Hide Details

[Clang (LLVM based)] [-ERROR-] Git blame errors: [Clang (LLVM based)] [-ERROR-] - no blame results for request <llvm-project/lldb/include/lldb/Core/ModuleChild.h - [49, 23]>.

Hide Details

[Clang (LLVM based)] [-ERROR-] Git blame errors: [Clang (LLVM based)] [-ERROR-] - no blame results for request <llvm-project/lldb/source/Plugins/ExpressionParser/Clang/IRForTarget.h - [384, 145, 497, 290, 74, 394, 108, 365, 525, 78, 190, 494]>.

Hide Details

[Clang (LLVM based)] [-ERROR-] Git blame errors: [Clang (LLVM based)] [-ERROR-] - no blame results for request <llvm-project/lldb/include/lldb/Breakpoint/BreakpointList.h - [141]>.

Hide Details

[Clang (LLVM based)] [-ERROR-] Git blame errors: [Clang (LLVM based)] [-ERROR-] - no blame results for request <llvm-project/lldb/include/lldb/Breakpoint/BreakpointLocationCollection.h - [34, 115, 69, 30]>.

Hide Details

[Clang (LLVM based)] [-ERROR-] Git blame errors: [Clang (LLVM based)] [-ERROR-] - no blame results for request <llvm-project/lldb/include/lldb/Core/AddressRange.h - [150, 126]>.

Hide Details

[Clang (LLVM based)] [-ERROR-] Git blame errors: [Clang (LLVM based)] [-ERROR-] - no blame results for request <llvm-project/lldb/include/lldb/Breakpoint/BreakpointOptions.h - [298]>.

Hide Details

[Clang (LLVM based)] [-ERROR-] Git blame errors: [Clang (LLVM based)] [-ERROR-] - no blame results for request <llvm-project/lldb/include/lldb/Breakpoint/Breakpoint.h - [208, 196, 376]>.

Hide Details

[Clang (LLVM based)] [-ERROR-] Git blame errors: [Clang (LLVM based)] [-ERROR-] - no blame results for request <llvm-project/lldb/include/lldb/Core/Highlighter.h - [102, 46, 47]>.

Hide Details

[Clang (LLVM based)] [-ERROR-] Git blame errors: [Clang (LLVM based)] [-ERROR-] - no blame results for request <llvm-project/lldb/include/lldb/Host/File.h - [96, 81, 79]>.

Hide Details

[Clang (LLVM based)] [-ERROR-] Git blame errors: [Clang (LLVM based)] [-ERROR-] - no blame results for request <llvm-project/lldb/include/lldb/Symbol/Block.h - [81, 85, 246, 235, 60, 63]>.

Hide Details

[Clang (LLVM based)] [-ERROR-] Git blame errors: [Clang (LLVM based)] [-ERROR-] - no blame results for request <llvm-project/llvm/include/llvm/Analysis/ScalarEvolution.h - [1702]>.

Hide Details

[Clang (LLVM based)] [-ERROR-] Git blame errors: [Clang (LLVM based)] [-ERROR-] - no blame results for request <llvm-project/lldb/include/lldb/Core/Module.h - [320, 419, 294, 446]>.

Hide Details

[Clang (LLVM based)] [-ERROR-] Git blame errors: [Clang (LLVM based)] [-ERROR-] - no blame results for request <llvm-project/lldb/include/lldb/Target/Platform.h - [780, 383]>.

Hide Details

[Clang (LLVM based)] [-ERROR-] Git blame errors: [Clang (LLVM based)] [-ERROR-] - no blame results for request <llvm-project/clang/lib/CodeGen/CGDecl.cpp - [1862, 1864]>.

Hide Details

[Clang (LLVM based)] [-ERROR-] Git blame errors: [Clang (LLVM based)] [-ERROR-] - no blame results for request <llvm-project/lldb/source/Plugins/ExpressionParser/Clang/ClangASTSource.h - [324, 327, 344, 92, 158]>.

Hide Details

[Clang (LLVM based)] [-ERROR-] Git blame errors: [Clang (LLVM based)] [-ERROR-] - no blame results for request <llvm-project/lldb/include/lldb/Breakpoint/BreakpointID.h - [68]>.

Hide Details

[Clang (LLVM based)] [-ERROR-] Git blame errors: [Clang (LLVM based)] [-ERROR-] - no blame results for request <llvm-project/lldb/include/lldb/Breakpoint/BreakpointResolver.h - [48, 75]>.

Hide Details

[Clang (LLVM based)] [-ERROR-] Git blame errors: [Clang (LLVM based)] [-ERROR-] - no blame results for request <llvm-project/lldb/include/lldb/Expression/DWARFExpression.h - [194, 187, 254]>.

Hide Details

[Clang (LLVM based)] [-ERROR-] Git blame errors: [Clang (LLVM based)] [-ERROR-] - no blame results for request <llvm-project/lldb/include/lldb/Utility/CompletionRequest.h - [181, 151, 138]>.

Hide Details

[Clang (LLVM based)] [-ERROR-] Git blame errors: [Clang (LLVM based)] [-ERROR-] - no blame results for request <llvm-project/lldb/include/lldb/Target/Queue.h - [131]>.

Hide Details

[Clang (LLVM based)] [-ERROR-] Git blame errors: [Clang (LLVM based)] [-ERROR-] - no blame results for request <llvm-project/lldb/source/Plugins/ExpressionParser/Clang/ClangExpressionParser.h - [102, 106, 45]>.

Hide Details

[Clang (LLVM based)] [-ERROR-] Git blame errors: [Clang (LLVM based)] [-ERROR-] - no blame results for request <llvm-project/lldb/include/lldb/Interpreter/CommandObject.h - [229, 264, 238]>.

Hide Details

[Clang (LLVM based)] [-ERROR-] Git blame errors: [Clang (LLVM based)] [-ERROR-] - no blame results for request <llvm-project/lldb/source/Plugins/ExpressionParser/Clang/IRDynamicChecks.h - [80]>.

Hide Details

[Clang (LLVM based)] [-ERROR-] Git blame errors: [Clang (LLVM based)] [-ERROR-] - no blame results for request <llvm-project/lldb/source/Plugins/InstrumentationRuntime/UBSan/UBSanRuntime.cpp - [210]>.

Hide Details

[Clang (LLVM based)] [-ERROR-] Git blame errors: [Clang (LLVM based)] [-ERROR-] - no blame results for request <llvm-project/lldb/include/lldb/Breakpoint/WatchpointList.h - [183]>.

Hide Details

[Clang (LLVM based)] [-ERROR-] Git blame errors: [Clang (LLVM based)] [-ERROR-] - no blame results for request <llvm-project/lldb/include/lldb/Symbol/Function.h - [70, 185]>.

Hide Details

[Clang (LLVM based)] [-ERROR-] Git blame errors: [Clang (LLVM based)] [-ERROR-] - no blame results for request <llvm-project/lldb/source/Plugins/ExpressionParser/Clang/ClangExpressionParser.cpp - [699]>.

Hide Details

[Clang (LLVM based)] [-ERROR-] Git blame errors: [Clang (LLVM based)] [-ERROR-] - no blame results for request <llvm-project/lldb/include/lldb/Breakpoint/BreakpointLocationList.h - [171, 79]>.

Hide Details

[Clang (LLVM based)] [-ERROR-] Git blame errors: [Clang (LLVM based)] [-ERROR-] - no blame results for request <llvm-project/lldb/include/lldb/Target/Thread.h - [1154, 131, 133, 184, 809, 762, 814, 1007]>.

Hide Details

[Clang (LLVM based)] [-ERROR-] Git blame errors: [Clang (LLVM based)] [-ERROR-] - no blame results for request <llvm-project/lldb/source/Plugins/ExpressionParser/Clang/IRDynamicChecks.cpp - [182]>.

Hide Details

[Clang (LLVM based)] [-ERROR-] Git blame errors: [Clang (LLVM based)] [-ERROR-] - no blame results for request <llvm-project/llvm/lib/Transforms/Utils/FlattenCFG.cpp - [323, 100, 132, 117, 133, 134, 108, 124]>.

Hide Details

[Clang (LLVM based)] [-ERROR-] Git blame errors: [Clang (LLVM based)] [-ERROR-] - no blame results for request <llvm-project/lldb/include/lldb/Symbol/LineEntry.h - [104, 45, 78]>.

Hide Details

[Clang (LLVM based)] [-ERROR-] Git blame errors: [Clang (LLVM based)] [-ERROR-] - no blame results for request <llvm-project/lldb/source/Plugins/SymbolFile/DWARF/SymbolFileDWARFDebugMap.h - [351]>.

Hide Details

[Clang (LLVM based)] [-ERROR-] Git blame errors: [Clang (LLVM based)] [-ERROR-] - no blame results for request <llvm-project/lldb/include/lldb/Interpreter/Options.h - [166, 185]>.

Hide Details

[Clang (LLVM based)] [-ERROR-] Git blame errors: [Clang (LLVM based)] [-ERROR-] - no blame results for request <llvm-project/lldb/include/lldb/Target/Target.h - [909]>.

Hide Details

[Clang (LLVM based)] [-ERROR-] Git blame errors: [Clang (LLVM based)] [-ERROR-] - no blame results for request <llvm-project/lldb/include/lldb/Breakpoint/BreakpointSite.h - [103, 205, 110, 126]>.

Hide Details

[Clang (LLVM based)] [-ERROR-] Git blame errors: [Clang (LLVM based)] [-ERROR-] - no blame results for request <llvm-project/lldb/include/lldb/Expression/REPL.h - [35]>.

Hide Details

[Clang (LLVM based)] [-ERROR-] Git blame errors: [Clang (LLVM based)] [-ERROR-] - no blame results for request <llvm-project/lldb/include/lldb/Symbol/SymbolContext.h - [322, 54, 282, 302]>.

Hide Details

[Clang (LLVM based)] [-ERROR-] Git blame errors: [Clang (LLVM based)] [-ERROR-] - no blame results for request <llvm-project/lldb/include/lldb/Symbol/LineTable.h - [200, 138, 204]>.

Hide Details

[Clang (LLVM based)] [-ERROR-] Git blame errors: [Clang (LLVM based)] [-ERROR-] - no blame results for request <llvm-project/lldb/include/lldb/Expression/FunctionCaller.h - [226, 69, 72, 235, 238]>.

Hide Details

[Clang (LLVM based)] [-ERROR-] Git blame errors: [Clang (LLVM based)] [-ERROR-] - no blame results for request <llvm-project/lldb/include/lldb/Expression/UserExpression.h - [49, 169]>.

Hide Details

[Clang (LLVM based)] [-ERROR-] Git blame errors: [Clang (LLVM based)] [-ERROR-] - no blame results for request <llvm-project/lldb/include/lldb/Core/Mangled.h - [110]>.

Hide Details

[Clang (LLVM based)] [-ERROR-] Git blame errors: [Clang (LLVM based)] [-ERROR-] - no blame results for request <llvm-project/lldb/include/lldb/Breakpoint/BreakpointLocation.h - [96, 227]>.

Hide Details

[Clang (LLVM based)] [-ERROR-] Git blame errors: [Clang (LLVM based)] [-ERROR-] - no blame results for request <llvm-project/lldb/include/lldb/Core/Address.h - [82, 68, 436, 181, 86, 73, 124, 77]>.

Hide Details

[Clang (LLVM based)] [-ERROR-] Git blame errors: [Clang (LLVM based)] [-ERROR-] - no blame results for request <llvm-project/lldb/include/lldb/Expression/IRExecutionUnit.h - [180, 183, 329, 190, 207]>.

Hide Details

[Clang (LLVM based)] [-ERROR-] Git blame errors: [Clang (LLVM based)] [-ERROR-] - no blame results for request <llvm-project/lldb/include/lldb/Symbol/CompileUnit.h - [85, 232, 47]>.

Hide Details

[Clang (LLVM based)] [-ERROR-] Git blame errors: [Clang (LLVM based)] [-ERROR-] - no blame results for request <llvm-project/clang/lib/Format/TokenAnnotator.cpp - [30]>.

Hide Details

[Clang (LLVM based)] [-ERROR-] Git blame errors: [Clang (LLVM based)] [-ERROR-] - no blame results for request <llvm-project/lldb/include/lldb/Symbol/ObjectFile.h - [656, 161, 133, 360, 364]>.

Hide Details

[Clang (LLVM based)] [-ERROR-] Git blame errors: [Clang (LLVM based)] [-ERROR-] - no blame results for request <llvm-project/lldb/include/lldb/Core/ModuleList.h - [354, 371, 308, 312, 138, 363, 300, 316, 367]>.

Hide Details

[Clang (LLVM based)] [-ERROR-] Git blame errors: [Clang (LLVM based)] [-ERROR-] - no blame results for request <llvm-project/lldb/include/lldb/Interpreter/CommandInterpreter.h - [54]>.

Hide Details

[Clang (LLVM based)] [-ERROR-] Git blame errors: [Clang (LLVM based)] [-ERROR-] - no blame results for request <llvm-project/lldb/include/lldb/Target/TargetList.h - [58, 63]>.

Hide Details

[Clang (LLVM based)] [-ERROR-] Git blame errors: [Clang (LLVM based)] [-ERROR-] - no blame results for request <llvm-project/lldb/include/lldb/Host/HostInfoBase.h - [44]>.

Hide Details

[Clang (LLVM based)] [-ERROR-] Git blame errors: [Clang (LLVM based)] [-ERROR-] - no blame results for request <llvm-project/lldb/source/Plugins/ExpressionParser/Clang/ClangExpressionVariable.h - [77]>.

Hide Details

[Clang (LLVM based)] [-ERROR-] Git blame errors: [Clang (LLVM based)] [-ERROR-] - no blame results for request <llvm-project/lldb/tools/lldb-vscode/LLDBUtils.h - [116]>.

Hide Details

[Clang (LLVM based)] [-ERROR-] Git blame errors: [Clang (LLVM based)] [-ERROR-] - no blame results for request <llvm-project/lldb/source/Plugins/ExpressionParser/Clang/ClangUserExpression.h - [96]>.

Hide Details

[Clang (LLVM based)] [-ERROR-] Git blame errors: [Clang (LLVM based)] [-ERROR-] - no blame results for request <llvm-project/lldb/source/Plugins/Process/gdb-remote/GDBRemoteCommunicationClient.h - [92, 158]>.

Hide Details

[Clang (LLVM based)] [-ERROR-] Git blame errors: [Clang (LLVM based)] [-ERROR-] - no blame results for request <llvm-project/lldb/source/Plugins/ExpressionParser/Clang/ClangFunctionCaller.h - [101, 104]>.

Hide Details

[Clang (LLVM based)] [-ERROR-] Git blame errors: [Clang (LLVM based)] [-ERROR-] - no blame results for request <llvm-project/lldb/include/lldb/Breakpoint/Watchpoint.h - [117]>.

Hide Details

[Clang (LLVM based)] Post processing issues on 'green-dragon-24' with source code encoding 'UTF-8' [Clang (LLVM based)] Resolving absolute file names for all issues in workspace '/Users/buildslave/jenkins/workspace/lldb-cmake' [Clang (LLVM based)] -> 10 resolved, 0 unresolved, 76 already resolved [Clang (LLVM based)] Copying affected files to Jenkins' build folder '/Users/Shared/Jenkins/Home/jobs/lldb-cmake/builds/2812/files-with-issues' [Clang (LLVM based)] -> 74 copied, 2 not in workspace, 0 not-found, 0 with I/O error [Clang (LLVM based)] Resolving module names from module definitions (build.xml, pom.xml, or Manifest.mf files) [Clang (LLVM based)] -> resolved module names for 266 issues [Clang (LLVM based)] Resolving package names (or namespaces) by parsing the affected files [Clang (LLVM based)] -> resolved package names of 76 affected files [Clang (LLVM based)] No filter has been set, publishing all 227 issues [Clang (LLVM based)] Creating fingerprints for all affected code blocks to track issues over different builds [Clang (LLVM based)] -> created fingerprints for 227 issues [Clang (LLVM based)] Invoking Git blamer to create author and commit information for all affected files [Clang (LLVM based)] GIT_COMMIT env = 'HEAD' [Clang (LLVM based)] Git working tree = '/Users/buildslave/jenkins/workspace/lldb-cmake' [Clang (LLVM based)] Git commit ID = '7774c4da0ada8aad6524d2e5722c0014fedfd6c0' [Clang (LLVM based)] Job workspace = '/Users/buildslave/jenkins/workspace/lldb-cmake' [Clang (LLVM based)] Created blame requests for 74 files - invoking Git blame on agent for each of the requests [Clang (LLVM based)] -> blamed authors of issues in 74 files
[Pipeline] junit Recording test results [BFA] Scanning build for known causes... [Pipeline] emailext [BFA] Found failure cause(s): [BFA] Ninja target failed from category Compile [BFA] Regression test failed from category Test [BFA] Done. 3s Not sending mail to unregistered user grimar@accesssoftek.com because your SCM claimed this was associated with a user ID ‘grimar' which your security realm does not recognize; you may need changes in your SCM plugin Not sending mail to unregistered user grimar@accesssoftek.com because your SCM claimed this was associated with a user ID ‘grimar' which your security realm does not recognize; you may need changes in your SCM plugin

Hide Details

Begin Pre-Send Script... javax.mail.internet.AddressException: Missing '>' in string ``Bruno Lopes <blopes@apple.com'' at position 29 at javax.mail.internet.InternetAddress.parse(InternetAddress.java:811) at javax.mail.internet.InternetAddress.parse(InternetAddress.java:633) at javax.mail.internet.InternetAddress.<init>(InternetAddress.java:111) at sun.reflect.GeneratedConstructorAccessor411.newInstance(Unknown Source) at sun.reflect.DelegatingConstructorAccessorImpl.newInstance(DelegatingConstructorAccessorImpl.java:45) at java.lang.reflect.Constructor.newInstance(Constructor.java:423) at org.codehaus.groovy.reflection.CachedConstructor.invoke(CachedConstructor.java:83) at org.codehaus.groovy.runtime.callsite.ConstructorSite$ConstructorSiteNoUnwrapNoCoerce.callConstructor(ConstructorSite.java:105) at org.codehaus.groovy.runtime.callsite.CallSiteArray.defaultCallConstructor(CallSiteArray.java:60) at org.codehaus.groovy.runtime.callsite.AbstractCallSite.callConstructor(AbstractCallSite.java:235) at org.kohsuke.groovy.sandbox.impl.Checker$3.call(Checker.java:203) at org.kohsuke.groovy.sandbox.impl.Checker.checkedConstructor(Checker.java:205) at org.kohsuke.groovy.sandbox.impl.Checker$checkedConstructor$3.callStatic(Unknown Source) at org.codehaus.groovy.runtime.callsite.CallSiteArray.defaultCallStatic(CallSiteArray.java:56) at org.codehaus.groovy.runtime.callsite.AbstractCallSite.callStatic(AbstractCallSite.java:194) at org.codehaus.groovy.runtime.callsite.AbstractCallSite.callStatic(AbstractCallSite.java:214) at Script1.run(Script1.groovy:66) at hudson.plugins.emailext.ExtendedEmailPublisher.executeScript(ExtendedEmailPublisher.java:623) at hudson.plugins.emailext.ExtendedEmailPublisher.executePresendScript(ExtendedEmailPublisher.java:573) at hudson.plugins.emailext.ExtendedEmailPublisher.sendMail(ExtendedEmailPublisher.java:456) at hudson.plugins.emailext.EmailExtStep$EmailExtStepExecution.run(EmailExtStep.java:224) at hudson.plugins.emailext.EmailExtStep$EmailExtStepExecution.run(EmailExtStep.java:163) at org.jenkinsci.plugins.workflow.steps.AbstractSynchronousNonBlockingStepExecution$1$1.call(AbstractSynchronousNonBlockingStepExecution.java:47) at hudson.security.ACL.impersonate(ACL.java:290) at org.jenkinsci.plugins.workflow.steps.AbstractSynchronousNonBlockingStepExecution$1.run(AbstractSynchronousNonBlockingStepExecution.java:44) at java.util.concurrent.Executors$RunnableAdapter.call(Executors.java:511) at java.util.concurrent.FutureTask.run(FutureTask.java:266) at java.util.concurrent.ThreadPoolExecutor.runWorker(ThreadPoolExecutor.java:1149) at java.util.concurrent.ThreadPoolExecutor$Worker.run(ThreadPoolExecutor.java:624) at java.lang.Thread.run(Thread.java:748)

Hide Details

Sending email to: mschifer@apple.com devnexen@gmail.com
[Pipeline] } [Pipeline] // stage [Pipeline] } [Pipeline] // withEnv [Pipeline] } [Pipeline] // node [Pipeline] End of Pipeline ERROR: script returned exit code 1 Finished: FAILURE