Started 1 mo 1 day ago
Took 2 hr 16 min

Failed Build clang-d326941-g431141c5cc3-t1925-b1925.tar.gz (Sep 15, 2019 4:32:03 PM)

Issues

Found 6 issues:
Ninja target: fpcmp.c.o
++ TEST_SUITE_NINJA_FLAGS+=
++ eval ninja ' -v -k0'
+++ ninja -v -k0
[1/8583] cd /Users/buildslave/jenkins/workspace/test-suite-verify-machineinstrs-aarch64-globalisel-O0-g/test-suite-build/tools && /usr/local/Cellar/cmake/3.13.1/bin/cmake -E copy /Users/buildslave/jenkins/workspace/test-suite-verify-machineinstrs-aarch64-globalisel-O0-g/test-suite/tools/../HashProgramOutput.sh /Users/buildslave/jenkins/workspace/test-suite-verify-machineinstrs-aarch64-globalisel-O0-g/test-suite-build/tools/HashProgramOutput.sh && chmod +x /Users/buildslave/jenkins/workspace/test-suite-verify-machineinstrs-aarch64-globalisel-O0-g/test-suite-build/tools/HashProgramOutput.sh
[2/8583] /Users/buildslave/jenkins/workspace/test-suite-verify-machineinstrs-aarch64-globalisel-O0-g/compiler/bin/clang -DNDEBUG  -B /Applications/Xcode.app/Contents/Developer/Toolchains/XcodeDefault.xctoolchain/usr/bin    -Wno-unused-command-line-argument -mllvm -verify-machineinstrs -O0 -g -arch arm64 -isysroot /Applications/Xcode.app/Contents/Developer/Platforms/iPhoneOS.platform/Developer/SDKs/iPhoneOS11.4.sdk   -w -Werror=date-time -MD -MT tools/CMakeFiles/fpcmp-target.dir/fpcmp.c.o -MF tools/CMakeFiles/fpcmp-target.dir/fpcmp.c.o.d -o tools/CMakeFiles/fpcmp-target.dir/fpcmp.c.o   -c /Users/buildslave/jenkins/workspace/test-suite-verify-machineinstrs-aarch64-globalisel-O0-g/test-suite/tools/fpcmp.c
FAILED: tools/CMakeFiles/fpcmp-target.dir/fpcmp.c.o 
/Users/buildslave/jenkins/workspace/test-suite-verify-machineinstrs-aarch64-globalisel-O0-g/compiler/bin/clang -DNDEBUG  -B /Applications/Xcode.app/Contents/Developer/Toolchains/XcodeDefault.xctoolchain/usr/bin    -Wno-unused-command-line-argument -mllvm -verify-machineinstrs -O0 -g -arch arm64 -isysroot /Applications/Xcode.app/Contents/Developer/Platforms/iPhoneOS.platform/Developer/SDKs/iPhoneOS11.4.sdk   -w -Werror=date-time -MD -MT tools/CMakeFiles/fpcmp-target.dir/fpcmp.c.o -MF tools/CMakeFiles/fpcmp-target.dir/fpcmp.c.o.d -o tools/CMakeFiles/fpcmp-target.dir/fpcmp.c.o   -c /Users/buildslave/jenkins/workspace/test-suite-verify-machineinstrs-aarch64-globalisel-O0-g/test-suite/tools/fpcmp.c
Fatal Error: error in backend: Found 2 machine code errors.
First terminator was:	G_BRCOND %72:_(s1), %bb.13, debug-location !253; test-suite/tools/fpcmp.c:274:5

*** Bad machine code: Virtual register defs don't dominate all uses. ***
- function:    diff_files_with_tolerance
- v. register: %72
fatal error: error in backend: Found 2 machine code errors.
clang-10: error: clang frontend command failed with exit code 70 (use -v to see invocation)
clang version 10.0.0 (https://github.com/llvm/llvm-project.git 431141c5cc343c7601cbd5f30c5b34810b123e5c)
Error: clang frontend command failed with exit code 70 (use -v to see invocation)

*** Bad machine code: Virtual register defs don't dominate all uses. ***
- function:    diff_files_with_tolerance
- v. register: %72
fatal error: error in backend: Found 2 machine code errors.
clang-10: error: clang frontend command failed with exit code 70 (use -v to see invocation)
clang version 10.0.0 (https://github.com/llvm/llvm-project.git 431141c5cc343c7601cbd5f30c5b34810b123e5c)
Target: aarch64-apple-darwin17.6.0
Ninja target: timeit.c.o
clang-10: note: diagnostic msg: 

********************
[3/8583] cd /Users/buildslave/jenkins/workspace/test-suite-verify-machineinstrs-aarch64-globalisel-O0-g/test-suite-build/tools && cc -c /Users/buildslave/jenkins/workspace/test-suite-verify-machineinstrs-aarch64-globalisel-O0-g/test-suite/tools/fpcmp.c -o /Users/buildslave/jenkins/workspace/test-suite-verify-machineinstrs-aarch64-globalisel-O0-g/test-suite-build/tools/fpcmp.c.o
[4/8583] /Users/buildslave/jenkins/workspace/test-suite-verify-machineinstrs-aarch64-globalisel-O0-g/compiler/bin/clang -DNDEBUG  -B /Applications/Xcode.app/Contents/Developer/Toolchains/XcodeDefault.xctoolchain/usr/bin    -Wno-unused-command-line-argument -mllvm -verify-machineinstrs -O0 -g -arch arm64 -isysroot /Applications/Xcode.app/Contents/Developer/Platforms/iPhoneOS.platform/Developer/SDKs/iPhoneOS11.4.sdk   -w -Werror=date-time -MD -MT tools/CMakeFiles/timeit-target.dir/timeit.c.o -MF tools/CMakeFiles/timeit-target.dir/timeit.c.o.d -o tools/CMakeFiles/timeit-target.dir/timeit.c.o   -c /Users/buildslave/jenkins/workspace/test-suite-verify-machineinstrs-aarch64-globalisel-O0-g/test-suite/tools/timeit.c
FAILED: tools/CMakeFiles/timeit-target.dir/timeit.c.o 
/Users/buildslave/jenkins/workspace/test-suite-verify-machineinstrs-aarch64-globalisel-O0-g/compiler/bin/clang -DNDEBUG  -B /Applications/Xcode.app/Contents/Developer/Toolchains/XcodeDefault.xctoolchain/usr/bin    -Wno-unused-command-line-argument -mllvm -verify-machineinstrs -O0 -g -arch arm64 -isysroot /Applications/Xcode.app/Contents/Developer/Platforms/iPhoneOS.platform/Developer/SDKs/iPhoneOS11.4.sdk   -w -Werror=date-time -MD -MT tools/CMakeFiles/timeit-target.dir/timeit.c.o -MF tools/CMakeFiles/timeit-target.dir/timeit.c.o.d -o tools/CMakeFiles/timeit-target.dir/timeit.c.o   -c /Users/buildslave/jenkins/workspace/test-suite-verify-machineinstrs-aarch64-globalisel-O0-g/test-suite/tools/timeit.c
Fatal Error: error in backend: Found 3 machine code errors.
First terminator was:	G_BRCOND %34:_(s1), %bb.4, debug-location !875; test-suite/tools/timeit.c:163:3

*** Bad machine code: Virtual register defs don't dominate all uses. ***
- function:    monitor_child_process
- v. register: %34
fatal error: error in backend: Found 3 machine code errors.
clang-10: error: clang frontend command failed with exit code 70 (use -v to see invocation)
clang version 10.0.0 (https://github.com/llvm/llvm-project.git 431141c5cc343c7601cbd5f30c5b34810b123e5c)
Error: clang frontend command failed with exit code 70 (use -v to see invocation)

*** Bad machine code: Virtual register defs don't dominate all uses. ***
- function:    monitor_child_process
- v. register: %34
fatal error: error in backend: Found 3 machine code errors.
clang-10: error: clang frontend command failed with exit code 70 (use -v to see invocation)
clang version 10.0.0 (https://github.com/llvm/llvm-project.git 431141c5cc343c7601cbd5f30c5b34810b123e5c)
Target: aarch64-apple-darwin17.6.0

Build Log

Changes
  1. [InstCombine] add icmp tests with extra uses; NFC (detail)
  2. [InstCombine] remove unneeded one-use checks for icmp fold (detail)
  3. Commit missing part of "Split many_tls_keys.cpp into two tests" (detail)
  4. [Attributor] Heap-To-Stack Conversion (detail)
Revision: 371220
Changes
  1. [LNT] Python 3 support: Update `<>` and `None` comparisons

    Summary:
    Replaces comparisons using `!=`, `<>`, and `==` against `None` with the
    corresponding version of `is not None` and `is None`.

    Replaces `<>` with `!=`.

    As requested by reviewers, add spaces around operators on lines touched.

    Reviewers: cmatthews, thopre, kristof.beyls

    Reviewed By: thopre

    Subscribers: llvm-commits

    Differential Revision: https://reviews.llvm.org/D67535 (detail)
    by hubert.reinterpretcast
  2. Subject: [LNT] Python 3 support: Update type comparisons and type names

    Summary:
    This patch is split out from D67535, updating type names (or, in one
    case, `type(1.4)`-style goodness) and updating type comparisons with use
    of `isinstance`. Additionally, changed a dictionary key lookup for a
    type mapping.

    As requested by reviewers in D67535, spaces are added after commas in
    what are now tuples of types.

    Reviewers: cmatthews, thopre, kristof.beyls

    Reviewed By: thopre

    Subscribers: llvm-commits

    Differential Revision: https://reviews.llvm.org/D67587 (detail)
    by hubert.reinterpretcast
  3. [LNT] Python 3 support: Set up (client) setup requirements

    Summary:
    Changes required to allow setup of a LNT client with Python 3.

      - Use `PyModule_Create` instead of `Py_InitModule`
      - Drop `argparse` and `wsgiref` install requirements
      - Require Python 2.7 or higher in `setup.py`; Python 2.7 is needed for
        some Python 3 support idioms

    Reviewers: cmatthews, thopre, kristof.beyls

    Reviewed By: cmatthews

    Subscribers: llvm-commits

    Differential Revision: https://reviews.llvm.org/D67533 (detail)
    by hubert.reinterpretcast

Started by upstream project relay-test-suite-verify-machineinstrs build number 6200
originally caused by:

This run spent:

  • 2 hr 8 min waiting;
  • 2 hr 16 min build duration;
  • 2 hr 16 min total from scheduled to completion.
Revision: 431141c5cc343c7601cbd5f30c5b34810b123e5c
  • detached

Identified problems

Compile Error

This build failed because of a compile error. Below is a list of all errors in the build log:
Indication 1

Ninja target failed

Below is a link to the first failed ninja target.
Indication 2