Started 1 mo 6 days ago
Took 2 hr 16 min

Failed Build clang-d326942-gf5d5cd205e7-t1928-b1928.tar.gz (Sep 15, 2019 6:48:18 PM)

Issues

Found 6 issues:
Ninja target: timeit.c.o
++ TEST_SUITE_NINJA_FLAGS+=
++ eval ninja ' -v -k0'
+++ ninja -v -k0
[1/8583] cd /Users/buildslave/jenkins/workspace/test-suite-verify-machineinstrs-aarch64-globalisel-O0-g/test-suite-build/tools && /usr/local/Cellar/cmake/3.13.1/bin/cmake -E copy /Users/buildslave/jenkins/workspace/test-suite-verify-machineinstrs-aarch64-globalisel-O0-g/test-suite/tools/../HashProgramOutput.sh /Users/buildslave/jenkins/workspace/test-suite-verify-machineinstrs-aarch64-globalisel-O0-g/test-suite-build/tools/HashProgramOutput.sh && chmod +x /Users/buildslave/jenkins/workspace/test-suite-verify-machineinstrs-aarch64-globalisel-O0-g/test-suite-build/tools/HashProgramOutput.sh
[2/8583] /Users/buildslave/jenkins/workspace/test-suite-verify-machineinstrs-aarch64-globalisel-O0-g/compiler/bin/clang -DNDEBUG  -B /Applications/Xcode.app/Contents/Developer/Toolchains/XcodeDefault.xctoolchain/usr/bin    -Wno-unused-command-line-argument -mllvm -verify-machineinstrs -O0 -g -arch arm64 -isysroot /Applications/Xcode.app/Contents/Developer/Platforms/iPhoneOS.platform/Developer/SDKs/iPhoneOS11.4.sdk   -w -Werror=date-time -MD -MT tools/CMakeFiles/timeit-target.dir/timeit.c.o -MF tools/CMakeFiles/timeit-target.dir/timeit.c.o.d -o tools/CMakeFiles/timeit-target.dir/timeit.c.o   -c /Users/buildslave/jenkins/workspace/test-suite-verify-machineinstrs-aarch64-globalisel-O0-g/test-suite/tools/timeit.c
FAILED: tools/CMakeFiles/timeit-target.dir/timeit.c.o 
/Users/buildslave/jenkins/workspace/test-suite-verify-machineinstrs-aarch64-globalisel-O0-g/compiler/bin/clang -DNDEBUG  -B /Applications/Xcode.app/Contents/Developer/Toolchains/XcodeDefault.xctoolchain/usr/bin    -Wno-unused-command-line-argument -mllvm -verify-machineinstrs -O0 -g -arch arm64 -isysroot /Applications/Xcode.app/Contents/Developer/Platforms/iPhoneOS.platform/Developer/SDKs/iPhoneOS11.4.sdk   -w -Werror=date-time -MD -MT tools/CMakeFiles/timeit-target.dir/timeit.c.o -MF tools/CMakeFiles/timeit-target.dir/timeit.c.o.d -o tools/CMakeFiles/timeit-target.dir/timeit.c.o   -c /Users/buildslave/jenkins/workspace/test-suite-verify-machineinstrs-aarch64-globalisel-O0-g/test-suite/tools/timeit.c
Fatal Error: error in backend: Found 3 machine code errors.
First terminator was:	G_BRCOND %34:_(s1), %bb.4, debug-location !875; test-suite/tools/timeit.c:163:3

*** Bad machine code: Virtual register defs don't dominate all uses. ***
- function:    monitor_child_process
- v. register: %34
fatal error: error in backend: Found 3 machine code errors.
clang-10: error: clang frontend command failed with exit code 70 (use -v to see invocation)
clang version 10.0.0 (https://github.com/llvm/llvm-project.git f5d5cd205e7bc5177c80d39c03eac26eff916d20)
Error: clang frontend command failed with exit code 70 (use -v to see invocation)

*** Bad machine code: Virtual register defs don't dominate all uses. ***
- function:    monitor_child_process
- v. register: %34
fatal error: error in backend: Found 3 machine code errors.
clang-10: error: clang frontend command failed with exit code 70 (use -v to see invocation)
clang version 10.0.0 (https://github.com/llvm/llvm-project.git f5d5cd205e7bc5177c80d39c03eac26eff916d20)
Target: aarch64-apple-darwin17.6.0
Ninja target: fpcmp.c.o
clang-10: note: diagnostic msg: 

********************
[3/8583] cd /Users/buildslave/jenkins/workspace/test-suite-verify-machineinstrs-aarch64-globalisel-O0-g/test-suite-build/tools && cc -c /Users/buildslave/jenkins/workspace/test-suite-verify-machineinstrs-aarch64-globalisel-O0-g/test-suite/tools/fpcmp.c -o /Users/buildslave/jenkins/workspace/test-suite-verify-machineinstrs-aarch64-globalisel-O0-g/test-suite-build/tools/fpcmp.c.o
[4/8583] /Users/buildslave/jenkins/workspace/test-suite-verify-machineinstrs-aarch64-globalisel-O0-g/compiler/bin/clang -DNDEBUG  -B /Applications/Xcode.app/Contents/Developer/Toolchains/XcodeDefault.xctoolchain/usr/bin    -Wno-unused-command-line-argument -mllvm -verify-machineinstrs -O0 -g -arch arm64 -isysroot /Applications/Xcode.app/Contents/Developer/Platforms/iPhoneOS.platform/Developer/SDKs/iPhoneOS11.4.sdk   -w -Werror=date-time -MD -MT tools/CMakeFiles/fpcmp-target.dir/fpcmp.c.o -MF tools/CMakeFiles/fpcmp-target.dir/fpcmp.c.o.d -o tools/CMakeFiles/fpcmp-target.dir/fpcmp.c.o   -c /Users/buildslave/jenkins/workspace/test-suite-verify-machineinstrs-aarch64-globalisel-O0-g/test-suite/tools/fpcmp.c
FAILED: tools/CMakeFiles/fpcmp-target.dir/fpcmp.c.o 
/Users/buildslave/jenkins/workspace/test-suite-verify-machineinstrs-aarch64-globalisel-O0-g/compiler/bin/clang -DNDEBUG  -B /Applications/Xcode.app/Contents/Developer/Toolchains/XcodeDefault.xctoolchain/usr/bin    -Wno-unused-command-line-argument -mllvm -verify-machineinstrs -O0 -g -arch arm64 -isysroot /Applications/Xcode.app/Contents/Developer/Platforms/iPhoneOS.platform/Developer/SDKs/iPhoneOS11.4.sdk   -w -Werror=date-time -MD -MT tools/CMakeFiles/fpcmp-target.dir/fpcmp.c.o -MF tools/CMakeFiles/fpcmp-target.dir/fpcmp.c.o.d -o tools/CMakeFiles/fpcmp-target.dir/fpcmp.c.o   -c /Users/buildslave/jenkins/workspace/test-suite-verify-machineinstrs-aarch64-globalisel-O0-g/test-suite/tools/fpcmp.c
Fatal Error: error in backend: Found 2 machine code errors.
First terminator was:	G_BRCOND %72:_(s1), %bb.13, debug-location !253; test-suite/tools/fpcmp.c:274:5

*** Bad machine code: Virtual register defs don't dominate all uses. ***
- function:    diff_files_with_tolerance
- v. register: %72
fatal error: error in backend: Found 2 machine code errors.
clang-10: error: clang frontend command failed with exit code 70 (use -v to see invocation)
clang version 10.0.0 (https://github.com/llvm/llvm-project.git f5d5cd205e7bc5177c80d39c03eac26eff916d20)
Error: clang frontend command failed with exit code 70 (use -v to see invocation)

*** Bad machine code: Virtual register defs don't dominate all uses. ***
- function:    diff_files_with_tolerance
- v. register: %72
fatal error: error in backend: Found 2 machine code errors.
clang-10: error: clang frontend command failed with exit code 70 (use -v to see invocation)
clang version 10.0.0 (https://github.com/llvm/llvm-project.git f5d5cd205e7bc5177c80d39c03eac26eff916d20)
Target: aarch64-apple-darwin17.6.0

Build Log

Changes
  1. AMDGPU/GlobalISel: Fix VALU s16 fneg (detail)
Revision: 371220
Changes
  1. [LNT] Python 3 support: Remove implicit tuple parameter unpacking on lambdas

    Summary:
    Lambda changes split out and updated from D67535.

    Applies the `2to3 -f tuple_params` fixes, tweaks the variable naming,
    and updates the affected tuples to be named tuples.

    Reviewers: cmatthews, thopre, kristof.beyls

    Reviewed By: thopre

    Subscribers: llvm-commits

    Differential Revision: https://reviews.llvm.org/D67582 (detail)
    by hubert.reinterpretcast
  2. [LNT] Python 3 support: Replace `raise E, V` with `raise E(V)`

    Summary:
    Mechanically changed `raise E, V` to `raise E(V)`. Split out from
    D67535.

    This patch covers the files found to be affected when running tests
    (without result submission).

    Reviewers: cmatthews, thopre, kristof.beyls

    Reviewed By: thopre

    Subscribers: llvm-commits

    Differential Revision: https://reviews.llvm.org/D67581 (detail)
    by hubert.reinterpretcast

Started by upstream project relay-test-suite-verify-machineinstrs build number 6201
originally caused by:

This run spent:

  • 2 hr 8 min waiting;
  • 2 hr 16 min build duration;
  • 2 hr 16 min total from scheduled to completion.
Revision: f5d5cd205e7bc5177c80d39c03eac26eff916d20
  • detached

Identified problems

Compile Error

This build failed because of a compile error. Below is a list of all errors in the build log:
Indication 1

Ninja target failed

Below is a link to the first failed ninja target.
Indication 2