Started 1 mo 4 days ago
Took 1 hr 34 min

Failed Build clang-d326951-gd4306e90cb1-t1933-b1933.tar.gz (Sep 16, 2019 1:14:51 AM)

Issues

Found 8 issues:
Warning: clock of the subversion server appears to be out of sync. This can result in inconsistent check out behavior.
[Pipeline] // dir
[Pipeline] dir
Running in /Users/buildslave/jenkins/workspace/test-suite-verify-machineinstrs-aarch64-globalisel-O0-g/test-suite
[Pipeline] {
[Pipeline] svn
WARNING: clock of the subversion server appears to be out of sync. This can result in inconsistent check out behavior.
Updating http://llvm.org/svn/llvm-project/test-suite/trunk at revision '2019-09-16T01:14:51.273 -0700'
No changes for http://llvm.org/svn/llvm-project/test-suite/trunk since the previous build
Warning: clock of the subversion server appears to be out of sync. This can result in inconsistent check out behavior.
+ CMAKE_FLAGS+=' -C ../config/tasks/cmake/caches/opt-O0-g.cmake'
+ CMAKE_FLAGS+=' -C ../config/tasks/cmake/caches/global-isel.cmake'
+ config/tasks/task jenkinsrun config/tasks/test-suite-verify-machineinstrs.sh -a compiler=http://labmaster2.local/artifacts/clang-stage1-RA/clang-d326951-gd4306e90cb1-t1933-b1933.tar.gz -D 'CMAKE_FLAGS= -C ../config/tasks/cmake/caches/target-arm64-iphoneos.cmake -C ../config/tasks/cmake/caches/opt-O0-g.cmake -C ../config/tasks/cmake/caches/global-isel.cmake'
At revision 371962

WARNING: clock of the subversion server appears to be out of sync. This can result in inconsistent check out behavior.
+ export PATH=/Users/buildslave/jenkins/workspace/test-suite-verify-machineinstrs-aarch64-globalisel-O0-g/config/tasks/bin:/usr/local/bin:/usr/local/sbin:/usr/bin:/bin:/usr/sbin:/sbin
+ PATH=/Users/buildslave/jenkins/workspace/test-suite-verify-machineinstrs-aarch64-globalisel-O0-g/config/tasks/bin:/usr/local/bin:/usr/local/sbin:/usr/bin:/bin:/usr/sbin:/sbin
Ninja target: fpcmp.c.o
++ TEST_SUITE_NINJA_FLAGS+=
++ eval ninja ' -v -k0'
+++ ninja -v -k0
[1/8583] cd /Users/buildslave/jenkins/workspace/test-suite-verify-machineinstrs-aarch64-globalisel-O0-g/test-suite-build/tools && /usr/local/Cellar/cmake/3.13.1/bin/cmake -E copy /Users/buildslave/jenkins/workspace/test-suite-verify-machineinstrs-aarch64-globalisel-O0-g/test-suite/tools/../HashProgramOutput.sh /Users/buildslave/jenkins/workspace/test-suite-verify-machineinstrs-aarch64-globalisel-O0-g/test-suite-build/tools/HashProgramOutput.sh && chmod +x /Users/buildslave/jenkins/workspace/test-suite-verify-machineinstrs-aarch64-globalisel-O0-g/test-suite-build/tools/HashProgramOutput.sh
[2/8583] /Users/buildslave/jenkins/workspace/test-suite-verify-machineinstrs-aarch64-globalisel-O0-g/compiler/bin/clang -DNDEBUG  -B /Applications/Xcode.app/Contents/Developer/Toolchains/XcodeDefault.xctoolchain/usr/bin    -Wno-unused-command-line-argument -mllvm -verify-machineinstrs -O0 -g -arch arm64 -isysroot /Applications/Xcode.app/Contents/Developer/Platforms/iPhoneOS.platform/Developer/SDKs/iPhoneOS11.4.sdk   -w -Werror=date-time -MD -MT tools/CMakeFiles/fpcmp-target.dir/fpcmp.c.o -MF tools/CMakeFiles/fpcmp-target.dir/fpcmp.c.o.d -o tools/CMakeFiles/fpcmp-target.dir/fpcmp.c.o   -c /Users/buildslave/jenkins/workspace/test-suite-verify-machineinstrs-aarch64-globalisel-O0-g/test-suite/tools/fpcmp.c
FAILED: tools/CMakeFiles/fpcmp-target.dir/fpcmp.c.o 
/Users/buildslave/jenkins/workspace/test-suite-verify-machineinstrs-aarch64-globalisel-O0-g/compiler/bin/clang -DNDEBUG  -B /Applications/Xcode.app/Contents/Developer/Toolchains/XcodeDefault.xctoolchain/usr/bin    -Wno-unused-command-line-argument -mllvm -verify-machineinstrs -O0 -g -arch arm64 -isysroot /Applications/Xcode.app/Contents/Developer/Platforms/iPhoneOS.platform/Developer/SDKs/iPhoneOS11.4.sdk   -w -Werror=date-time -MD -MT tools/CMakeFiles/fpcmp-target.dir/fpcmp.c.o -MF tools/CMakeFiles/fpcmp-target.dir/fpcmp.c.o.d -o tools/CMakeFiles/fpcmp-target.dir/fpcmp.c.o   -c /Users/buildslave/jenkins/workspace/test-suite-verify-machineinstrs-aarch64-globalisel-O0-g/test-suite/tools/fpcmp.c
Fatal Error: error in backend: Found 2 machine code errors.
First terminator was:	G_BRCOND %72:_(s1), %bb.13, debug-location !253; test-suite/tools/fpcmp.c:274:5

*** Bad machine code: Virtual register defs don't dominate all uses. ***
- function:    diff_files_with_tolerance
- v. register: %72
fatal error: error in backend: Found 2 machine code errors.
clang-10: error: clang frontend command failed with exit code 70 (use -v to see invocation)
clang version 10.0.0 (https://github.com/llvm/llvm-project.git d4306e90cb18f663342068a4ad83ba42545dbf01)
Error: clang frontend command failed with exit code 70 (use -v to see invocation)

*** Bad machine code: Virtual register defs don't dominate all uses. ***
- function:    diff_files_with_tolerance
- v. register: %72
fatal error: error in backend: Found 2 machine code errors.
clang-10: error: clang frontend command failed with exit code 70 (use -v to see invocation)
clang version 10.0.0 (https://github.com/llvm/llvm-project.git d4306e90cb18f663342068a4ad83ba42545dbf01)
Target: aarch64-apple-darwin17.6.0
Ninja target: timeit.c.o
clang-10: note: diagnostic msg: (choose the .crash file that corresponds to your crash)
clang-10: note: diagnostic msg: 

********************
[3/8583] /Users/buildslave/jenkins/workspace/test-suite-verify-machineinstrs-aarch64-globalisel-O0-g/compiler/bin/clang -DNDEBUG  -B /Applications/Xcode.app/Contents/Developer/Toolchains/XcodeDefault.xctoolchain/usr/bin    -Wno-unused-command-line-argument -mllvm -verify-machineinstrs -O0 -g -arch arm64 -isysroot /Applications/Xcode.app/Contents/Developer/Platforms/iPhoneOS.platform/Developer/SDKs/iPhoneOS11.4.sdk   -w -Werror=date-time -MD -MT tools/CMakeFiles/timeit-target.dir/timeit.c.o -MF tools/CMakeFiles/timeit-target.dir/timeit.c.o.d -o tools/CMakeFiles/timeit-target.dir/timeit.c.o   -c /Users/buildslave/jenkins/workspace/test-suite-verify-machineinstrs-aarch64-globalisel-O0-g/test-suite/tools/timeit.c
FAILED: tools/CMakeFiles/timeit-target.dir/timeit.c.o 
/Users/buildslave/jenkins/workspace/test-suite-verify-machineinstrs-aarch64-globalisel-O0-g/compiler/bin/clang -DNDEBUG  -B /Applications/Xcode.app/Contents/Developer/Toolchains/XcodeDefault.xctoolchain/usr/bin    -Wno-unused-command-line-argument -mllvm -verify-machineinstrs -O0 -g -arch arm64 -isysroot /Applications/Xcode.app/Contents/Developer/Platforms/iPhoneOS.platform/Developer/SDKs/iPhoneOS11.4.sdk   -w -Werror=date-time -MD -MT tools/CMakeFiles/timeit-target.dir/timeit.c.o -MF tools/CMakeFiles/timeit-target.dir/timeit.c.o.d -o tools/CMakeFiles/timeit-target.dir/timeit.c.o   -c /Users/buildslave/jenkins/workspace/test-suite-verify-machineinstrs-aarch64-globalisel-O0-g/test-suite/tools/timeit.c
Fatal Error: error in backend: Found 3 machine code errors.
First terminator was:	G_BRCOND %34:_(s1), %bb.4, debug-location !875; test-suite/tools/timeit.c:163:3

*** Bad machine code: Virtual register defs don't dominate all uses. ***
- function:    monitor_child_process
- v. register: %34
fatal error: error in backend: Found 3 machine code errors.
clang-10: error: clang frontend command failed with exit code 70 (use -v to see invocation)
clang version 10.0.0 (https://github.com/llvm/llvm-project.git d4306e90cb18f663342068a4ad83ba42545dbf01)
Error: clang frontend command failed with exit code 70 (use -v to see invocation)

*** Bad machine code: Virtual register defs don't dominate all uses. ***
- function:    monitor_child_process
- v. register: %34
fatal error: error in backend: Found 3 machine code errors.
clang-10: error: clang frontend command failed with exit code 70 (use -v to see invocation)
clang version 10.0.0 (https://github.com/llvm/llvm-project.git d4306e90cb18f663342068a4ad83ba42545dbf01)
Target: aarch64-apple-darwin17.6.0

Build Log

Changes
  1. AMDGPU/GlobalISel: Remove illegal select tests (detail)
  2. [ELF] Map the ELF header at imageBase (detail)
  3. [ELF][X86] Allow PT_LOAD to have overlapping p_offset ranges on (detail)

Started by upstream project relay-test-suite-verify-machineinstrs build number 6204
originally caused by:

This run spent:

  • 1 hr 27 min waiting;
  • 1 hr 34 min build duration;
  • 1 hr 34 min total from scheduled to completion.
Revision: d4306e90cb18f663342068a4ad83ba42545dbf01
  • detached

Identified problems

Compile Error

This build failed because of a compile error. Below is a list of all errors in the build log:
Indication 1

Ninja target failed

Below is a link to the first failed ninja target.
Indication 2