Started 1 mo 1 day ago
Took 2 hr 15 min

Failed Build clang-d326975-ge8ed932683e-t1941-b1941.tar.gz (Sep 16, 2019 9:49:29 AM)

Issues

Found 6 issues:
Ninja target: fpcmp.c.o
++ TEST_SUITE_NINJA_FLAGS+=
++ eval ninja ' -v -k0'
+++ ninja -v -k0
[1/8583] cd /Users/buildslave/jenkins/workspace/test-suite-verify-machineinstrs-aarch64-globalisel-O0-g/test-suite-build/tools && /usr/local/Cellar/cmake/3.13.1/bin/cmake -E copy /Users/buildslave/jenkins/workspace/test-suite-verify-machineinstrs-aarch64-globalisel-O0-g/test-suite/tools/../HashProgramOutput.sh /Users/buildslave/jenkins/workspace/test-suite-verify-machineinstrs-aarch64-globalisel-O0-g/test-suite-build/tools/HashProgramOutput.sh && chmod +x /Users/buildslave/jenkins/workspace/test-suite-verify-machineinstrs-aarch64-globalisel-O0-g/test-suite-build/tools/HashProgramOutput.sh
[2/8583] /Users/buildslave/jenkins/workspace/test-suite-verify-machineinstrs-aarch64-globalisel-O0-g/compiler/bin/clang -DNDEBUG  -B /Applications/Xcode.app/Contents/Developer/Toolchains/XcodeDefault.xctoolchain/usr/bin    -Wno-unused-command-line-argument -mllvm -verify-machineinstrs -O0 -g -arch arm64 -isysroot /Applications/Xcode.app/Contents/Developer/Platforms/iPhoneOS.platform/Developer/SDKs/iPhoneOS11.4.sdk   -w -Werror=date-time -MD -MT tools/CMakeFiles/fpcmp-target.dir/fpcmp.c.o -MF tools/CMakeFiles/fpcmp-target.dir/fpcmp.c.o.d -o tools/CMakeFiles/fpcmp-target.dir/fpcmp.c.o   -c /Users/buildslave/jenkins/workspace/test-suite-verify-machineinstrs-aarch64-globalisel-O0-g/test-suite/tools/fpcmp.c
FAILED: tools/CMakeFiles/fpcmp-target.dir/fpcmp.c.o 
/Users/buildslave/jenkins/workspace/test-suite-verify-machineinstrs-aarch64-globalisel-O0-g/compiler/bin/clang -DNDEBUG  -B /Applications/Xcode.app/Contents/Developer/Toolchains/XcodeDefault.xctoolchain/usr/bin    -Wno-unused-command-line-argument -mllvm -verify-machineinstrs -O0 -g -arch arm64 -isysroot /Applications/Xcode.app/Contents/Developer/Platforms/iPhoneOS.platform/Developer/SDKs/iPhoneOS11.4.sdk   -w -Werror=date-time -MD -MT tools/CMakeFiles/fpcmp-target.dir/fpcmp.c.o -MF tools/CMakeFiles/fpcmp-target.dir/fpcmp.c.o.d -o tools/CMakeFiles/fpcmp-target.dir/fpcmp.c.o   -c /Users/buildslave/jenkins/workspace/test-suite-verify-machineinstrs-aarch64-globalisel-O0-g/test-suite/tools/fpcmp.c
Fatal Error: error in backend: Found 2 machine code errors.
First terminator was:	G_BRCOND %72:_(s1), %bb.13, debug-location !253; test-suite/tools/fpcmp.c:274:5

*** Bad machine code: Virtual register defs don't dominate all uses. ***
- function:    diff_files_with_tolerance
- v. register: %72
fatal error: error in backend: Found 2 machine code errors.
clang-10: error: clang frontend command failed with exit code 70 (use -v to see invocation)
clang version 10.0.0 (https://github.com/llvm/llvm-project.git e8ed932683ee6a26154ffc98c58e1888a2112494)
Error: clang frontend command failed with exit code 70 (use -v to see invocation)

*** Bad machine code: Virtual register defs don't dominate all uses. ***
- function:    diff_files_with_tolerance
- v. register: %72
fatal error: error in backend: Found 2 machine code errors.
clang-10: error: clang frontend command failed with exit code 70 (use -v to see invocation)
clang version 10.0.0 (https://github.com/llvm/llvm-project.git e8ed932683ee6a26154ffc98c58e1888a2112494)
Target: aarch64-apple-darwin17.6.0
Ninja target: timeit.c.o
clang-10: note: diagnostic msg: (choose the .crash file that corresponds to your crash)
clang-10: note: diagnostic msg: 

********************
[3/8583] /Users/buildslave/jenkins/workspace/test-suite-verify-machineinstrs-aarch64-globalisel-O0-g/compiler/bin/clang -DNDEBUG  -B /Applications/Xcode.app/Contents/Developer/Toolchains/XcodeDefault.xctoolchain/usr/bin    -Wno-unused-command-line-argument -mllvm -verify-machineinstrs -O0 -g -arch arm64 -isysroot /Applications/Xcode.app/Contents/Developer/Platforms/iPhoneOS.platform/Developer/SDKs/iPhoneOS11.4.sdk   -w -Werror=date-time -MD -MT tools/CMakeFiles/timeit-target.dir/timeit.c.o -MF tools/CMakeFiles/timeit-target.dir/timeit.c.o.d -o tools/CMakeFiles/timeit-target.dir/timeit.c.o   -c /Users/buildslave/jenkins/workspace/test-suite-verify-machineinstrs-aarch64-globalisel-O0-g/test-suite/tools/timeit.c
FAILED: tools/CMakeFiles/timeit-target.dir/timeit.c.o 
/Users/buildslave/jenkins/workspace/test-suite-verify-machineinstrs-aarch64-globalisel-O0-g/compiler/bin/clang -DNDEBUG  -B /Applications/Xcode.app/Contents/Developer/Toolchains/XcodeDefault.xctoolchain/usr/bin    -Wno-unused-command-line-argument -mllvm -verify-machineinstrs -O0 -g -arch arm64 -isysroot /Applications/Xcode.app/Contents/Developer/Platforms/iPhoneOS.platform/Developer/SDKs/iPhoneOS11.4.sdk   -w -Werror=date-time -MD -MT tools/CMakeFiles/timeit-target.dir/timeit.c.o -MF tools/CMakeFiles/timeit-target.dir/timeit.c.o.d -o tools/CMakeFiles/timeit-target.dir/timeit.c.o   -c /Users/buildslave/jenkins/workspace/test-suite-verify-machineinstrs-aarch64-globalisel-O0-g/test-suite/tools/timeit.c
Fatal Error: error in backend: Found 3 machine code errors.
First terminator was:	G_BRCOND %34:_(s1), %bb.4, debug-location !875; test-suite/tools/timeit.c:163:3

*** Bad machine code: Virtual register defs don't dominate all uses. ***
- function:    monitor_child_process
- v. register: %34
fatal error: error in backend: Found 3 machine code errors.
clang-10: error: clang frontend command failed with exit code 70 (use -v to see invocation)
clang version 10.0.0 (https://github.com/llvm/llvm-project.git e8ed932683ee6a26154ffc98c58e1888a2112494)
Error: clang frontend command failed with exit code 70 (use -v to see invocation)

*** Bad machine code: Virtual register defs don't dominate all uses. ***
- function:    monitor_child_process
- v. register: %34
fatal error: error in backend: Found 3 machine code errors.
clang-10: error: clang frontend command failed with exit code 70 (use -v to see invocation)
clang version 10.0.0 (https://github.com/llvm/llvm-project.git e8ed932683ee6a26154ffc98c58e1888a2112494)
Target: aarch64-apple-darwin17.6.0

Build Log

Changes
  1. [InstCombine] fix comments to match code; NFC (detail)
  2. [InstCombine] add icmp tests with extra uses; NFC (detail)
  3. [clangd] Bump vscode-clangd v0.0.17 (detail)
  4. [InstCombine] remove unneeded one-use checks for icmp fold (detail)
  5. [ARM] Fold VCMP into VPT (detail)
  6. [docs][llvm-size] Write llvm-size documentation (detail)

Started by upstream project relay-test-suite-verify-machineinstrs build number 6208
originally caused by:

This run spent:

  • 2 hr 7 min waiting;
  • 2 hr 15 min build duration;
  • 2 hr 16 min total from scheduled to completion.
Revision: e8ed932683ee6a26154ffc98c58e1888a2112494
  • detached

Identified problems

Compile Error

This build failed because of a compile error. Below is a list of all errors in the build log:
Indication 1

Ninja target failed

Below is a link to the first failed ninja target.
Indication 2