Started 1 mo 6 days ago
Took 2 hr 17 min

Failed Build clang-d327002-g6fcd4e080f0-t1947-b1947.tar.gz (Sep 16, 2019 12:05:37 PM)

Issues

Found 7 issues:
Warning: clock of the subversion server appears to be out of sync. This can result in inconsistent check out behavior.
+ CMAKE_FLAGS+=' -C ../config/tasks/cmake/caches/opt-O0-g.cmake'
+ CMAKE_FLAGS+=' -C ../config/tasks/cmake/caches/global-isel.cmake'
+ config/tasks/task jenkinsrun config/tasks/test-suite-verify-machineinstrs.sh -a compiler=http://labmaster2.local/artifacts/clang-stage1-RA/clang-d327002-g6fcd4e080f0-t1947-b1947.tar.gz -D 'CMAKE_FLAGS= -C ../config/tasks/cmake/caches/target-arm64-iphoneos.cmake -C ../config/tasks/cmake/caches/opt-O0-g.cmake -C ../config/tasks/cmake/caches/global-isel.cmake'
At revision 372023

WARNING: clock of the subversion server appears to be out of sync. This can result in inconsistent check out behavior.
+ export PATH=/Users/buildslave/jenkins/workspace/test-suite-verify-machineinstrs-aarch64-globalisel-O0-g/config/tasks/bin:/usr/local/bin:/usr/local/sbin:/usr/bin:/bin:/usr/sbin:/sbin
+ PATH=/Users/buildslave/jenkins/workspace/test-suite-verify-machineinstrs-aarch64-globalisel-O0-g/config/tasks/bin:/usr/local/bin:/usr/local/sbin:/usr/bin:/bin:/usr/sbin:/sbin
Ninja target: fpcmp.c.o
++ TEST_SUITE_NINJA_FLAGS+=
++ eval ninja ' -v -k0'
+++ ninja -v -k0
[1/8583] cd /Users/buildslave/jenkins/workspace/test-suite-verify-machineinstrs-aarch64-globalisel-O0-g/test-suite-build/tools && /usr/local/Cellar/cmake/3.13.1/bin/cmake -E copy /Users/buildslave/jenkins/workspace/test-suite-verify-machineinstrs-aarch64-globalisel-O0-g/test-suite/tools/../HashProgramOutput.sh /Users/buildslave/jenkins/workspace/test-suite-verify-machineinstrs-aarch64-globalisel-O0-g/test-suite-build/tools/HashProgramOutput.sh && chmod +x /Users/buildslave/jenkins/workspace/test-suite-verify-machineinstrs-aarch64-globalisel-O0-g/test-suite-build/tools/HashProgramOutput.sh
[2/8583] /Users/buildslave/jenkins/workspace/test-suite-verify-machineinstrs-aarch64-globalisel-O0-g/compiler/bin/clang -DNDEBUG  -B /Applications/Xcode.app/Contents/Developer/Toolchains/XcodeDefault.xctoolchain/usr/bin    -Wno-unused-command-line-argument -mllvm -verify-machineinstrs -O0 -g -arch arm64 -isysroot /Applications/Xcode.app/Contents/Developer/Platforms/iPhoneOS.platform/Developer/SDKs/iPhoneOS11.4.sdk   -w -Werror=date-time -MD -MT tools/CMakeFiles/fpcmp-target.dir/fpcmp.c.o -MF tools/CMakeFiles/fpcmp-target.dir/fpcmp.c.o.d -o tools/CMakeFiles/fpcmp-target.dir/fpcmp.c.o   -c /Users/buildslave/jenkins/workspace/test-suite-verify-machineinstrs-aarch64-globalisel-O0-g/test-suite/tools/fpcmp.c
FAILED: tools/CMakeFiles/fpcmp-target.dir/fpcmp.c.o 
/Users/buildslave/jenkins/workspace/test-suite-verify-machineinstrs-aarch64-globalisel-O0-g/compiler/bin/clang -DNDEBUG  -B /Applications/Xcode.app/Contents/Developer/Toolchains/XcodeDefault.xctoolchain/usr/bin    -Wno-unused-command-line-argument -mllvm -verify-machineinstrs -O0 -g -arch arm64 -isysroot /Applications/Xcode.app/Contents/Developer/Platforms/iPhoneOS.platform/Developer/SDKs/iPhoneOS11.4.sdk   -w -Werror=date-time -MD -MT tools/CMakeFiles/fpcmp-target.dir/fpcmp.c.o -MF tools/CMakeFiles/fpcmp-target.dir/fpcmp.c.o.d -o tools/CMakeFiles/fpcmp-target.dir/fpcmp.c.o   -c /Users/buildslave/jenkins/workspace/test-suite-verify-machineinstrs-aarch64-globalisel-O0-g/test-suite/tools/fpcmp.c
Fatal Error: error in backend: Found 2 machine code errors.
First terminator was:	G_BRCOND %72:_(s1), %bb.13, debug-location !253; test-suite/tools/fpcmp.c:274:5

*** Bad machine code: Virtual register defs don't dominate all uses. ***
- function:    diff_files_with_tolerance
- v. register: %72
fatal error: error in backend: Found 2 machine code errors.
clang-10: error: clang frontend command failed with exit code 70 (use -v to see invocation)
clang version 10.0.0 (https://github.com/llvm/llvm-project.git 6fcd4e080f09c9765d6e0ea03b1da91669c8509a)
Error: clang frontend command failed with exit code 70 (use -v to see invocation)

*** Bad machine code: Virtual register defs don't dominate all uses. ***
- function:    diff_files_with_tolerance
- v. register: %72
fatal error: error in backend: Found 2 machine code errors.
clang-10: error: clang frontend command failed with exit code 70 (use -v to see invocation)
clang version 10.0.0 (https://github.com/llvm/llvm-project.git 6fcd4e080f09c9765d6e0ea03b1da91669c8509a)
Target: aarch64-apple-darwin17.6.0
Ninja target: timeit.c.o
clang-10: note: diagnostic msg: (choose the .crash file that corresponds to your crash)
clang-10: note: diagnostic msg: 

********************
[3/8583] /Users/buildslave/jenkins/workspace/test-suite-verify-machineinstrs-aarch64-globalisel-O0-g/compiler/bin/clang -DNDEBUG  -B /Applications/Xcode.app/Contents/Developer/Toolchains/XcodeDefault.xctoolchain/usr/bin    -Wno-unused-command-line-argument -mllvm -verify-machineinstrs -O0 -g -arch arm64 -isysroot /Applications/Xcode.app/Contents/Developer/Platforms/iPhoneOS.platform/Developer/SDKs/iPhoneOS11.4.sdk   -w -Werror=date-time -MD -MT tools/CMakeFiles/timeit-target.dir/timeit.c.o -MF tools/CMakeFiles/timeit-target.dir/timeit.c.o.d -o tools/CMakeFiles/timeit-target.dir/timeit.c.o   -c /Users/buildslave/jenkins/workspace/test-suite-verify-machineinstrs-aarch64-globalisel-O0-g/test-suite/tools/timeit.c
FAILED: tools/CMakeFiles/timeit-target.dir/timeit.c.o 
/Users/buildslave/jenkins/workspace/test-suite-verify-machineinstrs-aarch64-globalisel-O0-g/compiler/bin/clang -DNDEBUG  -B /Applications/Xcode.app/Contents/Developer/Toolchains/XcodeDefault.xctoolchain/usr/bin    -Wno-unused-command-line-argument -mllvm -verify-machineinstrs -O0 -g -arch arm64 -isysroot /Applications/Xcode.app/Contents/Developer/Platforms/iPhoneOS.platform/Developer/SDKs/iPhoneOS11.4.sdk   -w -Werror=date-time -MD -MT tools/CMakeFiles/timeit-target.dir/timeit.c.o -MF tools/CMakeFiles/timeit-target.dir/timeit.c.o.d -o tools/CMakeFiles/timeit-target.dir/timeit.c.o   -c /Users/buildslave/jenkins/workspace/test-suite-verify-machineinstrs-aarch64-globalisel-O0-g/test-suite/tools/timeit.c
Fatal Error: error in backend: Found 3 machine code errors.
First terminator was:	G_BRCOND %34:_(s1), %bb.4, debug-location !875; test-suite/tools/timeit.c:163:3

*** Bad machine code: Virtual register defs don't dominate all uses. ***
- function:    monitor_child_process
- v. register: %34
fatal error: error in backend: Found 3 machine code errors.
clang-10: error: clang frontend command failed with exit code 70 (use -v to see invocation)
clang version 10.0.0 (https://github.com/llvm/llvm-project.git 6fcd4e080f09c9765d6e0ea03b1da91669c8509a)
Error: clang frontend command failed with exit code 70 (use -v to see invocation)

*** Bad machine code: Virtual register defs don't dominate all uses. ***
- function:    monitor_child_process
- v. register: %34
fatal error: error in backend: Found 3 machine code errors.
clang-10: error: clang frontend command failed with exit code 70 (use -v to see invocation)
clang version 10.0.0 (https://github.com/llvm/llvm-project.git 6fcd4e080f09c9765d6e0ea03b1da91669c8509a)
Target: aarch64-apple-darwin17.6.0

Build Log

Changes
  1. [docs][llvm-strings] Write llvm-strings documentation (detail)
  2. Move some definitions from Sema to Basic to fix shared libs build (detail)
  3. [clangd][vscode] update the development doc. (detail)
  4. [InstCombine] add/move tests for icmp with add operand; NFC (detail)
  5. [X86][NFC] Add a `use-aa` feature. (detail)
  6. AMDGPU/GlobalISel: Remove another illegal select test (detail)
  7. AMDGPU/GlobalISel: Fix RegBankSelect for G_FRINT and G_FCEIL (detail)
  8. AMDGPU/GlobalISel: Fix some broken run lines (detail)
  9. AMDGPU/GlobalISel: Fail select of G_INSERT non-32-bit source (detail)
  10. [NFC] remove unused functions (detail)
  11. [SystemZ]  Call erase() on the right MBB in (detail)
  12. [LV] Add ARM MVE tail-folding tests (detail)
  13. [libFuzzer] Remove unused version of FuzzedDataProvider.h. (detail)
  14. [ExecutionEngine] Don't dereference a dyn_cast result. NFCI. (detail)
  15. [ARM] Add patterns for CTLZ on MVE (detail)
  16. [ARM] Lower CTTZ on MVE (detail)
  17. [ARM] Add patterns for bitreverse intrinsic on MVE (detail)
  18. [ARM] Add patterns for BSWAP intrinsic on MVE (detail)
  19. [InstCombine] move tests for icmp+add; NFC (detail)
  20. [InstCombine] remove unneeded one-use checks for icmp fold (detail)
  21. [clangd] Simplify semantic highlighting visitor (detail)
  22. [SimplifyCFG] FoldTwoEntryPHINode(): consider *total* speculation cost, (detail)
  23. [OPENMP]Fix parsing/sema for function templates with declare simd. (detail)
  24. [ARM] A predicate cast of a predicate cast is a predicate cast (detail)
  25. [X86][AVX] matchShuffleWithSHUFPD - add support for zeroable operands (detail)
  26. [Clang][Codegen] Relax available-externally-suppress.c test (detail)
  27. [Clang][Codegen] Disable arm_acle.c test. (detail)

Started by upstream project relay-test-suite-verify-machineinstrs build number 6209
originally caused by:

This run spent:

  • 2 hr 10 min waiting;
  • 2 hr 17 min build duration;
  • 2 hr 17 min total from scheduled to completion.
Revision: 6fcd4e080f09c9765d6e0ea03b1da91669c8509a
  • detached

Identified problems

Compile Error

This build failed because of a compile error. Below is a list of all errors in the build log:
Indication 1

Ninja target failed

Below is a link to the first failed ninja target.
Indication 2