Started 27 days ago
Took 1 hr 17 min

Failed Build clang-d327301-ge2f9bc3b11b-t2063-b2063.tar.gz (Sep 19, 2019 11:50:05 AM)

Issues

Found 3 issues:
Ninja target: health.c.o
[2915/4714] /Users/buildslave/jenkins/workspace/test-suite-verify-machineinstrs-x86_64-O3/test-suite-build/tools/timeit --summary MultiSource/Benchmarks/Olden/bh/CMakeFiles/bh.dir/newbh.c.o.time /Users/buildslave/jenkins/workspace/test-suite-verify-machineinstrs-x86_64-O3/compiler/bin/clang -DNDEBUG  -B /Applications/Xcode.app/Contents/Developer/Toolchains/XcodeDefault.xctoolchain/usr/bin    -Wno-unused-command-line-argument -mllvm -verify-machineinstrs -O3 -arch x86_64 -isysroot /Applications/Xcode.app/Contents/Developer/Platforms/MacOSX.platform/Developer/SDKs/MacOSX10.14.sdk   -w -Werror=date-time -DTORONTO -MD -MT MultiSource/Benchmarks/Olden/bh/CMakeFiles/bh.dir/newbh.c.o -MF MultiSource/Benchmarks/Olden/bh/CMakeFiles/bh.dir/newbh.c.o.d -o MultiSource/Benchmarks/Olden/bh/CMakeFiles/bh.dir/newbh.c.o   -c /Users/buildslave/jenkins/workspace/test-suite-verify-machineinstrs-x86_64-O3/test-suite/MultiSource/Benchmarks/Olden/bh/newbh.c
[2916/4714] /Users/buildslave/jenkins/workspace/test-suite-verify-machineinstrs-x86_64-O3/test-suite-build/tools/timeit --summary MultiSource/Benchmarks/Olden/em3d/CMakeFiles/em3d.dir/make_graph.c.o.time /Users/buildslave/jenkins/workspace/test-suite-verify-machineinstrs-x86_64-O3/compiler/bin/clang -DNDEBUG  -B /Applications/Xcode.app/Contents/Developer/Toolchains/XcodeDefault.xctoolchain/usr/bin    -Wno-unused-command-line-argument -mllvm -verify-machineinstrs -O3 -arch x86_64 -isysroot /Applications/Xcode.app/Contents/Developer/Platforms/MacOSX.platform/Developer/SDKs/MacOSX10.14.sdk   -w -Werror=date-time -DTORONTO -MD -MT MultiSource/Benchmarks/Olden/em3d/CMakeFiles/em3d.dir/make_graph.c.o -MF MultiSource/Benchmarks/Olden/em3d/CMakeFiles/em3d.dir/make_graph.c.o.d -o MultiSource/Benchmarks/Olden/em3d/CMakeFiles/em3d.dir/make_graph.c.o   -c /Users/buildslave/jenkins/workspace/test-suite-verify-machineinstrs-x86_64-O3/test-suite/MultiSource/Benchmarks/Olden/em3d/make_graph.c
[2917/4714] /Users/buildslave/jenkins/workspace/test-suite-verify-machineinstrs-x86_64-O3/test-suite-build/tools/timeit --summary MultiSource/Benchmarks/Olden/mst/CMakeFiles/mst.dir/hash.c.o.time /Users/buildslave/jenkins/workspace/test-suite-verify-machineinstrs-x86_64-O3/compiler/bin/clang -DNDEBUG  -B /Applications/Xcode.app/Contents/Developer/Toolchains/XcodeDefault.xctoolchain/usr/bin    -Wno-unused-command-line-argument -mllvm -verify-machineinstrs -O3 -arch x86_64 -isysroot /Applications/Xcode.app/Contents/Developer/Platforms/MacOSX.platform/Developer/SDKs/MacOSX10.14.sdk   -w -Werror=date-time -DTORONTO -MD -MT MultiSource/Benchmarks/Olden/mst/CMakeFiles/mst.dir/hash.c.o -MF MultiSource/Benchmarks/Olden/mst/CMakeFiles/mst.dir/hash.c.o.d -o MultiSource/Benchmarks/Olden/mst/CMakeFiles/mst.dir/hash.c.o   -c /Users/buildslave/jenkins/workspace/test-suite-verify-machineinstrs-x86_64-O3/test-suite/MultiSource/Benchmarks/Olden/mst/hash.c
[2918/4714] /Users/buildslave/jenkins/workspace/test-suite-verify-machineinstrs-x86_64-O3/test-suite-build/tools/timeit --summary MultiSource/Benchmarks/Olden/mst/CMakeFiles/mst.dir/main.c.o.time /Users/buildslave/jenkins/workspace/test-suite-verify-machineinstrs-x86_64-O3/compiler/bin/clang -DNDEBUG  -B /Applications/Xcode.app/Contents/Developer/Toolchains/XcodeDefault.xctoolchain/usr/bin    -Wno-unused-command-line-argument -mllvm -verify-machineinstrs -O3 -arch x86_64 -isysroot /Applications/Xcode.app/Contents/Developer/Platforms/MacOSX.platform/Developer/SDKs/MacOSX10.14.sdk   -w -Werror=date-time -DTORONTO -MD -MT MultiSource/Benchmarks/Olden/mst/CMakeFiles/mst.dir/main.c.o -MF MultiSource/Benchmarks/Olden/mst/CMakeFiles/mst.dir/main.c.o.d -o MultiSource/Benchmarks/Olden/mst/CMakeFiles/mst.dir/main.c.o   -c /Users/buildslave/jenkins/workspace/test-suite-verify-machineinstrs-x86_64-O3/test-suite/MultiSource/Benchmarks/Olden/mst/main.c
[2919/4714] /Users/buildslave/jenkins/workspace/test-suite-verify-machineinstrs-x86_64-O3/test-suite-build/tools/timeit --summary MultiSource/Benchmarks/Olden/health/CMakeFiles/health.dir/health.c.o.time /Users/buildslave/jenkins/workspace/test-suite-verify-machineinstrs-x86_64-O3/compiler/bin/clang -DNDEBUG  -B /Applications/Xcode.app/Contents/Developer/Toolchains/XcodeDefault.xctoolchain/usr/bin    -Wno-unused-command-line-argument -mllvm -verify-machineinstrs -O3 -arch x86_64 -isysroot /Applications/Xcode.app/Contents/Developer/Platforms/MacOSX.platform/Developer/SDKs/MacOSX10.14.sdk   -w -Werror=date-time -DTORONTO -MD -MT MultiSource/Benchmarks/Olden/health/CMakeFiles/health.dir/health.c.o -MF MultiSource/Benchmarks/Olden/health/CMakeFiles/health.dir/health.c.o.d -o MultiSource/Benchmarks/Olden/health/CMakeFiles/health.dir/health.c.o   -c /Users/buildslave/jenkins/workspace/test-suite-verify-machineinstrs-x86_64-O3/test-suite/MultiSource/Benchmarks/Olden/health/health.c
FAILED: MultiSource/Benchmarks/Olden/health/CMakeFiles/health.dir/health.c.o 
/Users/buildslave/jenkins/workspace/test-suite-verify-machineinstrs-x86_64-O3/test-suite-build/tools/timeit --summary MultiSource/Benchmarks/Olden/health/CMakeFiles/health.dir/health.c.o.time /Users/buildslave/jenkins/workspace/test-suite-verify-machineinstrs-x86_64-O3/compiler/bin/clang -DNDEBUG  -B /Applications/Xcode.app/Contents/Developer/Toolchains/XcodeDefault.xctoolchain/usr/bin    -Wno-unused-command-line-argument -mllvm -verify-machineinstrs -O3 -arch x86_64 -isysroot /Applications/Xcode.app/Contents/Developer/Platforms/MacOSX.platform/Developer/SDKs/MacOSX10.14.sdk   -w -Werror=date-time -DTORONTO -MD -MT MultiSource/Benchmarks/Olden/health/CMakeFiles/health.dir/health.c.o -MF MultiSource/Benchmarks/Olden/health/CMakeFiles/health.dir/health.c.o.d -o MultiSource/Benchmarks/Olden/health/CMakeFiles/health.dir/health.c.o   -c /Users/buildslave/jenkins/workspace/test-suite-verify-machineinstrs-x86_64-O3/test-suite/MultiSource/Benchmarks/Olden/health/health.c
fatal error: error in backend: Cannot select: t80: v4f32 = X86ISD::BLENDI t75, t78, Constant:i8<1>
Fatal Error: error in backend: Cannot select: t80: v4f32 = X86ISD::BLENDI t75, t78, Constant:i8<1>
[2917/4714] /Users/buildslave/jenkins/workspace/test-suite-verify-machineinstrs-x86_64-O3/test-suite-build/tools/timeit --summary MultiSource/Benchmarks/Olden/mst/CMakeFiles/mst.dir/hash.c.o.time /Users/buildslave/jenkins/workspace/test-suite-verify-machineinstrs-x86_64-O3/compiler/bin/clang -DNDEBUG  -B /Applications/Xcode.app/Contents/Developer/Toolchains/XcodeDefault.xctoolchain/usr/bin    -Wno-unused-command-line-argument -mllvm -verify-machineinstrs -O3 -arch x86_64 -isysroot /Applications/Xcode.app/Contents/Developer/Platforms/MacOSX.platform/Developer/SDKs/MacOSX10.14.sdk   -w -Werror=date-time -DTORONTO -MD -MT MultiSource/Benchmarks/Olden/mst/CMakeFiles/mst.dir/hash.c.o -MF MultiSource/Benchmarks/Olden/mst/CMakeFiles/mst.dir/hash.c.o.d -o MultiSource/Benchmarks/Olden/mst/CMakeFiles/mst.dir/hash.c.o   -c /Users/buildslave/jenkins/workspace/test-suite-verify-machineinstrs-x86_64-O3/test-suite/MultiSource/Benchmarks/Olden/mst/hash.c
[2918/4714] /Users/buildslave/jenkins/workspace/test-suite-verify-machineinstrs-x86_64-O3/test-suite-build/tools/timeit --summary MultiSource/Benchmarks/Olden/mst/CMakeFiles/mst.dir/main.c.o.time /Users/buildslave/jenkins/workspace/test-suite-verify-machineinstrs-x86_64-O3/compiler/bin/clang -DNDEBUG  -B /Applications/Xcode.app/Contents/Developer/Toolchains/XcodeDefault.xctoolchain/usr/bin    -Wno-unused-command-line-argument -mllvm -verify-machineinstrs -O3 -arch x86_64 -isysroot /Applications/Xcode.app/Contents/Developer/Platforms/MacOSX.platform/Developer/SDKs/MacOSX10.14.sdk   -w -Werror=date-time -DTORONTO -MD -MT MultiSource/Benchmarks/Olden/mst/CMakeFiles/mst.dir/main.c.o -MF MultiSource/Benchmarks/Olden/mst/CMakeFiles/mst.dir/main.c.o.d -o MultiSource/Benchmarks/Olden/mst/CMakeFiles/mst.dir/main.c.o   -c /Users/buildslave/jenkins/workspace/test-suite-verify-machineinstrs-x86_64-O3/test-suite/MultiSource/Benchmarks/Olden/mst/main.c
[2919/4714] /Users/buildslave/jenkins/workspace/test-suite-verify-machineinstrs-x86_64-O3/test-suite-build/tools/timeit --summary MultiSource/Benchmarks/Olden/health/CMakeFiles/health.dir/health.c.o.time /Users/buildslave/jenkins/workspace/test-suite-verify-machineinstrs-x86_64-O3/compiler/bin/clang -DNDEBUG  -B /Applications/Xcode.app/Contents/Developer/Toolchains/XcodeDefault.xctoolchain/usr/bin    -Wno-unused-command-line-argument -mllvm -verify-machineinstrs -O3 -arch x86_64 -isysroot /Applications/Xcode.app/Contents/Developer/Platforms/MacOSX.platform/Developer/SDKs/MacOSX10.14.sdk   -w -Werror=date-time -DTORONTO -MD -MT MultiSource/Benchmarks/Olden/health/CMakeFiles/health.dir/health.c.o -MF MultiSource/Benchmarks/Olden/health/CMakeFiles/health.dir/health.c.o.d -o MultiSource/Benchmarks/Olden/health/CMakeFiles/health.dir/health.c.o   -c /Users/buildslave/jenkins/workspace/test-suite-verify-machineinstrs-x86_64-O3/test-suite/MultiSource/Benchmarks/Olden/health/health.c
FAILED: MultiSource/Benchmarks/Olden/health/CMakeFiles/health.dir/health.c.o 
/Users/buildslave/jenkins/workspace/test-suite-verify-machineinstrs-x86_64-O3/test-suite-build/tools/timeit --summary MultiSource/Benchmarks/Olden/health/CMakeFiles/health.dir/health.c.o.time /Users/buildslave/jenkins/workspace/test-suite-verify-machineinstrs-x86_64-O3/compiler/bin/clang -DNDEBUG  -B /Applications/Xcode.app/Contents/Developer/Toolchains/XcodeDefault.xctoolchain/usr/bin    -Wno-unused-command-line-argument -mllvm -verify-machineinstrs -O3 -arch x86_64 -isysroot /Applications/Xcode.app/Contents/Developer/Platforms/MacOSX.platform/Developer/SDKs/MacOSX10.14.sdk   -w -Werror=date-time -DTORONTO -MD -MT MultiSource/Benchmarks/Olden/health/CMakeFiles/health.dir/health.c.o -MF MultiSource/Benchmarks/Olden/health/CMakeFiles/health.dir/health.c.o.d -o MultiSource/Benchmarks/Olden/health/CMakeFiles/health.dir/health.c.o   -c /Users/buildslave/jenkins/workspace/test-suite-verify-machineinstrs-x86_64-O3/test-suite/MultiSource/Benchmarks/Olden/health/health.c
fatal error: error in backend: Cannot select: t80: v4f32 = X86ISD::BLENDI t75, t78, Constant:i8<1>
  t75: v4f32,ch = load<(load 16 from constant-pool)> t0, t74, undef:i64
    t74: i64 = X86ISD::WrapperRIP TargetConstantPool:i64<<4 x float> <float undef, float 1.000000e+00, float undef, float undef>> 0
Error: clang frontend command failed with exit code 70 (use -v to see invocation)
            t6: i64 = undef
          t15: i64 = Constant<4>
        t6: i64 = undef
  t79: i8 = Constant<1>
In function: get_results
clang-10: error: clang frontend command failed with exit code 70 (use -v to see invocation)
clang version 10.0.0 (https://github.com/llvm/llvm-project.git e2f9bc3b11baebbdd91ba0ae2faf30d39071ca54)
Target: x86_64-apple-darwin18.0.0

Build Log

Revision: 372241
Changes
  1. The LLD buildbot has some tests that are not reliable.
    Hopefully reducing the number of threads for the test will fix the issue.
    It seems that the quotes around the parameters means it tries to take everything as one argument. Bu using -j we can actually pass everything as one argument by attaching the j to the sv.

    Patch by Stefan Pintilie. (detail)
    by gkistanova
Changes
  1. [MCA] Improved cost computation for loop carried dependencies in the (detail)
  2. Reapply r372285 "GlobalISel: Don't materialize immarg arguments to (detail)
  3. [Float2Int] avoid crashing on unreachable code (PR38502) (detail)
  4. [AMDGPU] Unnecessary -amdgpu-scalarize-global-loads=false flag removed (detail)

Started by upstream project relay-test-suite-verify-machineinstrs build number 6240
originally caused by:

This run spent:

  • 52 min waiting;
  • 1 hr 17 min build duration;
  • 1 hr 17 min total from scheduled to completion.
Revision: e2f9bc3b11baebbdd91ba0ae2faf30d39071ca54
  • detached

Identified problems

Ninja target failed

Below is a link to the first failed ninja target.
Indication 1

Compile Error

This build failed because of a compile error. Below is a list of all errors in the build log:
Indication 2