Started 1 mo 0 days ago
Took 24 min

Failed Build clang-d327319-g9dd57df26ab-t2069-b2069.tar.gz (Sep 19, 2019 5:33:41 PM)

Issues

Found 3 issues:
Ninja target: health.c.o
[2816/4714] /Users/buildslave/jenkins/workspace/test-suite-verify-machineinstrs-x86_64-O3/test-suite-build/tools/timeit --summary MultiSource/Benchmarks/Olden/em3d/CMakeFiles/em3d.dir/make_graph.c.o.time /Users/buildslave/jenkins/workspace/test-suite-verify-machineinstrs-x86_64-O3/compiler/bin/clang -DNDEBUG  -B /Applications/Xcode.app/Contents/Developer/Toolchains/XcodeDefault.xctoolchain/usr/bin    -Wno-unused-command-line-argument -mllvm -verify-machineinstrs -O3 -arch x86_64 -isysroot /Applications/Xcode.app/Contents/Developer/Platforms/MacOSX.platform/Developer/SDKs/MacOSX10.14.sdk   -w -Werror=date-time -DTORONTO -MD -MT MultiSource/Benchmarks/Olden/em3d/CMakeFiles/em3d.dir/make_graph.c.o -MF MultiSource/Benchmarks/Olden/em3d/CMakeFiles/em3d.dir/make_graph.c.o.d -o MultiSource/Benchmarks/Olden/em3d/CMakeFiles/em3d.dir/make_graph.c.o   -c /Users/buildslave/jenkins/workspace/test-suite-verify-machineinstrs-x86_64-O3/test-suite/MultiSource/Benchmarks/Olden/em3d/make_graph.c
[2817/4714] /Users/buildslave/jenkins/workspace/test-suite-verify-machineinstrs-x86_64-O3/test-suite-build/tools/timeit --summary MultiSource/Benchmarks/Olden/mst/CMakeFiles/mst.dir/args.c.o.time /Users/buildslave/jenkins/workspace/test-suite-verify-machineinstrs-x86_64-O3/compiler/bin/clang -DNDEBUG  -B /Applications/Xcode.app/Contents/Developer/Toolchains/XcodeDefault.xctoolchain/usr/bin    -Wno-unused-command-line-argument -mllvm -verify-machineinstrs -O3 -arch x86_64 -isysroot /Applications/Xcode.app/Contents/Developer/Platforms/MacOSX.platform/Developer/SDKs/MacOSX10.14.sdk   -w -Werror=date-time -DTORONTO -MD -MT MultiSource/Benchmarks/Olden/mst/CMakeFiles/mst.dir/args.c.o -MF MultiSource/Benchmarks/Olden/mst/CMakeFiles/mst.dir/args.c.o.d -o MultiSource/Benchmarks/Olden/mst/CMakeFiles/mst.dir/args.c.o   -c /Users/buildslave/jenkins/workspace/test-suite-verify-machineinstrs-x86_64-O3/test-suite/MultiSource/Benchmarks/Olden/mst/args.c
[2818/4714] /Users/buildslave/jenkins/workspace/test-suite-verify-machineinstrs-x86_64-O3/test-suite-build/tools/timeit --summary MultiSource/Benchmarks/Olden/bh/CMakeFiles/bh.dir/newbh.c.o.time /Users/buildslave/jenkins/workspace/test-suite-verify-machineinstrs-x86_64-O3/compiler/bin/clang -DNDEBUG  -B /Applications/Xcode.app/Contents/Developer/Toolchains/XcodeDefault.xctoolchain/usr/bin    -Wno-unused-command-line-argument -mllvm -verify-machineinstrs -O3 -arch x86_64 -isysroot /Applications/Xcode.app/Contents/Developer/Platforms/MacOSX.platform/Developer/SDKs/MacOSX10.14.sdk   -w -Werror=date-time -DTORONTO -MD -MT MultiSource/Benchmarks/Olden/bh/CMakeFiles/bh.dir/newbh.c.o -MF MultiSource/Benchmarks/Olden/bh/CMakeFiles/bh.dir/newbh.c.o.d -o MultiSource/Benchmarks/Olden/bh/CMakeFiles/bh.dir/newbh.c.o   -c /Users/buildslave/jenkins/workspace/test-suite-verify-machineinstrs-x86_64-O3/test-suite/MultiSource/Benchmarks/Olden/bh/newbh.c
[2819/4714] : && /Users/buildslave/jenkins/workspace/test-suite-verify-machineinstrs-x86_64-O3/test-suite-build/tools/timeit --summary MultiSource/Benchmarks/Olden/em3d/em3d.link.time /Users/buildslave/jenkins/workspace/test-suite-verify-machineinstrs-x86_64-O3/compiler/bin/clang -B /Applications/Xcode.app/Contents/Developer/Toolchains/XcodeDefault.xctoolchain/usr/bin    -Wno-unused-command-line-argument -mllvm -verify-machineinstrs -O3 -arch x86_64 -isysroot /Applications/Xcode.app/Contents/Developer/Platforms/MacOSX.platform/Developer/SDKs/MacOSX10.14.sdk -Wl,-search_paths_first -Wl,-headerpad_max_install_names -B /Applications/Xcode.app/Contents/Developer/Toolchains/XcodeDefault.xctoolchain/usr/bin MultiSource/Benchmarks/Olden/em3d/CMakeFiles/em3d.dir/args.c.o MultiSource/Benchmarks/Olden/em3d/CMakeFiles/em3d.dir/em3d.c.o MultiSource/Benchmarks/Olden/em3d/CMakeFiles/em3d.dir/main.c.o MultiSource/Benchmarks/Olden/em3d/CMakeFiles/em3d.dir/make_graph.c.o MultiSource/Benchmarks/Olden/em3d/CMakeFiles/em3d.dir/util.c.o  -o MultiSource/Benchmarks/Olden/em3d/em3d  -Wl,-no_pie && cd /Users/buildslave/jenkins/workspace/test-suite-verify-machineinstrs-x86_64-O3/test-suite-build/MultiSource/Benchmarks/Olden/em3d && /usr/local/Cellar/cmake/3.13.1/bin/cmake -E create_symlink /Users/buildslave/jenkins/workspace/test-suite-verify-machineinstrs-x86_64-O3/test-suite/MultiSource/Benchmarks/Olden/em3d/em3d.reference_output /Users/buildslave/jenkins/workspace/test-suite-verify-machineinstrs-x86_64-O3/test-suite-build/MultiSource/Benchmarks/Olden/em3d/em3d.reference_output
[2820/4714] /Users/buildslave/jenkins/workspace/test-suite-verify-machineinstrs-x86_64-O3/test-suite-build/tools/timeit --summary MultiSource/Benchmarks/Olden/health/CMakeFiles/health.dir/health.c.o.time /Users/buildslave/jenkins/workspace/test-suite-verify-machineinstrs-x86_64-O3/compiler/bin/clang -DNDEBUG  -B /Applications/Xcode.app/Contents/Developer/Toolchains/XcodeDefault.xctoolchain/usr/bin    -Wno-unused-command-line-argument -mllvm -verify-machineinstrs -O3 -arch x86_64 -isysroot /Applications/Xcode.app/Contents/Developer/Platforms/MacOSX.platform/Developer/SDKs/MacOSX10.14.sdk   -w -Werror=date-time -DTORONTO -MD -MT MultiSource/Benchmarks/Olden/health/CMakeFiles/health.dir/health.c.o -MF MultiSource/Benchmarks/Olden/health/CMakeFiles/health.dir/health.c.o.d -o MultiSource/Benchmarks/Olden/health/CMakeFiles/health.dir/health.c.o   -c /Users/buildslave/jenkins/workspace/test-suite-verify-machineinstrs-x86_64-O3/test-suite/MultiSource/Benchmarks/Olden/health/health.c
FAILED: MultiSource/Benchmarks/Olden/health/CMakeFiles/health.dir/health.c.o 
/Users/buildslave/jenkins/workspace/test-suite-verify-machineinstrs-x86_64-O3/test-suite-build/tools/timeit --summary MultiSource/Benchmarks/Olden/health/CMakeFiles/health.dir/health.c.o.time /Users/buildslave/jenkins/workspace/test-suite-verify-machineinstrs-x86_64-O3/compiler/bin/clang -DNDEBUG  -B /Applications/Xcode.app/Contents/Developer/Toolchains/XcodeDefault.xctoolchain/usr/bin    -Wno-unused-command-line-argument -mllvm -verify-machineinstrs -O3 -arch x86_64 -isysroot /Applications/Xcode.app/Contents/Developer/Platforms/MacOSX.platform/Developer/SDKs/MacOSX10.14.sdk   -w -Werror=date-time -DTORONTO -MD -MT MultiSource/Benchmarks/Olden/health/CMakeFiles/health.dir/health.c.o -MF MultiSource/Benchmarks/Olden/health/CMakeFiles/health.dir/health.c.o.d -o MultiSource/Benchmarks/Olden/health/CMakeFiles/health.dir/health.c.o   -c /Users/buildslave/jenkins/workspace/test-suite-verify-machineinstrs-x86_64-O3/test-suite/MultiSource/Benchmarks/Olden/health/health.c
fatal error: error in backend: Cannot select: t80: v4f32 = X86ISD::BLENDI t75, t78, Constant:i8<1>
Fatal Error: error in backend: Cannot select: t80: v4f32 = X86ISD::BLENDI t75, t78, Constant:i8<1>
[2818/4714] /Users/buildslave/jenkins/workspace/test-suite-verify-machineinstrs-x86_64-O3/test-suite-build/tools/timeit --summary MultiSource/Benchmarks/Olden/bh/CMakeFiles/bh.dir/newbh.c.o.time /Users/buildslave/jenkins/workspace/test-suite-verify-machineinstrs-x86_64-O3/compiler/bin/clang -DNDEBUG  -B /Applications/Xcode.app/Contents/Developer/Toolchains/XcodeDefault.xctoolchain/usr/bin    -Wno-unused-command-line-argument -mllvm -verify-machineinstrs -O3 -arch x86_64 -isysroot /Applications/Xcode.app/Contents/Developer/Platforms/MacOSX.platform/Developer/SDKs/MacOSX10.14.sdk   -w -Werror=date-time -DTORONTO -MD -MT MultiSource/Benchmarks/Olden/bh/CMakeFiles/bh.dir/newbh.c.o -MF MultiSource/Benchmarks/Olden/bh/CMakeFiles/bh.dir/newbh.c.o.d -o MultiSource/Benchmarks/Olden/bh/CMakeFiles/bh.dir/newbh.c.o   -c /Users/buildslave/jenkins/workspace/test-suite-verify-machineinstrs-x86_64-O3/test-suite/MultiSource/Benchmarks/Olden/bh/newbh.c
[2819/4714] : && /Users/buildslave/jenkins/workspace/test-suite-verify-machineinstrs-x86_64-O3/test-suite-build/tools/timeit --summary MultiSource/Benchmarks/Olden/em3d/em3d.link.time /Users/buildslave/jenkins/workspace/test-suite-verify-machineinstrs-x86_64-O3/compiler/bin/clang -B /Applications/Xcode.app/Contents/Developer/Toolchains/XcodeDefault.xctoolchain/usr/bin    -Wno-unused-command-line-argument -mllvm -verify-machineinstrs -O3 -arch x86_64 -isysroot /Applications/Xcode.app/Contents/Developer/Platforms/MacOSX.platform/Developer/SDKs/MacOSX10.14.sdk -Wl,-search_paths_first -Wl,-headerpad_max_install_names -B /Applications/Xcode.app/Contents/Developer/Toolchains/XcodeDefault.xctoolchain/usr/bin MultiSource/Benchmarks/Olden/em3d/CMakeFiles/em3d.dir/args.c.o MultiSource/Benchmarks/Olden/em3d/CMakeFiles/em3d.dir/em3d.c.o MultiSource/Benchmarks/Olden/em3d/CMakeFiles/em3d.dir/main.c.o MultiSource/Benchmarks/Olden/em3d/CMakeFiles/em3d.dir/make_graph.c.o MultiSource/Benchmarks/Olden/em3d/CMakeFiles/em3d.dir/util.c.o  -o MultiSource/Benchmarks/Olden/em3d/em3d  -Wl,-no_pie && cd /Users/buildslave/jenkins/workspace/test-suite-verify-machineinstrs-x86_64-O3/test-suite-build/MultiSource/Benchmarks/Olden/em3d && /usr/local/Cellar/cmake/3.13.1/bin/cmake -E create_symlink /Users/buildslave/jenkins/workspace/test-suite-verify-machineinstrs-x86_64-O3/test-suite/MultiSource/Benchmarks/Olden/em3d/em3d.reference_output /Users/buildslave/jenkins/workspace/test-suite-verify-machineinstrs-x86_64-O3/test-suite-build/MultiSource/Benchmarks/Olden/em3d/em3d.reference_output
[2820/4714] /Users/buildslave/jenkins/workspace/test-suite-verify-machineinstrs-x86_64-O3/test-suite-build/tools/timeit --summary MultiSource/Benchmarks/Olden/health/CMakeFiles/health.dir/health.c.o.time /Users/buildslave/jenkins/workspace/test-suite-verify-machineinstrs-x86_64-O3/compiler/bin/clang -DNDEBUG  -B /Applications/Xcode.app/Contents/Developer/Toolchains/XcodeDefault.xctoolchain/usr/bin    -Wno-unused-command-line-argument -mllvm -verify-machineinstrs -O3 -arch x86_64 -isysroot /Applications/Xcode.app/Contents/Developer/Platforms/MacOSX.platform/Developer/SDKs/MacOSX10.14.sdk   -w -Werror=date-time -DTORONTO -MD -MT MultiSource/Benchmarks/Olden/health/CMakeFiles/health.dir/health.c.o -MF MultiSource/Benchmarks/Olden/health/CMakeFiles/health.dir/health.c.o.d -o MultiSource/Benchmarks/Olden/health/CMakeFiles/health.dir/health.c.o   -c /Users/buildslave/jenkins/workspace/test-suite-verify-machineinstrs-x86_64-O3/test-suite/MultiSource/Benchmarks/Olden/health/health.c
FAILED: MultiSource/Benchmarks/Olden/health/CMakeFiles/health.dir/health.c.o 
/Users/buildslave/jenkins/workspace/test-suite-verify-machineinstrs-x86_64-O3/test-suite-build/tools/timeit --summary MultiSource/Benchmarks/Olden/health/CMakeFiles/health.dir/health.c.o.time /Users/buildslave/jenkins/workspace/test-suite-verify-machineinstrs-x86_64-O3/compiler/bin/clang -DNDEBUG  -B /Applications/Xcode.app/Contents/Developer/Toolchains/XcodeDefault.xctoolchain/usr/bin    -Wno-unused-command-line-argument -mllvm -verify-machineinstrs -O3 -arch x86_64 -isysroot /Applications/Xcode.app/Contents/Developer/Platforms/MacOSX.platform/Developer/SDKs/MacOSX10.14.sdk   -w -Werror=date-time -DTORONTO -MD -MT MultiSource/Benchmarks/Olden/health/CMakeFiles/health.dir/health.c.o -MF MultiSource/Benchmarks/Olden/health/CMakeFiles/health.dir/health.c.o.d -o MultiSource/Benchmarks/Olden/health/CMakeFiles/health.dir/health.c.o   -c /Users/buildslave/jenkins/workspace/test-suite-verify-machineinstrs-x86_64-O3/test-suite/MultiSource/Benchmarks/Olden/health/health.c
fatal error: error in backend: Cannot select: t80: v4f32 = X86ISD::BLENDI t75, t78, Constant:i8<1>
  t75: v4f32,ch = load<(load 16 from constant-pool)> t0, t74, undef:i64
    t74: i64 = X86ISD::WrapperRIP TargetConstantPool:i64<<4 x float> <float undef, float 1.000000e+00, float undef, float undef>> 0
Error: clang frontend command failed with exit code 70 (use -v to see invocation)
            t6: i64 = undef
          t15: i64 = Constant<4>
        t6: i64 = undef
  t79: i8 = Constant<1>
In function: get_results
clang-10: error: clang frontend command failed with exit code 70 (use -v to see invocation)
clang version 10.0.0 (https://github.com/llvm/llvm-project.git 9dd57df26abfd2b7252fd4ce02d48f225930214e)
Target: x86_64-apple-darwin18.0.0

Build Log

Changes
  1. [AArch64] Fix formatting (NFC) (detail)
  2. [WebAssembly][NFC] Remove unnecessary braces (detail)
  3. Model converted constant expressions as full-expressions. (detail)
  4. Fix for stringized function-macro args continued across lines (detail)
  5. [Consumed] Treat by-value class arguments as consuming by default, like (detail)

Started by upstream project relay-test-suite-verify-machineinstrs build number 6242
originally caused by:

This run spent:

  • 7.4 sec waiting;
  • 24 min build duration;
  • 24 min total from scheduled to completion.
Revision: 9dd57df26abfd2b7252fd4ce02d48f225930214e
  • detached

Identified problems

Ninja target failed

Below is a link to the first failed ninja target.
Indication 1

Compile Error

This build failed because of a compile error. Below is a list of all errors in the build log:
Indication 2