Started 27 days ago
Took 56 min

Failed Build clang-d327321-g466fb68fce1-t2070-b2070.tar.gz (Sep 19, 2019 8:04:04 PM)

Issues

Found 3 issues:
Ninja target: health.c.o
[3250/4714] /Users/buildslave/jenkins/workspace/test-suite-verify-machineinstrs-x86_64-O3/test-suite-build/tools/timeit --summary MultiSource/Benchmarks/Olden/health/CMakeFiles/health.dir/poisson.c.o.time /Users/buildslave/jenkins/workspace/test-suite-verify-machineinstrs-x86_64-O3/compiler/bin/clang -DNDEBUG  -B /Applications/Xcode.app/Contents/Developer/Toolchains/XcodeDefault.xctoolchain/usr/bin    -Wno-unused-command-line-argument -mllvm -verify-machineinstrs -O3 -arch x86_64 -isysroot /Applications/Xcode.app/Contents/Developer/Platforms/MacOSX.platform/Developer/SDKs/MacOSX10.14.sdk   -w -Werror=date-time -DTORONTO -MD -MT MultiSource/Benchmarks/Olden/health/CMakeFiles/health.dir/poisson.c.o -MF MultiSource/Benchmarks/Olden/health/CMakeFiles/health.dir/poisson.c.o.d -o MultiSource/Benchmarks/Olden/health/CMakeFiles/health.dir/poisson.c.o   -c /Users/buildslave/jenkins/workspace/test-suite-verify-machineinstrs-x86_64-O3/test-suite/MultiSource/Benchmarks/Olden/health/poisson.c
[3251/4714] /Users/buildslave/jenkins/workspace/test-suite-verify-machineinstrs-x86_64-O3/test-suite-build/tools/timeit --summary MultiSource/Benchmarks/Olden/em3d/CMakeFiles/em3d.dir/make_graph.c.o.time /Users/buildslave/jenkins/workspace/test-suite-verify-machineinstrs-x86_64-O3/compiler/bin/clang -DNDEBUG  -B /Applications/Xcode.app/Contents/Developer/Toolchains/XcodeDefault.xctoolchain/usr/bin    -Wno-unused-command-line-argument -mllvm -verify-machineinstrs -O3 -arch x86_64 -isysroot /Applications/Xcode.app/Contents/Developer/Platforms/MacOSX.platform/Developer/SDKs/MacOSX10.14.sdk   -w -Werror=date-time -DTORONTO -MD -MT MultiSource/Benchmarks/Olden/em3d/CMakeFiles/em3d.dir/make_graph.c.o -MF MultiSource/Benchmarks/Olden/em3d/CMakeFiles/em3d.dir/make_graph.c.o.d -o MultiSource/Benchmarks/Olden/em3d/CMakeFiles/em3d.dir/make_graph.c.o   -c /Users/buildslave/jenkins/workspace/test-suite-verify-machineinstrs-x86_64-O3/test-suite/MultiSource/Benchmarks/Olden/em3d/make_graph.c
[3252/4714] /Users/buildslave/jenkins/workspace/test-suite-verify-machineinstrs-x86_64-O3/test-suite-build/tools/timeit --summary MultiSource/Benchmarks/Olden/mst/CMakeFiles/mst.dir/hash.c.o.time /Users/buildslave/jenkins/workspace/test-suite-verify-machineinstrs-x86_64-O3/compiler/bin/clang -DNDEBUG  -B /Applications/Xcode.app/Contents/Developer/Toolchains/XcodeDefault.xctoolchain/usr/bin    -Wno-unused-command-line-argument -mllvm -verify-machineinstrs -O3 -arch x86_64 -isysroot /Applications/Xcode.app/Contents/Developer/Platforms/MacOSX.platform/Developer/SDKs/MacOSX10.14.sdk   -w -Werror=date-time -DTORONTO -MD -MT MultiSource/Benchmarks/Olden/mst/CMakeFiles/mst.dir/hash.c.o -MF MultiSource/Benchmarks/Olden/mst/CMakeFiles/mst.dir/hash.c.o.d -o MultiSource/Benchmarks/Olden/mst/CMakeFiles/mst.dir/hash.c.o   -c /Users/buildslave/jenkins/workspace/test-suite-verify-machineinstrs-x86_64-O3/test-suite/MultiSource/Benchmarks/Olden/mst/hash.c
[3253/4714] /Users/buildslave/jenkins/workspace/test-suite-verify-machineinstrs-x86_64-O3/test-suite-build/tools/timeit --summary MultiSource/Benchmarks/Olden/mst/CMakeFiles/mst.dir/main.c.o.time /Users/buildslave/jenkins/workspace/test-suite-verify-machineinstrs-x86_64-O3/compiler/bin/clang -DNDEBUG  -B /Applications/Xcode.app/Contents/Developer/Toolchains/XcodeDefault.xctoolchain/usr/bin    -Wno-unused-command-line-argument -mllvm -verify-machineinstrs -O3 -arch x86_64 -isysroot /Applications/Xcode.app/Contents/Developer/Platforms/MacOSX.platform/Developer/SDKs/MacOSX10.14.sdk   -w -Werror=date-time -DTORONTO -MD -MT MultiSource/Benchmarks/Olden/mst/CMakeFiles/mst.dir/main.c.o -MF MultiSource/Benchmarks/Olden/mst/CMakeFiles/mst.dir/main.c.o.d -o MultiSource/Benchmarks/Olden/mst/CMakeFiles/mst.dir/main.c.o   -c /Users/buildslave/jenkins/workspace/test-suite-verify-machineinstrs-x86_64-O3/test-suite/MultiSource/Benchmarks/Olden/mst/main.c
[3254/4714] /Users/buildslave/jenkins/workspace/test-suite-verify-machineinstrs-x86_64-O3/test-suite-build/tools/timeit --summary MultiSource/Benchmarks/Olden/health/CMakeFiles/health.dir/health.c.o.time /Users/buildslave/jenkins/workspace/test-suite-verify-machineinstrs-x86_64-O3/compiler/bin/clang -DNDEBUG  -B /Applications/Xcode.app/Contents/Developer/Toolchains/XcodeDefault.xctoolchain/usr/bin    -Wno-unused-command-line-argument -mllvm -verify-machineinstrs -O3 -arch x86_64 -isysroot /Applications/Xcode.app/Contents/Developer/Platforms/MacOSX.platform/Developer/SDKs/MacOSX10.14.sdk   -w -Werror=date-time -DTORONTO -MD -MT MultiSource/Benchmarks/Olden/health/CMakeFiles/health.dir/health.c.o -MF MultiSource/Benchmarks/Olden/health/CMakeFiles/health.dir/health.c.o.d -o MultiSource/Benchmarks/Olden/health/CMakeFiles/health.dir/health.c.o   -c /Users/buildslave/jenkins/workspace/test-suite-verify-machineinstrs-x86_64-O3/test-suite/MultiSource/Benchmarks/Olden/health/health.c
FAILED: MultiSource/Benchmarks/Olden/health/CMakeFiles/health.dir/health.c.o 
/Users/buildslave/jenkins/workspace/test-suite-verify-machineinstrs-x86_64-O3/test-suite-build/tools/timeit --summary MultiSource/Benchmarks/Olden/health/CMakeFiles/health.dir/health.c.o.time /Users/buildslave/jenkins/workspace/test-suite-verify-machineinstrs-x86_64-O3/compiler/bin/clang -DNDEBUG  -B /Applications/Xcode.app/Contents/Developer/Toolchains/XcodeDefault.xctoolchain/usr/bin    -Wno-unused-command-line-argument -mllvm -verify-machineinstrs -O3 -arch x86_64 -isysroot /Applications/Xcode.app/Contents/Developer/Platforms/MacOSX.platform/Developer/SDKs/MacOSX10.14.sdk   -w -Werror=date-time -DTORONTO -MD -MT MultiSource/Benchmarks/Olden/health/CMakeFiles/health.dir/health.c.o -MF MultiSource/Benchmarks/Olden/health/CMakeFiles/health.dir/health.c.o.d -o MultiSource/Benchmarks/Olden/health/CMakeFiles/health.dir/health.c.o   -c /Users/buildslave/jenkins/workspace/test-suite-verify-machineinstrs-x86_64-O3/test-suite/MultiSource/Benchmarks/Olden/health/health.c
fatal error: error in backend: Cannot select: t80: v4f32 = X86ISD::BLENDI t75, t78, Constant:i8<1>
Fatal Error: error in backend: Cannot select: t80: v4f32 = X86ISD::BLENDI t75, t78, Constant:i8<1>
[3252/4714] /Users/buildslave/jenkins/workspace/test-suite-verify-machineinstrs-x86_64-O3/test-suite-build/tools/timeit --summary MultiSource/Benchmarks/Olden/mst/CMakeFiles/mst.dir/hash.c.o.time /Users/buildslave/jenkins/workspace/test-suite-verify-machineinstrs-x86_64-O3/compiler/bin/clang -DNDEBUG  -B /Applications/Xcode.app/Contents/Developer/Toolchains/XcodeDefault.xctoolchain/usr/bin    -Wno-unused-command-line-argument -mllvm -verify-machineinstrs -O3 -arch x86_64 -isysroot /Applications/Xcode.app/Contents/Developer/Platforms/MacOSX.platform/Developer/SDKs/MacOSX10.14.sdk   -w -Werror=date-time -DTORONTO -MD -MT MultiSource/Benchmarks/Olden/mst/CMakeFiles/mst.dir/hash.c.o -MF MultiSource/Benchmarks/Olden/mst/CMakeFiles/mst.dir/hash.c.o.d -o MultiSource/Benchmarks/Olden/mst/CMakeFiles/mst.dir/hash.c.o   -c /Users/buildslave/jenkins/workspace/test-suite-verify-machineinstrs-x86_64-O3/test-suite/MultiSource/Benchmarks/Olden/mst/hash.c
[3253/4714] /Users/buildslave/jenkins/workspace/test-suite-verify-machineinstrs-x86_64-O3/test-suite-build/tools/timeit --summary MultiSource/Benchmarks/Olden/mst/CMakeFiles/mst.dir/main.c.o.time /Users/buildslave/jenkins/workspace/test-suite-verify-machineinstrs-x86_64-O3/compiler/bin/clang -DNDEBUG  -B /Applications/Xcode.app/Contents/Developer/Toolchains/XcodeDefault.xctoolchain/usr/bin    -Wno-unused-command-line-argument -mllvm -verify-machineinstrs -O3 -arch x86_64 -isysroot /Applications/Xcode.app/Contents/Developer/Platforms/MacOSX.platform/Developer/SDKs/MacOSX10.14.sdk   -w -Werror=date-time -DTORONTO -MD -MT MultiSource/Benchmarks/Olden/mst/CMakeFiles/mst.dir/main.c.o -MF MultiSource/Benchmarks/Olden/mst/CMakeFiles/mst.dir/main.c.o.d -o MultiSource/Benchmarks/Olden/mst/CMakeFiles/mst.dir/main.c.o   -c /Users/buildslave/jenkins/workspace/test-suite-verify-machineinstrs-x86_64-O3/test-suite/MultiSource/Benchmarks/Olden/mst/main.c
[3254/4714] /Users/buildslave/jenkins/workspace/test-suite-verify-machineinstrs-x86_64-O3/test-suite-build/tools/timeit --summary MultiSource/Benchmarks/Olden/health/CMakeFiles/health.dir/health.c.o.time /Users/buildslave/jenkins/workspace/test-suite-verify-machineinstrs-x86_64-O3/compiler/bin/clang -DNDEBUG  -B /Applications/Xcode.app/Contents/Developer/Toolchains/XcodeDefault.xctoolchain/usr/bin    -Wno-unused-command-line-argument -mllvm -verify-machineinstrs -O3 -arch x86_64 -isysroot /Applications/Xcode.app/Contents/Developer/Platforms/MacOSX.platform/Developer/SDKs/MacOSX10.14.sdk   -w -Werror=date-time -DTORONTO -MD -MT MultiSource/Benchmarks/Olden/health/CMakeFiles/health.dir/health.c.o -MF MultiSource/Benchmarks/Olden/health/CMakeFiles/health.dir/health.c.o.d -o MultiSource/Benchmarks/Olden/health/CMakeFiles/health.dir/health.c.o   -c /Users/buildslave/jenkins/workspace/test-suite-verify-machineinstrs-x86_64-O3/test-suite/MultiSource/Benchmarks/Olden/health/health.c
FAILED: MultiSource/Benchmarks/Olden/health/CMakeFiles/health.dir/health.c.o 
/Users/buildslave/jenkins/workspace/test-suite-verify-machineinstrs-x86_64-O3/test-suite-build/tools/timeit --summary MultiSource/Benchmarks/Olden/health/CMakeFiles/health.dir/health.c.o.time /Users/buildslave/jenkins/workspace/test-suite-verify-machineinstrs-x86_64-O3/compiler/bin/clang -DNDEBUG  -B /Applications/Xcode.app/Contents/Developer/Toolchains/XcodeDefault.xctoolchain/usr/bin    -Wno-unused-command-line-argument -mllvm -verify-machineinstrs -O3 -arch x86_64 -isysroot /Applications/Xcode.app/Contents/Developer/Platforms/MacOSX.platform/Developer/SDKs/MacOSX10.14.sdk   -w -Werror=date-time -DTORONTO -MD -MT MultiSource/Benchmarks/Olden/health/CMakeFiles/health.dir/health.c.o -MF MultiSource/Benchmarks/Olden/health/CMakeFiles/health.dir/health.c.o.d -o MultiSource/Benchmarks/Olden/health/CMakeFiles/health.dir/health.c.o   -c /Users/buildslave/jenkins/workspace/test-suite-verify-machineinstrs-x86_64-O3/test-suite/MultiSource/Benchmarks/Olden/health/health.c
fatal error: error in backend: Cannot select: t80: v4f32 = X86ISD::BLENDI t75, t78, Constant:i8<1>
  t75: v4f32,ch = load<(load 16 from constant-pool)> t0, t74, undef:i64
    t74: i64 = X86ISD::WrapperRIP TargetConstantPool:i64<<4 x float> <float undef, float 1.000000e+00, float undef, float undef>> 0
Error: clang frontend command failed with exit code 70 (use -v to see invocation)
            t6: i64 = undef
          t15: i64 = Constant<4>
        t6: i64 = undef
  t79: i8 = Constant<1>
In function: get_results
clang-10: error: clang frontend command failed with exit code 70 (use -v to see invocation)
clang version 10.0.0 (https://github.com/llvm/llvm-project.git 466fb68fce10d34963c2fd651de32bd3a4ddcd1f)
Target: x86_64-apple-darwin18.0.0

Build Log

Changes
  1. MachineScheduler: Fix missing dependency with multiple subreg defs (detail)
  2. [NFCI] Always initialize const members of AttributeCommonInfo (detail)

Started by upstream project relay-test-suite-verify-machineinstrs build number 6243
originally caused by:

This run spent:

  • 28 min waiting;
  • 56 min build duration;
  • 56 min total from scheduled to completion.
Revision: 466fb68fce10d34963c2fd651de32bd3a4ddcd1f
  • detached

Identified problems

Ninja target failed

Below is a link to the first failed ninja target.
Indication 1

Compile Error

This build failed because of a compile error. Below is a list of all errors in the build log:
Indication 2