Started 1 mo 0 days ago
Took 28 min

Failed Build clang-d327341-g169cb63478a-t2080-b2080.tar.gz (Sep 20, 2019 6:47:18 AM)

Issues

Found 3 issues:
Ninja target: health.c.o
[2826/4714] /Users/buildslave/jenkins/workspace/test-suite-verify-machineinstrs-x86_64-O3/test-suite-build/tools/timeit --summary MultiSource/Benchmarks/Olden/bh/CMakeFiles/bh.dir/newbh.c.o.time /Users/buildslave/jenkins/workspace/test-suite-verify-machineinstrs-x86_64-O3/compiler/bin/clang -DNDEBUG  -B /Applications/Xcode.app/Contents/Developer/Toolchains/XcodeDefault.xctoolchain/usr/bin    -Wno-unused-command-line-argument -mllvm -verify-machineinstrs -O3 -arch x86_64 -isysroot /Applications/Xcode.app/Contents/Developer/Platforms/MacOSX.platform/Developer/SDKs/MacOSX10.14.sdk   -w -Werror=date-time -DTORONTO -MD -MT MultiSource/Benchmarks/Olden/bh/CMakeFiles/bh.dir/newbh.c.o -MF MultiSource/Benchmarks/Olden/bh/CMakeFiles/bh.dir/newbh.c.o.d -o MultiSource/Benchmarks/Olden/bh/CMakeFiles/bh.dir/newbh.c.o   -c /Users/buildslave/jenkins/workspace/test-suite-verify-machineinstrs-x86_64-O3/test-suite/MultiSource/Benchmarks/Olden/bh/newbh.c
[2827/4714] : && /Users/buildslave/jenkins/workspace/test-suite-verify-machineinstrs-x86_64-O3/test-suite-build/tools/timeit --summary MultiSource/Benchmarks/MiBench/consumer-typeset/consumer-typeset.link.time /Users/buildslave/jenkins/workspace/test-suite-verify-machineinstrs-x86_64-O3/compiler/bin/clang -B /Applications/Xcode.app/Contents/Developer/Toolchains/XcodeDefault.xctoolchain/usr/bin    -Wno-unused-command-line-argument -mllvm -verify-machineinstrs -O3 -arch x86_64 -isysroot /Applications/Xcode.app/Contents/Developer/Platforms/MacOSX.platform/Developer/SDKs/MacOSX10.14.sdk -Wl,-search_paths_first -Wl,-headerpad_max_install_names -B /Applications/Xcode.app/Contents/Developer/Toolchains/XcodeDefault.xctoolchain/usr/bin MultiSource/Benchmarks/MiBench/consumer-typeset/CMakeFiles/consumer-typeset.dir/z01.c.o MultiSource/Benchmarks/MiBench/consumer-typeset/CMakeFiles/consumer-typeset.dir/z02.c.o MultiSource/Benchmarks/MiBench/consumer-typeset/CMakeFiles/consumer-typeset.dir/z03.c.o MultiSource/Benchmarks/MiBench/consumer-typeset/CMakeFiles/consumer-typeset.dir/z04.c.o MultiSource/Benchmarks/MiBench/consumer-typeset/CMakeFiles/consumer-typeset.dir/z05.c.o MultiSource/Benchmarks/MiBench/consumer-typeset/CMakeFiles/consumer-typeset.dir/z06.c.o MultiSource/Benchmarks/MiBench/consumer-typeset/CMakeFiles/consumer-typeset.dir/z07.c.o MultiSource/Benchmarks/MiBench/consumer-typeset/CMakeFiles/consumer-typeset.dir/z08.c.o MultiSource/Benchmarks/MiBench/consumer-typeset/CMakeFiles/consumer-typeset.dir/z09.c.o MultiSource/Benchmarks/MiBench/consumer-typeset/CMakeFiles/consumer-typeset.dir/z10.c.o MultiSource/Benchmarks/MiBench/consumer-typeset/CMakeFiles/consumer-typeset.dir/z11.c.o MultiSource/Benchmarks/MiBench/consumer-typeset/CMakeFiles/consumer-typeset.dir/z12.c.o MultiSource/Benchmarks/MiBench/consumer-typeset/CMakeFiles/consumer-typeset.dir/z13.c.o MultiSource/Benchmarks/MiBench/consumer-typeset/CMakeFiles/consumer-typeset.dir/z14.c.o MultiSource/Benchmarks/MiBench/consumer-typeset/CMakeFiles/consumer-typeset.dir/z15.c.o MultiSource/Benchmarks/MiBench/consumer-typeset/CMakeFiles/consumer-typeset.dir/z16.c.o MultiSource/Benchmarks/MiBench/consumer-typeset/CMakeFiles/consumer-typeset.dir/z17.c.o MultiSource/Benchmarks/MiBench/consumer-typeset/CMakeFiles/consumer-typeset.dir/z18.c.o MultiSource/Benchmarks/MiBench/consumer-typeset/CMakeFiles/consumer-typeset.dir/z19.c.o MultiSource/Benchmarks/MiBench/consumer-typeset/CMakeFiles/consumer-typeset.dir/z20.c.o MultiSource/Benchmarks/MiBench/consumer-typeset/CMakeFiles/consumer-typeset.dir/z21.c.o MultiSource/Benchmarks/MiBench/consumer-typeset/CMakeFiles/consumer-typeset.dir/z22.c.o MultiSource/Benchmarks/MiBench/consumer-typeset/CMakeFiles/consumer-typeset.dir/z23.c.o MultiSource/Benchmarks/MiBench/consumer-typeset/CMakeFiles/consumer-typeset.dir/z24.c.o MultiSource/Benchmarks/MiBench/consumer-typeset/CMakeFiles/consumer-typeset.dir/z25.c.o MultiSource/Benchmarks/MiBench/consumer-typeset/CMakeFiles/consumer-typeset.dir/z26.c.o MultiSource/Benchmarks/MiBench/consumer-typeset/CMakeFiles/consumer-typeset.dir/z27.c.o MultiSource/Benchmarks/MiBench/consumer-typeset/CMakeFiles/consumer-typeset.dir/z28.c.o MultiSource/Benchmarks/MiBench/consumer-typeset/CMakeFiles/consumer-typeset.dir/z29.c.o MultiSource/Benchmarks/MiBench/consumer-typeset/CMakeFiles/consumer-typeset.dir/z30.c.o MultiSource/Benchmarks/MiBench/consumer-typeset/CMakeFiles/consumer-typeset.dir/z31.c.o MultiSource/Benchmarks/MiBench/consumer-typeset/CMakeFiles/consumer-typeset.dir/z32.c.o MultiSource/Benchmarks/MiBench/consumer-typeset/CMakeFiles/consumer-typeset.dir/z33.c.o MultiSource/Benchmarks/MiBench/consumer-typeset/CMakeFiles/consumer-typeset.dir/z34.c.o MultiSource/Benchmarks/MiBench/consumer-typeset/CMakeFiles/consumer-typeset.dir/z35.c.o MultiSource/Benchmarks/MiBench/consumer-typeset/CMakeFiles/consumer-typeset.dir/z36.c.o MultiSource/Benchmarks/MiBench/consumer-typeset/CMakeFiles/consumer-typeset.dir/z37.c.o MultiSource/Benchmarks/MiBench/consumer-typeset/CMakeFiles/consumer-typeset.dir/z38.c.o MultiSource/Benchmarks/MiBench/consumer-typeset/CMakeFiles/consumer-typeset.dir/z39.c.o MultiSource/Benchmarks/MiBench/consumer-typeset/CMakeFiles/consumer-typeset.dir/z40.c.o MultiSource/Benchmarks/MiBench/consumer-typeset/CMakeFiles/consumer-typeset.dir/z41.c.o MultiSource/Benchmarks/MiBench/consumer-typeset/CMakeFiles/consumer-typeset.dir/z42.c.o MultiSource/Benchmarks/MiBench/consumer-typeset/CMakeFiles/consumer-typeset.dir/z43.c.o MultiSource/Benchmarks/MiBench/consumer-typeset/CMakeFiles/consumer-typeset.dir/z44.c.o MultiSource/Benchmarks/MiBench/consumer-typeset/CMakeFiles/consumer-typeset.dir/z45.c.o MultiSource/Benchmarks/MiBench/consumer-typeset/CMakeFiles/consumer-typeset.dir/z46.c.o MultiSource/Benchmarks/MiBench/consumer-typeset/CMakeFiles/consumer-typeset.dir/z47.c.o MultiSource/Benchmarks/MiBench/consumer-typeset/CMakeFiles/consumer-typeset.dir/z48.c.o MultiSource/Benchmarks/MiBench/consumer-typeset/CMakeFiles/consumer-typeset.dir/z49.c.o MultiSource/Benchmarks/MiBench/consumer-typeset/CMakeFiles/consumer-typeset.dir/z50.c.o MultiSource/Benchmarks/MiBench/consumer-typeset/CMakeFiles/consumer-typeset.dir/z51.c.o  -o MultiSource/Benchmarks/MiBench/consumer-typeset/consumer-typeset  -Wl,-no_pie -lm && cd /Users/buildslave/jenkins/workspace/test-suite-verify-machineinstrs-x86_64-O3/test-suite-build/MultiSource/Benchmarks/MiBench/consumer-typeset && /usr/local/Cellar/cmake/3.13.1/bin/cmake -E create_symlink /Users/buildslave/jenkins/workspace/test-suite-verify-machineinstrs-x86_64-O3/test-suite/MultiSource/Benchmarks/MiBench/consumer-typeset/consumer-typeset.reference_output /Users/buildslave/jenkins/workspace/test-suite-verify-machineinstrs-x86_64-O3/test-suite-build/MultiSource/Benchmarks/MiBench/consumer-typeset/consumer-typeset.reference_output && cd /Users/buildslave/jenkins/workspace/test-suite-verify-machineinstrs-x86_64-O3/test-suite-build/MultiSource/Benchmarks/MiBench/consumer-typeset && /usr/local/Cellar/cmake/3.13.1/bin/cmake -E create_symlink /Users/buildslave/jenkins/workspace/test-suite-verify-machineinstrs-x86_64-O3/test-suite/MultiSource/Benchmarks/MiBench/consumer-typeset/large.lout /Users/buildslave/jenkins/workspace/test-suite-verify-machineinstrs-x86_64-O3/test-suite-build/MultiSource/Benchmarks/MiBench/consumer-typeset/large.lout && cd /Users/buildslave/jenkins/workspace/test-suite-verify-machineinstrs-x86_64-O3/test-suite-build/MultiSource/Benchmarks/MiBench/consumer-typeset && /usr/local/Cellar/cmake/3.13.1/bin/cmake -E create_symlink /Users/buildslave/jenkins/workspace/test-suite-verify-machineinstrs-x86_64-O3/test-suite/MultiSource/Benchmarks/MiBench/consumer-typeset/data /Users/buildslave/jenkins/workspace/test-suite-verify-machineinstrs-x86_64-O3/test-suite-build/MultiSource/Benchmarks/MiBench/consumer-typeset/data
[2828/4714] /Users/buildslave/jenkins/workspace/test-suite-verify-machineinstrs-x86_64-O3/test-suite-build/tools/timeit --summary MultiSource/Benchmarks/Olden/em3d/CMakeFiles/em3d.dir/make_graph.c.o.time /Users/buildslave/jenkins/workspace/test-suite-verify-machineinstrs-x86_64-O3/compiler/bin/clang -DNDEBUG  -B /Applications/Xcode.app/Contents/Developer/Toolchains/XcodeDefault.xctoolchain/usr/bin    -Wno-unused-command-line-argument -mllvm -verify-machineinstrs -O3 -arch x86_64 -isysroot /Applications/Xcode.app/Contents/Developer/Platforms/MacOSX.platform/Developer/SDKs/MacOSX10.14.sdk   -w -Werror=date-time -DTORONTO -MD -MT MultiSource/Benchmarks/Olden/em3d/CMakeFiles/em3d.dir/make_graph.c.o -MF MultiSource/Benchmarks/Olden/em3d/CMakeFiles/em3d.dir/make_graph.c.o.d -o MultiSource/Benchmarks/Olden/em3d/CMakeFiles/em3d.dir/make_graph.c.o   -c /Users/buildslave/jenkins/workspace/test-suite-verify-machineinstrs-x86_64-O3/test-suite/MultiSource/Benchmarks/Olden/em3d/make_graph.c
[2829/4714] : && /Users/buildslave/jenkins/workspace/test-suite-verify-machineinstrs-x86_64-O3/test-suite-build/tools/timeit --summary MultiSource/Benchmarks/Olden/bh/bh.link.time /Users/buildslave/jenkins/workspace/test-suite-verify-machineinstrs-x86_64-O3/compiler/bin/clang -B /Applications/Xcode.app/Contents/Developer/Toolchains/XcodeDefault.xctoolchain/usr/bin    -Wno-unused-command-line-argument -mllvm -verify-machineinstrs -O3 -arch x86_64 -isysroot /Applications/Xcode.app/Contents/Developer/Platforms/MacOSX.platform/Developer/SDKs/MacOSX10.14.sdk -Wl,-search_paths_first -Wl,-headerpad_max_install_names -B /Applications/Xcode.app/Contents/Developer/Toolchains/XcodeDefault.xctoolchain/usr/bin MultiSource/Benchmarks/Olden/bh/CMakeFiles/bh.dir/args.c.o MultiSource/Benchmarks/Olden/bh/CMakeFiles/bh.dir/newbh.c.o MultiSource/Benchmarks/Olden/bh/CMakeFiles/bh.dir/util.c.o MultiSource/Benchmarks/Olden/bh/CMakeFiles/bh.dir/walksub.c.o  -o MultiSource/Benchmarks/Olden/bh/bh  -Wl,-no_pie -lm && cd /Users/buildslave/jenkins/workspace/test-suite-verify-machineinstrs-x86_64-O3/test-suite-build/MultiSource/Benchmarks/Olden/bh && /usr/local/Cellar/cmake/3.13.1/bin/cmake -E create_symlink /Users/buildslave/jenkins/workspace/test-suite-verify-machineinstrs-x86_64-O3/test-suite/MultiSource/Benchmarks/Olden/bh/bh.reference_output /Users/buildslave/jenkins/workspace/test-suite-verify-machineinstrs-x86_64-O3/test-suite-build/MultiSource/Benchmarks/Olden/bh/bh.reference_output
[2830/4714] /Users/buildslave/jenkins/workspace/test-suite-verify-machineinstrs-x86_64-O3/test-suite-build/tools/timeit --summary MultiSource/Benchmarks/Olden/health/CMakeFiles/health.dir/health.c.o.time /Users/buildslave/jenkins/workspace/test-suite-verify-machineinstrs-x86_64-O3/compiler/bin/clang -DNDEBUG  -B /Applications/Xcode.app/Contents/Developer/Toolchains/XcodeDefault.xctoolchain/usr/bin    -Wno-unused-command-line-argument -mllvm -verify-machineinstrs -O3 -arch x86_64 -isysroot /Applications/Xcode.app/Contents/Developer/Platforms/MacOSX.platform/Developer/SDKs/MacOSX10.14.sdk   -w -Werror=date-time -DTORONTO -MD -MT MultiSource/Benchmarks/Olden/health/CMakeFiles/health.dir/health.c.o -MF MultiSource/Benchmarks/Olden/health/CMakeFiles/health.dir/health.c.o.d -o MultiSource/Benchmarks/Olden/health/CMakeFiles/health.dir/health.c.o   -c /Users/buildslave/jenkins/workspace/test-suite-verify-machineinstrs-x86_64-O3/test-suite/MultiSource/Benchmarks/Olden/health/health.c
FAILED: MultiSource/Benchmarks/Olden/health/CMakeFiles/health.dir/health.c.o 
/Users/buildslave/jenkins/workspace/test-suite-verify-machineinstrs-x86_64-O3/test-suite-build/tools/timeit --summary MultiSource/Benchmarks/Olden/health/CMakeFiles/health.dir/health.c.o.time /Users/buildslave/jenkins/workspace/test-suite-verify-machineinstrs-x86_64-O3/compiler/bin/clang -DNDEBUG  -B /Applications/Xcode.app/Contents/Developer/Toolchains/XcodeDefault.xctoolchain/usr/bin    -Wno-unused-command-line-argument -mllvm -verify-machineinstrs -O3 -arch x86_64 -isysroot /Applications/Xcode.app/Contents/Developer/Platforms/MacOSX.platform/Developer/SDKs/MacOSX10.14.sdk   -w -Werror=date-time -DTORONTO -MD -MT MultiSource/Benchmarks/Olden/health/CMakeFiles/health.dir/health.c.o -MF MultiSource/Benchmarks/Olden/health/CMakeFiles/health.dir/health.c.o.d -o MultiSource/Benchmarks/Olden/health/CMakeFiles/health.dir/health.c.o   -c /Users/buildslave/jenkins/workspace/test-suite-verify-machineinstrs-x86_64-O3/test-suite/MultiSource/Benchmarks/Olden/health/health.c
fatal error: error in backend: Cannot select: t80: v4f32 = X86ISD::BLENDI t75, t78, Constant:i8<1>
Fatal Error: error in backend: Cannot select: t80: v4f32 = X86ISD::BLENDI t75, t78, Constant:i8<1>
[2828/4714] /Users/buildslave/jenkins/workspace/test-suite-verify-machineinstrs-x86_64-O3/test-suite-build/tools/timeit --summary MultiSource/Benchmarks/Olden/em3d/CMakeFiles/em3d.dir/make_graph.c.o.time /Users/buildslave/jenkins/workspace/test-suite-verify-machineinstrs-x86_64-O3/compiler/bin/clang -DNDEBUG  -B /Applications/Xcode.app/Contents/Developer/Toolchains/XcodeDefault.xctoolchain/usr/bin    -Wno-unused-command-line-argument -mllvm -verify-machineinstrs -O3 -arch x86_64 -isysroot /Applications/Xcode.app/Contents/Developer/Platforms/MacOSX.platform/Developer/SDKs/MacOSX10.14.sdk   -w -Werror=date-time -DTORONTO -MD -MT MultiSource/Benchmarks/Olden/em3d/CMakeFiles/em3d.dir/make_graph.c.o -MF MultiSource/Benchmarks/Olden/em3d/CMakeFiles/em3d.dir/make_graph.c.o.d -o MultiSource/Benchmarks/Olden/em3d/CMakeFiles/em3d.dir/make_graph.c.o   -c /Users/buildslave/jenkins/workspace/test-suite-verify-machineinstrs-x86_64-O3/test-suite/MultiSource/Benchmarks/Olden/em3d/make_graph.c
[2829/4714] : && /Users/buildslave/jenkins/workspace/test-suite-verify-machineinstrs-x86_64-O3/test-suite-build/tools/timeit --summary MultiSource/Benchmarks/Olden/bh/bh.link.time /Users/buildslave/jenkins/workspace/test-suite-verify-machineinstrs-x86_64-O3/compiler/bin/clang -B /Applications/Xcode.app/Contents/Developer/Toolchains/XcodeDefault.xctoolchain/usr/bin    -Wno-unused-command-line-argument -mllvm -verify-machineinstrs -O3 -arch x86_64 -isysroot /Applications/Xcode.app/Contents/Developer/Platforms/MacOSX.platform/Developer/SDKs/MacOSX10.14.sdk -Wl,-search_paths_first -Wl,-headerpad_max_install_names -B /Applications/Xcode.app/Contents/Developer/Toolchains/XcodeDefault.xctoolchain/usr/bin MultiSource/Benchmarks/Olden/bh/CMakeFiles/bh.dir/args.c.o MultiSource/Benchmarks/Olden/bh/CMakeFiles/bh.dir/newbh.c.o MultiSource/Benchmarks/Olden/bh/CMakeFiles/bh.dir/util.c.o MultiSource/Benchmarks/Olden/bh/CMakeFiles/bh.dir/walksub.c.o  -o MultiSource/Benchmarks/Olden/bh/bh  -Wl,-no_pie -lm && cd /Users/buildslave/jenkins/workspace/test-suite-verify-machineinstrs-x86_64-O3/test-suite-build/MultiSource/Benchmarks/Olden/bh && /usr/local/Cellar/cmake/3.13.1/bin/cmake -E create_symlink /Users/buildslave/jenkins/workspace/test-suite-verify-machineinstrs-x86_64-O3/test-suite/MultiSource/Benchmarks/Olden/bh/bh.reference_output /Users/buildslave/jenkins/workspace/test-suite-verify-machineinstrs-x86_64-O3/test-suite-build/MultiSource/Benchmarks/Olden/bh/bh.reference_output
[2830/4714] /Users/buildslave/jenkins/workspace/test-suite-verify-machineinstrs-x86_64-O3/test-suite-build/tools/timeit --summary MultiSource/Benchmarks/Olden/health/CMakeFiles/health.dir/health.c.o.time /Users/buildslave/jenkins/workspace/test-suite-verify-machineinstrs-x86_64-O3/compiler/bin/clang -DNDEBUG  -B /Applications/Xcode.app/Contents/Developer/Toolchains/XcodeDefault.xctoolchain/usr/bin    -Wno-unused-command-line-argument -mllvm -verify-machineinstrs -O3 -arch x86_64 -isysroot /Applications/Xcode.app/Contents/Developer/Platforms/MacOSX.platform/Developer/SDKs/MacOSX10.14.sdk   -w -Werror=date-time -DTORONTO -MD -MT MultiSource/Benchmarks/Olden/health/CMakeFiles/health.dir/health.c.o -MF MultiSource/Benchmarks/Olden/health/CMakeFiles/health.dir/health.c.o.d -o MultiSource/Benchmarks/Olden/health/CMakeFiles/health.dir/health.c.o   -c /Users/buildslave/jenkins/workspace/test-suite-verify-machineinstrs-x86_64-O3/test-suite/MultiSource/Benchmarks/Olden/health/health.c
FAILED: MultiSource/Benchmarks/Olden/health/CMakeFiles/health.dir/health.c.o 
/Users/buildslave/jenkins/workspace/test-suite-verify-machineinstrs-x86_64-O3/test-suite-build/tools/timeit --summary MultiSource/Benchmarks/Olden/health/CMakeFiles/health.dir/health.c.o.time /Users/buildslave/jenkins/workspace/test-suite-verify-machineinstrs-x86_64-O3/compiler/bin/clang -DNDEBUG  -B /Applications/Xcode.app/Contents/Developer/Toolchains/XcodeDefault.xctoolchain/usr/bin    -Wno-unused-command-line-argument -mllvm -verify-machineinstrs -O3 -arch x86_64 -isysroot /Applications/Xcode.app/Contents/Developer/Platforms/MacOSX.platform/Developer/SDKs/MacOSX10.14.sdk   -w -Werror=date-time -DTORONTO -MD -MT MultiSource/Benchmarks/Olden/health/CMakeFiles/health.dir/health.c.o -MF MultiSource/Benchmarks/Olden/health/CMakeFiles/health.dir/health.c.o.d -o MultiSource/Benchmarks/Olden/health/CMakeFiles/health.dir/health.c.o   -c /Users/buildslave/jenkins/workspace/test-suite-verify-machineinstrs-x86_64-O3/test-suite/MultiSource/Benchmarks/Olden/health/health.c
fatal error: error in backend: Cannot select: t80: v4f32 = X86ISD::BLENDI t75, t78, Constant:i8<1>
  t75: v4f32,ch = load<(load 16 from constant-pool)> t0, t74, undef:i64
    t74: i64 = X86ISD::WrapperRIP TargetConstantPool:i64<<4 x float> <float undef, float 1.000000e+00, float undef, float undef>> 0
Error: clang frontend command failed with exit code 70 (use -v to see invocation)
            t6: i64 = undef
          t15: i64 = Constant<4>
        t6: i64 = undef
  t79: i8 = Constant<1>
In function: get_results
clang-10: error: clang frontend command failed with exit code 70 (use -v to see invocation)
clang version 10.0.0 (https://github.com/llvm/llvm-project.git 169cb63478aa047451786d8ccf6af4b721e3b271)
Target: x86_64-apple-darwin18.0.0

Build Log

Changes
  1. Revert "Fix swig python package path" (detail)
  2. [X86] Remove the special isBuildVectorOfConstantSDNodes handling from (detail)
  3. Use getTargetConstant for BLENDI, and add a test to catch it. (detail)
  4. llvm-undname: Delete an empty, unused method. (detail)
  5. Finish building the full-expression for a static_assert expression (detail)
  6. [Object] Uncapitalize an error message (detail)
  7. [llvm-ar] Removes repetition in the error message (detail)
  8. [X86] Use timm in MMX pinsrw/pextrw isel patterns. Add missing test (detail)
  9. [llvm-readobj] flush output before crash (detail)
  10. [X86] Convert tbm_bextri_u32/tbm_bextri_u64 intrinsics TargetConstant (detail)
  11. Reapply [llvm-ar] Include a line number when failing to parse an MRI (detail)
  12. [CallSiteSplitting] Remove unused includes (NFC). (detail)
  13. [MachinePipeliner] Improve the TargetInstrInfo API (detail)
  14. [yaml2obj/obj2yaml] - Do not trigger llvm_unreachable when (detail)
  15. [llvm-dwarfdump] Adjust Windows path to be acceptable by JSON (detail)
  16. [NFC] Test commit, deleting some whitespace (detail)
  17. [IntrinsicEmitter] Add overloaded types for SVE intrinsics (Subdivide2 & (detail)
  18. [lldb][NFC] Remove unused include in TestLineEntry.cpp (detail)
  19. Revert r372366 "Use getTargetConstant for BLENDI, and add a test to (detail)
  20. [AMDGPU] Use std::make_tuple to make some toolchains happy again (detail)

Started by upstream project relay-test-suite-verify-machineinstrs build number 6244
originally caused by:

This run spent:

  • 9 sec waiting;
  • 28 min build duration;
  • 28 min total from scheduled to completion.
Revision: 169cb63478aa047451786d8ccf6af4b721e3b271
  • detached

Identified problems

Ninja target failed

Below is a link to the first failed ninja target.
Indication 1

Compile Error

This build failed because of a compile error. Below is a list of all errors in the build log:
Indication 2