Started 24 days ago
Took 40 min

Failed Build clang-d327375-gc139d1e2810-t2086-b2086.tar.gz (Sep 20, 2019 12:50:57 PM)

Issues

Found 3 issues:
Ninja target: health.c.o
[2819/4714] /Users/buildslave/jenkins/workspace/test-suite-verify-machineinstrs-x86_64-O3/test-suite-build/tools/timeit --summary MultiSource/Benchmarks/Olden/health/CMakeFiles/health.dir/poisson.c.o.time /Users/buildslave/jenkins/workspace/test-suite-verify-machineinstrs-x86_64-O3/compiler/bin/clang -DNDEBUG  -B /Applications/Xcode.app/Contents/Developer/Toolchains/XcodeDefault.xctoolchain/usr/bin    -Wno-unused-command-line-argument -mllvm -verify-machineinstrs -O3 -arch x86_64 -isysroot /Applications/Xcode.app/Contents/Developer/Platforms/MacOSX.platform/Developer/SDKs/MacOSX10.14.sdk   -w -Werror=date-time -DTORONTO -MD -MT MultiSource/Benchmarks/Olden/health/CMakeFiles/health.dir/poisson.c.o -MF MultiSource/Benchmarks/Olden/health/CMakeFiles/health.dir/poisson.c.o.d -o MultiSource/Benchmarks/Olden/health/CMakeFiles/health.dir/poisson.c.o   -c /Users/buildslave/jenkins/workspace/test-suite-verify-machineinstrs-x86_64-O3/test-suite/MultiSource/Benchmarks/Olden/health/poisson.c
[2820/4714] : && /Users/buildslave/jenkins/workspace/test-suite-verify-machineinstrs-x86_64-O3/test-suite-build/tools/timeit --summary MultiSource/Benchmarks/Olden/bh/bh.link.time /Users/buildslave/jenkins/workspace/test-suite-verify-machineinstrs-x86_64-O3/compiler/bin/clang -B /Applications/Xcode.app/Contents/Developer/Toolchains/XcodeDefault.xctoolchain/usr/bin    -Wno-unused-command-line-argument -mllvm -verify-machineinstrs -O3 -arch x86_64 -isysroot /Applications/Xcode.app/Contents/Developer/Platforms/MacOSX.platform/Developer/SDKs/MacOSX10.14.sdk -Wl,-search_paths_first -Wl,-headerpad_max_install_names -B /Applications/Xcode.app/Contents/Developer/Toolchains/XcodeDefault.xctoolchain/usr/bin MultiSource/Benchmarks/Olden/bh/CMakeFiles/bh.dir/args.c.o MultiSource/Benchmarks/Olden/bh/CMakeFiles/bh.dir/newbh.c.o MultiSource/Benchmarks/Olden/bh/CMakeFiles/bh.dir/util.c.o MultiSource/Benchmarks/Olden/bh/CMakeFiles/bh.dir/walksub.c.o  -o MultiSource/Benchmarks/Olden/bh/bh  -Wl,-no_pie -lm && cd /Users/buildslave/jenkins/workspace/test-suite-verify-machineinstrs-x86_64-O3/test-suite-build/MultiSource/Benchmarks/Olden/bh && /usr/local/Cellar/cmake/3.13.1/bin/cmake -E create_symlink /Users/buildslave/jenkins/workspace/test-suite-verify-machineinstrs-x86_64-O3/test-suite/MultiSource/Benchmarks/Olden/bh/bh.reference_output /Users/buildslave/jenkins/workspace/test-suite-verify-machineinstrs-x86_64-O3/test-suite-build/MultiSource/Benchmarks/Olden/bh/bh.reference_output
[2821/4714] /Users/buildslave/jenkins/workspace/test-suite-verify-machineinstrs-x86_64-O3/test-suite-build/tools/timeit --summary MultiSource/Benchmarks/Olden/mst/CMakeFiles/mst.dir/args.c.o.time /Users/buildslave/jenkins/workspace/test-suite-verify-machineinstrs-x86_64-O3/compiler/bin/clang -DNDEBUG  -B /Applications/Xcode.app/Contents/Developer/Toolchains/XcodeDefault.xctoolchain/usr/bin    -Wno-unused-command-line-argument -mllvm -verify-machineinstrs -O3 -arch x86_64 -isysroot /Applications/Xcode.app/Contents/Developer/Platforms/MacOSX.platform/Developer/SDKs/MacOSX10.14.sdk   -w -Werror=date-time -DTORONTO -MD -MT MultiSource/Benchmarks/Olden/mst/CMakeFiles/mst.dir/args.c.o -MF MultiSource/Benchmarks/Olden/mst/CMakeFiles/mst.dir/args.c.o.d -o MultiSource/Benchmarks/Olden/mst/CMakeFiles/mst.dir/args.c.o   -c /Users/buildslave/jenkins/workspace/test-suite-verify-machineinstrs-x86_64-O3/test-suite/MultiSource/Benchmarks/Olden/mst/args.c
[2822/4714] /Users/buildslave/jenkins/workspace/test-suite-verify-machineinstrs-x86_64-O3/test-suite-build/tools/timeit --summary MultiSource/Benchmarks/Olden/em3d/CMakeFiles/em3d.dir/make_graph.c.o.time /Users/buildslave/jenkins/workspace/test-suite-verify-machineinstrs-x86_64-O3/compiler/bin/clang -DNDEBUG  -B /Applications/Xcode.app/Contents/Developer/Toolchains/XcodeDefault.xctoolchain/usr/bin    -Wno-unused-command-line-argument -mllvm -verify-machineinstrs -O3 -arch x86_64 -isysroot /Applications/Xcode.app/Contents/Developer/Platforms/MacOSX.platform/Developer/SDKs/MacOSX10.14.sdk   -w -Werror=date-time -DTORONTO -MD -MT MultiSource/Benchmarks/Olden/em3d/CMakeFiles/em3d.dir/make_graph.c.o -MF MultiSource/Benchmarks/Olden/em3d/CMakeFiles/em3d.dir/make_graph.c.o.d -o MultiSource/Benchmarks/Olden/em3d/CMakeFiles/em3d.dir/make_graph.c.o   -c /Users/buildslave/jenkins/workspace/test-suite-verify-machineinstrs-x86_64-O3/test-suite/MultiSource/Benchmarks/Olden/em3d/make_graph.c
[2823/4714] /Users/buildslave/jenkins/workspace/test-suite-verify-machineinstrs-x86_64-O3/test-suite-build/tools/timeit --summary MultiSource/Benchmarks/Olden/health/CMakeFiles/health.dir/health.c.o.time /Users/buildslave/jenkins/workspace/test-suite-verify-machineinstrs-x86_64-O3/compiler/bin/clang -DNDEBUG  -B /Applications/Xcode.app/Contents/Developer/Toolchains/XcodeDefault.xctoolchain/usr/bin    -Wno-unused-command-line-argument -mllvm -verify-machineinstrs -O3 -arch x86_64 -isysroot /Applications/Xcode.app/Contents/Developer/Platforms/MacOSX.platform/Developer/SDKs/MacOSX10.14.sdk   -w -Werror=date-time -DTORONTO -MD -MT MultiSource/Benchmarks/Olden/health/CMakeFiles/health.dir/health.c.o -MF MultiSource/Benchmarks/Olden/health/CMakeFiles/health.dir/health.c.o.d -o MultiSource/Benchmarks/Olden/health/CMakeFiles/health.dir/health.c.o   -c /Users/buildslave/jenkins/workspace/test-suite-verify-machineinstrs-x86_64-O3/test-suite/MultiSource/Benchmarks/Olden/health/health.c
FAILED: MultiSource/Benchmarks/Olden/health/CMakeFiles/health.dir/health.c.o 
/Users/buildslave/jenkins/workspace/test-suite-verify-machineinstrs-x86_64-O3/test-suite-build/tools/timeit --summary MultiSource/Benchmarks/Olden/health/CMakeFiles/health.dir/health.c.o.time /Users/buildslave/jenkins/workspace/test-suite-verify-machineinstrs-x86_64-O3/compiler/bin/clang -DNDEBUG  -B /Applications/Xcode.app/Contents/Developer/Toolchains/XcodeDefault.xctoolchain/usr/bin    -Wno-unused-command-line-argument -mllvm -verify-machineinstrs -O3 -arch x86_64 -isysroot /Applications/Xcode.app/Contents/Developer/Platforms/MacOSX.platform/Developer/SDKs/MacOSX10.14.sdk   -w -Werror=date-time -DTORONTO -MD -MT MultiSource/Benchmarks/Olden/health/CMakeFiles/health.dir/health.c.o -MF MultiSource/Benchmarks/Olden/health/CMakeFiles/health.dir/health.c.o.d -o MultiSource/Benchmarks/Olden/health/CMakeFiles/health.dir/health.c.o   -c /Users/buildslave/jenkins/workspace/test-suite-verify-machineinstrs-x86_64-O3/test-suite/MultiSource/Benchmarks/Olden/health/health.c
fatal error: error in backend: Cannot select: t80: v4f32 = X86ISD::BLENDI t75, t78, Constant:i8<1>
Fatal Error: error in backend: Cannot select: t80: v4f32 = X86ISD::BLENDI t75, t78, Constant:i8<1>
[2821/4714] /Users/buildslave/jenkins/workspace/test-suite-verify-machineinstrs-x86_64-O3/test-suite-build/tools/timeit --summary MultiSource/Benchmarks/Olden/mst/CMakeFiles/mst.dir/args.c.o.time /Users/buildslave/jenkins/workspace/test-suite-verify-machineinstrs-x86_64-O3/compiler/bin/clang -DNDEBUG  -B /Applications/Xcode.app/Contents/Developer/Toolchains/XcodeDefault.xctoolchain/usr/bin    -Wno-unused-command-line-argument -mllvm -verify-machineinstrs -O3 -arch x86_64 -isysroot /Applications/Xcode.app/Contents/Developer/Platforms/MacOSX.platform/Developer/SDKs/MacOSX10.14.sdk   -w -Werror=date-time -DTORONTO -MD -MT MultiSource/Benchmarks/Olden/mst/CMakeFiles/mst.dir/args.c.o -MF MultiSource/Benchmarks/Olden/mst/CMakeFiles/mst.dir/args.c.o.d -o MultiSource/Benchmarks/Olden/mst/CMakeFiles/mst.dir/args.c.o   -c /Users/buildslave/jenkins/workspace/test-suite-verify-machineinstrs-x86_64-O3/test-suite/MultiSource/Benchmarks/Olden/mst/args.c
[2822/4714] /Users/buildslave/jenkins/workspace/test-suite-verify-machineinstrs-x86_64-O3/test-suite-build/tools/timeit --summary MultiSource/Benchmarks/Olden/em3d/CMakeFiles/em3d.dir/make_graph.c.o.time /Users/buildslave/jenkins/workspace/test-suite-verify-machineinstrs-x86_64-O3/compiler/bin/clang -DNDEBUG  -B /Applications/Xcode.app/Contents/Developer/Toolchains/XcodeDefault.xctoolchain/usr/bin    -Wno-unused-command-line-argument -mllvm -verify-machineinstrs -O3 -arch x86_64 -isysroot /Applications/Xcode.app/Contents/Developer/Platforms/MacOSX.platform/Developer/SDKs/MacOSX10.14.sdk   -w -Werror=date-time -DTORONTO -MD -MT MultiSource/Benchmarks/Olden/em3d/CMakeFiles/em3d.dir/make_graph.c.o -MF MultiSource/Benchmarks/Olden/em3d/CMakeFiles/em3d.dir/make_graph.c.o.d -o MultiSource/Benchmarks/Olden/em3d/CMakeFiles/em3d.dir/make_graph.c.o   -c /Users/buildslave/jenkins/workspace/test-suite-verify-machineinstrs-x86_64-O3/test-suite/MultiSource/Benchmarks/Olden/em3d/make_graph.c
[2823/4714] /Users/buildslave/jenkins/workspace/test-suite-verify-machineinstrs-x86_64-O3/test-suite-build/tools/timeit --summary MultiSource/Benchmarks/Olden/health/CMakeFiles/health.dir/health.c.o.time /Users/buildslave/jenkins/workspace/test-suite-verify-machineinstrs-x86_64-O3/compiler/bin/clang -DNDEBUG  -B /Applications/Xcode.app/Contents/Developer/Toolchains/XcodeDefault.xctoolchain/usr/bin    -Wno-unused-command-line-argument -mllvm -verify-machineinstrs -O3 -arch x86_64 -isysroot /Applications/Xcode.app/Contents/Developer/Platforms/MacOSX.platform/Developer/SDKs/MacOSX10.14.sdk   -w -Werror=date-time -DTORONTO -MD -MT MultiSource/Benchmarks/Olden/health/CMakeFiles/health.dir/health.c.o -MF MultiSource/Benchmarks/Olden/health/CMakeFiles/health.dir/health.c.o.d -o MultiSource/Benchmarks/Olden/health/CMakeFiles/health.dir/health.c.o   -c /Users/buildslave/jenkins/workspace/test-suite-verify-machineinstrs-x86_64-O3/test-suite/MultiSource/Benchmarks/Olden/health/health.c
FAILED: MultiSource/Benchmarks/Olden/health/CMakeFiles/health.dir/health.c.o 
/Users/buildslave/jenkins/workspace/test-suite-verify-machineinstrs-x86_64-O3/test-suite-build/tools/timeit --summary MultiSource/Benchmarks/Olden/health/CMakeFiles/health.dir/health.c.o.time /Users/buildslave/jenkins/workspace/test-suite-verify-machineinstrs-x86_64-O3/compiler/bin/clang -DNDEBUG  -B /Applications/Xcode.app/Contents/Developer/Toolchains/XcodeDefault.xctoolchain/usr/bin    -Wno-unused-command-line-argument -mllvm -verify-machineinstrs -O3 -arch x86_64 -isysroot /Applications/Xcode.app/Contents/Developer/Platforms/MacOSX.platform/Developer/SDKs/MacOSX10.14.sdk   -w -Werror=date-time -DTORONTO -MD -MT MultiSource/Benchmarks/Olden/health/CMakeFiles/health.dir/health.c.o -MF MultiSource/Benchmarks/Olden/health/CMakeFiles/health.dir/health.c.o.d -o MultiSource/Benchmarks/Olden/health/CMakeFiles/health.dir/health.c.o   -c /Users/buildslave/jenkins/workspace/test-suite-verify-machineinstrs-x86_64-O3/test-suite/MultiSource/Benchmarks/Olden/health/health.c
fatal error: error in backend: Cannot select: t80: v4f32 = X86ISD::BLENDI t75, t78, Constant:i8<1>
  t75: v4f32,ch = load<(load 16 from constant-pool)> t0, t74, undef:i64
    t74: i64 = X86ISD::WrapperRIP TargetConstantPool:i64<<4 x float> <float undef, float 1.000000e+00, float undef, float undef>> 0
Error: clang frontend command failed with exit code 70 (use -v to see invocation)
            t6: i64 = undef
          t15: i64 = Constant<4>
        t6: i64 = undef
  t79: i8 = Constant<1>
In function: get_results
clang-10: error: clang frontend command failed with exit code 70 (use -v to see invocation)
clang version 10.0.0 (https://github.com/llvm/llvm-project.git c139d1e28109450085a11e3b2ec7d53c6a00c37b)
Target: x86_64-apple-darwin18.0.0

Build Log

Changes
  1. [SelectionDAG][Mips][Sparc] Don't allow SimplifyDemandedBits to constant (detail)
  2. [libTooling] Add `ifBound`, `elseBranch` RangeSelector combinators. (detail)
  3. Doxygenify comments. (detail)
  4. [MTE] Handle MTE instructions in AArch64LoadStoreOptimizer. (detail)
  5. [NFC][InstCombine] Fixup newly-added tests (detail)
  6. Reland '[analyzer][MallocChecker][NFC] Document and reorganize some (detail)
  7. [www] Turn 'Clang 9' boxes green in C++ status pages now Clang 9 is (detail)
  8. Fix MSVC "not all control paths return a value" warning. NFCI. (detail)
  9. [NFC][PowerPC] Refactor classifyGlobalReference (detail)
  10. Fix -Wdocumentation warning. NFCI. (detail)
  11. Fix a documentation error (detail)
  12. [Mips] Remove immarg test for intrinsics that no longer have an immarg (detail)

Started by upstream project relay-test-suite-verify-machineinstrs build number 6247
originally caused by:

This run spent:

  • 15 min waiting;
  • 40 min build duration;
  • 40 min total from scheduled to completion.
Revision: c139d1e28109450085a11e3b2ec7d53c6a00c37b
  • detached

Identified problems

Ninja target failed

Below is a link to the first failed ninja target.
Indication 1

Compile Error

This build failed because of a compile error. Below is a list of all errors in the build log:
Indication 2