Started 2 hr 56 min ago
Took 2 hr 4 min

Failed Build clang-d329964-g393d0f799f8-t3032-b3032.tar.gz (Oct 18, 2019 2:26:36 PM)

Issues

Found 11 issues:
Ninja target: alias-3.c.o
[5577/7684] : && /Users/buildslave/jenkins/workspace/test-suite-verify-machineinstrs-x86_64h-O3/test-suite-build/tools/timeit --summary SingleSource/Regression/C/gcc-c-torture/execute/GCC-C-execute-align-1.link.time /Users/buildslave/jenkins/workspace/test-suite-verify-machineinstrs-x86_64h-O3/compiler/bin/clang -B /Applications/Xcode.app/Contents/Developer/Toolchains/XcodeDefault.xctoolchain/usr/bin    -Wno-unused-command-line-argument -mllvm -verify-machineinstrs -O3 -arch x86_64h -isysroot /Applications/Xcode.app/Contents/Developer/Platforms/MacOSX.platform/Developer/SDKs/MacOSX10.14.sdk -Wl,-search_paths_first -Wl,-headerpad_max_install_names -B /Applications/Xcode.app/Contents/Developer/Toolchains/XcodeDefault.xctoolchain/usr/bin SingleSource/Regression/C/gcc-c-torture/execute/CMakeFiles/GCC-C-execute-align-1.dir/align-1.c.o  -o SingleSource/Regression/C/gcc-c-torture/execute/GCC-C-execute-align-1  -Wl,-no_pie && :
[5578/7684] : && /Users/buildslave/jenkins/workspace/test-suite-verify-machineinstrs-x86_64h-O3/test-suite-build/tools/timeit --summary SingleSource/Regression/C/gcc-c-torture/execute/GCC-C-execute-align-2.link.time /Users/buildslave/jenkins/workspace/test-suite-verify-machineinstrs-x86_64h-O3/compiler/bin/clang -B /Applications/Xcode.app/Contents/Developer/Toolchains/XcodeDefault.xctoolchain/usr/bin    -Wno-unused-command-line-argument -mllvm -verify-machineinstrs -O3 -arch x86_64h -isysroot /Applications/Xcode.app/Contents/Developer/Platforms/MacOSX.platform/Developer/SDKs/MacOSX10.14.sdk -Wl,-search_paths_first -Wl,-headerpad_max_install_names -B /Applications/Xcode.app/Contents/Developer/Toolchains/XcodeDefault.xctoolchain/usr/bin SingleSource/Regression/C/gcc-c-torture/execute/CMakeFiles/GCC-C-execute-align-2.dir/align-2.c.o  -o SingleSource/Regression/C/gcc-c-torture/execute/GCC-C-execute-align-2  -Wl,-no_pie && :
[5579/7684] : && /Users/buildslave/jenkins/workspace/test-suite-verify-machineinstrs-x86_64h-O3/test-suite-build/tools/timeit --summary SingleSource/Regression/C/gcc-c-torture/execute/GCC-C-execute-alias-access-path-1.link.time /Users/buildslave/jenkins/workspace/test-suite-verify-machineinstrs-x86_64h-O3/compiler/bin/clang -B /Applications/Xcode.app/Contents/Developer/Toolchains/XcodeDefault.xctoolchain/usr/bin    -Wno-unused-command-line-argument -mllvm -verify-machineinstrs -O3 -arch x86_64h -isysroot /Applications/Xcode.app/Contents/Developer/Platforms/MacOSX.platform/Developer/SDKs/MacOSX10.14.sdk -Wl,-search_paths_first -Wl,-headerpad_max_install_names -B /Applications/Xcode.app/Contents/Developer/Toolchains/XcodeDefault.xctoolchain/usr/bin SingleSource/Regression/C/gcc-c-torture/execute/CMakeFiles/GCC-C-execute-alias-access-path-1.dir/alias-access-path-1.c.o  -o SingleSource/Regression/C/gcc-c-torture/execute/GCC-C-execute-alias-access-path-1  -Wl,-no_pie && :
[5580/7684] : && /Users/buildslave/jenkins/workspace/test-suite-verify-machineinstrs-x86_64h-O3/test-suite-build/tools/timeit --summary SingleSource/Regression/C/gcc-c-torture/execute/GCC-C-execute-pr61306-2.link.time /Users/buildslave/jenkins/workspace/test-suite-verify-machineinstrs-x86_64h-O3/compiler/bin/clang -B /Applications/Xcode.app/Contents/Developer/Toolchains/XcodeDefault.xctoolchain/usr/bin    -Wno-unused-command-line-argument -mllvm -verify-machineinstrs -O3 -arch x86_64h -isysroot /Applications/Xcode.app/Contents/Developer/Platforms/MacOSX.platform/Developer/SDKs/MacOSX10.14.sdk -Wl,-search_paths_first -Wl,-headerpad_max_install_names -B /Applications/Xcode.app/Contents/Developer/Toolchains/XcodeDefault.xctoolchain/usr/bin SingleSource/Regression/C/gcc-c-torture/execute/CMakeFiles/GCC-C-execute-pr61306-2.dir/pr61306-2.c.o  -o SingleSource/Regression/C/gcc-c-torture/execute/GCC-C-execute-pr61306-2  -Wl,-no_pie && :
[5581/7684] /Users/buildslave/jenkins/workspace/test-suite-verify-machineinstrs-x86_64h-O3/test-suite-build/tools/timeit --summary SingleSource/Regression/C/gcc-c-torture/execute/CMakeFiles/GCC-C-execute-alias-3.dir/alias-3.c.o.time /Users/buildslave/jenkins/workspace/test-suite-verify-machineinstrs-x86_64h-O3/compiler/bin/clang -DNDEBUG  -B /Applications/Xcode.app/Contents/Developer/Toolchains/XcodeDefault.xctoolchain/usr/bin    -Wno-unused-command-line-argument -mllvm -verify-machineinstrs -O3 -arch x86_64h -isysroot /Applications/Xcode.app/Contents/Developer/Platforms/MacOSX.platform/Developer/SDKs/MacOSX10.14.sdk   -w -Werror=date-time -w -MD -MT SingleSource/Regression/C/gcc-c-torture/execute/CMakeFiles/GCC-C-execute-alias-3.dir/alias-3.c.o -MF SingleSource/Regression/C/gcc-c-torture/execute/CMakeFiles/GCC-C-execute-alias-3.dir/alias-3.c.o.d -o SingleSource/Regression/C/gcc-c-torture/execute/CMakeFiles/GCC-C-execute-alias-3.dir/alias-3.c.o   -c /Users/buildslave/jenkins/workspace/test-suite-verify-machineinstrs-x86_64h-O3/test-suite/SingleSource/Regression/C/gcc-c-torture/execute/alias-3.c
FAILED: SingleSource/Regression/C/gcc-c-torture/execute/CMakeFiles/GCC-C-execute-alias-3.dir/alias-3.c.o 
/Users/buildslave/jenkins/workspace/test-suite-verify-machineinstrs-x86_64h-O3/test-suite-build/tools/timeit --summary SingleSource/Regression/C/gcc-c-torture/execute/CMakeFiles/GCC-C-execute-alias-3.dir/alias-3.c.o.time /Users/buildslave/jenkins/workspace/test-suite-verify-machineinstrs-x86_64h-O3/compiler/bin/clang -DNDEBUG  -B /Applications/Xcode.app/Contents/Developer/Toolchains/XcodeDefault.xctoolchain/usr/bin    -Wno-unused-command-line-argument -mllvm -verify-machineinstrs -O3 -arch x86_64h -isysroot /Applications/Xcode.app/Contents/Developer/Platforms/MacOSX.platform/Developer/SDKs/MacOSX10.14.sdk   -w -Werror=date-time -w -MD -MT SingleSource/Regression/C/gcc-c-torture/execute/CMakeFiles/GCC-C-execute-alias-3.dir/alias-3.c.o -MF SingleSource/Regression/C/gcc-c-torture/execute/CMakeFiles/GCC-C-execute-alias-3.dir/alias-3.c.o.d -o SingleSource/Regression/C/gcc-c-torture/execute/CMakeFiles/GCC-C-execute-alias-3.dir/alias-3.c.o   -c /Users/buildslave/jenkins/workspace/test-suite-verify-machineinstrs-x86_64h-O3/test-suite/SingleSource/Regression/C/gcc-c-torture/execute/alias-3.c
/Users/buildslave/jenkins/workspace/test-suite-verify-machineinstrs-x86_64h-O3/test-suite/SingleSource/Regression/C/gcc-c-torture/execute/alias-3.c:4:30: error: aliases are not supported on darwin
alias-3.c error: aliases are not supported on darwin
[5579/7684] : && /Users/buildslave/jenkins/workspace/test-suite-verify-machineinstrs-x86_64h-O3/test-suite-build/tools/timeit --summary SingleSource/Regression/C/gcc-c-torture/execute/GCC-C-execute-alias-access-path-1.link.time /Users/buildslave/jenkins/workspace/test-suite-verify-machineinstrs-x86_64h-O3/compiler/bin/clang -B /Applications/Xcode.app/Contents/Developer/Toolchains/XcodeDefault.xctoolchain/usr/bin    -Wno-unused-command-line-argument -mllvm -verify-machineinstrs -O3 -arch x86_64h -isysroot /Applications/Xcode.app/Contents/Developer/Platforms/MacOSX.platform/Developer/SDKs/MacOSX10.14.sdk -Wl,-search_paths_first -Wl,-headerpad_max_install_names -B /Applications/Xcode.app/Contents/Developer/Toolchains/XcodeDefault.xctoolchain/usr/bin SingleSource/Regression/C/gcc-c-torture/execute/CMakeFiles/GCC-C-execute-alias-access-path-1.dir/alias-access-path-1.c.o  -o SingleSource/Regression/C/gcc-c-torture/execute/GCC-C-execute-alias-access-path-1  -Wl,-no_pie && :
[5580/7684] : && /Users/buildslave/jenkins/workspace/test-suite-verify-machineinstrs-x86_64h-O3/test-suite-build/tools/timeit --summary SingleSource/Regression/C/gcc-c-torture/execute/GCC-C-execute-pr61306-2.link.time /Users/buildslave/jenkins/workspace/test-suite-verify-machineinstrs-x86_64h-O3/compiler/bin/clang -B /Applications/Xcode.app/Contents/Developer/Toolchains/XcodeDefault.xctoolchain/usr/bin    -Wno-unused-command-line-argument -mllvm -verify-machineinstrs -O3 -arch x86_64h -isysroot /Applications/Xcode.app/Contents/Developer/Platforms/MacOSX.platform/Developer/SDKs/MacOSX10.14.sdk -Wl,-search_paths_first -Wl,-headerpad_max_install_names -B /Applications/Xcode.app/Contents/Developer/Toolchains/XcodeDefault.xctoolchain/usr/bin SingleSource/Regression/C/gcc-c-torture/execute/CMakeFiles/GCC-C-execute-pr61306-2.dir/pr61306-2.c.o  -o SingleSource/Regression/C/gcc-c-torture/execute/GCC-C-execute-pr61306-2  -Wl,-no_pie && :
[5581/7684] /Users/buildslave/jenkins/workspace/test-suite-verify-machineinstrs-x86_64h-O3/test-suite-build/tools/timeit --summary SingleSource/Regression/C/gcc-c-torture/execute/CMakeFiles/GCC-C-execute-alias-3.dir/alias-3.c.o.time /Users/buildslave/jenkins/workspace/test-suite-verify-machineinstrs-x86_64h-O3/compiler/bin/clang -DNDEBUG  -B /Applications/Xcode.app/Contents/Developer/Toolchains/XcodeDefault.xctoolchain/usr/bin    -Wno-unused-command-line-argument -mllvm -verify-machineinstrs -O3 -arch x86_64h -isysroot /Applications/Xcode.app/Contents/Developer/Platforms/MacOSX.platform/Developer/SDKs/MacOSX10.14.sdk   -w -Werror=date-time -w -MD -MT SingleSource/Regression/C/gcc-c-torture/execute/CMakeFiles/GCC-C-execute-alias-3.dir/alias-3.c.o -MF SingleSource/Regression/C/gcc-c-torture/execute/CMakeFiles/GCC-C-execute-alias-3.dir/alias-3.c.o.d -o SingleSource/Regression/C/gcc-c-torture/execute/CMakeFiles/GCC-C-execute-alias-3.dir/alias-3.c.o   -c /Users/buildslave/jenkins/workspace/test-suite-verify-machineinstrs-x86_64h-O3/test-suite/SingleSource/Regression/C/gcc-c-torture/execute/alias-3.c
FAILED: SingleSource/Regression/C/gcc-c-torture/execute/CMakeFiles/GCC-C-execute-alias-3.dir/alias-3.c.o 
/Users/buildslave/jenkins/workspace/test-suite-verify-machineinstrs-x86_64h-O3/test-suite-build/tools/timeit --summary SingleSource/Regression/C/gcc-c-torture/execute/CMakeFiles/GCC-C-execute-alias-3.dir/alias-3.c.o.time /Users/buildslave/jenkins/workspace/test-suite-verify-machineinstrs-x86_64h-O3/compiler/bin/clang -DNDEBUG  -B /Applications/Xcode.app/Contents/Developer/Toolchains/XcodeDefault.xctoolchain/usr/bin    -Wno-unused-command-line-argument -mllvm -verify-machineinstrs -O3 -arch x86_64h -isysroot /Applications/Xcode.app/Contents/Developer/Platforms/MacOSX.platform/Developer/SDKs/MacOSX10.14.sdk   -w -Werror=date-time -w -MD -MT SingleSource/Regression/C/gcc-c-torture/execute/CMakeFiles/GCC-C-execute-alias-3.dir/alias-3.c.o -MF SingleSource/Regression/C/gcc-c-torture/execute/CMakeFiles/GCC-C-execute-alias-3.dir/alias-3.c.o.d -o SingleSource/Regression/C/gcc-c-torture/execute/CMakeFiles/GCC-C-execute-alias-3.dir/alias-3.c.o   -c /Users/buildslave/jenkins/workspace/test-suite-verify-machineinstrs-x86_64h-O3/test-suite/SingleSource/Regression/C/gcc-c-torture/execute/alias-3.c
/Users/buildslave/jenkins/workspace/test-suite-verify-machineinstrs-x86_64h-O3/test-suite/SingleSource/Regression/C/gcc-c-torture/execute/alias-3.c:4:30: error: aliases are not supported on darwin
extern int b __attribute__ ((alias("a")));
                             ^
Ninja target: alias-2.c.o
/Users/buildslave/jenkins/workspace/test-suite-verify-machineinstrs-x86_64h-O3/test-suite/SingleSource/Regression/C/gcc-c-torture/execute/alias-3.c:4:30: error: aliases are not supported on darwin
extern int b __attribute__ ((alias("a")));
                             ^
1 error generated.
[5582/7684] /Users/buildslave/jenkins/workspace/test-suite-verify-machineinstrs-x86_64h-O3/test-suite-build/tools/timeit --summary SingleSource/Regression/C/gcc-c-torture/execute/CMakeFiles/GCC-C-execute-alias-2.dir/alias-2.c.o.time /Users/buildslave/jenkins/workspace/test-suite-verify-machineinstrs-x86_64h-O3/compiler/bin/clang -DNDEBUG  -B /Applications/Xcode.app/Contents/Developer/Toolchains/XcodeDefault.xctoolchain/usr/bin    -Wno-unused-command-line-argument -mllvm -verify-machineinstrs -O3 -arch x86_64h -isysroot /Applications/Xcode.app/Contents/Developer/Platforms/MacOSX.platform/Developer/SDKs/MacOSX10.14.sdk   -w -Werror=date-time -w -MD -MT SingleSource/Regression/C/gcc-c-torture/execute/CMakeFiles/GCC-C-execute-alias-2.dir/alias-2.c.o -MF SingleSource/Regression/C/gcc-c-torture/execute/CMakeFiles/GCC-C-execute-alias-2.dir/alias-2.c.o.d -o SingleSource/Regression/C/gcc-c-torture/execute/CMakeFiles/GCC-C-execute-alias-2.dir/alias-2.c.o   -c /Users/buildslave/jenkins/workspace/test-suite-verify-machineinstrs-x86_64h-O3/test-suite/SingleSource/Regression/C/gcc-c-torture/execute/alias-2.c
FAILED: SingleSource/Regression/C/gcc-c-torture/execute/CMakeFiles/GCC-C-execute-alias-2.dir/alias-2.c.o 
/Users/buildslave/jenkins/workspace/test-suite-verify-machineinstrs-x86_64h-O3/test-suite-build/tools/timeit --summary SingleSource/Regression/C/gcc-c-torture/execute/CMakeFiles/GCC-C-execute-alias-2.dir/alias-2.c.o.time /Users/buildslave/jenkins/workspace/test-suite-verify-machineinstrs-x86_64h-O3/compiler/bin/clang -DNDEBUG  -B /Applications/Xcode.app/Contents/Developer/Toolchains/XcodeDefault.xctoolchain/usr/bin    -Wno-unused-command-line-argument -mllvm -verify-machineinstrs -O3 -arch x86_64h -isysroot /Applications/Xcode.app/Contents/Developer/Platforms/MacOSX.platform/Developer/SDKs/MacOSX10.14.sdk   -w -Werror=date-time -w -MD -MT SingleSource/Regression/C/gcc-c-torture/execute/CMakeFiles/GCC-C-execute-alias-2.dir/alias-2.c.o -MF SingleSource/Regression/C/gcc-c-torture/execute/CMakeFiles/GCC-C-execute-alias-2.dir/alias-2.c.o.d -o SingleSource/Regression/C/gcc-c-torture/execute/CMakeFiles/GCC-C-execute-alias-2.dir/alias-2.c.o   -c /Users/buildslave/jenkins/workspace/test-suite-verify-machineinstrs-x86_64h-O3/test-suite/SingleSource/Regression/C/gcc-c-torture/execute/alias-2.c
/Users/buildslave/jenkins/workspace/test-suite-verify-machineinstrs-x86_64h-O3/test-suite/SingleSource/Regression/C/gcc-c-torture/execute/alias-2.c:3:34: error: aliases are not supported on darwin
alias-2.c error: aliases are not supported on darwin
                             ^
1 error generated.
[5582/7684] /Users/buildslave/jenkins/workspace/test-suite-verify-machineinstrs-x86_64h-O3/test-suite-build/tools/timeit --summary SingleSource/Regression/C/gcc-c-torture/execute/CMakeFiles/GCC-C-execute-alias-2.dir/alias-2.c.o.time /Users/buildslave/jenkins/workspace/test-suite-verify-machineinstrs-x86_64h-O3/compiler/bin/clang -DNDEBUG  -B /Applications/Xcode.app/Contents/Developer/Toolchains/XcodeDefault.xctoolchain/usr/bin    -Wno-unused-command-line-argument -mllvm -verify-machineinstrs -O3 -arch x86_64h -isysroot /Applications/Xcode.app/Contents/Developer/Platforms/MacOSX.platform/Developer/SDKs/MacOSX10.14.sdk   -w -Werror=date-time -w -MD -MT SingleSource/Regression/C/gcc-c-torture/execute/CMakeFiles/GCC-C-execute-alias-2.dir/alias-2.c.o -MF SingleSource/Regression/C/gcc-c-torture/execute/CMakeFiles/GCC-C-execute-alias-2.dir/alias-2.c.o.d -o SingleSource/Regression/C/gcc-c-torture/execute/CMakeFiles/GCC-C-execute-alias-2.dir/alias-2.c.o   -c /Users/buildslave/jenkins/workspace/test-suite-verify-machineinstrs-x86_64h-O3/test-suite/SingleSource/Regression/C/gcc-c-torture/execute/alias-2.c
FAILED: SingleSource/Regression/C/gcc-c-torture/execute/CMakeFiles/GCC-C-execute-alias-2.dir/alias-2.c.o 
/Users/buildslave/jenkins/workspace/test-suite-verify-machineinstrs-x86_64h-O3/test-suite-build/tools/timeit --summary SingleSource/Regression/C/gcc-c-torture/execute/CMakeFiles/GCC-C-execute-alias-2.dir/alias-2.c.o.time /Users/buildslave/jenkins/workspace/test-suite-verify-machineinstrs-x86_64h-O3/compiler/bin/clang -DNDEBUG  -B /Applications/Xcode.app/Contents/Developer/Toolchains/XcodeDefault.xctoolchain/usr/bin    -Wno-unused-command-line-argument -mllvm -verify-machineinstrs -O3 -arch x86_64h -isysroot /Applications/Xcode.app/Contents/Developer/Platforms/MacOSX.platform/Developer/SDKs/MacOSX10.14.sdk   -w -Werror=date-time -w -MD -MT SingleSource/Regression/C/gcc-c-torture/execute/CMakeFiles/GCC-C-execute-alias-2.dir/alias-2.c.o -MF SingleSource/Regression/C/gcc-c-torture/execute/CMakeFiles/GCC-C-execute-alias-2.dir/alias-2.c.o.d -o SingleSource/Regression/C/gcc-c-torture/execute/CMakeFiles/GCC-C-execute-alias-2.dir/alias-2.c.o   -c /Users/buildslave/jenkins/workspace/test-suite-verify-machineinstrs-x86_64h-O3/test-suite/SingleSource/Regression/C/gcc-c-torture/execute/alias-2.c
/Users/buildslave/jenkins/workspace/test-suite-verify-machineinstrs-x86_64h-O3/test-suite/SingleSource/Regression/C/gcc-c-torture/execute/alias-2.c:3:34: error: aliases are not supported on darwin
extern int b[10] __attribute__ ((alias("a")));
                                 ^
Ninja target: GCC-C-execute-930513-1
[5997/7684] : && /Users/buildslave/jenkins/workspace/test-suite-verify-machineinstrs-x86_64h-O3/test-suite-build/tools/timeit --summary SingleSource/Regression/C/gcc-c-torture/execute/GCC-C-execute-loop-2d.link.time /Users/buildslave/jenkins/workspace/test-suite-verify-machineinstrs-x86_64h-O3/compiler/bin/clang -B /Applications/Xcode.app/Contents/Developer/Toolchains/XcodeDefault.xctoolchain/usr/bin    -Wno-unused-command-line-argument -mllvm -verify-machineinstrs -O3 -arch x86_64h -isysroot /Applications/Xcode.app/Contents/Developer/Platforms/MacOSX.platform/Developer/SDKs/MacOSX10.14.sdk -Wl,-search_paths_first -Wl,-headerpad_max_install_names -B /Applications/Xcode.app/Contents/Developer/Toolchains/XcodeDefault.xctoolchain/usr/bin SingleSource/Regression/C/gcc-c-torture/execute/CMakeFiles/GCC-C-execute-loop-2d.dir/loop-2d.c.o  -o SingleSource/Regression/C/gcc-c-torture/execute/GCC-C-execute-loop-2d  -Wl,-no_pie && :
[5998/7684] /Users/buildslave/jenkins/workspace/test-suite-verify-machineinstrs-x86_64h-O3/test-suite-build/tools/timeit --summary SingleSource/Regression/C/gcc-c-torture/execute/CMakeFiles/GCC-C-execute-921218-1.dir/921218-1.c.o.time /Users/buildslave/jenkins/workspace/test-suite-verify-machineinstrs-x86_64h-O3/compiler/bin/clang -DNDEBUG  -B /Applications/Xcode.app/Contents/Developer/Toolchains/XcodeDefault.xctoolchain/usr/bin    -Wno-unused-command-line-argument -mllvm -verify-machineinstrs -O3 -arch x86_64h -isysroot /Applications/Xcode.app/Contents/Developer/Platforms/MacOSX.platform/Developer/SDKs/MacOSX10.14.sdk   -w -Werror=date-time -w -MD -MT SingleSource/Regression/C/gcc-c-torture/execute/CMakeFiles/GCC-C-execute-921218-1.dir/921218-1.c.o -MF SingleSource/Regression/C/gcc-c-torture/execute/CMakeFiles/GCC-C-execute-921218-1.dir/921218-1.c.o.d -o SingleSource/Regression/C/gcc-c-torture/execute/CMakeFiles/GCC-C-execute-921218-1.dir/921218-1.c.o   -c /Users/buildslave/jenkins/workspace/test-suite-verify-machineinstrs-x86_64h-O3/test-suite/SingleSource/Regression/C/gcc-c-torture/execute/921218-1.c
[5999/7684] /Users/buildslave/jenkins/workspace/test-suite-verify-machineinstrs-x86_64h-O3/test-suite-build/tools/timeit --summary SingleSource/Regression/C/gcc-c-torture/execute/CMakeFiles/GCC-C-execute-921208-1.dir/921208-1.c.o.time /Users/buildslave/jenkins/workspace/test-suite-verify-machineinstrs-x86_64h-O3/compiler/bin/clang -DNDEBUG  -B /Applications/Xcode.app/Contents/Developer/Toolchains/XcodeDefault.xctoolchain/usr/bin    -Wno-unused-command-line-argument -mllvm -verify-machineinstrs -O3 -arch x86_64h -isysroot /Applications/Xcode.app/Contents/Developer/Platforms/MacOSX.platform/Developer/SDKs/MacOSX10.14.sdk   -w -Werror=date-time -w -MD -MT SingleSource/Regression/C/gcc-c-torture/execute/CMakeFiles/GCC-C-execute-921208-1.dir/921208-1.c.o -MF SingleSource/Regression/C/gcc-c-torture/execute/CMakeFiles/GCC-C-execute-921208-1.dir/921208-1.c.o.d -o SingleSource/Regression/C/gcc-c-torture/execute/CMakeFiles/GCC-C-execute-921208-1.dir/921208-1.c.o   -c /Users/buildslave/jenkins/workspace/test-suite-verify-machineinstrs-x86_64h-O3/test-suite/SingleSource/Regression/C/gcc-c-torture/execute/921208-1.c
[6000/7684] /Users/buildslave/jenkins/workspace/test-suite-verify-machineinstrs-x86_64h-O3/test-suite-build/tools/timeit --summary SingleSource/Regression/C/gcc-c-torture/execute/CMakeFiles/GCC-C-execute-931012-1.dir/931012-1.c.o.time /Users/buildslave/jenkins/workspace/test-suite-verify-machineinstrs-x86_64h-O3/compiler/bin/clang -DNDEBUG  -B /Applications/Xcode.app/Contents/Developer/Toolchains/XcodeDefault.xctoolchain/usr/bin    -Wno-unused-command-line-argument -mllvm -verify-machineinstrs -O3 -arch x86_64h -isysroot /Applications/Xcode.app/Contents/Developer/Platforms/MacOSX.platform/Developer/SDKs/MacOSX10.14.sdk   -w -Werror=date-time -w -MD -MT SingleSource/Regression/C/gcc-c-torture/execute/CMakeFiles/GCC-C-execute-931012-1.dir/931012-1.c.o -MF SingleSource/Regression/C/gcc-c-torture/execute/CMakeFiles/GCC-C-execute-931012-1.dir/931012-1.c.o.d -o SingleSource/Regression/C/gcc-c-torture/execute/CMakeFiles/GCC-C-execute-931012-1.dir/931012-1.c.o   -c /Users/buildslave/jenkins/workspace/test-suite-verify-machineinstrs-x86_64h-O3/test-suite/SingleSource/Regression/C/gcc-c-torture/execute/931012-1.c
[6001/7684] : && /Users/buildslave/jenkins/workspace/test-suite-verify-machineinstrs-x86_64h-O3/test-suite-build/tools/timeit --summary SingleSource/Regression/C/gcc-c-torture/execute/GCC-C-execute-930513-1.link.time /Users/buildslave/jenkins/workspace/test-suite-verify-machineinstrs-x86_64h-O3/compiler/bin/clang -B /Applications/Xcode.app/Contents/Developer/Toolchains/XcodeDefault.xctoolchain/usr/bin    -Wno-unused-command-line-argument -mllvm -verify-machineinstrs -O3 -arch x86_64h -isysroot /Applications/Xcode.app/Contents/Developer/Platforms/MacOSX.platform/Developer/SDKs/MacOSX10.14.sdk -Wl,-search_paths_first -Wl,-headerpad_max_install_names -B /Applications/Xcode.app/Contents/Developer/Toolchains/XcodeDefault.xctoolchain/usr/bin SingleSource/Regression/C/gcc-c-torture/execute/CMakeFiles/GCC-C-execute-930513-1.dir/930513-1.c.o  -o SingleSource/Regression/C/gcc-c-torture/execute/GCC-C-execute-930513-1  -Wl,-no_pie -Wl,-u,_printf_float && :
FAILED: SingleSource/Regression/C/gcc-c-torture/execute/GCC-C-execute-930513-1 
: && /Users/buildslave/jenkins/workspace/test-suite-verify-machineinstrs-x86_64h-O3/test-suite-build/tools/timeit --summary SingleSource/Regression/C/gcc-c-torture/execute/GCC-C-execute-930513-1.link.time /Users/buildslave/jenkins/workspace/test-suite-verify-machineinstrs-x86_64h-O3/compiler/bin/clang -B /Applications/Xcode.app/Contents/Developer/Toolchains/XcodeDefault.xctoolchain/usr/bin    -Wno-unused-command-line-argument -mllvm -verify-machineinstrs -O3 -arch x86_64h -isysroot /Applications/Xcode.app/Contents/Developer/Platforms/MacOSX.platform/Developer/SDKs/MacOSX10.14.sdk -Wl,-search_paths_first -Wl,-headerpad_max_install_names -B /Applications/Xcode.app/Contents/Developer/Toolchains/XcodeDefault.xctoolchain/usr/bin SingleSource/Regression/C/gcc-c-torture/execute/CMakeFiles/GCC-C-execute-930513-1.dir/930513-1.c.o  -o SingleSource/Regression/C/gcc-c-torture/execute/GCC-C-execute-930513-1  -Wl,-no_pie -Wl,-u,_printf_float && :
Undefined symbols for architecture x86_64h:
link error
: && /Users/buildslave/jenkins/workspace/test-suite-verify-machineinstrs-x86_64h-O3/test-suite-build/tools/timeit --summary SingleSource/Regression/C/gcc-c-torture/execute/GCC-C-execute-930513-1.link.time /Users/buildslave/jenkins/workspace/test-suite-verify-machineinstrs-x86_64h-O3/compiler/bin/clang -B /Applications/Xcode.app/Contents/Developer/Toolchains/XcodeDefault.xctoolchain/usr/bin    -Wno-unused-command-line-argument -mllvm -verify-machineinstrs -O3 -arch x86_64h -isysroot /Applications/Xcode.app/Contents/Developer/Platforms/MacOSX.platform/Developer/SDKs/MacOSX10.14.sdk -Wl,-search_paths_first -Wl,-headerpad_max_install_names -B /Applications/Xcode.app/Contents/Developer/Toolchains/XcodeDefault.xctoolchain/usr/bin SingleSource/Regression/C/gcc-c-torture/execute/CMakeFiles/GCC-C-execute-930513-1.dir/930513-1.c.o  -o SingleSource/Regression/C/gcc-c-torture/execute/GCC-C-execute-930513-1  -Wl,-no_pie -Wl,-u,_printf_float && :
Undefined symbols for architecture x86_64h:
  "_printf_float", referenced from:
     -u command line option
ld: symbol(s) not found for architecture x86_64h
clang-10: error: linker command failed with exit code 1 (use -v to see invocation)
[6002/7684] : && /Users/buildslave/jenkins/workspace/test-suite-verify-machineinstrs-x86_64h-O3/test-suite-build/tools/timeit --summary SingleSource/Regression/C/gcc-c-torture/execute/GCC-C-execute-921218-1.link.time /Users/buildslave/jenkins/workspace/test-suite-verify-machineinstrs-x86_64h-O3/compiler/bin/clang -B /Applications/Xcode.app/Contents/Developer/Toolchains/XcodeDefault.xctoolchain/usr/bin    -Wno-unused-command-line-argument -mllvm -verify-machineinstrs -O3 -arch x86_64h -isysroot /Applications/Xcode.app/Contents/Developer/Platforms/MacOSX.platform/Developer/SDKs/MacOSX10.14.sdk -Wl,-search_paths_first -Wl,-headerpad_max_install_names -B /Applications/Xcode.app/Contents/Developer/Toolchains/XcodeDefault.xctoolchain/usr/bin SingleSource/Regression/C/gcc-c-torture/execute/CMakeFiles/GCC-C-execute-921218-1.dir/921218-1.c.o  -o SingleSource/Regression/C/gcc-c-torture/execute/GCC-C-execute-921218-1  -Wl,-no_pie && :
[6003/7684] : && /Users/buildslave/jenkins/workspace/test-suite-verify-machineinstrs-x86_64h-O3/test-suite-build/tools/timeit --summary SingleSource/Regression/C/gcc-c-torture/execute/GCC-C-execute-921208-1.link.time /Users/buildslave/jenkins/workspace/test-suite-verify-machineinstrs-x86_64h-O3/compiler/bin/clang -B /Applications/Xcode.app/Contents/Developer/Toolchains/XcodeDefault.xctoolchain/usr/bin    -Wno-unused-command-line-argument -mllvm -verify-machineinstrs -O3 -arch x86_64h -isysroot /Applications/Xcode.app/Contents/Developer/Platforms/MacOSX.platform/Developer/SDKs/MacOSX10.14.sdk -Wl,-search_paths_first -Wl,-headerpad_max_install_names -B /Applications/Xcode.app/Contents/Developer/Toolchains/XcodeDefault.xctoolchain/usr/bin SingleSource/Regression/C/gcc-c-torture/execute/CMakeFiles/GCC-C-execute-921208-1.dir/921208-1.c.o  -o SingleSource/Regression/C/gcc-c-torture/execute/GCC-C-execute-921208-1  -Wl,-no_pie && :
Ninja target: alias-4.c.o
[6231/7684] : && /Users/buildslave/jenkins/workspace/test-suite-verify-machineinstrs-x86_64h-O3/test-suite-build/tools/timeit --summary SingleSource/Regression/C/gcc-c-torture/execute/GCC-C-execute-20081103-1.link.time /Users/buildslave/jenkins/workspace/test-suite-verify-machineinstrs-x86_64h-O3/compiler/bin/clang -B /Applications/Xcode.app/Contents/Developer/Toolchains/XcodeDefault.xctoolchain/usr/bin    -Wno-unused-command-line-argument -mllvm -verify-machineinstrs -O3 -arch x86_64h -isysroot /Applications/Xcode.app/Contents/Developer/Platforms/MacOSX.platform/Developer/SDKs/MacOSX10.14.sdk -Wl,-search_paths_first -Wl,-headerpad_max_install_names -B /Applications/Xcode.app/Contents/Developer/Toolchains/XcodeDefault.xctoolchain/usr/bin SingleSource/Regression/C/gcc-c-torture/execute/CMakeFiles/GCC-C-execute-20081103-1.dir/20081103-1.c.o  -o SingleSource/Regression/C/gcc-c-torture/execute/GCC-C-execute-20081103-1  -Wl,-no_pie && :
[6232/7684] /Users/buildslave/jenkins/workspace/test-suite-verify-machineinstrs-x86_64h-O3/test-suite-build/tools/timeit --summary SingleSource/Regression/C/gcc-c-torture/execute/CMakeFiles/GCC-C-execute-20000801-2.dir/20000801-2.c.o.time /Users/buildslave/jenkins/workspace/test-suite-verify-machineinstrs-x86_64h-O3/compiler/bin/clang -DNDEBUG  -B /Applications/Xcode.app/Contents/Developer/Toolchains/XcodeDefault.xctoolchain/usr/bin    -Wno-unused-command-line-argument -mllvm -verify-machineinstrs -O3 -arch x86_64h -isysroot /Applications/Xcode.app/Contents/Developer/Platforms/MacOSX.platform/Developer/SDKs/MacOSX10.14.sdk   -w -Werror=date-time -w -MD -MT SingleSource/Regression/C/gcc-c-torture/execute/CMakeFiles/GCC-C-execute-20000801-2.dir/20000801-2.c.o -MF SingleSource/Regression/C/gcc-c-torture/execute/CMakeFiles/GCC-C-execute-20000801-2.dir/20000801-2.c.o.d -o SingleSource/Regression/C/gcc-c-torture/execute/CMakeFiles/GCC-C-execute-20000801-2.dir/20000801-2.c.o   -c /Users/buildslave/jenkins/workspace/test-suite-verify-machineinstrs-x86_64h-O3/test-suite/SingleSource/Regression/C/gcc-c-torture/execute/20000801-2.c
[6233/7684] : && /Users/buildslave/jenkins/workspace/test-suite-verify-machineinstrs-x86_64h-O3/test-suite-build/tools/timeit --summary SingleSource/Regression/C/gcc-c-torture/execute/GCC-C-execute-960312-1.link.time /Users/buildslave/jenkins/workspace/test-suite-verify-machineinstrs-x86_64h-O3/compiler/bin/clang -B /Applications/Xcode.app/Contents/Developer/Toolchains/XcodeDefault.xctoolchain/usr/bin    -Wno-unused-command-line-argument -mllvm -verify-machineinstrs -O3 -arch x86_64h -isysroot /Applications/Xcode.app/Contents/Developer/Platforms/MacOSX.platform/Developer/SDKs/MacOSX10.14.sdk -Wl,-search_paths_first -Wl,-headerpad_max_install_names -B /Applications/Xcode.app/Contents/Developer/Toolchains/XcodeDefault.xctoolchain/usr/bin SingleSource/Regression/C/gcc-c-torture/execute/CMakeFiles/GCC-C-execute-960312-1.dir/960312-1.c.o  -o SingleSource/Regression/C/gcc-c-torture/execute/GCC-C-execute-960312-1  -Wl,-no_pie && :
[6234/7684] /Users/buildslave/jenkins/workspace/test-suite-verify-machineinstrs-x86_64h-O3/test-suite-build/tools/timeit --summary SingleSource/Regression/C/gcc-c-torture/execute/CMakeFiles/GCC-C-execute-990531-1.dir/990531-1.c.o.time /Users/buildslave/jenkins/workspace/test-suite-verify-machineinstrs-x86_64h-O3/compiler/bin/clang -DNDEBUG  -B /Applications/Xcode.app/Contents/Developer/Toolchains/XcodeDefault.xctoolchain/usr/bin    -Wno-unused-command-line-argument -mllvm -verify-machineinstrs -O3 -arch x86_64h -isysroot /Applications/Xcode.app/Contents/Developer/Platforms/MacOSX.platform/Developer/SDKs/MacOSX10.14.sdk   -w -Werror=date-time -w -MD -MT SingleSource/Regression/C/gcc-c-torture/execute/CMakeFiles/GCC-C-execute-990531-1.dir/990531-1.c.o -MF SingleSource/Regression/C/gcc-c-torture/execute/CMakeFiles/GCC-C-execute-990531-1.dir/990531-1.c.o.d -o SingleSource/Regression/C/gcc-c-torture/execute/CMakeFiles/GCC-C-execute-990531-1.dir/990531-1.c.o   -c /Users/buildslave/jenkins/workspace/test-suite-verify-machineinstrs-x86_64h-O3/test-suite/SingleSource/Regression/C/gcc-c-torture/execute/990531-1.c
[6235/7684] /Users/buildslave/jenkins/workspace/test-suite-verify-machineinstrs-x86_64h-O3/test-suite-build/tools/timeit --summary SingleSource/Regression/C/gcc-c-torture/execute/CMakeFiles/GCC-C-execute-alias-4.dir/alias-4.c.o.time /Users/buildslave/jenkins/workspace/test-suite-verify-machineinstrs-x86_64h-O3/compiler/bin/clang -DNDEBUG  -B /Applications/Xcode.app/Contents/Developer/Toolchains/XcodeDefault.xctoolchain/usr/bin    -Wno-unused-command-line-argument -mllvm -verify-machineinstrs -O3 -arch x86_64h -isysroot /Applications/Xcode.app/Contents/Developer/Platforms/MacOSX.platform/Developer/SDKs/MacOSX10.14.sdk   -w -Werror=date-time -w -MD -MT SingleSource/Regression/C/gcc-c-torture/execute/CMakeFiles/GCC-C-execute-alias-4.dir/alias-4.c.o -MF SingleSource/Regression/C/gcc-c-torture/execute/CMakeFiles/GCC-C-execute-alias-4.dir/alias-4.c.o.d -o SingleSource/Regression/C/gcc-c-torture/execute/CMakeFiles/GCC-C-execute-alias-4.dir/alias-4.c.o   -c /Users/buildslave/jenkins/workspace/test-suite-verify-machineinstrs-x86_64h-O3/test-suite/SingleSource/Regression/C/gcc-c-torture/execute/alias-4.c
FAILED: SingleSource/Regression/C/gcc-c-torture/execute/CMakeFiles/GCC-C-execute-alias-4.dir/alias-4.c.o 
/Users/buildslave/jenkins/workspace/test-suite-verify-machineinstrs-x86_64h-O3/test-suite-build/tools/timeit --summary SingleSource/Regression/C/gcc-c-torture/execute/CMakeFiles/GCC-C-execute-alias-4.dir/alias-4.c.o.time /Users/buildslave/jenkins/workspace/test-suite-verify-machineinstrs-x86_64h-O3/compiler/bin/clang -DNDEBUG  -B /Applications/Xcode.app/Contents/Developer/Toolchains/XcodeDefault.xctoolchain/usr/bin    -Wno-unused-command-line-argument -mllvm -verify-machineinstrs -O3 -arch x86_64h -isysroot /Applications/Xcode.app/Contents/Developer/Platforms/MacOSX.platform/Developer/SDKs/MacOSX10.14.sdk   -w -Werror=date-time -w -MD -MT SingleSource/Regression/C/gcc-c-torture/execute/CMakeFiles/GCC-C-execute-alias-4.dir/alias-4.c.o -MF SingleSource/Regression/C/gcc-c-torture/execute/CMakeFiles/GCC-C-execute-alias-4.dir/alias-4.c.o.d -o SingleSource/Regression/C/gcc-c-torture/execute/CMakeFiles/GCC-C-execute-alias-4.dir/alias-4.c.o   -c /Users/buildslave/jenkins/workspace/test-suite-verify-machineinstrs-x86_64h-O3/test-suite/SingleSource/Regression/C/gcc-c-torture/execute/alias-4.c
/Users/buildslave/jenkins/workspace/test-suite-verify-machineinstrs-x86_64h-O3/test-suite/SingleSource/Regression/C/gcc-c-torture/execute/alias-4.c:3:30: error: aliases are not supported on darwin
alias-4.c error: aliases are not supported on darwin
[6233/7684] : && /Users/buildslave/jenkins/workspace/test-suite-verify-machineinstrs-x86_64h-O3/test-suite-build/tools/timeit --summary SingleSource/Regression/C/gcc-c-torture/execute/GCC-C-execute-960312-1.link.time /Users/buildslave/jenkins/workspace/test-suite-verify-machineinstrs-x86_64h-O3/compiler/bin/clang -B /Applications/Xcode.app/Contents/Developer/Toolchains/XcodeDefault.xctoolchain/usr/bin    -Wno-unused-command-line-argument -mllvm -verify-machineinstrs -O3 -arch x86_64h -isysroot /Applications/Xcode.app/Contents/Developer/Platforms/MacOSX.platform/Developer/SDKs/MacOSX10.14.sdk -Wl,-search_paths_first -Wl,-headerpad_max_install_names -B /Applications/Xcode.app/Contents/Developer/Toolchains/XcodeDefault.xctoolchain/usr/bin SingleSource/Regression/C/gcc-c-torture/execute/CMakeFiles/GCC-C-execute-960312-1.dir/960312-1.c.o  -o SingleSource/Regression/C/gcc-c-torture/execute/GCC-C-execute-960312-1  -Wl,-no_pie && :
[6234/7684] /Users/buildslave/jenkins/workspace/test-suite-verify-machineinstrs-x86_64h-O3/test-suite-build/tools/timeit --summary SingleSource/Regression/C/gcc-c-torture/execute/CMakeFiles/GCC-C-execute-990531-1.dir/990531-1.c.o.time /Users/buildslave/jenkins/workspace/test-suite-verify-machineinstrs-x86_64h-O3/compiler/bin/clang -DNDEBUG  -B /Applications/Xcode.app/Contents/Developer/Toolchains/XcodeDefault.xctoolchain/usr/bin    -Wno-unused-command-line-argument -mllvm -verify-machineinstrs -O3 -arch x86_64h -isysroot /Applications/Xcode.app/Contents/Developer/Platforms/MacOSX.platform/Developer/SDKs/MacOSX10.14.sdk   -w -Werror=date-time -w -MD -MT SingleSource/Regression/C/gcc-c-torture/execute/CMakeFiles/GCC-C-execute-990531-1.dir/990531-1.c.o -MF SingleSource/Regression/C/gcc-c-torture/execute/CMakeFiles/GCC-C-execute-990531-1.dir/990531-1.c.o.d -o SingleSource/Regression/C/gcc-c-torture/execute/CMakeFiles/GCC-C-execute-990531-1.dir/990531-1.c.o   -c /Users/buildslave/jenkins/workspace/test-suite-verify-machineinstrs-x86_64h-O3/test-suite/SingleSource/Regression/C/gcc-c-torture/execute/990531-1.c
[6235/7684] /Users/buildslave/jenkins/workspace/test-suite-verify-machineinstrs-x86_64h-O3/test-suite-build/tools/timeit --summary SingleSource/Regression/C/gcc-c-torture/execute/CMakeFiles/GCC-C-execute-alias-4.dir/alias-4.c.o.time /Users/buildslave/jenkins/workspace/test-suite-verify-machineinstrs-x86_64h-O3/compiler/bin/clang -DNDEBUG  -B /Applications/Xcode.app/Contents/Developer/Toolchains/XcodeDefault.xctoolchain/usr/bin    -Wno-unused-command-line-argument -mllvm -verify-machineinstrs -O3 -arch x86_64h -isysroot /Applications/Xcode.app/Contents/Developer/Platforms/MacOSX.platform/Developer/SDKs/MacOSX10.14.sdk   -w -Werror=date-time -w -MD -MT SingleSource/Regression/C/gcc-c-torture/execute/CMakeFiles/GCC-C-execute-alias-4.dir/alias-4.c.o -MF SingleSource/Regression/C/gcc-c-torture/execute/CMakeFiles/GCC-C-execute-alias-4.dir/alias-4.c.o.d -o SingleSource/Regression/C/gcc-c-torture/execute/CMakeFiles/GCC-C-execute-alias-4.dir/alias-4.c.o   -c /Users/buildslave/jenkins/workspace/test-suite-verify-machineinstrs-x86_64h-O3/test-suite/SingleSource/Regression/C/gcc-c-torture/execute/alias-4.c
FAILED: SingleSource/Regression/C/gcc-c-torture/execute/CMakeFiles/GCC-C-execute-alias-4.dir/alias-4.c.o 
/Users/buildslave/jenkins/workspace/test-suite-verify-machineinstrs-x86_64h-O3/test-suite-build/tools/timeit --summary SingleSource/Regression/C/gcc-c-torture/execute/CMakeFiles/GCC-C-execute-alias-4.dir/alias-4.c.o.time /Users/buildslave/jenkins/workspace/test-suite-verify-machineinstrs-x86_64h-O3/compiler/bin/clang -DNDEBUG  -B /Applications/Xcode.app/Contents/Developer/Toolchains/XcodeDefault.xctoolchain/usr/bin    -Wno-unused-command-line-argument -mllvm -verify-machineinstrs -O3 -arch x86_64h -isysroot /Applications/Xcode.app/Contents/Developer/Platforms/MacOSX.platform/Developer/SDKs/MacOSX10.14.sdk   -w -Werror=date-time -w -MD -MT SingleSource/Regression/C/gcc-c-torture/execute/CMakeFiles/GCC-C-execute-alias-4.dir/alias-4.c.o -MF SingleSource/Regression/C/gcc-c-torture/execute/CMakeFiles/GCC-C-execute-alias-4.dir/alias-4.c.o.d -o SingleSource/Regression/C/gcc-c-torture/execute/CMakeFiles/GCC-C-execute-alias-4.dir/alias-4.c.o   -c /Users/buildslave/jenkins/workspace/test-suite-verify-machineinstrs-x86_64h-O3/test-suite/SingleSource/Regression/C/gcc-c-torture/execute/alias-4.c
/Users/buildslave/jenkins/workspace/test-suite-verify-machineinstrs-x86_64h-O3/test-suite/SingleSource/Regression/C/gcc-c-torture/execute/alias-4.c:3:30: error: aliases are not supported on darwin
extern int b __attribute__ ((alias ("a")));
                             ^
alias-4.c error: aliases are not supported on darwin
FAILED: SingleSource/Regression/C/gcc-c-torture/execute/CMakeFiles/GCC-C-execute-alias-4.dir/alias-4.c.o 
/Users/buildslave/jenkins/workspace/test-suite-verify-machineinstrs-x86_64h-O3/test-suite-build/tools/timeit --summary SingleSource/Regression/C/gcc-c-torture/execute/CMakeFiles/GCC-C-execute-alias-4.dir/alias-4.c.o.time /Users/buildslave/jenkins/workspace/test-suite-verify-machineinstrs-x86_64h-O3/compiler/bin/clang -DNDEBUG  -B /Applications/Xcode.app/Contents/Developer/Toolchains/XcodeDefault.xctoolchain/usr/bin    -Wno-unused-command-line-argument -mllvm -verify-machineinstrs -O3 -arch x86_64h -isysroot /Applications/Xcode.app/Contents/Developer/Platforms/MacOSX.platform/Developer/SDKs/MacOSX10.14.sdk   -w -Werror=date-time -w -MD -MT SingleSource/Regression/C/gcc-c-torture/execute/CMakeFiles/GCC-C-execute-alias-4.dir/alias-4.c.o -MF SingleSource/Regression/C/gcc-c-torture/execute/CMakeFiles/GCC-C-execute-alias-4.dir/alias-4.c.o.d -o SingleSource/Regression/C/gcc-c-torture/execute/CMakeFiles/GCC-C-execute-alias-4.dir/alias-4.c.o   -c /Users/buildslave/jenkins/workspace/test-suite-verify-machineinstrs-x86_64h-O3/test-suite/SingleSource/Regression/C/gcc-c-torture/execute/alias-4.c
/Users/buildslave/jenkins/workspace/test-suite-verify-machineinstrs-x86_64h-O3/test-suite/SingleSource/Regression/C/gcc-c-torture/execute/alias-4.c:3:30: error: aliases are not supported on darwin
extern int b __attribute__ ((alias ("a")));
                             ^
/Users/buildslave/jenkins/workspace/test-suite-verify-machineinstrs-x86_64h-O3/test-suite/SingleSource/Regression/C/gcc-c-torture/execute/alias-4.c:5:30: error: aliases are not supported on darwin
extern int d __attribute__ ((alias ("c")));
                             ^
Ninja target: GCC-C-execute-920501-8
[7245/7684] : && /Users/buildslave/jenkins/workspace/test-suite-verify-machineinstrs-x86_64h-O3/test-suite-build/tools/timeit --summary SingleSource/Regression/C/gcc-c-torture/execute/GCC-C-execute-20020307-1.link.time /Users/buildslave/jenkins/workspace/test-suite-verify-machineinstrs-x86_64h-O3/compiler/bin/clang -B /Applications/Xcode.app/Contents/Developer/Toolchains/XcodeDefault.xctoolchain/usr/bin    -Wno-unused-command-line-argument -mllvm -verify-machineinstrs -O3 -arch x86_64h -isysroot /Applications/Xcode.app/Contents/Developer/Platforms/MacOSX.platform/Developer/SDKs/MacOSX10.14.sdk -Wl,-search_paths_first -Wl,-headerpad_max_install_names -B /Applications/Xcode.app/Contents/Developer/Toolchains/XcodeDefault.xctoolchain/usr/bin SingleSource/Regression/C/gcc-c-torture/execute/CMakeFiles/GCC-C-execute-20020307-1.dir/20020307-1.c.o  -o SingleSource/Regression/C/gcc-c-torture/execute/GCC-C-execute-20020307-1  -Wl,-no_pie && :
[7246/7684] : && /Users/buildslave/jenkins/workspace/test-suite-verify-machineinstrs-x86_64h-O3/test-suite-build/tools/timeit --summary SingleSource/Regression/C/gcc-c-torture/execute/GCC-C-execute-20071213-1.link.time /Users/buildslave/jenkins/workspace/test-suite-verify-machineinstrs-x86_64h-O3/compiler/bin/clang -B /Applications/Xcode.app/Contents/Developer/Toolchains/XcodeDefault.xctoolchain/usr/bin    -Wno-unused-command-line-argument -mllvm -verify-machineinstrs -O3 -arch x86_64h -isysroot /Applications/Xcode.app/Contents/Developer/Platforms/MacOSX.platform/Developer/SDKs/MacOSX10.14.sdk -Wl,-search_paths_first -Wl,-headerpad_max_install_names -B /Applications/Xcode.app/Contents/Developer/Toolchains/XcodeDefault.xctoolchain/usr/bin SingleSource/Regression/C/gcc-c-torture/execute/CMakeFiles/GCC-C-execute-20071213-1.dir/20071213-1.c.o  -o SingleSource/Regression/C/gcc-c-torture/execute/GCC-C-execute-20071213-1  -Wl,-no_pie && :
[7247/7684] : && /Users/buildslave/jenkins/workspace/test-suite-verify-machineinstrs-x86_64h-O3/test-suite-build/tools/timeit --summary SingleSource/Regression/C/gcc-c-torture/execute/GCC-C-execute-20010221-1.link.time /Users/buildslave/jenkins/workspace/test-suite-verify-machineinstrs-x86_64h-O3/compiler/bin/clang -B /Applications/Xcode.app/Contents/Developer/Toolchains/XcodeDefault.xctoolchain/usr/bin    -Wno-unused-command-line-argument -mllvm -verify-machineinstrs -O3 -arch x86_64h -isysroot /Applications/Xcode.app/Contents/Developer/Platforms/MacOSX.platform/Developer/SDKs/MacOSX10.14.sdk -Wl,-search_paths_first -Wl,-headerpad_max_install_names -B /Applications/Xcode.app/Contents/Developer/Toolchains/XcodeDefault.xctoolchain/usr/bin SingleSource/Regression/C/gcc-c-torture/execute/CMakeFiles/GCC-C-execute-20010221-1.dir/20010221-1.c.o  -o SingleSource/Regression/C/gcc-c-torture/execute/GCC-C-execute-20010221-1  -Wl,-no_pie && :
[7248/7684] /Users/buildslave/jenkins/workspace/test-suite-verify-machineinstrs-x86_64h-O3/test-suite-build/tools/timeit --summary SingleSource/Regression/C/gcc-c-torture/execute/CMakeFiles/GCC-C-execute-920501-8.dir/920501-8.c.o.time /Users/buildslave/jenkins/workspace/test-suite-verify-machineinstrs-x86_64h-O3/compiler/bin/clang -DNDEBUG  -B /Applications/Xcode.app/Contents/Developer/Toolchains/XcodeDefault.xctoolchain/usr/bin    -Wno-unused-command-line-argument -mllvm -verify-machineinstrs -O3 -arch x86_64h -isysroot /Applications/Xcode.app/Contents/Developer/Platforms/MacOSX.platform/Developer/SDKs/MacOSX10.14.sdk   -w -Werror=date-time -w -MD -MT SingleSource/Regression/C/gcc-c-torture/execute/CMakeFiles/GCC-C-execute-920501-8.dir/920501-8.c.o -MF SingleSource/Regression/C/gcc-c-torture/execute/CMakeFiles/GCC-C-execute-920501-8.dir/920501-8.c.o.d -o SingleSource/Regression/C/gcc-c-torture/execute/CMakeFiles/GCC-C-execute-920501-8.dir/920501-8.c.o   -c /Users/buildslave/jenkins/workspace/test-suite-verify-machineinstrs-x86_64h-O3/test-suite/SingleSource/Regression/C/gcc-c-torture/execute/920501-8.c
[7249/7684] : && /Users/buildslave/jenkins/workspace/test-suite-verify-machineinstrs-x86_64h-O3/test-suite-build/tools/timeit --summary SingleSource/Regression/C/gcc-c-torture/execute/GCC-C-execute-920501-8.link.time /Users/buildslave/jenkins/workspace/test-suite-verify-machineinstrs-x86_64h-O3/compiler/bin/clang -B /Applications/Xcode.app/Contents/Developer/Toolchains/XcodeDefault.xctoolchain/usr/bin    -Wno-unused-command-line-argument -mllvm -verify-machineinstrs -O3 -arch x86_64h -isysroot /Applications/Xcode.app/Contents/Developer/Platforms/MacOSX.platform/Developer/SDKs/MacOSX10.14.sdk -Wl,-search_paths_first -Wl,-headerpad_max_install_names -B /Applications/Xcode.app/Contents/Developer/Toolchains/XcodeDefault.xctoolchain/usr/bin SingleSource/Regression/C/gcc-c-torture/execute/CMakeFiles/GCC-C-execute-920501-8.dir/920501-8.c.o  -o SingleSource/Regression/C/gcc-c-torture/execute/GCC-C-execute-920501-8  -Wl,-no_pie -Wl,-u,_printf_float && :
FAILED: SingleSource/Regression/C/gcc-c-torture/execute/GCC-C-execute-920501-8 
: && /Users/buildslave/jenkins/workspace/test-suite-verify-machineinstrs-x86_64h-O3/test-suite-build/tools/timeit --summary SingleSource/Regression/C/gcc-c-torture/execute/GCC-C-execute-920501-8.link.time /Users/buildslave/jenkins/workspace/test-suite-verify-machineinstrs-x86_64h-O3/compiler/bin/clang -B /Applications/Xcode.app/Contents/Developer/Toolchains/XcodeDefault.xctoolchain/usr/bin    -Wno-unused-command-line-argument -mllvm -verify-machineinstrs -O3 -arch x86_64h -isysroot /Applications/Xcode.app/Contents/Developer/Platforms/MacOSX.platform/Developer/SDKs/MacOSX10.14.sdk -Wl,-search_paths_first -Wl,-headerpad_max_install_names -B /Applications/Xcode.app/Contents/Developer/Toolchains/XcodeDefault.xctoolchain/usr/bin SingleSource/Regression/C/gcc-c-torture/execute/CMakeFiles/GCC-C-execute-920501-8.dir/920501-8.c.o  -o SingleSource/Regression/C/gcc-c-torture/execute/GCC-C-execute-920501-8  -Wl,-no_pie -Wl,-u,_printf_float && :
Undefined symbols for architecture x86_64h:
link error
: && /Users/buildslave/jenkins/workspace/test-suite-verify-machineinstrs-x86_64h-O3/test-suite-build/tools/timeit --summary SingleSource/Regression/C/gcc-c-torture/execute/GCC-C-execute-920501-8.link.time /Users/buildslave/jenkins/workspace/test-suite-verify-machineinstrs-x86_64h-O3/compiler/bin/clang -B /Applications/Xcode.app/Contents/Developer/Toolchains/XcodeDefault.xctoolchain/usr/bin    -Wno-unused-command-line-argument -mllvm -verify-machineinstrs -O3 -arch x86_64h -isysroot /Applications/Xcode.app/Contents/Developer/Platforms/MacOSX.platform/Developer/SDKs/MacOSX10.14.sdk -Wl,-search_paths_first -Wl,-headerpad_max_install_names -B /Applications/Xcode.app/Contents/Developer/Toolchains/XcodeDefault.xctoolchain/usr/bin SingleSource/Regression/C/gcc-c-torture/execute/CMakeFiles/GCC-C-execute-920501-8.dir/920501-8.c.o  -o SingleSource/Regression/C/gcc-c-torture/execute/GCC-C-execute-920501-8  -Wl,-no_pie -Wl,-u,_printf_float && :
Undefined symbols for architecture x86_64h:
  "_printf_float", referenced from:
     -u command line option
ld: symbol(s) not found for architecture x86_64h
clang-10: error: linker command failed with exit code 1 (use -v to see invocation)
[7250/7684] /Users/buildslave/jenkins/workspace/test-suite-verify-machineinstrs-x86_64h-O3/test-suite-build/tools/timeit --summary SingleSource/Regression/C/gcc-c-torture/execute/CMakeFiles/GCC-C-execute-pr84521.dir/pr84521.c.o.time /Users/buildslave/jenkins/workspace/test-suite-verify-machineinstrs-x86_64h-O3/compiler/bin/clang -DNDEBUG  -B /Applications/Xcode.app/Contents/Developer/Toolchains/XcodeDefault.xctoolchain/usr/bin    -Wno-unused-command-line-argument -mllvm -verify-machineinstrs -O3 -arch x86_64h -isysroot /Applications/Xcode.app/Contents/Developer/Platforms/MacOSX.platform/Developer/SDKs/MacOSX10.14.sdk   -w -Werror=date-time -w -fomit-frame-pointer -fno-inline -MD -MT SingleSource/Regression/C/gcc-c-torture/execute/CMakeFiles/GCC-C-execute-pr84521.dir/pr84521.c.o -MF SingleSource/Regression/C/gcc-c-torture/execute/CMakeFiles/GCC-C-execute-pr84521.dir/pr84521.c.o.d -o SingleSource/Regression/C/gcc-c-torture/execute/CMakeFiles/GCC-C-execute-pr84521.dir/pr84521.c.o   -c /Users/buildslave/jenkins/workspace/test-suite-verify-machineinstrs-x86_64h-O3/test-suite/SingleSource/Regression/C/gcc-c-torture/execute/pr84521.c
[7251/7684] /Users/buildslave/jenkins/workspace/test-suite-verify-machineinstrs-x86_64h-O3/test-suite-build/tools/timeit --summary SingleSource/Regression/C/gcc-c-torture/execute/CMakeFiles/GCC-C-execute-930208-1.dir/930208-1.c.o.time /Users/buildslave/jenkins/workspace/test-suite-verify-machineinstrs-x86_64h-O3/compiler/bin/clang -DNDEBUG  -B /Applications/Xcode.app/Contents/Developer/Toolchains/XcodeDefault.xctoolchain/usr/bin    -Wno-unused-command-line-argument -mllvm -verify-machineinstrs -O3 -arch x86_64h -isysroot /Applications/Xcode.app/Contents/Developer/Platforms/MacOSX.platform/Developer/SDKs/MacOSX10.14.sdk   -w -Werror=date-time -w -MD -MT SingleSource/Regression/C/gcc-c-torture/execute/CMakeFiles/GCC-C-execute-930208-1.dir/930208-1.c.o -MF SingleSource/Regression/C/gcc-c-torture/execute/CMakeFiles/GCC-C-execute-930208-1.dir/930208-1.c.o.d -o SingleSource/Regression/C/gcc-c-torture/execute/CMakeFiles/GCC-C-execute-930208-1.dir/930208-1.c.o   -c /Users/buildslave/jenkins/workspace/test-suite-verify-machineinstrs-x86_64h-O3/test-suite/SingleSource/Regression/C/gcc-c-torture/execute/930208-1.c

Build Log

Changes
  1. AMDGPU: Fix SMEM WAR hazard for gfx10 readlane (detail)
  2. [examples] Add an example of how to use JITLink and small-code-model (detail)
  3. AMDGPU: Relax 32-bit SGPR register class (detail)
  4. [examples] Fix some comments in the LLJITWithJITLink example (detail)
  5. [lldb][NFC] Remove wrong tests in TestCallOverriddenMethod (detail)
  6. [CVP] After proving that @llvm.with.overflow()/@llvm.sat() don't (detail)
  7. [libunwind][Android] Fix findUnwindSections for ARM EHABI Bionic (detail)
  8. scudo: Update TLS_SLOT_SANITIZER value. (detail)
  9. [GISel][CallLowering] Make isIncomingArgumentHandler a pure virtual (detail)
  10. [analyzer] Fix hidden node traversal in exploded graph dumps. (detail)
  11. [analyzer] exploded-graph-rewriter: Fix dump for state 0. (detail)
  12. [analyzer] Drop the logic for collapsing the state if it's same as in (detail)
  13. [analyzer] Fix FieldRegion dumps. (detail)
  14. [analyzer] exploded-graph-rewriter: Rename Environment to Expressions. (detail)
  15. [WebAssembly] Allow multivalue signatures in object files (detail)

Started by upstream project relay-test-suite-verify-machineinstrs build number 6483
originally caused by:

This run spent:

  • 7.7 sec waiting;
  • 2 hr 4 min build duration;
  • 2 hr 4 min total from scheduled to completion.
Revision: 393d0f799f8828e9d8002766a9e9db21797451df
  • detached

Identified problems

Compile Error

This build failed because of a compile error. Below is a list of all errors in the build log:
Indication 1

Link error

A link command has failed:
Indication 2

Ninja target failed

Below is a link to the first failed ninja target.
Indication 3