FailedConsole Output

Skipping 14,631 KB.. Full Log
g/TestThreadStepping.py (570 of 2172)
PASS: lldb-api :: lang/c/set_values/TestSetValues.py (571 of 2172)
PASS: lldb-api :: lang/c/register_variables/TestRegisterVariables.py (572 of 2172)
UNSUPPORTED: lldb-api :: lang/c/typedef/Testtypedef.py (573 of 2172)
PASS: lldb-api :: lang/c/stepping/TestStepAndBreakpoints.py (574 of 2172)
PASS: lldb-api :: lang/cpp/alignas_base_class/TestAlignAsBaseClass.py (575 of 2172)
PASS: lldb-api :: lang/c/strings/TestCStrings.py (576 of 2172)
PASS: lldb-api :: lang/cpp/accelerator-table/TestCPPAccelerator.py (577 of 2172)
PASS: lldb-api :: lang/c/struct_types/TestStructTypes.py (578 of 2172)
PASS: lldb-api :: lang/c/step_over_no_deadlock/TestStepOverDoesntBlock.py (579 of 2172)
PASS: lldb-api :: lang/c/bitfields/TestBitfields.py (580 of 2172)
PASS: lldb-api :: lang/cpp/breakpoint-commands/TestCPPBreakpointCommands.py (581 of 2172)
PASS: lldb-api :: lang/cpp/breakpoint_in_member_func_w_non_primitive_params/TestBreakpointInMemberFuncWNonPrimitiveParams.py (582 of 2172)
PASS: lldb-api :: lang/c/tls_globals/TestTlsGlobals.py (583 of 2172)
PASS: lldb-api :: lang/c/unions/TestUnionMembers.py (584 of 2172)
PASS: lldb-api :: lang/cpp/auto/TestCPPAuto.py (585 of 2172)
PASS: lldb-api :: lang/cpp/bitfields/TestCppBitfields.py (586 of 2172)
PASS: lldb-api :: lang/cpp/bool/TestCPPBool.py (587 of 2172)
PASS: lldb-api :: lang/cpp/call-function/TestCallCPPFunction.py (588 of 2172)
PASS: lldb-api :: lang/cpp/chained-calls/TestCppChainedCalls.py (589 of 2172)
PASS: lldb-api :: lang/c/vla/TestVLA.py (590 of 2172)
PASS: lldb-api :: lang/cpp/char8_t/TestCxxChar8_t.py (591 of 2172)
PASS: lldb-api :: lang/cpp/class-template-parameter-pack/TestClassTemplateParameterPack.py (592 of 2172)
PASS: lldb-api :: lang/cpp/dynamic-value-same-basename/TestDynamicValueSameBase.py (593 of 2172)
PASS: lldb-api :: lang/cpp/covariant-return-types/TestCovariantReturnTypes.py (594 of 2172)
PASS: lldb-api :: lang/cpp/elaborated-types/TestElaboratedTypes.py (595 of 2172)
PASS: lldb-api :: lang/c/shared_lib_stripped_symbols/TestSharedLibStrippedSymbols.py (596 of 2172)
PASS: lldb-api :: lang/cpp/const_this/TestConstThis.py (597 of 2172)
PASS: lldb-api :: lang/cpp/enum_types/TestCPP11EnumTypes.py (598 of 2172)
PASS: lldb-api :: lang/cpp/diamond/TestDiamond.py (599 of 2172)
UNSUPPORTED: lldb-api :: lang/cpp/function-template-parameter-pack/TestFunctionTemplateParameterPack.py (600 of 2172)
PASS: lldb-api :: lang/c/step-target/TestStepTarget.py (601 of 2172)
PASS: lldb-api :: lang/cpp/dynamic-value/TestCppValueCast.py (602 of 2172)
PASS: lldb-api :: lang/cpp/class_types/TestClassTypesDisassembly.py (603 of 2172)
PASS: lldb-api :: lang/cpp/dynamic-value/TestDynamicValue.py (604 of 2172)
PASS: lldb-api :: lang/cpp/class_static/TestStaticVariables.py (605 of 2172)
PASS: lldb-api :: lang/cpp/char1632_t/TestChar1632T.py (606 of 2172)
PASS: lldb-api :: lang/cpp/exceptions/TestCPPExceptionBreakpoints.py (607 of 2172)
PASS: lldb-api :: lang/cpp/frame-var-anon-unions/TestFrameVariableAnonymousUnions.py (608 of 2172)
PASS: lldb-api :: lang/cpp/extern_c/TestExternCSymbols.py (609 of 2172)
PASS: lldb-api :: lang/cpp/gmodules/TestWithModuleDebugging.py (610 of 2172)
PASS: lldb-api :: lang/cpp/function_refs/TestFunctionRefs.py (611 of 2172)
PASS: lldb-api :: lang/cpp/limit-debug-info/TestWithLimitDebugInfo.py (612 of 2172)
PASS: lldb-api :: lang/c/anonymous/TestAnonymous.py (613 of 2172)
PASS: lldb-api :: lang/cpp/gmodules-templates/TestGModules.py (614 of 2172)
PASS: lldb-api :: lang/cpp/constructors/TestCppConstructors.py (615 of 2172)
PASS: lldb-api :: lang/cpp/function-qualifiers/TestCppFunctionQualifiers.py (616 of 2172)
PASS: lldb-api :: lang/cpp/global_variables/TestCPPGlobalVariables.py (617 of 2172)
PASS: lldb-api :: lang/c/shared_lib/TestSharedLib.py (618 of 2172)
PASS: lldb-api :: lang/cpp/llvm-style/TestLLVMStyle.py (619 of 2172)
PASS: lldb-api :: lang/cpp/lambdas/TestLambdas.py (620 of 2172)
PASS: lldb-api :: lang/cpp/offsetof/TestOffsetofCpp.py (621 of 2172)
PASS: lldb-api :: lang/cpp/inlines/TestInlines.py (622 of 2172)
PASS: lldb-api :: lang/cpp/class_types/TestClassTypes.py (623 of 2172)
PASS: lldb-api :: lang/cpp/multiple-inheritance/TestCppMultipleInheritance.py (624 of 2172)
PASS: lldb-api :: lang/cpp/namespace_conflicts/TestNamespaceConflicts.py (625 of 2172)
PASS: lldb-api :: lang/cpp/nested-class-other-compilation-unit/TestNestedClassWithParentInAnotherCU.py (626 of 2172)
PASS: lldb-api :: lang/cpp/global_operators/TestCppGlobalOperators.py (627 of 2172)
PASS: lldb-api :: lang/cpp/nsimport/TestCppNsImport.py (628 of 2172)
UNSUPPORTED: lldb-api :: lang/cpp/printf/TestPrintf.py (629 of 2172)
PASS: lldb-api :: lang/cpp/operator-overload/TestOperatorOverload.py (630 of 2172)
PASS: lldb-api :: lang/cpp/modules-import/TestCXXModulesImport.py (631 of 2172)
PASS: lldb-api :: lang/cpp/subst_template_type_param/TestSubstTemplateTypeParam.py (632 of 2172)
PASS: lldb-api :: lang/cpp/signed_types/TestSignedTypes.py (633 of 2172)
PASS: lldb-api :: lang/cpp/overloaded-functions/TestOverloadedFunctions.py (634 of 2172)
PASS: lldb-api :: lang/cpp/member-and-local-vars-with-same-name/TestMembersAndLocalsWithSameName.py (635 of 2172)
PASS: lldb-api :: lang/cpp/incomplete-types/TestCppIncompleteTypes.py (636 of 2172)
PASS: lldb-api :: lang/cpp/namespace_definitions/TestNamespaceDefinitions.py (637 of 2172)
PASS: lldb-api :: lang/cpp/rvalue-references/TestRvalueReferences.py (638 of 2172)
PASS: lldb-api :: lang/cpp/template-arguments/TestCppTemplateArguments.py (639 of 2172)
PASS: lldb-api :: lang/cpp/scope/TestCppScope.py (640 of 2172)
PASS: lldb-api :: lang/cpp/operators/TestCppOperators.py (641 of 2172)
PASS: lldb-api :: lang/cpp/std-function-step-into-callable/TestStdFunctionStepIntoCallable.py (642 of 2172)
UNSUPPORTED: lldb-api :: lang/cpp/static_members/TestCPPStaticMembers.py (643 of 2172)
PASS: lldb-api :: lang/cpp/static_methods/TestCPPStaticMethods.py (644 of 2172)
PASS: lldb-api :: lang/cpp/typeof/TestTypeOfDeclTypeExpr.py (645 of 2172)
PASS: lldb-api :: lang/cpp/this_class_type_mixing/TestThisClassTypeMixing.py (646 of 2172)
PASS: lldb-api :: lang/cpp/symbols/TestSymbols.py (647 of 2172)
PASS: lldb-api :: lang/cpp/trivial_abi/TestTrivialABI.py (648 of 2172)
PASS: lldb-api :: lang/cpp/template-specialization-type/TestTemplateSpecializationType.py (649 of 2172)
PASS: lldb-api :: lang/cpp/this/TestCPPThis.py (650 of 2172)
PASS: lldb-api :: lang/cpp/namespace/TestNamespace.py (651 of 2172)
PASS: lldb-api :: lang/cpp/unsigned_types/TestUnsignedTypes.py (652 of 2172)
PASS: lldb-api :: lang/cpp/stl/TestSTL.py (653 of 2172)
PASS: lldb-api :: lang/cpp/type_lookup/TestCppTypeLookup.py (654 of 2172)
PASS: lldb-api :: lang/cpp/typedef/TestCppTypedef.py (655 of 2172)
PASS: lldb-api :: lang/cpp/stl/TestStdCXXDisassembly.py (656 of 2172)
PASS: lldb-api :: lang/cpp/virtual-overload/TestVirtualOverload.py (657 of 2172)
PASS: lldb-api :: lang/cpp/thread_local/TestThreadLocal.py (658 of 2172)
PASS: lldb-api :: lang/cpp/template-function/TestTemplateFunctions.py (659 of 2172)
PASS: lldb-api :: lang/cpp/unique-types/TestUniqueTypes.py (660 of 2172)
PASS: lldb-api :: lang/cpp/wchar_t/TestCxxWCharT.py (661 of 2172)
PASS: lldb-api :: lang/cpp/unicode-literals/TestUnicodeLiterals.py (662 of 2172)
PASS: lldb-api :: lang/mixed/TestMixedLanguages.py (663 of 2172)
PASS: lldb-api :: lang/objc/direct-dispatch-step/TestObjCDirectDispatchStepping.py (664 of 2172)
PASS: lldb-api :: lang/cpp/template/TestTemplateArgs.py (665 of 2172)
PASS: lldb-api :: lang/objc/foundation/TestObjCMethods2.py (666 of 2172)
PASS: lldb-api :: lang/objc/bitfield_ivars/TestBitfieldIvars.py (667 of 2172)
PASS: lldb-api :: lang/objc/foundation/TestConstStrings.py (668 of 2172)
PASS: lldb-api :: lang/cpp/virtual-functions/TestCppVirtualFunctions.py (669 of 2172)
PASS: lldb-api :: lang/objc/blocks/TestObjCIvarsInBlocks.py (670 of 2172)
PASS: lldb-api :: lang/objc/foundation/TestObjectDescriptionAPI.py (671 of 2172)
PASS: lldb-api :: lang/objc/foundation/TestObjCMethodsNSArray.py (672 of 2172)
PASS: lldb-api :: lang/objc/ivar-IMP/TestObjCiVarIMP.py (673 of 2172)
PASS: lldb-api :: lang/objc/modules-cache/TestClangModulesCache.py (674 of 2172)
PASS: lldb-api :: lang/objc/global_ptrs/TestGlobalObjects.py (675 of 2172)
PASS: lldb-api :: lang/objc/modules-hash-mismatch/TestClangModulesHashMismatch.py (676 of 2172)
PASS: lldb-api :: lang/objc/foundation/TestSymbolTable.py (677 of 2172)
PASS: lldb-api :: lang/objc/modules-compile-error/TestModulesCompileError.py (678 of 2172)
PASS: lldb-api :: lang/objc/modules-auto-import/TestModulesAutoImport.py (679 of 2172)
PASS: lldb-api :: lang/objc/foundation/TestRuntimeTypes.py (680 of 2172)
PASS: lldb-api :: lang/objc/forward-decl/TestForwardDecl.py (681 of 2172)
PASS: lldb-api :: lang/objc/conflicting-definition/TestConflictingDefinition.py (682 of 2172)
PASS: lldb-api :: lang/objc/modules-incomplete/TestIncompleteModules.py (683 of 2172)
PASS: lldb-api :: lang/objc/modules-app-update/TestClangModulesAppUpdate.py (684 of 2172)
PASS: lldb-api :: lang/objc/modules-update/TestClangModulesUpdate.py (685 of 2172)
PASS: lldb-api :: lang/objc/modules-non-objc-target/TestObjCModulesNonObjCTarget.py (686 of 2172)
PASS: lldb-api :: lang/objc/objc-builtin-types/TestObjCBuiltinTypes.py (687 of 2172)
PASS: lldb-api :: lang/objc/modules-inline-functions/TestModulesInlineFunctions.py (688 of 2172)
PASS: lldb-api :: lang/cpp/namespace/TestNamespaceLookup.py (689 of 2172)
PASS: lldb-api :: lang/objc/objc-checker/TestObjCCheckers.py (690 of 2172)
PASS: lldb-api :: lang/objc/objc++/TestObjCXX.py (691 of 2172)
PASS: lldb-api :: lang/objc/objc-baseclass-sbtype/TestObjCBaseClassSBType.py (692 of 2172)
PASS: lldb-api :: lang/objc/objc-ivar-stripped/TestObjCIvarStripped.py (693 of 2172)
PASS: lldb-api :: lang/objc/foundation/TestObjCMethodsNSError.py (694 of 2172)
PASS: lldb-api :: lang/objc/foundation/TestObjCMethodsString.py (695 of 2172)
PASS: lldb-api :: lang/objc/objc-class-method/TestObjCClassMethod.py (696 of 2172)
PASS: lldb-api :: lang/objc/objc-dyn-sbtype/TestObjCDynamicSBType.py (697 of 2172)
UNSUPPORTED: lldb-api :: lang/objc/objc-dynamic-value/TestObjCDynamicValue.py (698 of 2172)
PASS: lldb-api :: lang/objc/modules/TestObjCModules.py (699 of 2172)
PASS: lldb-api :: lang/objc/objc-foundation-dictionary-empty/TestNSDictionary0.py (700 of 2172)
PASS: lldb-api :: lang/objc/objc-ivar-protocols/TestIvarProtocols.py (701 of 2172)
PASS: lldb-api :: lang/objc/objc-static-method-stripped/TestObjCStaticMethodStripped.py (702 of 2172)
PASS: lldb-api :: lang/objc/objc-ivar-offsets/TestObjCIvarOffsets.py (703 of 2172)
PASS: lldb-api :: lang/objc/objc-runtime-ivars/TestRuntimeIvars.py (704 of 2172)
PASS: lldb-api :: lang/objc/objc-property/TestObjCProperty.py (705 of 2172)
PASS: lldb-api :: lang/objc/objc-static-method/TestObjCStaticMethod.py (706 of 2172)
PASS: lldb-api :: lang/objc/objc-stepping/TestObjCStepping.py (707 of 2172)
PASS: lldb-api :: lang/objc/objc-struct-argument/TestObjCStructArgument.py (708 of 2172)
PASS: lldb-api :: lang/objc/objc-struct-return/TestObjCStructReturn.py (709 of 2172)
PASS: lldb-api :: lang/objc/objc-optimized/TestObjcOptimized.py (710 of 2172)
UNSUPPORTED: lldb-api :: lang/objc/rdar-12408181/TestRdar12408181.py (711 of 2172)
PASS: lldb-api :: lang/objc/objc-super/TestObjCSuper.py (712 of 2172)
PASS: lldb-api :: lang/objc/objc_direct-methods/TestObjCDirectMethods.py (713 of 2172)
PASS: lldb-api :: lang/objc/exceptions/TestObjCExceptions.py (714 of 2172)
PASS: lldb-api :: lang/objc/orderedset/TestOrderedSet.py (715 of 2172)
PASS: lldb-api :: lang/objc/ptr_refs/TestPtrRefsObjC.py (716 of 2172)
PASS: lldb-api :: lang/objc/rdar-10967107/TestRdar10967107.py (717 of 2172)
PASS: lldb-api :: lang/objc/print-obj/TestPrintObj.py (718 of 2172)
PASS: lldb-api :: lang/objc/radar-9691614/TestObjCMethodReturningBOOL.py (719 of 2172)
PASS: lldb-api :: lang/objc/foundation/TestObjCMethods.py (720 of 2172)
UNSUPPORTED: lldb-api :: linux/add-symbols/TestTargetSymbolsAddCommand.py (721 of 2172)
PASS: lldb-api :: lang/objc/rdar-11355592/TestRdar11355592.py (722 of 2172)
UNSUPPORTED: lldb-api :: linux/mix-dwo-and-regular-objects/TestMixedDwarfBinary.py (723 of 2172)
PASS: lldb-api :: lang/objc/foundation/TestFoundationDisassembly.py (724 of 2172)
UNSUPPORTED: lldb-api :: linux/sepdebugsymlink/TestTargetSymbolsSepDebugSymlink.py (725 of 2172)
UNSUPPORTED: lldb-api :: linux/thread/create_during_instruction_step/TestCreateDuringInstructionStep.py (726 of 2172)
PASS: lldb-api :: lang/objc/objc-new-syntax/TestObjCNewSyntaxArray.py (727 of 2172)
PASS: lldb-api :: lang/objc/self/TestObjCSelf.py (728 of 2172)
PASS: lldb-api :: macosx/add-dsym/TestAddDsymMidExecutionCommand.py (729 of 2172)
PASS: lldb-api :: macosx/DBGSourcePathRemapping/TestDSYMSourcePathRemapping.py (730 of 2172)
PASS: lldb-api :: linux/builtin_trap/TestBuiltinTrap.py (731 of 2172)
PASS: lldb-api :: lang/objcxx/cxx-bridged-po/TestObjCXXBridgedPO.py (732 of 2172)
PASS: lldb-api :: lang/objc/single-entry-dictionary/TestObjCSingleEntryDictionary.py (733 of 2172)
PASS: lldb-api :: lang/objc/objc-new-syntax/TestObjCNewSyntaxDictionary.py (734 of 2172)
PASS: lldb-api :: macosx/find-app-in-bundle/TestFindAppInBundle.py (735 of 2172)
PASS: lldb-api :: lang/objc/unicode-string/TestUnicodeString.py (736 of 2172)
PASS: lldb-api :: macosx/find-dsym/bundle-with-dot-in-filename/TestBundleWithDotInFilename.py (737 of 2172)
PASS: lldb-api :: macosx/duplicate-archive-members/TestDuplicateMembers.py (738 of 2172)
PASS: lldb-api :: macosx/load-kext/TestLoadKext.py (739 of 2172)
PASS: lldb-api :: macosx/find-dsym/deep-bundle/TestDeepBundle.py (740 of 2172)
PASS: lldb-api :: macosx/dyld-trie-symbols/TestDyldTrieSymbols.py (741 of 2172)
PASS: lldb-api :: macosx/lc-note/firmware-corefile/TestFirmwareCorefiles.py (742 of 2172)
PASS: lldb-api :: macosx/lc-note/kern-ver-str/TestKernVerStrLCNOTE.py (743 of 2172)
PASS: lldb-api :: lang/objc/variadic_methods/TestVariadicMethods.py (744 of 2172)
PASS: lldb-api :: macosx/order/TestOrderFile.py (745 of 2172)
PASS: lldb-api :: macosx/indirect_symbol/TestIndirectSymbols.py (746 of 2172)
PASS: lldb-api :: macosx/save_crashlog/TestSaveCrashlog.py (747 of 2172)
UNSUPPORTED: lldb-api :: macosx/macCatalystAppMacOSFramework/TestMacCatalystAppWithMacOSFramework.py (748 of 2172)
PASS: lldb-api :: macosx/macCatalyst/TestMacCatalyst.py (749 of 2172)
PASS: lldb-api :: lang/objcxx/hide-runtime-values/TestObjCXXHideRuntimeValues.py (750 of 2172)
PASS: lldb-api :: macosx/version_zero/TestGetVersionZeroVersion.py (751 of 2172)
PASS: lldb-api :: macosx/profile_vrs_detach/TestDetachVrsProfile.py (752 of 2172)
PASS: lldb-api :: macosx/function-starts/TestFunctionStarts.py (753 of 2172)
PASS: lldb-api :: python_api/debugger/TestDebuggerAPI.py (754 of 2172)
PASS: lldb-api :: macosx/thread_suspend/TestInternalThreadSuspension.py (755 of 2172)
PASS: lldb-api :: macosx/universal/TestUniversal.py (756 of 2172)
UNSUPPORTED: lldb-api :: python_api/disassemble-raw-data/TestDisassemble_VST1_64.py (757 of 2172)
PASS: lldb-api :: python_api/disassemble-raw-data/TestDisassembleRawData.py (758 of 2172)
PASS: lldb-api :: python_api/breakpoint/TestBreakpointAPI.py (759 of 2172)
UNSUPPORTED: lldb-api :: python_api/event/TestEvents.py (760 of 2172)
PASS: lldb-api :: python_api/default-constructor/TestDefaultConstructorForAPIObjects.py (761 of 2172)
PASS: lldb-api :: lang/objcxx/class-name-clash/TestNameClash.py (762 of 2172)
PASS: lldb-api :: python_api/findvalue_duplist/TestSBFrameFindValue.py (763 of 2172)
PASS: lldb-api :: macosx/safe-to-func-call/TestSafeFuncCalls.py (764 of 2172)
PASS: lldb-api :: lang/objcxx/objcxx-ivar-vector/TestIvarVector.py (765 of 2172)
PASS: lldb-api :: lang/objc/hidden-ivars/TestHiddenIvars.py (766 of 2172)
PASS: lldb-api :: python_api/file_handle/TestFileHandle.py (767 of 2172)
PASS: lldb-api :: macosx/queues/TestQueues.py (768 of 2172)
PASS: lldb-api :: python_api/get-value-32bit-int/TestGetValue32BitInt.py (769 of 2172)
PASS: lldb-api :: macosx/nslog/TestDarwinNSLogOutput.py (770 of 2172)
PASS: lldb-api :: python_api/frame/get-variables/TestGetVariables.py (771 of 2172)
PASS: lldb-api :: python_api/interpreter/TestCommandInterpreterAPI.py (772 of 2172)
PASS: lldb-api :: python_api/lldbutil/TestSwigVersion.py (773 of 2172)
PASS: lldb-api :: python_api/interpreter/TestRunCommandInterpreterAPI.py (774 of 2172)
PASS: lldb-api :: python_api/frame/inlines/TestInlinedFrame.py (775 of 2172)
PASS: lldb-api :: lang/objc/objc-new-syntax/TestObjCNewSyntaxLiteral.py (776 of 2172)
PASS: lldb-api :: macosx/thread-names/TestInterruptThreadNames.py (777 of 2172)
PASS: lldb-api :: python_api/function_symbol/TestDisasmAPI.py (778 of 2172)
PASS: lldb-api :: python_api/function_symbol/TestSymbolAPI.py (779 of 2172)
PASS: lldb-api :: python_api/formatters/TestFormattersSBAPI.py (780 of 2172)
PASS: lldb-api :: python_api/hello_world/TestHelloWorld.py (781 of 2172)
PASS: lldb-api :: python_api/name_lookup/TestNameLookup.py (782 of 2172)
PASS: lldb-api :: python_api/lldbutil/frame/TestFrameUtils.py (783 of 2172)
PASS: lldb-api :: python_api/sbenvironment/TestSBEnvironment.py (784 of 2172)
PASS: lldb-api :: python_api/lldbutil/process/TestPrintStackTraces.py (785 of 2172)
PASS: lldb-api :: python_api/sberror/TestSBError.py (786 of 2172)
PASS: lldb-api :: python_api/process/read-mem-cstring/TestReadMemCString.py (787 of 2172)
PASS: lldb-api :: python_api/sbdata/TestSBData.py (788 of 2172)
PASS: lldb-api :: python_api/sblaunchinfo/TestSBLaunchInfo.py (789 of 2172)
PASS: lldb-api :: python_api/sbstructureddata/TestStructuredDataAPI.py (790 of 2172)
PASS: lldb-api :: python_api/frame/TestFrames.py (791 of 2172)
PASS: lldb-api :: python_api/sbplatform/TestSBPlatform.py (792 of 2172)
PASS: lldb-api :: python_api/signals/TestSignalsAPI.py (793 of 2172)
PASS: lldb-api :: python_api/process/io/TestProcessIO.py (794 of 2172)
PASS: lldb-api :: python_api/class_members/TestSBTypeClassMembers.py (795 of 2172)
PASS: lldb-api :: python_api/section/TestSectionAPI.py (796 of 2172)
PASS: lldb-api :: python_api/sbvalue_persist/TestSBValuePersist.py (797 of 2172)
PASS: lldb-api :: python_api/sbvalue_const_addrof/TestSBValueConstAddrOf.py (798 of 2172)
PASS: lldb-api :: python_api/symbol-context/TestSymbolContext.py (799 of 2172)
PASS: lldb-api :: python_api/module_section/TestModuleAndSection.py (800 of 2172)
PASS: lldb-api :: python_api/value/change_values/TestChangeValueAPI.py (801 of 2172)
PASS: lldb-api :: python_api/symbol-context/two-files/TestSymbolContextTwoFiles.py (802 of 2172)
PASS: lldb-api :: python_api/value/empty_class/TestValueAPIEmptyClass.py (803 of 2172)
PASS: lldb-api :: python_api/type/TestTypeList.py (804 of 2172)
PASS: lldb-api :: python_api/objc_type/TestObjCType.py (805 of 2172)
PASS: lldb-api :: python_api/value/linked_list/TestValueAPILinkedList.py (806 of 2172)
PASS: lldb-api :: python_api/value/TestValueAPI.py (807 of 2172)
PASS: lldb-api :: python_api/watchpoint/TestSetWatchpoint.py (808 of 2172)
PASS: lldb-api :: python_api/watchpoint/TestWatchpointIgnoreCount.py (809 of 2172)
PASS: lldb-api :: python_api/watchpoint/TestWatchpointIter.py (810 of 2172)
PASS: lldb-api :: python_api/lldbutil/iter/TestRegistersIterator.py (811 of 2172)
PASS: lldb-api :: sanity/TestModuleCacheSanity.py (812 of 2172)
PASS: lldb-api :: sanity/TestSettingSkipping.py (813 of 2172)
PASS: lldb-api :: python_api/value_var_update/TestValueVarUpdate.py (814 of 2172)
PASS: lldb-api :: python_api/watchpoint/condition/TestWatchpointConditionAPI.py (815 of 2172)
PASS: lldb-api :: sample_test/TestSampleTest.py (816 of 2172)
UNSUPPORTED: lldb-api :: tools/intel-features/intel-pt/test/TestIntelPTSimpleBinary.py (817 of 2172)
PASS: lldb-api :: terminal/TestEditline.py (818 of 2172)
PASS: lldb-api :: python_api/exprpath_synthetic/TestExprPathSynthetic.py (819 of 2172)
PASS: lldb-api :: terminal/TestSTTYBeforeAndAfter.py (820 of 2172)
UNSUPPORTED: lldb-api :: tools/lldb-server/TestGdbRemoteCompletion.py (821 of 2172)
PASS: lldb-api :: sample_test/TestSampleInlineTest.py (822 of 2172)
PASS: lldb-api :: python_api/sbtype_typeclass/TestSBTypeTypeClass.py (823 of 2172)
PASS: lldb-api :: python_api/process/TestProcessAPI.py (824 of 2172)
UNSUPPORTED: lldb-api :: tools/lldb-server/TestGdbRemoteModuleInfo.py (825 of 2172)
PASS: lldb-api :: tools/lldb-server/TestGdbRemoteAttach.py (826 of 2172)
PASS: lldb-api :: lang/objc/real-definition/TestRealDefinition.py (827 of 2172)
PASS: lldb-api :: tools/lldb-server/TestGdbRemoteHostInfo.py (828 of 2172)
PASS: lldb-api :: source-manager/TestSourceManager.py (829 of 2172)
PASS: lldb-api :: python_api/thread/TestThreadAPI.py (830 of 2172)
PASS: lldb-api :: tools/lldb-server/TestGdbRemoteSingleStep.py (831 of 2172)
PASS: lldb-api :: python_api/watchpoint/watchlocation/TestSetWatchlocation.py (832 of 2172)
UNSUPPORTED: lldb-api :: tools/lldb-server/TestGdbRemote_vContThreads.py (833 of 2172)
UNSUPPORTED: lldb-api :: tools/lldb-server/TestGdbRemoteAuxvSupport.py (834 of 2172)
PASS: lldb-api :: tools/lldb-server/commandline/TestStubReverseConnect.py (835 of 2172)
PASS: lldb-api :: tools/lldb-server/TestGdbRemoteExitCode.py (836 of 2172)
PASS: lldb-api :: tools/lldb-server/TestGdbRemoteKill.py (837 of 2172)
PASS: lldb-api :: tools/lldb-server/TestGdbRemoteRegisterState.py (838 of 2172)
UNSUPPORTED: lldb-api :: tools/lldb-server/libraries-svr4/TestGdbRemoteLibrariesSvr4Support.py (839 of 2172)
PASS: lldb-api :: tools/lldb-server/commandline/TestStubSetSID.py (840 of 2172)
UNSUPPORTED: lldb-api :: tools/lldb-server/memory-allocation/TestGdbRemoteMemoryAllocation.py (841 of 2172)
UNSUPPORTED: lldb-api :: tools/lldb-server/platform-process-connect/TestPlatformProcessConnect.py (842 of 2172)
UNSUPPORTED: lldb-api :: tools/lldb-server/registers-target-xml-reading/TestGdbRemoteTargetXmlPacket.py (843 of 2172)
UNSUPPORTED: lldb-api :: tools/lldb-server/signal-filtering/TestGdbRemote_QPassSignals.py (844 of 2172)
UNSUPPORTED: lldb-api :: tools/lldb-server/thread-name/TestGdbRemoteThreadName.py (845 of 2172)
PASS: lldb-api :: tools/lldb-server/register-reading/TestGdbRemoteGPacket.py (846 of 2172)
PASS: lldb-api :: python_api/watchpoint/watchlocation/TestTargetWatchAddress.py (847 of 2172)
PASS: lldb-api :: tools/lldb-server/inferior-crash/TestGdbRemoteAbort.py (848 of 2172)
PASS: lldb-api :: tools/lldb-server/inferior-crash/TestGdbRemoteSegFault.py (849 of 2172)
UNSUPPORTED: lldb-api :: tools/lldb-vscode/completions/TestVSCode_completions.py (850 of 2172)
PASS: lldb-api :: tools/lldb-vscode/breakpoint-events/TestVSCode_breakpointEvents.py (851 of 2172)
PASS: lldb-api :: python_api/lldbutil/iter/TestLLDBIterator.py (852 of 2172)
PASS: lldb-api :: tools/lldb-server/TestAppleSimulatorOSType.py (853 of 2172)
UNSUPPORTED: lldb-api :: tools/lldb-vscode/disconnect/TestVSCode_disconnect.py (854 of 2172)
PASS: lldb-api :: tools/lldb-vscode/coreFile/TestVSCode_coreFile.py (855 of 2172)
PASS: lldb-api :: tools/lldb-vscode/console/TestVSCode_console.py (856 of 2172)
PASS: lldb-api :: tools/lldb-server/TestGdbRemoteExpeditedRegisters.py (857 of 2172)
PASS: lldb-api :: tools/lldb-vscode/breakpoint/TestVSCode_setExceptionBreakpoints.py (858 of 2172)
PASS: lldb-api :: tools/lldb-vscode/runInTerminal/TestVSCode_runInTerminal.py (859 of 2172)
PASS: lldb-api :: tools/lldb-server/TestGdbRemoteProcessInfo.py (860 of 2172)
PASS: lldb-api :: tools/lldb-vscode/stackTrace/TestVSCode_stackTrace.py (861 of 2172)
PASS: lldb-api :: tools/lldb-vscode/variables/TestVSCode_variables.py (862 of 2172)
PASS: lldb-api :: tools/lldb-vscode/step/TestVSCode_step.py (863 of 2172)
PASS: lldb-api :: tools/lldb-vscode/breakpoint/TestVSCode_setFunctionBreakpoints.py (864 of 2172)
PASS: lldb-api :: macosx/simulator/TestSimulatorPlatform.py (865 of 2172)
PASS: lldb-api :: tools/lldb-vscode/breakpoint/TestVSCode_setBreakpoints.py (866 of 2172)
PASS: lldb-api :: tools/lldb-server/TestGdbRemote_qThreadStopInfo.py (867 of 2172)
PASS: lldb-api :: tools/lldb-server/TestGdbRemote_vCont.py (868 of 2172)
PASS: lldb-api :: tools/lldb-vscode/attach/TestVSCode_attach.py (869 of 2172)
PASS: lldb-api :: python_api/target/TestTargetAPI.py (870 of 2172)
PASS: lldb-api :: types/TestDoubleTypes.py (871 of 2172)
PASS: lldb-api :: types/TestFloatTypes.py (872 of 2172)
UNSUPPORTED: lldb-shell :: Breakpoint/case-insensitive.test (873 of 2172)
PASS: lldb-api :: tools/lldb-vscode/module/TestVSCode_module.py (874 of 2172)
PASS: lldb-api :: types/TestFloatTypesExpr.py (875 of 2172)
PASS: lldb-api :: types/TestDoubleTypesExpr.py (876 of 2172)
PASS: lldb-api :: tools/lldb-vscode/launch/TestVSCode_launch.py (877 of 2172)
PASS: lldb-shell :: Breakpoint/debug_rnglist_rlestartend.test (878 of 2172)
PASS: lldb-shell :: Breakpoint/debug_addrx.test (879 of 2172)
PASS: lldb-shell :: Breakpoint/debug_rnglist_offset_pair.test (880 of 2172)
PASS: lldb-shell :: Breakpoint/debug_rnglist_basic.test (881 of 2172)
PASS: lldb-shell :: Breakpoint/case-sensitive.test (882 of 2172)
UNSUPPORTED: lldb-shell :: Breakpoint/ppc64-localentry.test (883 of 2172)
PASS: lldb-shell :: Breakpoint/debug_rnglistx_rlex.test (884 of 2172)
PASS: lldb-shell :: Breakpoint/implicit_const_form_support.test (885 of 2172)
PASS: lldb-shell :: Breakpoint/single-file-split-dwarf.test (886 of 2172)
PASS: lldb-shell :: Breakpoint/split-dwarf-5-addrbase.test (887 of 2172)
PASS: lldb-shell :: Breakpoint/split-dwarf5-debug-stroffsets.test (888 of 2172)
PASS: lldb-shell :: BuildScript/compiler-full-path.test (889 of 2172)
UNSUPPORTED: lldb-shell :: BuildScript/toolchain-clang-cl.test (890 of 2172)
PASS: lldb-shell :: Breakpoint/dummy-target.test (891 of 2172)
UNSUPPORTED: lldb-shell :: BuildScript/toolchain-msvc.test (892 of 2172)
PASS: lldb-shell :: BuildScript/script-args.test (893 of 2172)
PASS: lldb-shell :: BuildScript/toolchain-clang.test (894 of 2172)
PASS: lldb-shell :: Commands/CommandScriptImmediateOutput/CommandScriptImmediateOutputConsole.test (895 of 2172)
PASS: lldb-shell :: Commands/command-backtrace.test (896 of 2172)
PASS: lldb-shell :: Commands/CommandScriptImmediateOutput/CommandScriptImmediateOutputFile.test (897 of 2172)
PASS: lldb-shell :: Commands/command-disassemble-process.yaml (898 of 2172)
PASS: lldb-shell :: Commands/command-regex-delete.test (899 of 2172)
PASS: lldb-shell :: BuildScript/modes.test (900 of 2172)
PASS: lldb-shell :: Commands/command-regex-unalias.test (901 of 2172)
PASS: lldb-shell :: Commands/command-breakpoint-col.test (902 of 2172)
PASS: lldb-shell :: Breakpoint/jitbp_elf.test (903 of 2172)
PASS: lldb-shell :: Commands/command-target-modules-dump-sections.yaml (904 of 2172)
PASS: lldb-shell :: Commands/command-disassemble.s (905 of 2172)
PASS: lldb-shell :: Commands/command-source.test (906 of 2172)
PASS: lldb-shell :: Commands/command-script-import.test (907 of 2172)
PASS: lldb-shell :: Driver/LocalLLDBInit.test (908 of 2172)
PASS: lldb-shell :: Driver/TestCore.test (909 of 2172)
PASS: lldb-shell :: Driver/TestCommands.test (910 of 2172)
PASS: lldb-shell :: Driver/TestError.test (911 of 2172)
PASS: lldb-shell :: Driver/TestHelp.test (912 of 2172)
PASS: lldb-shell :: Driver/TestFile.test (913 of 2172)
PASS: lldb-shell :: Driver/TestNoUseColor.test (914 of 2172)
PASS: lldb-shell :: Driver/TestProcessAttach.test (915 of 2172)
PASS: lldb-shell :: Commands/command-stop-hook-output.test (916 of 2172)
PASS: lldb-shell :: Driver/TestRepl.test (917 of 2172)
PASS: lldb-shell :: Commands/command-thread-select.test (918 of 2172)
PASS: lldb-api :: types/TestRecursiveTypes.py (919 of 2172)
UNSUPPORTED: lldb-shell :: ExecControl/StopHook/stop-hook-threads.test (920 of 2172)
PASS: lldb-shell :: Driver/TestUseColor.test (921 of 2172)
PASS: lldb-shell :: Driver/TestSingleQuote.test (922 of 2172)
UNSUPPORTED: lldb-shell :: Expr/TestIRMemoryMapWindows.test (923 of 2172)
PASS: lldb-shell :: Driver/TestTarget.test (924 of 2172)
PASS: lldb-shell :: Expr/TestMultilineExpr.test (925 of 2172)
PASS: lldb-shell :: Driver/TestConvenienceVariables.test (926 of 2172)
XFAIL: lldb-shell :: Expr/nodefaultlib.cpp (927 of 2172)
PASS: lldb-shell :: Driver/TestPositionalArgs.test (928 of 2172)
UNSUPPORTED: lldb-shell :: Minidump/Windows/arm-fp-unwind.test (929 of 2172)
PASS: lldb-shell :: Host/TestCustomShell.test (930 of 2172)
PASS: lldb-shell :: Heap/heap-cstr.test (931 of 2172)
PASS: lldb-shell :: Minidump/breakpad-symbols.test (932 of 2172)
PASS: lldb-shell :: Minidump/disassemble-no-module.yaml (933 of 2172)
PASS: lldb-api :: types/TestIntegerType.py (934 of 2172)
PASS: lldb-shell :: Minidump/dump-all.test (935 of 2172)
PASS: lldb-shell :: Minidump/memory-region-from-module.yaml (936 of 2172)
PASS: lldb-shell :: Minidump/memory-region.yaml (937 of 2172)
PASS: lldb-shell :: Minidump/fb-dump.test (938 of 2172)
PASS: lldb-shell :: Minidump/no-process-id.yaml (939 of 2172)
PASS: lldb-shell :: ObjectFile/Breakpad/discontiguous-sections.test (940 of 2172)
PASS: lldb-shell :: ObjectFile/Breakpad/sections-trailing-func.test (941 of 2172)
PASS: lldb-shell :: ObjectFile/Breakpad/sections.test (942 of 2172)
PASS: lldb-shell :: ObjectFile/Breakpad/uuid-matching-mac.test (943 of 2172)
PASS: lldb-shell :: ObjectFile/Breakpad/breakpad-identification.test (944 of 2172)
PASS: lldb-shell :: ObjectFile/ELF/PT_LOAD-empty.yaml (945 of 2172)
PASS: lldb-shell :: ObjectFile/ELF/PT_LOAD-overlap-PT_INTERP.yaml (946 of 2172)
PASS: lldb-shell :: ObjectFile/ELF/PT_LOAD-overlap-section.yaml (947 of 2172)
PASS: lldb-shell :: ObjectFile/ELF/PT_LOAD-overlap.yaml (948 of 2172)
PASS: lldb-shell :: ObjectFile/ELF/PT_LOAD.yaml (949 of 2172)
PASS: lldb-shell :: ExecControl/StopHook/stop-hook.test (950 of 2172)
PASS: lldb-shell :: ObjectFile/ELF/aarch64-relocations.yaml (951 of 2172)
PASS: lldb-shell :: ObjectFile/ELF/avr-basic-info.yaml (952 of 2172)
PASS: lldb-shell :: ObjectFile/ELF/base-address.yaml (953 of 2172)
UNSUPPORTED: lldb-shell :: ObjectFile/ELF/basic-info.yaml (954 of 2172)
PASS: lldb-shell :: ObjectFile/ELF/build-id-case.yaml (955 of 2172)
PASS: lldb-shell :: ObjectFile/ELF/compressed-sections.yaml (956 of 2172)
PASS: lldb-shell :: ObjectFile/ELF/duplicate-section.yaml (957 of 2172)
PASS: lldb-shell :: ObjectFile/ELF/gnu-debuglink.yaml (958 of 2172)
PASS: lldb-api :: types/TestCharType.py (959 of 2172)
PASS: lldb-shell :: ObjectFile/ELF/minidebuginfo-corrupt-xz.yaml (960 of 2172)
PASS: lldb-shell :: ObjectFile/ELF/minidebuginfo-find-symbols.yaml (961 of 2172)
UNSUPPORTED: lldb-shell :: ObjectFile/ELF/minidebuginfo-no-lzma.yaml (962 of 2172)
UNSUPPORTED: lldb-shell :: ObjectFile/ELF/minidebuginfo-set-and-hit-breakpoint.test (963 of 2172)
PASS: lldb-shell :: ObjectFile/ELF/netbsd-core-amd64.test (964 of 2172)
PASS: lldb-shell :: ObjectFile/ELF/netbsd-exec-8.99.30-amd64.yaml (965 of 2172)
PASS: lldb-shell :: ObjectFile/ELF/section-addresses.yaml (966 of 2172)
PASS: lldb-shell :: ObjectFile/ELF/section-overlap.yaml (967 of 2172)
PASS: lldb-shell :: ObjectFile/ELF/section-permissions.yaml (968 of 2172)
PASS: lldb-shell :: ObjectFile/ELF/section-types-edgecases.yaml (969 of 2172)
PASS: lldb-shell :: ObjectFile/ELF/section-types.yaml (970 of 2172)
PASS: lldb-shell :: ObjectFile/ELF/short-build-id.yaml (971 of 2172)
PASS: lldb-shell :: Expr/TestIRMemoryMap.test (972 of 2172)
PASS: lldb-shell :: ObjectFile/MachO/lc_build_version_notools.yaml (973 of 2172)
PASS: lldb-shell :: ObjectFile/MachO/lc_build_version.yaml (974 of 2172)
PASS: lldb-api :: tools/lldb-server/TestGdbRemoteThreadsInStopReply.py (975 of 2172)
PASS: lldb-shell :: ObjectFile/MachO/lc_version_min.yaml (976 of 2172)
PASS: lldb-shell :: ObjectFile/MachO/subsections.yaml (977 of 2172)
PASS: lldb-shell :: ObjectFile/PECOFF/basic-info-arm.yaml (978 of 2172)
PASS: lldb-shell :: ObjectFile/PECOFF/basic-info-arm64.yaml (979 of 2172)
PASS: lldb-shell :: ObjectFile/PECOFF/basic-info.yaml (980 of 2172)
UNSUPPORTED: lldb-shell :: ObjectFile/PECOFF/dep-modules.yaml (981 of 2172)
UNSUPPORTED: lldb-shell :: ObjectFile/PECOFF/disassemble-thumb.yaml (982 of 2172)
UNSUPPORTED: lldb-shell :: ObjectFile/PECOFF/export-dllfunc.yaml (983 of 2172)
PASS: lldb-shell :: ObjectFile/PDB/object.test (984 of 2172)
PASS: lldb-shell :: ObjectFile/PECOFF/invalid-export-table.yaml (985 of 2172)
PASS: lldb-shell :: ObjectFile/PECOFF/section-types.yaml (986 of 2172)
PASS: lldb-shell :: ObjectFile/PECOFF/sections-names.yaml (987 of 2172)
PASS: lldb-shell :: ObjectFile/PECOFF/sections.yaml (988 of 2172)
UNSUPPORTED: lldb-shell :: ObjectFile/PECOFF/uuid.yaml (989 of 2172)
PASS: lldb-shell :: ObjectFile/PECOFF/symbol.yaml (990 of 2172)
PASS: lldb-shell :: ObjectFile/wasm/basic.yaml (991 of 2172)
PASS: lldb-shell :: ObjectFile/MachO/symtab.yaml (992 of 2172)
PASS: lldb-shell :: ObjectFile/wasm/embedded-debug-sections.yaml (993 of 2172)
PASS: lldb-shell :: ObjectFile/wasm/stripped-debug-sections.yaml (994 of 2172)
PASS: lldb-shell :: ObjectFile/wasm/unified-debug-sections.yaml (995 of 2172)
PASS: lldb-shell :: ObjectFile/ELF/many-sections.s (996 of 2172)
PASS: lldb-shell :: Process/TestAbortExitCode.test (997 of 2172)
UNSUPPORTED: lldb-shell :: Process/Windows/exception_access_violation.cpp (998 of 2172)
PASS: lldb-shell :: Quit/TestQuitExitCode-30.test (999 of 2172)
PASS: lldb-shell :: Quit/TestQuitExitCode0.test (1000 of 2172)
PASS: lldb-shell :: Process/Optimization.test (1001 of 2172)
PASS: lldb-shell :: Quit/TestQuitExitCode30.test (1002 of 2172)
PASS: lldb-shell :: Quit/TestQuitExitCodeHex0.test (1003 of 2172)
PASS: lldb-shell :: Quit/TestQuitExitCodeImplicit0.test (1004 of 2172)
PASS: lldb-shell :: Process/UnsupportedLanguage.test (1005 of 2172)
PASS: lldb-shell :: Quit/TestQuitExitCodeNonInt.test (1006 of 2172)
PASS: lldb-shell :: Minidump/Windows/Sigsegv/sigsegv.test (1007 of 2172)
UNSUPPORTED: lldb-shell :: Register/aarch64-fp-read.test (1008 of 2172)
UNSUPPORTED: lldb-shell :: Register/aarch64-gp-read.test (1009 of 2172)
UNSUPPORTED: lldb-shell :: Register/arm-fp-read.test (1010 of 2172)
UNSUPPORTED: lldb-shell :: Register/arm-gp-read.test (1011 of 2172)
PASS: lldb-shell :: Quit/TestQuitExitCodeHexA.test (1012 of 2172)
PASS: lldb-shell :: Quit/TestQuitExitCodeTooManyArgs.test (1013 of 2172)
UNSUPPORTED: lldb-shell :: Register/x86-64-gp-write.test (1014 of 2172)
PASS: lldb-shell :: Register/x86-64-gp-read.test (1015 of 2172)
PASS: lldb-shell :: Register/x86-64-read.test (1016 of 2172)
UNSUPPORTED: lldb-shell :: Register/x86-64-xmm16-read.test (1017 of 2172)
UNSUPPORTED: lldb-shell :: Register/x86-64-xmm16-write.test (1018 of 2172)
XFAIL: lldb-shell :: Register/x86-64-fp-write.test (1019 of 2172)
PASS: lldb-shell :: Minidump/Windows/broken-unwind.test (1020 of 2172)
UNSUPPORTED: lldb-shell :: Register/x86-64-ymm16-read.test (1021 of 2172)
UNSUPPORTED: lldb-shell :: Register/x86-64-ymm16-write.test (1022 of 2172)
UNSUPPORTED: lldb-shell :: Register/x86-64-zmm-read.test (1023 of 2172)
UNSUPPORTED: lldb-shell :: Register/x86-64-zmm-write.test (1024 of 2172)
PASS: lldb-shell :: Minidump/Windows/find-module.test (1025 of 2172)
UNSUPPORTED: lldb-shell :: Register/x86-fp-write.test (1026 of 2172)
UNSUPPORTED: lldb-shell :: Register/x86-gp-read.test (1027 of 2172)
UNSUPPORTED: lldb-shell :: Register/x86-gp-write.test (1028 of 2172)
PASS: lldb-shell :: Recognizer/assert.test (1029 of 2172)
PASS: lldb-shell :: Register/x86-64-ymm-read.test (1030 of 2172)
XFAIL: lldb-shell :: Register/x86-64-write.test (1031 of 2172)
XFAIL: lldb-shell :: Register/x86-mm-xmm-read.test (1032 of 2172)
UNSUPPORTED: lldb-shell :: Register/x86-ymm-read.test (1033 of 2172)
UNSUPPORTED: lldb-shell :: Register/x86-ymm-write.test (1034 of 2172)
UNSUPPORTED: lldb-shell :: Register/x86-zmm-read.test (1035 of 2172)
UNSUPPORTED: lldb-shell :: Register/x86-zmm-write.test (1036 of 2172)
XFAIL: lldb-shell :: Register/x86-mm-xmm-write.test (1037 of 2172)
XFAIL: lldb-shell :: Register/x86-64-ymm-write.test (1038 of 2172)
PASS: lldb-shell :: Process/TestEnvironment.test (1039 of 2172)
PASS: lldb-shell :: Register/x86-fp-read.test (1040 of 2172)
PASS: lldb-api :: types/TestCharTypeExpr.py (1041 of 2172)
PASS: lldb-shell :: ObjectFile/ELF/PT_LOAD-overlap-PT_TLS.yaml (1042 of 2172)
PASS: lldb-shell :: ObjectFile/ELF/PT_TLS-overlap-PT_LOAD.yaml (1043 of 2172)
PASS: lldb-shell :: Reproducer/TestCrash.test (1044 of 2172)
PASS: lldb-shell :: Register/x86-multithread-read.test (1045 of 2172)
PASS: lldb-shell :: Reproducer/TestCaptureEnvOverride.test (1046 of 2172)
XFAIL: lldb-shell :: Register/x86-multithread-write.test (1047 of 2172)
PASS: lldb-shell :: Reproducer/TestDebugSymbols.test (1048 of 2172)
PASS: lldb-shell :: Reproducer/TestDriverOptions.test (1049 of 2172)
PASS: lldb-shell :: Reproducer/TestFinalize.test (1050 of 2172)
PASS: lldb-shell :: Reproducer/TestDiscard.test (1051 of 2172)
PASS: lldb-shell :: Reproducer/TestDSYM.test (1052 of 2172)
UNSUPPORTED: lldb-shell :: Reproducer/TestLuaImport.test (1053 of 2172)
PASS: lldb-api :: types/TestShortType.py (1054 of 2172)
PASS: lldb-shell :: Reproducer/TestHomeDir.test (1055 of 2172)
PASS: lldb-shell :: Reproducer/TestProcessList.test (1056 of 2172)
PASS: lldb-shell :: Reproducer/TestPythonImport.test (1057 of 2172)
PASS: lldb-api :: types/TestIntegerTypeExpr.py (1058 of 2172)
PASS: lldb-shell :: Reproducer/Functionalities/TestDataFormatter.test (1059 of 2172)
PASS: lldb-shell :: Reproducer/Functionalities/TestImageList.test (1060 of 2172)
PASS: lldb-shell :: Reproducer/Functionalities/TestStepping.test (1061 of 2172)
PASS: lldb-shell :: Reproducer/TestSynchronous.test (1062 of 2172)
UNSUPPORTED: lldb-shell :: ScriptInterpreter/Lua/bindings.test (1063 of 2172)
UNSUPPORTED: lldb-shell :: ScriptInterpreter/Lua/breakpoint_callback.test (1064 of 2172)
UNSUPPORTED: lldb-shell :: ScriptInterpreter/Lua/command_script_import.test (1065 of 2172)
UNSUPPORTED: lldb-shell :: ScriptInterpreter/Lua/convenience_variables.test (1066 of 2172)
UNSUPPORTED: lldb-shell :: ScriptInterpreter/Lua/independent_state.test (1067 of 2172)
UNSUPPORTED: lldb-shell :: ScriptInterpreter/Lua/io.test (1068 of 2172)
UNSUPPORTED: lldb-shell :: ScriptInterpreter/Lua/lua-python.test (1069 of 2172)
UNSUPPORTED: lldb-shell :: ScriptInterpreter/Lua/lua.test (1070 of 2172)
UNSUPPORTED: lldb-shell :: ScriptInterpreter/Lua/nested_sessions.test (1071 of 2172)
UNSUPPORTED: lldb-shell :: ScriptInterpreter/Lua/persistent_state.test (1072 of 2172)
UNSUPPORTED: lldb-shell :: ScriptInterpreter/Lua/quit.test (1073 of 2172)
UNSUPPORTED: lldb-shell :: ScriptInterpreter/Lua/watchpoint_callback.test (1074 of 2172)
PASS: lldb-shell :: ScriptInterpreter/None/import_module.test (1075 of 2172)
PASS: lldb-shell :: ScriptInterpreter/None/none.test (1076 of 2172)
PASS: lldb-shell :: ScriptInterpreter/Python/command_relative_import.test (1077 of 2172)
PASS: lldb-shell :: Reproducer/Modules/TestModuleCXX.test (1078 of 2172)
PASS: lldb-shell :: ScriptInterpreter/Python/crashlog.test (1079 of 2172)
PASS: lldb-shell :: Reproducer/Functionalities/TestExpressionEvaluation.test (1080 of 2172)
PASS: lldb-shell :: ScriptInterpreter/Python/eof.test (1081 of 2172)
PASS: lldb-shell :: ScriptInterpreter/Python/sb_address_exception.test (1082 of 2172)
PASS: lldb-shell :: ScriptInterpreter/Python/scripted_breakpoint.test (1083 of 2172)
PASS: lldb-shell :: Settings/TestDisableColor.test (1084 of 2172)
PASS: lldb-shell :: Settings/TestDisassemblyFormat.test (1085 of 2172)
PASS: lldb-shell :: Settings/TestEchoCommands.test (1086 of 2172)
PASS: lldb-shell :: Reproducer/TestFileRepro.test (1087 of 2172)
PASS: lldb-shell :: Reproducer/TestDump.test (1088 of 2172)
PASS: lldb-shell :: Settings/TestFrameFormatColor.test (1089 of 2172)
PASS: lldb-shell :: Settings/TestModuleCacheSanity.test (1090 of 2172)
PASS: lldb-shell :: Settings/TestSettingsSet.test (1091 of 2172)
PASS: lldb-shell :: ScriptInterpreter/Python/python.test (1092 of 2172)
PASS: lldb-shell :: Settings/TestFrameFormatMangling.test (1093 of 2172)
PASS: lldb-shell :: Settings/TestSettingsWrite.test (1094 of 2172)
PASS: lldb-shell :: SymbolFile/Breakpad/line-table-discontinuous-file-ids.test (1095 of 2172)
PASS: lldb-shell :: SymbolFile/Breakpad/line-table-missing-file.test (1096 of 2172)
PASS: lldb-shell :: SymbolFile/Breakpad/line-table-edgecases.test (1097 of 2172)
PASS: lldb-shell :: SymbolFile/Breakpad/line-table-mixed-path-styles.test (1098 of 2172)
PASS: lldb-shell :: SymbolFile/Breakpad/line-table.test (1099 of 2172)
UNSUPPORTED: lldb-shell :: SymbolFile/Breakpad/stack-cfi-arm.yaml (1100 of 2172)
PASS: lldb-shell :: Settings/TestStopCommandSourceOnError.test (1101 of 2172)
PASS: lldb-shell :: SymbolFile/Breakpad/symtab-macho.test (1102 of 2172)
PASS: lldb-shell :: SymbolFile/Breakpad/stack-cfi-parsing.test (1103 of 2172)
PASS: lldb-shell :: SymbolFile/Breakpad/symtab.test (1104 of 2172)
PASS: lldb-shell :: SymbolFile/Breakpad/unwind-via-stack-cfi.test (1105 of 2172)
PASS: lldb-shell :: Settings/TestFrameFormatNoColor.test (1106 of 2172)
PASS: lldb-shell :: SymbolFile/DWARF/DW_AT_const_value-bitfields.s (1107 of 2172)
PASS: lldb-shell :: SymbolFile/DWARF/DW_AT_const_value.s (1108 of 2172)
PASS: lldb-shell :: SymbolFile/DWARF/DW_AT_data_bit_offset-DW_OP_stack_value.s (1109 of 2172)
PASS: lldb-shell :: Reproducer/TestRelativePath.test (1110 of 2172)
PASS: lldb-shell :: SymbolFile/DWARF/DW_AT_location-DW_AT_const_value.s (1111 of 2172)
PASS: lldb-shell :: SymbolFile/DWARF/DW_AT_declaration-with-children.s (1112 of 2172)
PASS: lldb-shell :: SymbolFile/DWARF/DW_AT_loclists_base.s (1113 of 2172)
PASS: lldb-shell :: SymbolFile/DWARF/DW_AT_low_pc-addrx.s (1114 of 2172)
PASS: lldb-shell :: SymbolFile/DWARF/DW_OP_piece-smaller-than-struct.s (1115 of 2172)
UNSUPPORTED: lldb-shell :: SymbolFile/DWARF/DW_TAG_GNU_call_site-DW_AT_low_pc.s (1116 of 2172)
PASS: lldb-shell :: SymbolFile/DWARF/DW_OP_piece-struct.s (1117 of 2172)
PASS: lldb-shell :: Settings/TestLineMarkerColor.test (1118 of 2172)
PASS: lldb-shell :: SymbolFile/DWARF/DW_TAG_basic_type_DW_ATE_UTF_nonC.ll (1119 of 2172)
PASS: lldb-shell :: SymbolFile/DWARF/DW_TAG_variable-invalid_location.s (1120 of 2172)
PASS: lldb-shell :: SymbolFile/DWARF/DW_TAG_variable-DW_AT_const_value.s (1121 of 2172)
UNSUPPORTED: lldb-shell :: SymbolFile/DWARF/array-sizes.s (1122 of 2172)
PASS: lldb-shell :: SymbolFile/DWARF/childless-compile-unit.s (1123 of 2172)
PASS: lldb-shell :: SymbolFile/DWARF/apple-index-is-used.cpp (1124 of 2172)
PASS: lldb-shell :: SymbolFile/DWARF/clang-ast-from-dwarf-objc-property.m (1125 of 2172)
PASS: lldb-shell :: SymbolFile/DWARF/clang-ast-from-dwarf-unamed-and-anon-structs.cpp (1126 of 2172)
UNSUPPORTED: lldb-shell :: SymbolFile/DWARF/debug-line-basic.s (1127 of 2172)
UNSUPPORTED: lldb-shell :: SymbolFile/DWARF/debug-names-compressed.cpp (1128 of 2172)
UNSUPPORTED: lldb-shell :: SymbolFile/DWARF/debug-types-address-ranges.s (1129 of 2172)
UNSUPPORTED: lldb-shell :: SymbolFile/DWARF/debug-types-basic.test (1130 of 2172)
PASS: lldb-shell :: SymbolFile/DWARF/debug-types-dwarf5.s (1131 of 2172)
PASS: lldb-shell :: SymbolFile/DWARF/anon_class_w_and_wo_export_symbols.ll (1132 of 2172)
UNSUPPORTED: lldb-shell :: SymbolFile/DWARF/debug-types-dwo-cross-reference.cpp (1133 of 2172)
UNSUPPORTED: lldb-shell :: SymbolFile/DWARF/debug-types-expressions.test (1134 of 2172)
PASS: lldb-shell :: SymbolFile/DWARF/debug-types-line-tables.s (1135 of 2172)
UNSUPPORTED: lldb-shell :: SymbolFile/DWARF/debug-types-signature-loop.s (1136 of 2172)
PASS: lldb-shell :: SymbolFile/DWARF/debug_aranges-empty-section.s (1137 of 2172)
PASS: lldb-shell :: SymbolFile/DWARF/debug_line-relative_path.s (1138 of 2172)
PASS: lldb-shell :: SymbolFile/DWARF/debug_line-tombstone.s (1139 of 2172)
PASS: lldb-shell :: SymbolFile/DWARF/debug_loc-aslr.s (1140 of 2172)
PASS: lldb-shell :: SymbolFile/DWARF/debug-types-missing-signature.test (1141 of 2172)
PASS: lldb-shell :: SymbolFile/DWARF/debug_loc.s (1142 of 2172)
PASS: lldb-shell :: SymbolFile/DWARF/debug_loc_and_loclists.s (1143 of 2172)
PASS: lldb-shell :: SymbolFile/DWARF/debug_loclists-dwo.s (1144 of 2172)
PASS: lldb-shell :: SymbolFile/DWARF/debug_ranges-missing-section.s (1145 of 2172)
UNSUPPORTED: lldb-shell :: SymbolFile/DWARF/debug_ranges_and_rnglists.test (1146 of 2172)
PASS: lldb-shell :: SymbolFile/DWARF/debug_ranges.s (1147 of 2172)
PASS: lldb-shell :: SymbolFile/DWARF/debug_rnglists-dwo.s (1148 of 2172)
PASS: lldb-shell :: SymbolFile/DWARF/debug_rnglists.s (1149 of 2172)
UNSUPPORTED: lldb-shell :: SymbolFile/DWARF/dir-separator-no-comp-dir-relative-name.s (1150 of 2172)
UNSUPPORTED: lldb-shell :: SymbolFile/DWARF/dir-separator-no-comp-dir.s (1151 of 2172)
UNSUPPORTED: lldb-shell :: SymbolFile/DWARF/dir-separator-posix.s (1152 of 2172)
UNSUPPORTED: lldb-shell :: SymbolFile/DWARF/dir-separator-windows.s (1153 of 2172)
PASS: lldb-shell :: SymbolFile/DWARF/compilercontext.ll (1154 of 2172)
PASS: lldb-shell :: SymbolFile/DWARF/dwarf5-atomic.s (1155 of 2172)
UNSUPPORTED: lldb-shell :: SymbolFile/DWARF/dwarf5-index-is-used.cpp (1156 of 2172)
UNSUPPORTED: lldb-shell :: SymbolFile/DWARF/dwarf5-partial-index.cpp (1157 of 2172)
UNSUPPORTED: lldb-shell :: SymbolFile/DWARF/dwarf5_locations.s (1158 of 2172)
PASS: lldb-shell :: SymbolFile/DWARF/dwarf5-debug_line.s (1159 of 2172)
PASS: lldb-shell :: SymbolFile/DWARF/dwo-type-in-main-file.s (1160 of 2172)
UNSUPPORTED: lldb-shell :: SymbolFile/DWARF/dwp-separate-debug-file.cpp (1161 of 2172)
PASS: lldb-shell :: SymbolFile/DWARF/dwp-debug-types.s (1162 of 2172)
UNSUPPORTED: lldb-shell :: SymbolFile/DWARF/find-basic-function.cpp (1163 of 2172)
UNSUPPORTED: lldb-shell :: SymbolFile/DWARF/find-basic-namespace.cpp (1164 of 2172)
UNSUPPORTED: lldb-shell :: SymbolFile/DWARF/find-basic-type.cpp (1165 of 2172)
UNSUPPORTED: lldb-shell :: SymbolFile/DWARF/find-basic-variable.cpp (1166 of 2172)
UNSUPPORTED: lldb-shell :: SymbolFile/DWARF/find-function-regex.cpp (1167 of 2172)
UNSUPPORTED: lldb-shell :: SymbolFile/DWARF/find-inline-method.s (1168 of 2172)
PASS: lldb-shell :: SymbolFile/DWARF/find-method-local-struct.cpp (1169 of 2172)
UNSUPPORTED: lldb-shell :: SymbolFile/DWARF/find-method.cpp (1170 of 2172)
PASS: lldb-shell :: SymbolFile/DWARF/dwp.s (1171 of 2172)
UNSUPPORTED: lldb-shell :: SymbolFile/DWARF/find-type-in-function.cpp (1172 of 2172)
UNSUPPORTED: lldb-shell :: SymbolFile/DWARF/find-variable-dwo.cpp (1173 of 2172)
UNSUPPORTED: lldb-shell :: SymbolFile/DWARF/find-variable-file.cpp (1174 of 2172)
PASS: lldb-shell :: SymbolFile/DWARF/find-qualified-variable.cpp (1175 of 2172)
UNSUPPORTED: lldb-shell :: SymbolFile/DWARF/inline-function-address-shared.test (1176 of 2172)
UNSUPPORTED: lldb-shell :: SymbolFile/DWARF/inline-function-address.ll (1177 of 2172)
UNSUPPORTED: lldb-shell :: SymbolFile/DWARF/limit-debug-info.s (1178 of 2172)
PASS: lldb-shell :: SymbolFile/DWARF/gnu-style-compression.cpp (1179 of 2172)
PASS: lldb-api :: types/TestShortTypeExpr.py (1180 of 2172)
UNSUPPORTED: lldb-shell :: SymbolFile/DWARF/split-dwarf-expression-eval-bug.cpp (1181 of 2172)
PASS: lldb-shell :: SymbolFile/DWARF/parallel-indexing-stress.s (1182 of 2172)
PASS: lldb-shell :: SymbolFile/DWARF/split-dwarf-inlining.cpp (1183 of 2172)
PASS: lldb-shell :: SymbolFile/DWARF/static_scope.s (1184 of 2172)
UNSUPPORTED: lldb-shell :: SymbolFile/DWARF/win-i386-line-table.s (1185 of 2172)
UNSUPPORTED: lldb-shell :: SymbolFile/NativePDB/ast-functions-msvc.cpp (1186 of 2172)
UNSUPPORTED: lldb-shell :: SymbolFile/NativePDB/ast-functions.cpp (1187 of 2172)
UNSUPPORTED: lldb-shell :: SymbolFile/NativePDB/ast-methods.cpp (1188 of 2172)
UNSUPPORTED: lldb-shell :: SymbolFile/NativePDB/ast-types.cpp (1189 of 2172)
UNSUPPORTED: lldb-shell :: SymbolFile/NativePDB/bitfields.cpp (1190 of 2172)
UNSUPPORTED: lldb-shell :: SymbolFile/NativePDB/break-by-function.cpp (1191 of 2172)
UNSUPPORTED: lldb-shell :: SymbolFile/NativePDB/break-by-line.cpp (1192 of 2172)
UNSUPPORTED: lldb-shell :: SymbolFile/NativePDB/disassembly.cpp (1193 of 2172)
UNSUPPORTED: lldb-shell :: SymbolFile/NativePDB/function-types-builtins.cpp (1194 of 2172)
UNSUPPORTED: lldb-shell :: SymbolFile/NativePDB/function-types-calling-conv.cpp (1195 of 2172)
PASS: lldb-shell :: SymbolFile/DWARF/split-dwarf-multiple-cu.ll (1196 of 2172)
UNSUPPORTED: lldb-shell :: SymbolFile/NativePDB/function-types-classes.cpp (1197 of 2172)
UNSUPPORTED: lldb-shell :: SymbolFile/NativePDB/globals-bss.cpp (1198 of 2172)
UNSUPPORTED: lldb-shell :: SymbolFile/NativePDB/global-classes.cpp (1199 of 2172)
UNSUPPORTED: lldb-shell :: SymbolFile/NativePDB/globals-fundamental.cpp (1200 of 2172)
UNSUPPORTED: lldb-shell :: SymbolFile/NativePDB/load-pdb.cpp (1201 of 2172)
UNSUPPORTED: lldb-shell :: SymbolFile/NativePDB/local-variables.cpp (1202 of 2172)
UNSUPPORTED: lldb-shell :: SymbolFile/NativePDB/locate-pdb.cpp (1203 of 2172)
UNSUPPORTED: lldb-shell :: SymbolFile/NativePDB/nested-types.cpp (1204 of 2172)
UNSUPPORTED: lldb-shell :: SymbolFile/NativePDB/s_constant.cpp (1205 of 2172)
UNSUPPORTED: lldb-shell :: SymbolFile/NativePDB/source-list.cpp (1206 of 2172)
UNSUPPORTED: lldb-shell :: SymbolFile/NativePDB/stack_unwinding01.cpp (1207 of 2172)
UNSUPPORTED: lldb-shell :: SymbolFile/NativePDB/tag-types.cpp (1208 of 2172)
UNSUPPORTED: lldb-shell :: SymbolFile/NativePDB/typedefs.cpp (1209 of 2172)
UNSUPPORTED: lldb-shell :: SymbolFile/PDB/calling-conventions.test (1210 of 2172)
UNSUPPORTED: lldb-shell :: SymbolFile/PDB/ast-restore.test (1211 of 2172)
UNSUPPORTED: lldb-shell :: SymbolFile/PDB/compilands.test (1212 of 2172)
UNSUPPORTED: lldb-shell :: SymbolFile/PDB/class-layout.test (1213 of 2172)
UNSUPPORTED: lldb-shell :: SymbolFile/PDB/expressions.test (1214 of 2172)
UNSUPPORTED: lldb-shell :: SymbolFile/PDB/enums-layout.test (1215 of 2172)
UNSUPPORTED: lldb-shell :: SymbolFile/PDB/function-level-linking.test (1216 of 2172)
UNSUPPORTED: lldb-shell :: SymbolFile/PDB/func-symbols.test (1217 of 2172)
UNSUPPORTED: lldb-shell :: SymbolFile/PDB/function-nested-block.test (1218 of 2172)
UNSUPPORTED: lldb-shell :: SymbolFile/PDB/pointers.test (1219 of 2172)
UNSUPPORTED: lldb-shell :: SymbolFile/PDB/type-quals.test (1220 of 2172)
UNSUPPORTED: lldb-shell :: SymbolFile/PDB/typedefs.test (1221 of 2172)
UNSUPPORTED: lldb-shell :: SymbolFile/PDB/udt-layout.test (1222 of 2172)
UNSUPPORTED: lldb-shell :: SymbolFile/PDB/variables-locations.test (1223 of 2172)
UNSUPPORTED: lldb-shell :: SymbolFile/PDB/vbases.test (1224 of 2172)
UNSUPPORTED: lldb-shell :: SymbolFile/PDB/variables.test (1225 of 2172)
UNSUPPORTED: lldb-shell :: SymbolFile/dissassemble-entry-point.s (1226 of 2172)
UNSUPPORTED: lldb-shell :: SymbolFile/target-symbols-add-unwind.test (1227 of 2172)
UNSUPPORTED: lldb-shell :: Unwind/basic-block-sections.test (1228 of 2172)
UNSUPPORTED: lldb-shell :: Unwind/eh-frame-augment-noop.test (1229 of 2172)
PASS: lldb-shell :: SymbolFile/DWARF/module-ownership.mm (1230 of 2172)
PASS: lldb-shell :: SymbolFile/symbol-binding.test (1231 of 2172)
UNSUPPORTED: lldb-shell :: Unwind/eh-frame-small-fde.test (1232 of 2172)
UNSUPPORTED: lldb-shell :: Unwind/split-machine-functions.test (1233 of 2172)
PASS: lldb-shell :: SymbolFile/DWARF/deterministic-build.cpp (1234 of 2172)
PASS: lldb-shell :: Unwind/eh-frame-dwarf-unwind.test (1235 of 2172)
UNSUPPORTED: lldb-shell :: Unwind/unwind-plan-dwarf-dump.test (1236 of 2172)
PASS: lldb-shell :: VSCode/TestOptions.test (1237 of 2172)
PASS: lldb-shell :: Unwind/thread-step-out-ret-addr-check.test (1238 of 2172)
UNSUPPORTED: lldb-shell :: Watchpoint/netbsd-nouserdbregs.test (1239 of 2172)
FAIL: lldb-shell :: lldb-server/TestErrorMessages.test (1240 of 2172)
PASS: lldb-unit :: API/Release/APITests/SBCommandInterpreterTest.MultiWordCommand (1241 of 2172)
PASS: lldb-shell :: Unwind/trap_frame_sym_ctx.test (1242 of 2172)
PASS: lldb-unit :: Breakpoint/Release/LLDBBreakpointTests/BreakpointIDTest.StringIsBreakpointName (1243 of 2172)
PASS: lldb-unit :: Core/Release/LLDBCoreTests/CommunicationTest.SynchronizeWhileClosing (1244 of 2172)
PASS: lldb-unit :: API/Release/APITests/SBCommandInterpreterTest.SingleWordCommand (1245 of 2172)
PASS: lldb-unit :: Core/Release/LLDBCoreTests/MangledTest.EmptyForInvalidName (1246 of 2172)
PASS: lldb-unit :: Core/Release/LLDBCoreTests/MangledTest.NameIndexes_FindFunctionSymbols (1247 of 2172)
PASS: lldb-unit :: Core/Release/LLDBCoreTests/MangledTest.ResultForBlockInvocation (1248 of 2172)
PASS: lldb-unit :: Core/Release/LLDBCoreTests/MangledTest.ResultForValidName (1249 of 2172)
PASS: lldb-unit :: Core/Release/LLDBCoreTests/ModuleSpecTest.InvalidInMemoryBuffer (1250 of 2172)
PASS: lldb-unit :: Core/Release/LLDBCoreTests/ModuleSpecTest.InvalidInMemoryBufferValidFile (1251 of 2172)
PASS: lldb-unit :: Core/Release/LLDBCoreTests/ModuleSpecTest.TestCOFFFile (1252 of 2172)
PASS: lldb-unit :: Core/Release/LLDBCoreTests/ModuleSpecTest.TestELFFile (1253 of 2172)
PASS: lldb-unit :: Core/Release/LLDBCoreTests/ModuleSpecTest.TestMachOFile (1254 of 2172)
PASS: lldb-unit :: Core/Release/LLDBCoreTests/RichManglingContextTest.Basic (1255 of 2172)
PASS: lldb-unit :: Core/Release/LLDBCoreTests/RichManglingContextTest.FromCxxMethodName (1256 of 2172)
PASS: lldb-unit :: Core/Release/LLDBCoreTests/RichManglingContextTest.IPDRealloc (1257 of 2172)
PASS: lldb-unit :: Core/Release/LLDBCoreTests/SourceFileCache.FindSourceFileFound (1258 of 2172)
PASS: lldb-unit :: Core/Release/LLDBCoreTests/RichManglingContextTest.SwitchProvider (1259 of 2172)
PASS: lldb-unit :: Core/Release/LLDBCoreTests/SourceFileCache.FindSourceFileNotFound (1260 of 2172)
PASS: lldb-unit :: Core/Release/LLDBCoreTests/StreamCallbackTest.Callback (1261 of 2172)
PASS: lldb-unit :: Core/Release/LLDBCoreTests/UniqueCStringMap.NoDefaultConstructor (1262 of 2172)
XFAIL: lldb-shell :: Unwind/prefer-debug-over-eh-frame.test (1263 of 2172)
PASS: lldb-unit :: DataFormatter/Release/LLDBFormatterTests/FormatManagerTests.CompatibleLangs (1264 of 2172)
PASS: lldb-unit :: DataFormatter/Release/LLDBFormatterTests/StringPrinterTests.CxxASCII (1265 of 2172)
PASS: lldb-unit :: DataFormatter/Release/LLDBFormatterTests/StringPrinterTests.SwiftUTF8 (1266 of 2172)
PASS: lldb-unit :: DataFormatter/Release/LLDBFormatterTests/StringPrinterTests.CxxUTF8 (1267 of 2172)
PASS: lldb-unit :: DataFormatter/Release/LLDBFormatterTests/TypeMatcherTests.CreatedBySameMatchStringExactNamePrefixes (1268 of 2172)
PASS: lldb-unit :: DataFormatter/Release/LLDBFormatterTests/TypeMatcherTests.CreatedBySameMatchString (1269 of 2172)
PASS: lldb-unit :: DataFormatter/Release/LLDBFormatterTests/TypeMatcherTests.ExactName (1270 of 2172)
PASS: lldb-unit :: DataFormatter/Release/LLDBFormatterTests/TypeMatcherTests.RegexMatchPart (1271 of 2172)
PASS: lldb-unit :: DataFormatter/Release/LLDBFormatterTests/TypeMatcherTests.GetMatchStringRegex (1272 of 2172)
PASS: lldb-unit :: DataFormatter/Release/LLDBFormatterTests/TypeMatcherTests.GetMatchStringExactName (1273 of 2172)
PASS: lldb-unit :: DataFormatter/Release/LLDBFormatterTests/TypeMatcherTests.RegexName (1274 of 2172)
PASS: lldb-unit :: Editline/Release/EditlineTests/EditlineTestFixture.EditlineReceivesMultiLineText (1275 of 2172)
PASS: lldb-unit :: Editline/Release/EditlineTests/EditlineTestFixture.EditlineReceivesSingleLineText (1276 of 2172)
PASS: lldb-unit :: Expression/Release/ExpressionTests/ClangExpressionDeclMapTest.TestPersistentDeclLookup (1277 of 2172)
PASS: lldb-unit :: Expression/Release/ExpressionTests/ClangHostTest.ComputeClangResourceDirectory (1278 of 2172)
PASS: lldb-unit :: Expression/Release/ExpressionTests/ClangExpressionDeclMapTest.TestUnknownIdentifierLookup (1279 of 2172)
PASS: lldb-unit :: Expression/Release/ExpressionTests/CppModuleConfigurationTest.AmbiguousCLib (1280 of 2172)
PASS: lldb-unit :: Expression/Release/ExpressionTests/CppModuleConfigurationTest.AmbiguousLibCpp (1281 of 2172)
PASS: lldb-unit :: Expression/Release/ExpressionTests/ClangHostTest.MacOSX (1282 of 2172)
PASS: lldb-unit :: Expression/Release/ExpressionTests/CppModuleConfigurationTest.LibCppV2 (1283 of 2172)
PASS: lldb-unit :: Expression/Release/ExpressionTests/CppModuleConfigurationTest.IgnoreLibStdCpp (1284 of 2172)
PASS: lldb-unit :: Expression/Release/ExpressionTests/CppModuleConfigurationTest.Linux (1285 of 2172)
PASS: lldb-unit :: Expression/Release/ExpressionTests/CppModuleConfigurationTest.LinuxLocalLibCpp (1286 of 2172)
PASS: lldb-unit :: Expression/Release/ExpressionTests/CppModuleConfigurationTest.MissingUsrInclude (1287 of 2172)
PASS: lldb-unit :: Expression/Release/ExpressionTests/CppModuleConfigurationTest.MissingLibCpp (1288 of 2172)
PASS: lldb-unit :: Expression/Release/ExpressionTests/CppModuleConfigurationTest.Sysroot (1289 of 2172)
PASS: lldb-unit :: Expression/Release/ExpressionTests/CppModuleConfigurationTest.UnknownLibCppFile (1290 of 2172)
PASS: lldb-unit :: Expression/Release/ExpressionTests/CppModuleConfigurationTest.UnrelatedLibrary (1291 of 2172)
PASS: lldb-unit :: Expression/Release/ExpressionTests/DWARFExpression.DW_OP_implicit_value (1292 of 2172)
PASS: lldb-unit :: Expression/Release/ExpressionTests/CppModuleConfigurationTest.Xcode (1293 of 2172)
PASS: lldb-unit :: Expression/Release/ExpressionTests/DWARFExpression.DW_OP_convert (1294 of 2172)
PASS: lldb-unit :: Expression/Release/ExpressionTests/DWARFExpression.DW_OP_pick (1295 of 2172)
PASS: lldb-unit :: Expression/Release/ExpressionTests/DWARFExpression.DW_OP_stack_value (1296 of 2172)
PASS: lldb-unit :: Expression/Release/ExpressionTests/DWARFExpression.DW_OP_piece (1297 of 2172)
PASS: lldb-unit :: Expression/Release/ExpressionTests/DWARFExpression.DW_OP_unknown (1298 of 2172)
PASS: lldb-unit :: Expression/Release/ExpressionTests/DiagnosticManagerTest.AddDiagnostic (1299 of 2172)
PASS: lldb-unit :: Expression/Release/ExpressionTests/DiagnosticManagerTest.AppendMessageAttachToLastDiag (1300 of 2172)
PASS: lldb-unit :: Expression/Release/ExpressionTests/DiagnosticManagerTest.AppendMessageNoDiag (1301 of 2172)
PASS: lldb-unit :: Expression/Release/ExpressionTests/DiagnosticManagerTest.AppendMessageSubsequentDiags (1302 of 2172)
PASS: lldb-unit :: Expression/Release/ExpressionTests/DiagnosticManagerTest.FixedExpression (1303 of 2172)
PASS: lldb-unit :: Expression/Release/ExpressionTests/DiagnosticManagerTest.GetStringBasic (1304 of 2172)
PASS: lldb-unit :: Expression/Release/ExpressionTests/DiagnosticManagerTest.GetStringMultiline (1305 of 2172)
PASS: lldb-unit :: Expression/Release/ExpressionTests/DiagnosticManagerTest.GetStringMultipleDiags (1306 of 2172)
PASS: lldb-unit :: Expression/Release/ExpressionTests/DiagnosticManagerTest.GetStringSeverityLabels (1307 of 2172)
PASS: lldb-unit :: Expression/Release/ExpressionTests/DiagnosticManagerTest.GetStringPreserveOrder (1308 of 2172)
PASS: lldb-unit :: Expression/Release/ExpressionTests/DiagnosticManagerTest.GetStringNoDiags (1309 of 2172)
PASS: lldb-unit :: Expression/Release/ExpressionTests/DiagnosticManagerTest.PutString (1310 of 2172)
PASS: lldb-unit :: Expression/Release/ExpressionTests/DiagnosticManagerTest.HasFixits (1311 of 2172)
PASS: lldb-unit :: Expression/Release/ExpressionTests/DiagnosticManagerTest.PutStringMultiple (1312 of 2172)
PASS: lldb-unit :: Host/Release/HostTests/ConnectionFileDescriptorTest.TCPGetURIv4 (1313 of 2172)
PASS: lldb-unit :: Host/Release/HostTests/ConnectionFileDescriptorTest.TCPGetURIv6 (1314 of 2172)
PASS: lldb-unit :: Expression/Release/ExpressionTests/DiagnosticManagerTest.PutStringSeverities (1315 of 2172)
PASS: lldb-unit :: Host/Release/HostTests/FileActionTest.Open (1316 of 2172)
PASS: lldb-unit :: Host/Release/HostTests/File.GetStreamFromDescriptor (1317 of 2172)
PASS: lldb-unit :: Host/Release/HostTests/File.GetWaitableHandleFileno (1318 of 2172)
PASS: lldb-unit :: Host/Release/HostTests/FileSystemTest.EnumerateDirectory (1319 of 2172)
PASS: lldb-unit :: Host/Release/HostTests/FileSystemTest.Exists (1320 of 2172)
PASS: lldb-unit :: Host/Release/HostTests/FileSystemTest.EmptyTest (1321 of 2172)
PASS: lldb-unit :: Host/Release/HostTests/FileSystemTest.FileAndDirectoryComponents (1322 of 2172)
PASS: lldb-unit :: Host/Release/HostTests/FileSystemTest.GetPermissions (1323 of 2172)
PASS: lldb-unit :: Host/Release/HostTests/FileSystemTest.GetByteSize (1324 of 2172)
PASS: lldb-unit :: Host/Release/HostTests/FileSystemTest.Readable (1325 of 2172)
PASS: lldb-unit :: Host/Release/HostTests/FileSystemTest.MakeAbsolute (1326 of 2172)
PASS: lldb-unit :: Host/Release/HostTests/FileSystemTest.OpenErrno (1327 of 2172)
PASS: lldb-unit :: Host/Release/HostTests/Host.GetEnvironment (1328 of 2172)
PASS: lldb-unit :: Host/Release/HostTests/Host.WaitStatusFormat (1329 of 2172)
PASS: lldb-unit :: Host/Release/HostTests/FileSystemTest.Resolve (1330 of 2172)
PASS: lldb-unit :: Host/Release/HostTests/HostInfoTest.GetAugmentedArchSpec (1331 of 2172)
PASS: lldb-unit :: Host/Release/HostTests/HostInfoTest.GetHostname (1332 of 2172)
PASS: lldb-unit :: Host/Release/HostTests/MainLoopTest.ReadObject (1333 of 2172)
PASS: lldb-unit :: Host/Release/HostTests/MainLoopTest.DetectsEOF (1334 of 2172)
PASS: lldb-unit :: Host/Release/HostTests/MainLoopTest.Signal (1335 of 2172)
PASS: lldb-unit :: Host/Release/HostTests/MainLoopTest.TerminatesImmediately (1336 of 2172)
PASS: lldb-unit :: Host/Release/HostTests/HostInfoTest.GetXcodeSDK (1337 of 2172)
PASS: lldb-unit :: Host/Release/HostTests/NativeProcessProtocolTest.ReadCStringFromMemory (1338 of 2172)
PASS: lldb-unit :: Host/Release/HostTests/NativeProcessProtocolTest.ReadCStringFromMemory_CrossPageBoundary (1339 of 2172)
PASS: lldb-unit :: Host/Release/HostTests/NativeProcessProtocolTest.ReadCStringFromMemory_MaxSize (1340 of 2172)
PASS: lldb-unit :: Host/Release/HostTests/NativeProcessProtocolTest.ReadMemoryWithoutTrap (1341 of 2172)
PASS: lldb-unit :: Host/Release/HostTests/NativeProcessProtocolTest.SetBreakpoint (1342 of 2172)
PASS: lldb-unit :: Host/Release/HostTests/NativeProcessProtocolTest.SetBreakpointFailRead (1343 of 2172)
PASS: lldb-unit :: Host/Release/HostTests/NativeProcessProtocolTest.SetBreakpointFailVerify (1344 of 2172)
PASS: lldb-unit :: Host/Release/HostTests/NativeProcessProtocolTest.SetBreakpointFailWrite (1345 of 2172)
PASS: lldb-unit :: Host/Release/HostTests/ProcessLaunchInfoTest.Constructor (1346 of 2172)
PASS: lldb-unit :: Host/Release/HostTests/SocketAddressTest.GetAddressInfo (1347 of 2172)
PASS: lldb-unit :: Host/Release/HostTests/SocketAddressTest.Set (1348 of 2172)
PASS: lldb-unit :: Host/Release/HostTests/SocketTests/SocketTest.DecodeHostAndPort/ipv4 (1349 of 2172)
PASS: lldb-unit :: Host/Release/HostTests/SocketTests/SocketTest.DecodeHostAndPort/ipv6 (1350 of 2172)
PASS: lldb-unit :: Host/Release/HostTests/SocketTests/SocketTest.DomainGetConnectURI/ipv4 (1351 of 2172)
PASS: lldb-unit :: Host/Release/HostTests/SocketTests/SocketTest.DomainGetConnectURI/ipv6 (1352 of 2172)
PASS: lldb-unit :: Host/Release/HostTests/SocketTests/SocketTest.DomainListenConnectAccept/ipv4 (1353 of 2172)
PASS: lldb-unit :: Host/Release/HostTests/SocketTests/SocketTest.DomainListenConnectAccept/ipv6 (1354 of 2172)
PASS: lldb-unit :: Host/Release/HostTests/SocketTests/SocketTest.TCPGetAddress/ipv4 (1355 of 2172)
PASS: lldb-unit :: Host/Release/HostTests/SocketTests/SocketTest.TCPGetConnectURI/ipv4 (1356 of 2172)
PASS: lldb-unit :: Host/Release/HostTests/SocketTests/SocketTest.TCPGetAddress/ipv6 (1357 of 2172)
PASS: lldb-unit :: Host/Release/HostTests/SocketTests/SocketTest.TCPListen0ConnectAccept/ipv4 (1358 of 2172)
PASS: lldb-unit :: Host/Release/HostTests/SocketTests/SocketTest.TCPGetConnectURI/ipv6 (1359 of 2172)
PASS: lldb-unit :: Host/Release/HostTests/SocketTests/SocketTest.TCPListen0ConnectAccept/ipv6 (1360 of 2172)
PASS: lldb-unit :: Host/Release/HostTests/SocketTests/SocketTest.TCPListen0GetPort/ipv4 (1361 of 2172)
PASS: lldb-unit :: Host/Release/HostTests/SocketTests/SocketTest.UDPConnect/ipv4 (1362 of 2172)
PASS: lldb-unit :: Host/Release/HostTests/SocketTests/SocketTest.TCPListen0GetPort/ipv6 (1363 of 2172)
PASS: lldb-unit :: Host/Release/HostTests/SocketTests/SocketTest.UDPConnect/ipv6 (1364 of 2172)
PASS: lldb-unit :: Host/Release/HostTests/SocketTests/SocketTest.UDPGetConnectURI/ipv4 (1365 of 2172)
PASS: lldb-unit :: Host/Release/HostTests/SocketTests/SocketTest.UDPGetConnectURI/ipv6 (1366 of 2172)
PASS: lldb-unit :: Interpreter/Release/InterpreterTests/CompletionTest.DirCompletionAbsolute (1367 of 2172)
PASS: lldb-unit :: Interpreter/Release/InterpreterTests/CompletionTest.DirCompletionUsername (1368 of 2172)
PASS: lldb-unit :: Interpreter/Release/InterpreterTests/CompletionTest.FileCompletionAbsolute (1369 of 2172)
PASS: lldb-unit :: Interpreter/Release/InterpreterTests/OptionArgParserTest.toBoolean (1370 of 2172)
PASS: lldb-unit :: Interpreter/Release/InterpreterTests/OptionArgParserTest.toChar (1371 of 2172)
PASS: lldb-unit :: Interpreter/Release/InterpreterTests/OptionArgParserTest.toScriptLanguage (1372 of 2172)
PASS: lldb-unit :: Interpreter/Release/InterpreterTests/OptionValueFileColonLine.setFromString (1373 of 2172)
PASS: lldb-unit :: Language/CLanguages/Release/LanguageCLanguagesTests/CLanguages.LookupCLanguagesByLanguageType (1374 of 2172)
PASS: lldb-api :: types/TestLongTypes.py (1375 of 2172)
PASS: lldb-unit :: Language/CPlusPlus/Release/LanguageCPlusPlusTests/CPlusPlusLanguage.CPlusPlusNameParser (1376 of 2172)
PASS: lldb-unit :: Language/CPlusPlus/Release/LanguageCPlusPlusTests/CPlusPlusLanguage.ExtractContextAndIdentifier (1377 of 2172)
PASS: lldb-unit :: Language/CPlusPlus/Release/LanguageCPlusPlusTests/CPlusPlusLanguage.FindAlternateFunctionManglings (1378 of 2172)
PASS: lldb-unit :: Language/CPlusPlus/Release/LanguageCPlusPlusTests/CPlusPlusLanguage.MethodNameParsing (1379 of 2172)
PASS: lldb-unit :: Language/Highlighting/Release/HighlighterTests/HighlighterTest.ClangBraces (1380 of 2172)
PASS: lldb-unit :: Language/Highlighting/Release/HighlighterTests/HighlighterTest.ClangCommas (1381 of 2172)
PASS: lldb-unit :: Language/Highlighting/Release/HighlighterTests/HighlighterTest.ClangComments (1382 of 2172)
PASS: lldb-unit :: Language/Highlighting/Release/HighlighterTests/HighlighterTest.ClangCursorOutOfBounds (1383 of 2172)
PASS: lldb-unit :: Language/Highlighting/Release/HighlighterTests/HighlighterTest.ClangCursorPos (1384 of 2172)
PASS: lldb-unit :: Language/Highlighting/Release/HighlighterTests/HighlighterTest.ClangCursorPosAfterOtherToken (1385 of 2172)
PASS: lldb-unit :: Language/Highlighting/Release/HighlighterTests/HighlighterTest.ClangCursorPosEndOfLine (1386 of 2172)
PASS: lldb-unit :: Language/Highlighting/Release/HighlighterTests/HighlighterTest.ClangCursorPosBeforeOtherToken (1387 of 2172)
PASS: lldb-unit :: Language/Highlighting/Release/HighlighterTests/HighlighterTest.ClangCursorPosInOtherToken (1388 of 2172)
PASS: lldb-unit :: Language/Highlighting/Release/HighlighterTests/HighlighterTest.ClangEmptyInput (1389 of 2172)
PASS: lldb-unit :: Language/Highlighting/Release/HighlighterTests/HighlighterTest.ClangIdentifiers (1390 of 2172)
PASS: lldb-unit :: Language/Highlighting/Release/HighlighterTests/HighlighterTest.ClangOperators (1391 of 2172)
PASS: lldb-unit :: Language/Highlighting/Release/HighlighterTests/HighlighterTest.ClangPPDirectives (1392 of 2172)
PASS: lldb-unit :: Language/Highlighting/Release/HighlighterTests/HighlighterTest.ClangPreserveNewLine (1393 of 2172)
PASS: lldb-unit :: Language/Highlighting/Release/HighlighterTests/HighlighterTest.ClangScalarLiterals (1394 of 2172)
PASS: lldb-unit :: Language/Highlighting/Release/HighlighterTests/HighlighterTest.ClangStringLiterals (1395 of 2172)
PASS: lldb-unit :: Language/Highlighting/Release/HighlighterTests/HighlighterTest.ClangSquareBrackets (1396 of 2172)
PASS: lldb-unit :: Language/Highlighting/Release/HighlighterTests/HighlighterTest.ClangTrailingBackslashBeforeNewline (1397 of 2172)
PASS: lldb-unit :: Language/Highlighting/Release/HighlighterTests/HighlighterTest.ClangTrailingBackslashWithWhitespace (1398 of 2172)
PASS: lldb-unit :: Language/Highlighting/Release/HighlighterTests/HighlighterTest.ClangTrailingBackslashMissingNewLine (1399 of 2172)
PASS: lldb-unit :: Language/Highlighting/Release/HighlighterTests/HighlighterTest.ClangUnterminatedString (1400 of 2172)
PASS: lldb-unit :: Language/Highlighting/Release/HighlighterTests/HighlighterTest.DefaultHighlighter (1401 of 2172)
PASS: lldb-unit :: Language/Highlighting/Release/HighlighterTests/HighlighterTest.Colons (1402 of 2172)
PASS: lldb-unit :: Language/Highlighting/Release/HighlighterTests/HighlighterTest.DefaultHighlighterWithCursor (1403 of 2172)
PASS: lldb-unit :: Language/Highlighting/Release/HighlighterTests/HighlighterTest.DefaultHighlighterWithCursorOutOfBounds (1404 of 2172)
PASS: lldb-unit :: Language/Highlighting/Release/HighlighterTests/HighlighterTest.FallbackHighlighter (1405 of 2172)
PASS: lldb-unit :: Language/Highlighting/Release/HighlighterTests/HighlighterTest.HighlighterSelectionPath (1406 of 2172)
PASS: lldb-unit :: ObjectFile/Breakpad/Release/ObjectFileBreakpadTests/FileRecord.parse (1407 of 2172)
PASS: lldb-unit :: Language/Highlighting/Release/HighlighterTests/HighlighterTest.Keywords (1408 of 2172)
PASS: lldb-unit :: Language/Highlighting/Release/HighlighterTests/HighlighterTest.HighlighterSelectionType (1409 of 2172)
PASS: lldb-unit :: ObjectFile/Breakpad/Release/ObjectFileBreakpadTests/FuncRecord.parse (1410 of 2172)
PASS: lldb-unit :: ObjectFile/Breakpad/Release/ObjectFileBreakpadTests/LineRecord.parse (1411 of 2172)
PASS: lldb-unit :: ObjectFile/Breakpad/Release/ObjectFileBreakpadTests/InfoRecord.parse (1412 of 2172)
PASS: lldb-unit :: ObjectFile/Breakpad/Release/ObjectFileBreakpadTests/ModuleRecord.parse (1413 of 2172)
PASS: lldb-unit :: ObjectFile/Breakpad/Release/ObjectFileBreakpadTests/PublicRecord.parse (1414 of 2172)
PASS: lldb-unit :: ObjectFile/Breakpad/Release/ObjectFileBreakpadTests/Record.classify (1415 of 2172)
PASS: lldb-unit :: ObjectFile/Breakpad/Release/ObjectFileBreakpadTests/StackCFIRecord.parse (1416 of 2172)
PASS: lldb-unit :: ObjectFile/Breakpad/Release/ObjectFileBreakpadTests/StackWinRecord.parse (1417 of 2172)
PASS: lldb-unit :: ObjectFile/ELF/Release/ObjectFileELFTests/ObjectFileELFTest.GetModuleSpecifications_EarlySectionHeaders (1418 of 2172)
PASS: lldb-unit :: ObjectFile/ELF/Release/ObjectFileELFTests/ObjectFileELFTest.GetSymtab_NoSymEntryPointArmAddressClass (1419 of 2172)
PASS: lldb-unit :: ObjectFile/ELF/Release/ObjectFileELFTests/ObjectFileELFTest.GetSymtab_NoSymEntryPointArmThumbAddressClass (1420 of 2172)
PASS: lldb-unit :: ObjectFile/ELF/Release/ObjectFileELFTests/ObjectFileELFTest.SectionsResolveConsistently (1421 of 2172)
PASS: lldb-unit :: ObjectFile/PECOFF/Release/ObjectFilePECOFFTests/PECallFrameInfoTest.Basic_eh (1422 of 2172)
PASS: lldb-unit :: ObjectFile/PECOFF/Release/ObjectFilePECOFFTests/PECallFrameInfoTest.Chained_eh (1423 of 2172)
PASS: lldb-unit :: ObjectFile/MachO/Release/ObjectFileMachOTests/ObjectFileMachOTest.ModuleFromSharedCacheInfo (1424 of 2172)
PASS: lldb-unit :: Platform/Android/Release/AdbClientTests/AdbClientTest.CreateByDeviceId (1425 of 2172)
PASS: lldb-unit :: ObjectFile/PECOFF/Release/ObjectFilePECOFFTests/PECallFrameInfoTest.Frame_reg_eh (1426 of 2172)
PASS: lldb-unit :: Platform/Android/Release/AdbClientTests/AdbClientTest.CreateByDeviceId_ByEnvVar (1427 of 2172)
PASS: lldb-unit :: Platform/Release/LLDBPlatformTests/PlatformDarwinTest.FindComponentInPath (1428 of 2172)
PASS: lldb-unit :: Platform/Release/LLDBPlatformTests/PlatformDarwinTest.TestParseVersionBuildDir (1429 of 2172)
PASS: lldb-unit :: Process/Release/ProcessEventDataTests/ProcessEventDataTest.DoOnRemoval (1430 of 2172)
PASS: lldb-shell :: Watchpoint/SetErrorCases.test (1431 of 2172)
PASS: lldb-unit :: Process/Release/ProcessEventDataTests/ProcessEventDataTest.ShouldStop (1432 of 2172)
PASS: lldb-unit :: Process/gdb-remote/Release/ProcessGdbRemoteTests/GDBRemoteClientBaseTest.SendContinueAndAsyncPacket (1433 of 2172)
PASS: lldb-unit :: Process/gdb-remote/Release/ProcessGdbRemoteTests/GDBRemoteClientBaseTest.SendContinueAndAsyncSignal (1434 of 2172)
PASS: lldb-unit :: Process/gdb-remote/Release/ProcessGdbRemoteTests/GDBRemoteClientBaseTest.SendContinueAndInterrupt (1435 of 2172)
PASS: lldb-unit :: Process/gdb-remote/Release/ProcessGdbRemoteTests/GDBRemoteClientBaseTest.SendContinueAndInterrupt2PacketBug (1436 of 2172)
PASS: lldb-unit :: Process/gdb-remote/Release/ProcessGdbRemoteTests/GDBRemoteClientBaseTest.SendContinueAndLateInterrupt (1437 of 2172)
PASS: lldb-unit :: Process/gdb-remote/Release/ProcessGdbRemoteTests/GDBRemoteClientBaseTest.SendContinueAndWait (1438 of 2172)
PASS: lldb-unit :: Process/gdb-remote/Release/ProcessGdbRemoteTests/GDBRemoteClientBaseTest.SendContinueDelegateInterface (1439 of 2172)
PASS: lldb-unit :: Process/gdb-remote/Release/ProcessGdbRemoteTests/GDBRemoteClientBaseTest.SendContinueDelegateStructuredDataReceipt (1440 of 2172)
PASS: lldb-unit :: Process/gdb-remote/Release/ProcessGdbRemoteTests/GDBRemoteClientBaseTest.SendPacketAndReceiveResponseWithOutputSupport (1441 of 2172)
PASS: lldb-unit :: Process/gdb-remote/Release/ProcessGdbRemoteTests/GDBRemoteCommunicationClientTest.GetMemoryRegionInfo (1442 of 2172)
PASS: lldb-unit :: Process/gdb-remote/Release/ProcessGdbRemoteTests/GDBRemoteCommunicationClientTest.GetMemoryRegionInfoInvalidResponse (1443 of 2172)
PASS: lldb-shell :: Reproducer/TestWorkingDir.test (1444 of 2172)
PASS: lldb-unit :: Process/gdb-remote/Release/ProcessGdbRemoteTests/GDBRemoteCommunicationClientTest.GetModulesInfo (1445 of 2172)
PASS: lldb-unit :: Process/gdb-remote/Release/ProcessGdbRemoteTests/GDBRemoteCommunicationClientTest.GetModulesInfoInvalidResponse (1446 of 2172)
PASS: lldb-unit :: Process/gdb-remote/Release/ProcessGdbRemoteTests/GDBRemoteCommunicationClientTest.GetModulesInfo_UUID20 (1447 of 2172)
PASS: lldb-unit :: Process/gdb-remote/Release/ProcessGdbRemoteTests/GDBRemoteCommunicationClientTest.ReadRegister (1448 of 2172)
PASS: lldb-unit :: Process/gdb-remote/Release/ProcessGdbRemoteTests/GDBRemoteCommunicationClientTest.GetQOffsets (1449 of 2172)
PASS: lldb-unit :: Process/gdb-remote/Release/ProcessGdbRemoteTests/GDBRemoteCommunicationClientTest.SaveRestoreRegistersNoSuffix (1450 of 2172)
PASS: lldb-unit :: Process/gdb-remote/Release/ProcessGdbRemoteTests/GDBRemoteCommunicationClientTest.SendGetDataPacket (1451 of 2172)
PASS: lldb-unit :: Process/gdb-remote/Release/ProcessGdbRemoteTests/GDBRemoteCommunicationClientTest.SendGetTraceConfigPacket (1452 of 2172)
PASS: lldb-unit :: Process/gdb-remote/Release/ProcessGdbRemoteTests/GDBRemoteCommunicationClientTest.SendGetMetaDataPacket (1453 of 2172)
PASS: lldb-unit :: Process/gdb-remote/Release/ProcessGdbRemoteTests/GDBRemoteCommunicationClientTest.SendSignalsToIgnore (1454 of 2172)
PASS: lldb-unit :: Process/gdb-remote/Release/ProcessGdbRemoteTests/GDBRemoteCommunicationClientTest.SendStartTracePacket (1455 of 2172)
PASS: lldb-unit :: Process/gdb-remote/Release/ProcessGdbRemoteTests/GDBRemoteCommunicationClientTest.SendStopTracePacket (1456 of 2172)
PASS: lldb-unit :: Process/gdb-remote/Release/ProcessGdbRemoteTests/GDBRemoteCommunicationClientTest.SyncThreadState (1457 of 2172)
PASS: lldb-unit :: Process/gdb-remote/Release/ProcessGdbRemoteTests/GDBRemoteCommunicationClientTest.WriteRegister (1458 of 2172)
PASS: lldb-unit :: Process/gdb-remote/Release/ProcessGdbRemoteTests/GDBRemoteCommunicationClientTest.WriteRegisterNoSuffix (1459 of 2172)
PASS: lldb-unit :: Process/gdb-remote/Release/ProcessGdbRemoteTests/GDBRemoteCommunicationServerTest.SendErrorResponse_ErrorList (1460 of 2172)
PASS: lldb-unit :: Process/gdb-remote/Release/ProcessGdbRemoteTests/GDBRemoteCommunicationClientTest.TestPacketSpeedJSON (1461 of 2172)
PASS: lldb-unit :: Process/gdb-remote/Release/ProcessGdbRemoteTests/GDBRemoteCommunicationServerTest.SendErrorResponse_ErrorNumber (1462 of 2172)
PASS: lldb-unit :: Process/gdb-remote/Release/ProcessGdbRemoteTests/GDBRemoteCommunicationServerTest.SendErrorResponse_Status (1463 of 2172)
PASS: lldb-unit :: Process/gdb-remote/Release/ProcessGdbRemoteTests/GDBRemoteCommunicationServerTest.SendErrorResponse_StringError (1464 of 2172)
PASS: lldb-unit :: Process/gdb-remote/Release/ProcessGdbRemoteTests/GDBRemoteCommunicationServerTest.SendErrorResponse_UnimplementedError (1465 of 2172)
PASS: lldb-unit :: Process/gdb-remote/Release/ProcessGdbRemoteTests/GDBRemoteCommunicationTest.ReadPacket_checksum (1466 of 2172)
PASS: lldb-unit :: Process/minidump/Release/LLDBMinidumpTests/MinidumpParserTest.FindMemoryRange (1467 of 2172)
PASS: lldb-unit :: Process/minidump/Release/LLDBMinidumpTests/MinidumpParserTest.FindMemoryRangeWithFullMemoryMinidump (1468 of 2172)
PASS: lldb-unit :: Process/minidump/Release/LLDBMinidumpTests/MinidumpParserTest.GetArchitecture (1469 of 2172)
PASS: lldb-unit :: Process/minidump/Release/LLDBMinidumpTests/MinidumpParserTest.GetArchitectureWindows (1470 of 2172)
PASS: lldb-unit :: Process/minidump/Release/LLDBMinidumpTests/MinidumpParserTest.GetExceptionStream (1471 of 2172)
PASS: lldb-unit :: Process/minidump/Release/LLDBMinidumpTests/MinidumpParserTest.GetFilteredModuleList (1472 of 2172)
PASS: lldb-unit :: Process/minidump/Release/LLDBMinidumpTests/MinidumpParserTest.GetLinuxProcStatus (1473 of 2172)
PASS: lldb-unit :: Process/minidump/Release/LLDBMinidumpTests/MinidumpParserTest.GetLinuxProcStatus_no_stream (1474 of 2172)
PASS: lldb-unit :: Process/minidump/Release/LLDBMinidumpTests/MinidumpParserTest.GetMemory (1475 of 2172)
PASS: lldb-unit :: Process/minidump/Release/LLDBMinidumpTests/MinidumpParserTest.GetMemoryRegionInfo (1476 of 2172)
PASS: lldb-unit :: Process/minidump/Release/LLDBMinidumpTests/MinidumpParserTest.GetMemoryRegionInfoFromMemory64List (1477 of 2172)
PASS: lldb-unit :: Process/minidump/Release/LLDBMinidumpTests/MinidumpParserTest.GetMemoryRegionInfoFromMemoryList (1478 of 2172)
PASS: lldb-unit :: Process/minidump/Release/LLDBMinidumpTests/MinidumpParserTest.GetMemoryRegionInfoLinuxMaps (1479 of 2172)
PASS: lldb-unit :: Process/minidump/Release/LLDBMinidumpTests/MinidumpParserTest.GetMiscInfoWindows (1480 of 2172)
PASS: lldb-unit :: Process/minidump/Release/LLDBMinidumpTests/MinidumpParserTest.GetMiscInfo_no_stream (1481 of 2172)
PASS: lldb-unit :: Process/minidump/Release/LLDBMinidumpTests/MinidumpParserTest.GetPid (1482 of 2172)
PASS: lldb-unit :: Process/minidump/Release/LLDBMinidumpTests/MinidumpParserTest.GetPidWindows (1483 of 2172)
PASS: lldb-unit :: Process/minidump/Release/LLDBMinidumpTests/MinidumpParserTest.GetPidWow64 (1484 of 2172)
PASS: lldb-unit :: Process/minidump/Release/LLDBMinidumpTests/MinidumpParserTest.GetThreadContext_x86_32 (1485 of 2172)
PASS: lldb-unit :: Process/minidump/Release/LLDBMinidumpTests/MinidumpParserTest.GetThreadContext_x86_32_wow64 (1486 of 2172)
PASS: lldb-unit :: Process/minidump/Release/LLDBMinidumpTests/MinidumpParserTest.GetThreadContext_x86_64 (1487 of 2172)
PASS: lldb-unit :: Process/minidump/Release/LLDBMinidumpTests/MinidumpParserTest.GetThreadsAndGetThreadContext (1488 of 2172)
PASS: lldb-unit :: Process/minidump/Release/LLDBMinidumpTests/MinidumpParserTest.MinidumpDuplicateModuleMappedFirst (1489 of 2172)
PASS: lldb-unit :: Process/minidump/Release/LLDBMinidumpTests/MinidumpParserTest.InvalidMinidump (1490 of 2172)
PASS: lldb-unit :: Process/minidump/Release/LLDBMinidumpTests/MinidumpParserTest.MinidumpDuplicateModuleMinAddress (1491 of 2172)
PASS: lldb-unit :: Process/minidump/Release/LLDBMinidumpTests/MinidumpParserTest.MinidumpDuplicateModuleMappedSecond (1492 of 2172)
PASS: lldb-unit :: Process/minidump/Release/LLDBMinidumpTests/MinidumpParserTest.MinidumpModuleOrder (1493 of 2172)
PASS: lldb-unit :: Process/minidump/Release/LLDBMinidumpTests/MinidumpParserTest.MinidumpDuplicateModuleSeparateCode (1494 of 2172)
PASS: lldb-unit :: Process/minidump/Release/LLDBMinidumpTests/RegisterContextMinidump.CheckRegisterContextMinidump_ARM (1495 of 2172)
PASS: lldb-unit :: Process/minidump/Release/LLDBMinidumpTests/RegisterContextMinidump.ConvertMinidumpContext_x86_32 (1496 of 2172)
PASS: lldb-unit :: Process/minidump/Release/LLDBMinidumpTests/RegisterContextMinidump.ConvertMinidumpContext_x86_64 (1497 of 2172)
PASS: lldb-unit :: ScriptInterpreter/Python/Release/ScriptInterpreterPythonTests/PythonDataObjectsTest.TestBorrowedReferences (1498 of 2172)
PASS: lldb-unit :: ScriptInterpreter/Python/Release/ScriptInterpreterPythonTests/PythonDataObjectsTest.TestCallable (1499 of 2172)
PASS: lldb-unit :: ScriptInterpreter/Python/Release/ScriptInterpreterPythonTests/PythonDataObjectsTest.TestDictionaryResolutionWithDot (1500 of 2172)
PASS: lldb-unit :: ScriptInterpreter/Python/Release/ScriptInterpreterPythonTests/PythonDataObjectsTest.TestExceptions (1501 of 2172)
PASS: lldb-unit :: ScriptInterpreter/Python/Release/ScriptInterpreterPythonTests/PythonDataObjectsTest.TestExtractingUInt64ThroughStructuredData (1502 of 2172)
PASS: lldb-shell :: SymbolFile/Breakpad/unwind-via-raSearch.test (1503 of 2172)
PASS: lldb-shell :: SymbolFile/Breakpad/unwind-via-stack-win-no-memory-info.yaml (1504 of 2172)
PASS: lldb-shell :: SymbolFile/Breakpad/unwind-via-stack-win.test (1505 of 2172)
PASS: lldb-unit :: ScriptInterpreter/Python/Release/ScriptInterpreterPythonTests/PythonDataObjectsTest.TestGlobalNameResolutionNoDot (1506 of 2172)
PASS: lldb-unit :: ScriptInterpreter/Python/Release/ScriptInterpreterPythonTests/PythonDataObjectsTest.TestGlobalNameResolutionWithDot (1507 of 2172)
PASS: lldb-unit :: ScriptInterpreter/Python/Release/ScriptInterpreterPythonTests/PythonDataObjectsTest.TestModuleNameResolutionNoDot (1508 of 2172)
PASS: lldb-unit :: ScriptInterpreter/Python/Release/ScriptInterpreterPythonTests/PythonDataObjectsTest.TestInstanceNameResolutionNoDot (1509 of 2172)
PASS: lldb-unit :: ScriptInterpreter/Python/Release/ScriptInterpreterPythonTests/PythonDataObjectsTest.TestObjectAttributes (1510 of 2172)
PASS: lldb-unit :: ScriptInterpreter/Python/Release/ScriptInterpreterPythonTests/PythonDataObjectsTest.TestOwnedReferences (1511 of 2172)
PASS: lldb-unit :: ScriptInterpreter/Python/Release/ScriptInterpreterPythonTests/PythonDataObjectsTest.TestPythonBoolean (1512 of 2172)
PASS: lldb-unit :: ScriptInterpreter/Python/Release/ScriptInterpreterPythonTests/PythonDataObjectsTest.TestPythonByteArray (1513 of 2172)
PASS: lldb-unit :: ScriptInterpreter/Python/Release/ScriptInterpreterPythonTests/PythonDataObjectsTest.TestPythonCallableInvoke (1514 of 2172)
PASS: lldb-unit :: ScriptInterpreter/Python/Release/ScriptInterpreterPythonTests/PythonDataObjectsTest.TestPythonCallableCheck (1515 of 2172)
PASS: lldb-unit :: ScriptInterpreter/Python/Release/ScriptInterpreterPythonTests/PythonDataObjectsTest.TestPythonBytes (1516 of 2172)
PASS: lldb-unit :: ScriptInterpreter/Python/Release/ScriptInterpreterPythonTests/PythonDataObjectsTest.TestPythonDictionaryManipulation (1517 of 2172)
PASS: lldb-unit :: ScriptInterpreter/Python/Release/ScriptInterpreterPythonTests/PythonDataObjectsTest.TestPythonDictionaryToStructuredDictionary (1518 of 2172)
PASS: lldb-unit :: ScriptInterpreter/Python/Release/ScriptInterpreterPythonTests/PythonDataObjectsTest.TestPythonDictionaryValueEquality (1519 of 2172)
PASS: lldb-unit :: ScriptInterpreter/Python/Release/ScriptInterpreterPythonTests/PythonDataObjectsTest.TestPythonFile (1520 of 2172)
PASS: lldb-unit :: ScriptInterpreter/Python/Release/ScriptInterpreterPythonTests/PythonDataObjectsTest.TestPythonInteger (1521 of 2172)
PASS: lldb-unit :: ScriptInterpreter/Python/Release/ScriptInterpreterPythonTests/PythonDataObjectsTest.TestPythonIntegerToStr (1522 of 2172)
PASS: lldb-unit :: ScriptInterpreter/Python/Release/ScriptInterpreterPythonTests/PythonDataObjectsTest.TestPythonIntegerToStructuredInteger (1523 of 2172)
PASS: lldb-unit :: ScriptInterpreter/Python/Release/ScriptInterpreterPythonTests/PythonDataObjectsTest.TestPythonListManipulation (1524 of 2172)
PASS: lldb-unit :: ScriptInterpreter/Python/Release/ScriptInterpreterPythonTests/PythonDataObjectsTest.TestPythonListValueEquality (1525 of 2172)
PASS: lldb-unit :: ScriptInterpreter/Python/Release/ScriptInterpreterPythonTests/PythonDataObjectsTest.TestPythonListToStructuredList (1526 of 2172)
PASS: lldb-unit :: ScriptInterpreter/Python/Release/ScriptInterpreterPythonTests/PythonDataObjectsTest.TestPythonString (1527 of 2172)
PASS: lldb-unit :: ScriptInterpreter/Python/Release/ScriptInterpreterPythonTests/PythonDataObjectsTest.TestPythonStringToStr (1528 of 2172)
PASS: lldb-unit :: ScriptInterpreter/Python/Release/ScriptInterpreterPythonTests/PythonDataObjectsTest.TestPythonStringToStructuredString (1529 of 2172)
PASS: lldb-unit :: ScriptInterpreter/Python/Release/ScriptInterpreterPythonTests/PythonDataObjectsTest.TestPythonTupleInitializerList2 (1530 of 2172)
PASS: lldb-unit :: ScriptInterpreter/Python/Release/ScriptInterpreterPythonTests/PythonDataObjectsTest.TestPythonTupleInitializerList (1531 of 2172)
PASS: lldb-unit :: ScriptInterpreter/Python/Release/ScriptInterpreterPythonTests/PythonDataObjectsTest.TestPythonTupleSize (1532 of 2172)
PASS: lldb-unit :: ScriptInterpreter/Python/Release/ScriptInterpreterPythonTests/PythonDataObjectsTest.TestPythonTupleToStructuredList (1533 of 2172)
PASS: lldb-unit :: ScriptInterpreter/Python/Release/ScriptInterpreterPythonTests/PythonDataObjectsTest.TestPythonTupleValues (1534 of 2172)
PASS: lldb-unit :: ScriptInterpreter/Python/Release/ScriptInterpreterPythonTests/PythonDataObjectsTest.TestResetting (1535 of 2172)
PASS: lldb-unit :: ScriptInterpreter/Python/Release/ScriptInterpreterPythonTests/PythonDataObjectsTest.TestScript (1536 of 2172)
PASS: lldb-unit :: ScriptInterpreter/Python/Release/ScriptInterpreterPythonTests/PythonDataObjectsTest.TestRun (1537 of 2172)
PASS: lldb-unit :: Signals/Release/SignalsTests/UnixSignalsTest.GetFilteredSignals (1538 of 2172)
PASS: lldb-unit :: Signals/Release/SignalsTests/UnixSignalsTest.GetInfo (1539 of 2172)
PASS: lldb-unit :: Signals/Release/SignalsTests/UnixSignalsTest.Iteration (1540 of 2172)
PASS: lldb-unit :: Signals/Release/SignalsTests/UnixSignalsTest.VersionChange (1541 of 2172)
PASS: lldb-unit :: Symbol/Release/SymbolTests/DWARFCallFrameInfoTest.Basic_dwarf3 (1542 of 2172)
PASS: lldb-unit :: Symbol/Release/SymbolTests/DWARFCallFrameInfoTest.Basic_eh (1543 of 2172)
PASS: lldb-unit :: Symbol/Release/SymbolTests/DWARFCallFrameInfoTest.Basic_dwarf4 (1544 of 2172)
PASS: lldb-unit :: ScriptInterpreter/Python/Release/ScriptInterpreterPythonTests/PythonDataObjectsTest.TestTypeNameResolutionNoDot (1545 of 2172)
PASS: lldb-unit :: Symbol/Release/SymbolTests/LineEntryTest.GetSameLineContiguousAddressRangeNestedInline (1546 of 2172)
PASS: lldb-unit :: Symbol/Release/SymbolTests/PostfixExpression.ParseFPOProgram (1547 of 2172)
PASS: lldb-unit :: Symbol/Release/SymbolTests/LineEntryTest.GetSameLineContiguousAddressRangeNoInlines (1548 of 2172)
PASS: lldb-unit :: Symbol/Release/SymbolTests/PostfixExpression.ParseOneExpression (1549 of 2172)
PASS: lldb-unit :: Symbol/Release/SymbolTests/PostfixExpression.ToDWARF (1550 of 2172)
PASS: lldb-unit :: Symbol/Release/SymbolTests/LineEntryTest.GetSameLineContiguousAddressRangeOneInline (1551 of 2172)
PASS: lldb-unit :: Symbol/Release/SymbolTests/SymbolsTest.LocateExecutableSymbolFileForUnknownExecutableAndMissingSymbolFile (1552 of 2172)
PASS: lldb-unit :: Symbol/Release/SymbolTests/TestClangASTImporter.CanImportInvalidType (1553 of 2172)
PASS: lldb-unit :: Symbol/Release/SymbolTests/SymbolsTest.TerminateLocateExecutableSymbolFileForUnknownExecutableAndUnknownSymbolFile (1554 of 2172)
PASS: lldb-unit :: Symbol/Release/SymbolTests/TestClangASTImporter.CompleteFwdDeclWithOtherOrigin (1555 of 2172)
PASS: lldb-unit :: Symbol/Release/SymbolTests/TestClangASTImporter.CopyDeclTagDecl (1556 of 2172)
PASS: lldb-unit :: Symbol/Release/SymbolTests/TestClangASTImporter.DeportDeclTagDecl (1557 of 2172)
PASS: lldb-unit :: Symbol/Release/SymbolTests/TestClangASTImporter.CopyTypeTagDecl (1558 of 2172)
PASS: lldb-unit :: Symbol/Release/SymbolTests/TestClangASTImporter.ImportInvalidType (1559 of 2172)
PASS: lldb-unit :: Symbol/Release/SymbolTests/TestClangASTImporter.MetadataPropagation (1560 of 2172)
PASS: lldb-unit :: Symbol/Release/SymbolTests/TestClangASTImporter.DeportTypeTagDecl (1561 of 2172)
PASS: lldb-unit :: Symbol/Release/SymbolTests/TestClangASTImporter.MetadataPropagationAfterCopying (1562 of 2172)
PASS: lldb-unit :: Symbol/Release/SymbolTests/TestClangASTImporter.MetadataPropagationIndirectImport (1563 of 2172)
PASS: lldb-unit :: Symbol/Release/SymbolTests/TestClangASTImporter.RecordLayout (1564 of 2172)
PASS: lldb-unit :: Symbol/Release/SymbolTests/TestTypeSystemClang.AddMethodToObjCObjectType (1565 of 2172)
PASS: lldb-unit :: Symbol/Release/SymbolTests/TestTypeSystemClang.TemplateArguments (1566 of 2172)
PASS: lldb-unit :: Symbol/Release/SymbolTests/TestTypeSystemClang.TestConvertAccessTypeToAccessSpecifier (1567 of 2172)
PASS: lldb-unit :: Symbol/Release/SymbolTests/TestTypeSystemClang.TestBuiltinTypeForEncodingAndBitSize (1568 of 2172)
PASS: lldb-unit :: Host/Release/HostTests/MainLoopTest.UnmonitoredSignal (1569 of 2172)
PASS: lldb-unit :: Symbol/Release/SymbolTests/TestTypeSystemClang.TestDisplayName (1570 of 2172)
PASS: lldb-unit :: Symbol/Release/SymbolTests/TestTypeSystemClang.TestDisplayNameEmpty (1571 of 2172)
PASS: lldb-unit :: Symbol/Release/SymbolTests/TestTypeSystemClang.TestDeletingImplicitCopyCstrDueToMoveCStr (1572 of 2172)
PASS: lldb-unit :: Symbol/Release/SymbolTests/TestTypeSystemClang.TestFunctionTemplateConstruction (1573 of 2172)
PASS: lldb-unit :: Symbol/Release/SymbolTests/TestTypeSystemClang.TestFunctionTemplateInRecordConstruction (1574 of 2172)
PASS: lldb-unit :: Symbol/Release/SymbolTests/TestTypeSystemClang.TestGetBasicTypeFromEnum (1575 of 2172)
PASS: lldb-unit :: Symbol/Release/SymbolTests/TestTypeSystemClang.TestGetEnumIntegerTypeInvalid (1576 of 2172)
PASS: lldb-unit :: Symbol/Release/SymbolTests/TestTypeSystemClang.TestGetBasicTypeFromName (1577 of 2172)
PASS: lldb-unit :: Symbol/Release/SymbolTests/TestTypeSystemClang.TestGetEnumIntegerTypeBasicTypes (1578 of 2172)
PASS: lldb-unit :: Symbol/Release/SymbolTests/TestTypeSystemClang.TestGetEnumIntegerTypeUnexpectedType (1579 of 2172)
PASS: lldb-unit :: Symbol/Release/SymbolTests/TestTypeSystemClang.TestGetTypeClassDeclType (1580 of 2172)
PASS: lldb-unit :: Symbol/Release/SymbolTests/TestTypeSystemClang.TestGetTypeClassNested (1581 of 2172)
PASS: lldb-unit :: Symbol/Release/SymbolTests/TestTypeSystemClang.TestGetTypeClassTypeOf (1582 of 2172)
PASS: lldb-unit :: Symbol/Release/SymbolTests/TestTypeSystemClang.TestGetTypeClassTypeOfExpr (1583 of 2172)
PASS: lldb-unit :: Symbol/Release/SymbolTests/TestTypeSystemClang.TestIsClangType (1584 of 2172)
PASS: lldb-unit :: Symbol/Release/SymbolTests/TestTypeSystemClang.TestOwningModule (1585 of 2172)
PASS: lldb-unit :: Symbol/Release/SymbolTests/TestTypeSystemClang.TestNotDeletingUserCopyCstrDueToMoveCStr (1586 of 2172)
PASS: lldb-unit :: Symbol/Release/SymbolTests/TestTypeSystemClang.TestRecordHasFields (1587 of 2172)
PASS: lldb-unit :: Symbol/Release/SymbolTests/TestTypeSystemClang.TestRemoveFastQualifiers (1588 of 2172)
PASS: lldb-unit :: Symbol/Release/SymbolTests/TestTypeSystemClang.TestUnifyAccessSpecifiers (1589 of 2172)
PASS: lldb-unit :: Symbol/Release/SymbolTests/Type.CompilerContextPattern (1590 of 2172)
PASS: lldb-unit :: Symbol/Release/SymbolTests/Type.GetTypeScopeAndBasename (1591 of 2172)
PASS: lldb-unit :: SymbolFile/DWARF/Release/SymbolFileDWARFTests/SymbolFileDWARFTests.TestAbbrevInvalidNULLTag (1592 of 2172)
PASS: lldb-unit :: SymbolFile/DWARF/Release/SymbolFileDWARFTests/SymbolFileDWARFTests.ParseArangesNonzeroSegmentSize (1593 of 2172)
PASS: lldb-unit :: SymbolFile/DWARF/Release/SymbolFileDWARFTests/SymbolFileDWARFTests.ParseAranges (1594 of 2172)
PASS: lldb-unit :: SymbolFile/DWARF/Release/SymbolFileDWARFTests/SymbolFileDWARFTests.TestAbbrevMissingTerminator (1595 of 2172)
PASS: lldb-unit :: SymbolFile/DWARF/Release/SymbolFileDWARFTests/DWARFASTParserClangTests.EnsureAllDIEsInDeclContextHaveBeenParsedParsesOnlyMatchingEntries (1596 of 2172)
PASS: lldb-unit :: SymbolFile/DWARF/Release/SymbolFileDWARFTests/SymbolFileDWARFTests.TestAbbrevOrder1Start1 (1597 of 2172)
PASS: lldb-unit :: SymbolFile/DWARF/Release/SymbolFileDWARFTests/SymbolFileDWARFTests.TestAbbrevNullAttrValidForm (1598 of 2172)
PASS: lldb-unit :: SymbolFile/DWARF/Release/SymbolFileDWARFTests/SymbolFileDWARFTests.TestAbbrevOrder1Start5 (1599 of 2172)
PASS: lldb-unit :: SymbolFile/DWARF/Release/SymbolFileDWARFTests/SymbolFileDWARFTests.TestAbbrevValidAttrNullForm (1600 of 2172)
PASS: lldb-unit :: SymbolFile/DWARF/Release/SymbolFileDWARFTests/SymbolFileDWARFTests.TestAbbrevOutOfOrder (1601 of 2172)
PASS: lldb-unit :: SymbolFile/DWARF/Release/SymbolFileDWARFTests/SymbolFileDWARFTests.TestAbilitiesForDWARF (1602 of 2172)
PASS: lldb-unit :: SymbolFile/NativePDB/Release/SymbolFileNativePDBTests/PDBFPOProgramToDWARFExpressionTests.DependencyChain (1603 of 2172)
PASS: lldb-unit :: SymbolFile/NativePDB/Release/SymbolFileNativePDBTests/PDBFPOProgramToDWARFExpressionTests.InvalidAssignmentMultiple (1604 of 2172)
PASS: lldb-unit :: SymbolFile/NativePDB/Release/SymbolFileNativePDBTests/PDBFPOProgramToDWARFExpressionTests.InvalidOpBinary (1605 of 2172)
PASS: lldb-unit :: SymbolFile/NativePDB/Release/SymbolFileNativePDBTests/PDBFPOProgramToDWARFExpressionTests.InvalidAssignmentSingle (1606 of 2172)
PASS: lldb-unit :: SymbolFile/NativePDB/Release/SymbolFileNativePDBTests/PDBFPOProgramToDWARFExpressionTests.InvalidOpUnary (1607 of 2172)
PASS: lldb-unit :: SymbolFile/NativePDB/Release/SymbolFileNativePDBTests/PDBFPOProgramToDWARFExpressionTests.MissingTargetRegister (1608 of 2172)
PASS: lldb-unit :: SymbolFile/NativePDB/Release/SymbolFileNativePDBTests/PDBFPOProgramToDWARFExpressionTests.MultipleDependentAssignments (1609 of 2172)
PASS: lldb-unit :: SymbolFile/NativePDB/Release/SymbolFileNativePDBTests/PDBFPOProgramToDWARFExpressionTests.SingleAssignmentRegisterRef (1610 of 2172)
PASS: lldb-unit :: SymbolFile/NativePDB/Release/SymbolFileNativePDBTests/PDBFPOProgramToDWARFExpressionTests.MultipleIndependentAssignments (1611 of 2172)
PASS: lldb-unit :: SymbolFile/NativePDB/Release/SymbolFileNativePDBTests/PDBFPOProgramToDWARFExpressionTests.UnknownOp (1612 of 2172)
PASS: lldb-unit :: SymbolFile/NativePDB/Release/SymbolFileNativePDBTests/PDBFPOProgramToDWARFExpressionTests.UnresolvedCyclicRegisterAssignmentReference (1613 of 2172)
PASS: lldb-unit :: SymbolFile/NativePDB/Release/SymbolFileNativePDBTests/PDBFPOProgramToDWARFExpressionTests.UnresolvedRegisterAssignmentReference (1614 of 2172)
PASS: lldb-unit :: SymbolFile/NativePDB/Release/SymbolFileNativePDBTests/PDBFPOProgramToDWARFExpressionTests.UnresolvedDependentCyclicRegisterAssignmentReference (1615 of 2172)
PASS: lldb-unit :: SymbolFile/NativePDB/Release/SymbolFileNativePDBTests/PDBFPOProgramToDWARFExpressionTests.UnresolvedRegisterReference (1616 of 2172)
PASS: lldb-unit :: SymbolFile/NativePDB/Release/SymbolFileNativePDBTests/PDBFPOProgramToDWARFExpressionTests.UnsupportedRASearch (1617 of 2172)
PASS: lldb-unit :: Target/Release/TargetTests/ExecutionContextTest.GetByteOrder (1618 of 2172)
PASS: lldb-unit :: Target/Release/TargetTests/MCBasedABI.MapRegisterName (1619 of 2172)
PASS: lldb-unit :: Target/Release/TargetTests/MemoryRegionInfoTest.Formatv (1620 of 2172)
PASS: lldb-unit :: Target/Release/TargetTests/ExecutionContextTest.GetByteOrderTarget (1621 of 2172)
PASS: lldb-unit :: Target/Release/TargetTests/ExecutionContextTest.GetByteOrderProcess (1622 of 2172)
PASS: lldb-unit :: Target/Release/TargetTests/ModuleCacheTest.GetAndPutUuidExists (1623 of 2172)
PASS: lldb-unit :: Target/Release/TargetTests/PathMappingListTest.RelativeTests (1624 of 2172)
PASS: lldb-unit :: Target/Release/TargetTests/ModuleCacheTest.GetAndPutStrangeHostname (1625 of 2172)
PASS: lldb-unit :: Target/Release/TargetTests/ModuleCacheTest.GetAndPut (1626 of 2172)
PASS: lldb-unit :: Target/Release/TargetTests/PathMappingListTest.AbsoluteTests (1627 of 2172)
PASS: lldb-unit :: Target/Release/TargetTests/RemoteAwarePlatformTest.TestResolveExecutabelOnClientByPlatform (1628 of 2172)
PASS: lldb-unit :: Target/Release/TargetTests/PathMappingListTest.RemapRoot (1629 of 2172)
PASS: lldb-unit :: Target/Release/TargetTests/StackFrameRecognizerTest.NullModuleRegex (1630 of 2172)
PASS: lldb-unit :: Thread/Release/ThreadTests/ThreadTest.GetPrivateStopInfo (1631 of 2172)
PASS: lldb-unit :: Thread/Release/ThreadTests/ThreadTest.SetStopInfo (1632 of 2172)
PASS: lldb-unit :: UnwindAssembly/x86/Release/UnwindAssemblyx86Tests/Testx86AssemblyInspectionEngine.Test32bitFramelessBigStackFrame (1633 of 2172)
PASS: lldb-unit :: UnwindAssembly/x86/Release/UnwindAssemblyx86Tests/Testx86AssemblyInspectionEngine.Test32BitOnlyInstruction (1634 of 2172)
PASS: lldb-unit :: UnwindAssembly/x86/Release/UnwindAssemblyx86Tests/Testx86AssemblyInspectionEngine.Test32bitFramelessSmallStackFrame (1635 of 2172)
PASS: lldb-unit :: UnwindAssembly/x86/Release/UnwindAssemblyx86Tests/Testx86AssemblyInspectionEngine.Test64bitFramelessBigStackFrame (1636 of 2172)
PASS: lldb-unit :: UnwindAssembly/x86/Release/UnwindAssemblyx86Tests/Testx86AssemblyInspectionEngine.Test64bitFramelessSmallStackFrame (1637 of 2172)
PASS: lldb-unit :: UnwindAssembly/x86/Release/UnwindAssemblyx86Tests/Testx86AssemblyInspectionEngine.TestAddRSP (1638 of 2172)
PASS: lldb-unit :: UnwindAssembly/x86/Release/UnwindAssemblyx86Tests/Testx86AssemblyInspectionEngine.TestAddESP (1639 of 2172)
PASS: lldb-unit :: UnwindAssembly/x86/Release/UnwindAssemblyx86Tests/Testx86AssemblyInspectionEngine.TestCALLNextInsn (1640 of 2172)
PASS: lldb-unit :: UnwindAssembly/x86/Release/UnwindAssemblyx86Tests/Testx86AssemblyInspectionEngine.TestDisassemblyJunkBytes (1641 of 2172)
PASS: lldb-unit :: UnwindAssembly/x86/Release/UnwindAssemblyx86Tests/Testx86AssemblyInspectionEngine.TestDisassemblyMidFunctionEpilogues (1642 of 2172)
PASS: lldb-unit :: UnwindAssembly/x86/Release/UnwindAssemblyx86Tests/Testx86AssemblyInspectionEngine.TestMovRSPtoRBP (1643 of 2172)
PASS: lldb-unit :: UnwindAssembly/x86/Release/UnwindAssemblyx86Tests/Testx86AssemblyInspectionEngine.TestLEAVE (1644 of 2172)
PASS: lldb-unit :: UnwindAssembly/x86/Release/UnwindAssemblyx86Tests/Testx86AssemblyInspectionEngine.TestPopEBP (1645 of 2172)
PASS: lldb-unit :: UnwindAssembly/x86/Release/UnwindAssemblyx86Tests/Testx86AssemblyInspectionEngine.TestPopEBX (1646 of 2172)
PASS: lldb-unit :: UnwindAssembly/x86/Release/UnwindAssemblyx86Tests/Testx86AssemblyInspectionEngine.TestPopEDI (1647 of 2172)
PASS: lldb-unit :: UnwindAssembly/x86/Release/UnwindAssemblyx86Tests/Testx86AssemblyInspectionEngine.TestPopESI (1648 of 2172)
PASS: lldb-unit :: UnwindAssembly/x86/Release/UnwindAssemblyx86Tests/Testx86AssemblyInspectionEngine.TestPopR12 (1649 of 2172)
PASS: lldb-unit :: UnwindAssembly/x86/Release/UnwindAssemblyx86Tests/Testx86AssemblyInspectionEngine.TestPopR13 (1650 of 2172)
PASS: lldb-unit :: UnwindAssembly/x86/Release/UnwindAssemblyx86Tests/Testx86AssemblyInspectionEngine.TestPopR14 (1651 of 2172)
PASS: lldb-unit :: UnwindAssembly/x86/Release/UnwindAssemblyx86Tests/Testx86AssemblyInspectionEngine.TestPopRBP (1652 of 2172)
PASS: lldb-unit :: UnwindAssembly/x86/Release/UnwindAssemblyx86Tests/Testx86AssemblyInspectionEngine.TestPopR15 (1653 of 2172)
PASS: lldb-unit :: UnwindAssembly/x86/Release/UnwindAssemblyx86Tests/Testx86AssemblyInspectionEngine.TestPopRBPWithREX (1654 of 2172)
PASS: lldb-unit :: UnwindAssembly/x86/Release/UnwindAssemblyx86Tests/Testx86AssemblyInspectionEngine.TestPopRBX (1655 of 2172)
PASS: lldb-unit :: UnwindAssembly/x86/Release/UnwindAssemblyx86Tests/Testx86AssemblyInspectionEngine.TestPush0 (1656 of 2172)
PASS: lldb-unit :: UnwindAssembly/x86/Release/UnwindAssemblyx86Tests/Testx86AssemblyInspectionEngine.TestPushEAX (1657 of 2172)
PASS: lldb-unit :: UnwindAssembly/x86/Release/UnwindAssemblyx86Tests/Testx86AssemblyInspectionEngine.TestPushEBP (1658 of 2172)
PASS: lldb-unit :: UnwindAssembly/x86/Release/UnwindAssemblyx86Tests/Testx86AssemblyInspectionEngine.TestPushEBX (1659 of 2172)
PASS: lldb-unit :: UnwindAssembly/x86/Release/UnwindAssemblyx86Tests/Testx86AssemblyInspectionEngine.TestPushECX (1660 of 2172)
PASS: lldb-unit :: UnwindAssembly/x86/Release/UnwindAssemblyx86Tests/Testx86AssemblyInspectionEngine.TestPushEDI (1661 of 2172)
PASS: lldb-unit :: UnwindAssembly/x86/Release/UnwindAssemblyx86Tests/Testx86AssemblyInspectionEngine.TestPushESI (1662 of 2172)
PASS: lldb-unit :: UnwindAssembly/x86/Release/UnwindAssemblyx86Tests/Testx86AssemblyInspectionEngine.TestPushExtended (1663 of 2172)
PASS: lldb-unit :: UnwindAssembly/x86/Release/UnwindAssemblyx86Tests/Testx86AssemblyInspectionEngine.TestPushEDX (1664 of 2172)
PASS: lldb-unit :: UnwindAssembly/x86/Release/UnwindAssemblyx86Tests/Testx86AssemblyInspectionEngine.TestPushImm (1665 of 2172)
PASS: lldb-unit :: UnwindAssembly/x86/Release/UnwindAssemblyx86Tests/Testx86AssemblyInspectionEngine.TestPushR14 (1666 of 2172)
PASS: lldb-unit :: UnwindAssembly/x86/Release/UnwindAssemblyx86Tests/Testx86AssemblyInspectionEngine.TestPushR12 (1667 of 2172)
PASS: lldb-unit :: UnwindAssembly/x86/Release/UnwindAssemblyx86Tests/Testx86AssemblyInspectionEngine.TestPushR15 (1668 of 2172)
PASS: lldb-unit :: UnwindAssembly/x86/Release/UnwindAssemblyx86Tests/Testx86AssemblyInspectionEngine.TestPushR13 (1669 of 2172)
PASS: lldb-unit :: UnwindAssembly/x86/Release/UnwindAssemblyx86Tests/Testx86AssemblyInspectionEngine.TestPushRBP (1670 of 2172)
PASS: lldb-unit :: UnwindAssembly/x86/Release/UnwindAssemblyx86Tests/Testx86AssemblyInspectionEngine.TestPushRBX (1671 of 2172)
PASS: lldb-unit :: UnwindAssembly/x86/Release/UnwindAssemblyx86Tests/Testx86AssemblyInspectionEngine.TestReturnDetect (1672 of 2172)
PASS: lldb-unit :: UnwindAssembly/x86/Release/UnwindAssemblyx86Tests/Testx86AssemblyInspectionEngine.TestSimple32bitFrameFunction (1673 of 2172)
PASS: lldb-unit :: UnwindAssembly/x86/Release/UnwindAssemblyx86Tests/Testx86AssemblyInspectionEngine.TestPushRBPWithREX (1674 of 2172)
PASS: lldb-unit :: UnwindAssembly/x86/Release/UnwindAssemblyx86Tests/Testx86AssemblyInspectionEngine.TestSimple64bitFrameFunction (1675 of 2172)
PASS: lldb-unit :: UnwindAssembly/x86/Release/UnwindAssemblyx86Tests/Testx86AssemblyInspectionEngine.TestSpillRegToStackViaMOVi386 (1676 of 2172)
PASS: lldb-unit :: UnwindAssembly/x86/Release/UnwindAssemblyx86Tests/Testx86AssemblyInspectionEngine.TestSimplei386ugmented (1677 of 2172)
PASS: lldb-unit :: UnwindAssembly/x86/Release/UnwindAssemblyx86Tests/Testx86AssemblyInspectionEngine.TestSpArithx86_64Augmented (1678 of 2172)
PASS: lldb-unit :: UnwindAssembly/x86/Release/UnwindAssemblyx86Tests/Testx86AssemblyInspectionEngine.TestSpillRegToStackViaMOVx86_64 (1679 of 2172)
PASS: lldb-unit :: UnwindAssembly/x86/Release/UnwindAssemblyx86Tests/Testx86AssemblyInspectionEngine.TestSimplex86_64Augmented (1680 of 2172)
PASS: lldb-unit :: UnwindAssembly/x86/Release/UnwindAssemblyx86Tests/Testx86AssemblyInspectionEngine.TestStackRealign32BitDisp_x86_64 (1681 of 2172)
PASS: lldb-unit :: UnwindAssembly/x86/Release/UnwindAssemblyx86Tests/Testx86AssemblyInspectionEngine.TestSubRSP (1682 of 2172)
PASS: lldb-unit :: UnwindAssembly/x86/Release/UnwindAssemblyx86Tests/Testx86AssemblyInspectionEngine.TestStackRealign8BitDisp_i386 (1683 of 2172)
PASS: lldb-unit :: UnwindAssembly/x86/Release/UnwindAssemblyx86Tests/Testx86AssemblyInspectionEngine.TestStackRealignMSVC_i386 (1684 of 2172)
PASS: lldb-unit :: UnwindAssembly/x86/Release/UnwindAssemblyx86Tests/Testx86AssemblyInspectionEngine.TestSubESP (1685 of 2172)
PASS: lldb-unit :: Utility/Release/UtilityTests/AnsiTerminal.AtEnd (1686 of 2172)
PASS: lldb-unit :: Utility/Release/UtilityTests/AnsiTerminal.AtStart (1687 of 2172)
PASS: lldb-unit :: Utility/Release/UtilityTests/AnsiTerminal.Empty (1688 of 2172)
PASS: lldb-unit :: Utility/Release/UtilityTests/AnsiTerminal.Basic (1689 of 2172)
PASS: lldb-unit :: UnwindAssembly/x86/Release/UnwindAssemblyx86Tests/Testx86AssemblyInspectionEngine.Testi386IgnoredRegisters (1690 of 2172)
PASS: lldb-unit :: Utility/Release/UtilityTests/AnsiTerminal.KnownPrefix (1691 of 2172)
PASS: lldb-unit :: Utility/Release/UtilityTests/AnsiTerminal.Unknown (1692 of 2172)
PASS: lldb-unit :: Utility/Release/UtilityTests/AnsiTerminal.Twice (1693 of 2172)
PASS: lldb-unit :: Utility/Release/UtilityTests/AnsiTerminal.Incomplete (1694 of 2172)
PASS: lldb-unit :: Utility/Release/UtilityTests/AnsiTerminal.WhiteSpace (1695 of 2172)
PASS: lldb-unit :: Utility/Release/UtilityTests/ArchSpecTest.Compatibility (1696 of 2172)
PASS: lldb-unit :: Utility/Release/UtilityTests/ArchSpecTest.OperatorBool (1697 of 2172)
PASS: lldb-unit :: Utility/Release/UtilityTests/ArchSpecTest.MergeFromMachOUnknown (1698 of 2172)
PASS: lldb-unit :: Utility/Release/UtilityTests/ArchSpecTest.MergeFrom (1699 of 2172)
PASS: lldb-unit :: Utility/Release/UtilityTests/ArchSpecTest.TestParseMachCPUDashSubtypeTripleExtra (1700 of 2172)
PASS: lldb-unit :: Utility/Release/UtilityTests/ArchSpecTest.TestParseMachCPUDashSubtypeTripleSimple (1701 of 2172)
PASS: lldb-unit :: Utility/Release/UtilityTests/ArchSpecTest.TestSetTriple (1702 of 2172)
PASS: lldb-unit :: Utility/Release/UtilityTests/ArchSpecTest.YAML (1703 of 2172)
PASS: lldb-unit :: Utility/Release/UtilityTests/ArchSpecTest.TripleComponentsWereSpecified (1704 of 2172)
PASS: lldb-unit :: Utility/Release/UtilityTests/ArgsTest.AppendArguments (1705 of 2172)
PASS: lldb-unit :: Utility/Release/UtilityTests/ArgsTest.DoubleQuotedItem (1706 of 2172)
PASS: lldb-unit :: Utility/Release/UtilityTests/ArgsTest.BareSingleQuote (1707 of 2172)
PASS: lldb-unit :: Utility/Release/UtilityTests/ArgsTest.EscapeLLDBCommandArgument (1708 of 2172)
PASS: lldb-unit :: Utility/Release/UtilityTests/ArgsTest.GetArgumentArrayRef (1709 of 2172)
PASS: lldb-unit :: Utility/Release/UtilityTests/ArgsTest.GetQuotedCommandString (1710 of 2172)
PASS: lldb-unit :: Utility/Release/UtilityTests/ArgsTest.ReplaceArgumentAtIndexOutOfRange (1711 of 2172)
PASS: lldb-unit :: Utility/Release/UtilityTests/ArgsTest.ReplaceArgumentAtIndexEqual (1712 of 2172)
PASS: lldb-unit :: Utility/Release/UtilityTests/ArgsTest.ReplaceArgumentAtIndexLonger (1713 of 2172)
PASS: lldb-unit :: Utility/Release/UtilityTests/ArgsTest.ReplaceArgumentAtIndexFarOutOfRange (1714 of 2172)
PASS: lldb-unit :: Utility/Release/UtilityTests/ArgsTest.GetShellSafeArgument (1715 of 2172)
PASS: lldb-unit :: Utility/Release/UtilityTests/ArgsTest.ReplaceArgumentAtIndexShort (1716 of 2172)
PASS: lldb-unit :: Utility/Release/UtilityTests/ArgsTest.StringListConstructor (1717 of 2172)
PASS: lldb-unit :: Utility/Release/UtilityTests/ArgsTest.TestInsertArg (1718 of 2172)
PASS: lldb-unit :: Utility/Release/UtilityTests/ArgsTest.TestArgv (1719 of 2172)
PASS: lldb-unit :: Utility/Release/UtilityTests/ArgsTest.TestAppendArg (1720 of 2172)
PASS: lldb-unit :: Utility/Release/UtilityTests/ArgsTest.TestSingleArg (1721 of 2172)
PASS: lldb-unit :: Utility/Release/UtilityTests/ArgsTest.TestQuotedTrailingBackslash (1722 of 2172)
PASS: lldb-unit :: Utility/Release/UtilityTests/ArgsTest.TestMultipleArgs (1723 of 2172)
PASS: lldb-unit :: Utility/Release/UtilityTests/ArgsTest.TestOverwriteArgs (1724 of 2172)
PASS: lldb-unit :: Utility/Release/UtilityTests/ArgsTest.TestQuotedUnknownEscape (1725 of 2172)
PASS: lldb-shell :: Reproducer/TestMultipleTargets.test (1726 of 2172)
PASS: lldb-unit :: Utility/Release/UtilityTests/ArgsTest.TestSingleArgWithQuotedSpace (1727 of 2172)
PASS: lldb-unit :: Utility/Release/UtilityTests/ArgsTest.TestSingleQuotedArgWithSpace (1728 of 2172)
PASS: lldb-unit :: Utility/Release/UtilityTests/ArgsTest.TestTrailingBackslash (1729 of 2172)
PASS: lldb-unit :: Utility/Release/UtilityTests/ArgsTest.TestUnknownEscape (1730 of 2172)
PASS: lldb-unit :: Utility/Release/UtilityTests/ArgsTest.Yaml (1731 of 2172)
PASS: lldb-unit :: Utility/Release/UtilityTests/BinaryStreamTest.PutSLEB128EightBytes (1732 of 2172)
PASS: lldb-unit :: Utility/Release/UtilityTests/BinaryStreamTest.PutSLEB128FourBytes (1733 of 2172)
PASS: lldb-unit :: Utility/Release/UtilityTests/BinaryStreamTest.PutSLEB128NineBytes (1734 of 2172)
PASS: lldb-unit :: Utility/Release/UtilityTests/BinaryStreamTest.PutSLEB128FiveBytes (1735 of 2172)
PASS: lldb-unit :: Utility/Release/UtilityTests/BinaryStreamTest.PutSLEB128MaxValue (1736 of 2172)
PASS: lldb-unit :: Utility/Release/UtilityTests/BinaryStreamTest.PutSLEB128OneByte (1737 of 2172)
PASS: lldb-unit :: Utility/Release/UtilityTests/BinaryStreamTest.PutSLEB128One (1738 of 2172)
PASS: lldb-unit :: Utility/Release/UtilityTests/BinaryStreamTest.PutSLEB128SevenBytes (1739 of 2172)
PASS: lldb-unit :: Utility/Release/UtilityTests/BinaryStreamTest.PutSLEB128SixBytes (1740 of 2172)
PASS: lldb-unit :: Utility/Release/UtilityTests/BinaryStreamTest.PutSLEB128Zero (1741 of 2172)
PASS: lldb-unit :: Utility/Release/UtilityTests/BinaryStreamTest.PutSLEB128ThreeBytes (1742 of 2172)
PASS: lldb-unit :: Utility/Release/UtilityTests/BinaryStreamTest.PutSLEB128TwoBytes (1743 of 2172)
PASS: lldb-unit :: Utility/Release/UtilityTests/BinaryStreamTest.PutULEB128EightBytes (1744 of 2172)
PASS: lldb-unit :: Utility/Release/UtilityTests/BinaryStreamTest.PutULEB128FiveBytes (1745 of 2172)
PASS: lldb-unit :: Utility/Release/UtilityTests/BinaryStreamTest.PutULEB128NineBytes (1746 of 2172)
PASS: lldb-unit :: Utility/Release/UtilityTests/BinaryStreamTest.PutULEB128FourBytes (1747 of 2172)
PASS: lldb-unit :: Utility/Release/UtilityTests/BinaryStreamTest.PutULEB128One (1748 of 2172)
PASS: lldb-unit :: Utility/Release/UtilityTests/BinaryStreamTest.PutULEB128MaxValue (1749 of 2172)
PASS: lldb-unit :: Utility/Release/UtilityTests/BinaryStreamTest.PutULEB128OneByte (1750 of 2172)
PASS: lldb-unit :: Utility/Release/UtilityTests/BinaryStreamTest.PutULEB128ThreeBytes (1751 of 2172)
PASS: lldb-unit :: Utility/Release/UtilityTests/BinaryStreamTest.PutULEB128SevenBytes (1752 of 2172)
PASS: lldb-unit :: Utility/Release/UtilityTests/BinaryStreamTest.PutULEB128SixBytes (1753 of 2172)
PASS: lldb-unit :: Utility/Release/UtilityTests/BinaryStreamTest.PutULEB128Zero (1754 of 2172)
PASS: lldb-unit :: Utility/Release/UtilityTests/BinaryStreamTest.PutULEB128TwoBytes (1755 of 2172)
PASS: lldb-unit :: Utility/Release/UtilityTests/BroadcasterTest.BroadcastEvent (1756 of 2172)
PASS: lldb-unit :: Utility/Release/UtilityTests/CompletionRequest.DuplicateFiltering (1757 of 2172)
PASS: lldb-unit :: Utility/Release/UtilityTests/BroadcasterTest.EventTypeHasListeners (1758 of 2172)
PASS: lldb-unit :: Utility/Release/UtilityTests/CompletionRequest.FakeLastArg (1759 of 2172)
PASS: lldb-unit :: Utility/Release/UtilityTests/CompletionRequest.Constructor (1760 of 2172)
PASS: lldb-unit :: Utility/Release/UtilityTests/CompletionRequest.DuplicateFilteringWithComments (1761 of 2172)
PASS: lldb-unit :: Utility/Release/UtilityTests/CompletionRequest.ShiftArguments (1762 of 2172)
PASS: lldb-unit :: Utility/Release/UtilityTests/CompletionRequest.TryCompleteCurrentArgBad (1763 of 2172)
PASS: lldb-unit :: Utility/Release/UtilityTests/CompletionRequest.TestCompletionOwnership (1764 of 2172)
PASS: lldb-unit :: Utility/Release/UtilityTests/CompletionRequest.TryCompleteCurrentArgGood (1765 of 2172)
PASS: lldb-unit :: Utility/Release/UtilityTests/CompletionRequest.TryCompleteCurrentArgMode (1766 of 2172)
PASS: lldb-unit :: Utility/Release/UtilityTests/ConstStringTest.CompareStringRef (1767 of 2172)
PASS: lldb-unit :: Utility/Release/UtilityTests/ConstStringTest.CompareConstString (1768 of 2172)
PASS: lldb-unit :: Utility/Release/UtilityTests/ConstStringTest.YAML (1769 of 2172)
PASS: lldb-unit :: Utility/Release/UtilityTests/ConstStringTest.format_provider (1770 of 2172)
PASS: lldb-unit :: Utility/Release/UtilityTests/ConstStringTest.FromMidOfBufferStringRef (1771 of 2172)
PASS: lldb-unit :: Utility/Release/UtilityTests/ConstStringTest.MangledCounterpart (1772 of 2172)
PASS: lldb-unit :: Utility/Release/UtilityTests/ConstStringTest.NullAndEmptyStates (1773 of 2172)
PASS: lldb-unit :: Utility/Release/UtilityTests/ConstStringTest.UpdateMangledCounterpart (1774 of 2172)
PASS: lldb-unit :: Utility/Release/UtilityTests/DataExtractorTest.GetCStr (1775 of 2172)
PASS: lldb-unit :: Utility/Release/UtilityTests/DataExtractorTest.GetCStrAtEnd (1776 of 2172)
PASS: lldb-unit :: Utility/Release/UtilityTests/DataExtractorTest.GetCStrAtNullOffset (1777 of 2172)
PASS: lldb-unit :: Utility/Release/UtilityTests/DataExtractorTest.GetBitfield (1778 of 2172)
PASS: lldb-unit :: Utility/Release/UtilityTests/DataExtractorTest.GetCStrUnterminated (1779 of 2172)
PASS: lldb-unit :: Utility/Release/UtilityTests/DataExtractorTest.GetCStrEmpty (1780 of 2172)
PASS: lldb-unit :: Utility/Release/UtilityTests/DataExtractorTest.GetFloat (1781 of 2172)
PASS: lldb-unit :: Utility/Release/UtilityTests/DataExtractorTest.GetDouble (1782 of 2172)
PASS: lldb-unit :: Utility/Release/UtilityTests/DataExtractorTest.GetDoubleUnaligned (1783 of 2172)
PASS: lldb-unit :: Utility/Release/UtilityTests/DataExtractorTest.GetMaxS64 (1784 of 2172)
PASS: lldb-unit :: Utility/Release/UtilityTests/DataExtractorTest.GetFloatUnaligned (1785 of 2172)
PASS: lldb-unit :: Utility/Release/UtilityTests/DataExtractorTest.GetMaxU64 (1786 of 2172)
PASS: lldb-unit :: Utility/Release/UtilityTests/DataExtractorTest.GetSLEB128_bit63 (1787 of 2172)
PASS: lldb-unit :: Utility/Release/UtilityTests/DataExtractorTest.GetMaxU64_unchecked (1788 of 2172)
PASS: lldb-unit :: Utility/Release/UtilityTests/DataExtractorTest.GetULEB128_bit63 (1789 of 2172)
PASS: lldb-unit :: Utility/Release/UtilityTests/DeserializerTest.HasData (1790 of 2172)
PASS: lldb-unit :: Utility/Release/UtilityTests/DataExtractorTest.PeekData (1791 of 2172)
PASS: lldb-unit :: Utility/Release/UtilityTests/DataExtractorTest.UncommonAddressSize (1792 of 2172)
PASS: lldb-unit :: Utility/Release/UtilityTests/FileSpecTest.AppendPathComponent (1793 of 2172)
PASS: lldb-unit :: Utility/Release/UtilityTests/FileSpecTest.Equal (1794 of 2172)
PASS: lldb-unit :: Utility/Release/UtilityTests/EnvironmentTest.EnvpConstruction (1795 of 2172)
PASS: lldb-unit :: Utility/Release/UtilityTests/EnvironmentTest.EnvpConversion (1796 of 2172)
PASS: lldb-unit :: Utility/Release/UtilityTests/EventTest.DumpEventDataBytes (1797 of 2172)
PASS: lldb-unit :: Utility/Release/UtilityTests/FileSpecTest.CopyByAppendingPathComponent (1798 of 2172)
PASS: lldb-unit :: Utility/Release/UtilityTests/FileSpecTest.EqualDotsPosixRoot (1799 of 2172)
PASS: lldb-unit :: Utility/Release/UtilityTests/FileSpecTest.EqualDotsWindows (1800 of 2172)
PASS: lldb-unit :: Utility/Release/UtilityTests/FileSpecTest.EqualSeparator (1801 of 2172)
PASS: lldb-unit :: Utility/Release/UtilityTests/FileSpecTest.FormatFileSpec (1802 of 2172)
PASS: lldb-unit :: Utility/Release/UtilityTests/FileSpecTest.EqualDotsPosix (1803 of 2172)
PASS: lldb-unit :: Utility/Release/UtilityTests/FileSpecTest.FileAndDirectoryComponents (1804 of 2172)
PASS: lldb-unit :: Utility/Release/UtilityTests/FileSpecTest.Match (1805 of 2172)
PASS: lldb-unit :: Utility/Release/UtilityTests/FileSpecTest.PrependPathComponent (1806 of 2172)
PASS: lldb-unit :: Utility/Release/UtilityTests/FileSpecTest.OperatorBool (1807 of 2172)
PASS: lldb-unit :: Utility/Release/UtilityTests/FileSpecTest.GetPath (1808 of 2172)
PASS: lldb-unit :: Utility/Release/UtilityTests/FileSpecTest.GuessPathStyle (1809 of 2172)
PASS: lldb-unit :: Utility/Release/UtilityTests/FileSpecTest.IsRelative (1810 of 2172)
PASS: lldb-unit :: Utility/Release/UtilityTests/FileSpecTest.RemoveLastPathComponent (1811 of 2172)
PASS: lldb-unit :: Utility/Release/UtilityTests/Flags.AllClear (1812 of 2172)
PASS: lldb-unit :: Utility/Release/UtilityTests/FileSpecTest.Yaml (1813 of 2172)
PASS: lldb-unit :: Utility/Release/UtilityTests/Flags.AllSet (1814 of 2172)
PASS: lldb-unit :: Utility/Release/UtilityTests/Flags.AnySet (1815 of 2172)
PASS: lldb-unit :: Utility/Release/UtilityTests/Flags.AnyClear (1816 of 2172)
PASS: lldb-unit :: Utility/Release/UtilityTests/Flags.GetBitSize (1817 of 2172)
PASS: lldb-unit :: Utility/Release/UtilityTests/Flags.IsClear (1818 of 2172)
PASS: lldb-unit :: Utility/Release/UtilityTests/Flags.Reset (1819 of 2172)
PASS: lldb-unit :: Utility/Release/UtilityTests/Flags.Clear (1820 of 2172)
PASS: lldb-unit :: Utility/Release/UtilityTests/Flags.Test (1821 of 2172)
PASS: lldb-unit :: Utility/Release/UtilityTests/GeneratorTest.Create (1822 of 2172)
PASS: lldb-unit :: Utility/Release/UtilityTests/GeneratorTest.Get (1823 of 2172)
PASS: lldb-unit :: Utility/Release/UtilityTests/GeneratorTest.GetOrCreate (1824 of 2172)
PASS: lldb-unit :: Utility/Release/UtilityTests/ListenerTest.GetEventImmediate (1825 of 2172)
PASS: lldb-unit :: Utility/Release/UtilityTests/IndexToObjectTest.ObjectForIndex (1826 of 2172)
PASS: lldb-unit :: Utility/Release/UtilityTests/GeneratorTest.YamlMultiProvider (1827 of 2172)
PASS: lldb-unit :: Utility/Release/UtilityTests/LogChannelEnabledTest.LogGetLogThread (1828 of 2172)
PASS: lldb-unit :: Utility/Release/UtilityTests/LogChannelEnabledTest.LogVerboseThread (1829 of 2172)
PASS: lldb-unit :: Utility/Release/UtilityTests/LogChannelEnabledTest.LLDB_LOG_ERROR (1830 of 2172)
PASS: lldb-unit :: Utility/Release/UtilityTests/LogChannelEnabledTest.LogThread (1831 of 2172)
PASS: lldb-unit :: Utility/Release/UtilityTests/LogChannelEnabledTest.log_options (1832 of 2172)
PASS: lldb-unit :: Utility/Release/UtilityTests/LogChannelTest.Disable (1833 of 2172)
PASS: lldb-unit :: Utility/Release/UtilityTests/LogChannelTest.Enable (1834 of 2172)
PASS: lldb-unit :: Utility/Release/UtilityTests/LogTest.LLDB_LOG_nullptr (1835 of 2172)
PASS: lldb-unit :: Utility/Release/UtilityTests/LogChannelTest.EnableOptions (1836 of 2172)
PASS: lldb-unit :: Utility/Release/UtilityTests/LogChannelTest.List (1837 of 2172)
PASS: lldb-unit :: Utility/Release/UtilityTests/ListenerTest.GetEventWait (1838 of 2172)
PASS: lldb-shell :: Reproducer/TestGDBRemoteRepro.test (1839 of 2172)
PASS: lldb-unit :: Utility/Release/UtilityTests/LogTest.Register (1840 of 2172)
PASS: lldb-unit :: Utility/Release/UtilityTests/LogTest.Unregister (1841 of 2172)
PASS: lldb-unit :: Utility/Release/UtilityTests/NameMatchesTest.EndsWith (1842 of 2172)
PASS: lldb-unit :: Utility/Release/UtilityTests/NameMatchesTest.Equals (1843 of 2172)
PASS: lldb-unit :: Utility/Release/UtilityTests/NameMatchesTest.Contains (1844 of 2172)
PASS: lldb-unit :: Utility/Release/UtilityTests/NameMatchesTest.Ignore (1845 of 2172)
PASS: lldb-unit :: Utility/Release/UtilityTests/NameMatchesTest.RegularExpression (1846 of 2172)
PASS: lldb-unit :: Utility/Release/UtilityTests/NameMatchesTest.StartsWith (1847 of 2172)
PASS: lldb-unit :: Utility/Release/UtilityTests/OptionsWithRawTest.ArgsButNoDelimiter (1848 of 2172)
PASS: lldb-unit :: Utility/Release/UtilityTests/OptionsWithRawTest.ArgsButNoLeadingDash (1849 of 2172)
PASS: lldb-unit :: Utility/Release/UtilityTests/OptionsWithRawTest.EmptyArgsOnlySuffix (1850 of 2172)
PASS: lldb-unit :: Utility/Release/UtilityTests/OptionsWithRawTest.EmptyInput (1851 of 2172)
PASS: lldb-unit :: Utility/Release/UtilityTests/OptionsWithRawTest.EmptySuffix (1852 of 2172)
PASS: lldb-unit :: Utility/Release/UtilityTests/OptionsWithRawTest.EmptySuffixSingleWhitespace (1853 of 2172)
PASS: lldb-unit :: Utility/Release/UtilityTests/OptionsWithRawTest.LeadingSpaceArgs (1854 of 2172)
PASS: lldb-unit :: Utility/Release/UtilityTests/OptionsWithRawTest.MultiWordSuffix (1855 of 2172)
PASS: lldb-unit :: Utility/Release/UtilityTests/OptionsWithRawTest.SingleWhitespaceInput (1856 of 2172)
PASS: lldb-unit :: Utility/Release/UtilityTests/OptionsWithRawTest.QuotedSuffix (1857 of 2172)
PASS: lldb-unit :: Utility/Release/UtilityTests/OptionsWithRawTest.SingleWordSuffix (1858 of 2172)
PASS: lldb-unit :: Utility/Release/UtilityTests/OptionsWithRawTest.TerminatedQuote (1859 of 2172)
PASS: lldb-unit :: Utility/Release/UtilityTests/OptionsWithRawTest.UnterminatedQuote (1860 of 2172)
PASS: lldb-unit :: Utility/Release/UtilityTests/OptionsWithRawTest.WhitespaceInput (1861 of 2172)
PASS: lldb-unit :: Utility/Release/UtilityTests/PassiveReplayTest.InstrumentedBarRef (1862 of 2172)
PASS: lldb-unit :: Utility/Release/UtilityTests/PassiveReplayTest.InstrumentedBar (1863 of 2172)
PASS: lldb-unit :: Utility/Release/UtilityTests/PassiveReplayTest.InstrumentedBarPtr (1864 of 2172)
PASS: lldb-unit :: Utility/Release/UtilityTests/OptionsWithRawTest.WhitespaceSuffix (1865 of 2172)
PASS: lldb-unit :: Utility/Release/UtilityTests/PassiveReplayTest.InstrumentedFoo (1866 of 2172)
PASS: lldb-unit :: Utility/Release/UtilityTests/ProcessInstanceInfo.DumpTable (1867 of 2172)
PASS: lldb-unit :: Utility/Release/UtilityTests/ProcessInfoTest.Constructor (1868 of 2172)
PASS: lldb-unit :: Utility/Release/UtilityTests/ProcessInstanceInfo.Dump (1869 of 2172)
PASS: lldb-unit :: Utility/Release/UtilityTests/ProcessInstanceInfo.DumpTable_invalidUID (1870 of 2172)
PASS: lldb-unit :: Utility/Release/UtilityTests/PassiveReplayTest.InstrumentedFooInvalid (1871 of 2172)
PASS: lldb-unit :: Utility/Release/UtilityTests/Predicate.WaitForValueNotEqualTo (1872 of 2172)
PASS: lldb-unit :: Utility/Release/UtilityTests/ProcessInstanceInfoList.Yaml (1873 of 2172)
PASS: lldb-unit :: Utility/Release/UtilityTests/ProcessInstanceInfo.Yaml (1874 of 2172)
PASS: lldb-unit :: Utility/Release/UtilityTests/ProcessInstanceInfoMatch.Name (1875 of 2172)
PASS: lldb-unit :: Utility/Release/UtilityTests/RangeDataVector.CustomSort (1876 of 2172)
PASS: lldb-unit :: Utility/Release/UtilityTests/RangeDataVector.FindEntryIndexesThatContain (1877 of 2172)
PASS: lldb-unit :: Utility/Release/UtilityTests/RangeDataVector.FindEntryIndexesThatContain_Overlap (1878 of 2172)
PASS: lldb-unit :: Utility/Release/UtilityTests/RangeTest.Clear (1879 of 2172)
PASS: lldb-unit :: Utility/Release/UtilityTests/RangeDataVector.FindEntryThatContains (1880 of 2172)
PASS: lldb-unit :: Utility/Release/UtilityTests/RangeDataVector.FindEntryThatContains_Overlap (1881 of 2172)
PASS: lldb-unit :: Utility/Release/UtilityTests/RangeTest.ClearWithStarAddress (1882 of 2172)
PASS: lldb-unit :: Utility/Release/UtilityTests/RangeTest.ContainsAddr (1883 of 2172)
PASS: lldb-unit :: Utility/Release/UtilityTests/RangeTest.Constructor (1884 of 2172)
PASS: lldb-unit :: Utility/Release/UtilityTests/RangeTest.ContainsEndInclusiveInvalid (1885 of 2172)
PASS: lldb-unit :: Utility/Release/UtilityTests/RangeTest.ContainsEndInclusive (1886 of 2172)
PASS: lldb-unit :: Utility/Release/UtilityTests/RangeTest.ContainsAddrInvalid (1887 of 2172)
PASS: lldb-unit :: Utility/Release/UtilityTests/RangeTest.ContainsRange (1888 of 2172)
PASS: lldb-unit :: Utility/Release/UtilityTests/RangeTest.ContainsRangeStartingFromZero (1889 of 2172)
PASS: lldb-unit :: Utility/Release/UtilityTests/RangeTest.Copy (1890 of 2172)
PASS: lldb-unit :: Utility/Release/UtilityTests/RangeTest.DoesAdjoinOrIntersect (1891 of 2172)
PASS: lldb-unit :: Utility/Release/UtilityTests/RangeTest.DefaultConstructor (1892 of 2172)
PASS: lldb-unit :: Utility/Release/UtilityTests/RangeTest.DoesIntersect (1893 of 2172)
PASS: lldb-unit :: Utility/Release/UtilityTests/RangeTest.Equal (1894 of 2172)
PASS: lldb-unit :: Utility/Release/UtilityTests/RangeTest.LessThan (1895 of 2172)
PASS: lldb-unit :: Utility/Release/UtilityTests/RangeTest.EqualInvalid (1896 of 2172)
PASS: lldb-unit :: Utility/Release/UtilityTests/RangeTest.LessThanInvalid (1897 of 2172)
PASS: lldb-unit :: Utility/Release/UtilityTests/RangeTest.NotEqual (1898 of 2172)
PASS: lldb-unit :: Utility/Release/UtilityTests/RangeTest.NotEqualInvalid (1899 of 2172)
PASS: lldb-unit :: Utility/Release/UtilityTests/RangeTest.SetRangeBase (1900 of 2172)
PASS: lldb-unit :: Utility/Release/UtilityTests/RangeTest.SizeTypes (1901 of 2172)
PASS: lldb-unit :: Utility/Release/UtilityTests/RangeTest.Slide (1902 of 2172)
PASS: lldb-unit :: Utility/Release/UtilityTests/RangeTest.SlideZero (1903 of 2172)
PASS: lldb-unit :: Utility/Release/UtilityTests/RangeTest.Union (1904 of 2172)
PASS: lldb-unit :: Utility/Release/UtilityTests/RangeVector.CombineConsecutiveRanges (1905 of 2172)
PASS: lldb-unit :: Utility/Release/UtilityTests/RegisterValueTest.GetSet8 (1906 of 2172)
PASS: lldb-unit :: Utility/Release/UtilityTests/Predicate.WaitForValueEqualTo (1907 of 2172)
PASS: lldb-unit :: Utility/Release/UtilityTests/RegularExpression.CopyAssignment (1908 of 2172)
PASS: lldb-unit :: Utility/Release/UtilityTests/RegularExpression.Empty (1909 of 2172)
PASS: lldb-unit :: Utility/Release/UtilityTests/RegularExpression.Invalid (1910 of 2172)
PASS: lldb-unit :: Utility/Release/UtilityTests/RegularExpression.Match (1911 of 2172)
PASS: lldb-unit :: Utility/Release/UtilityTests/RegularExpression.Valid (1912 of 2172)
PASS: lldb-unit :: Utility/Release/UtilityTests/ReproducerTest.SetCapture (1913 of 2172)
PASS: lldb-unit :: Utility/Release/UtilityTests/ReproducerTest.SetReplay (1914 of 2172)
PASS: lldb-unit :: Utility/Release/UtilityTests/ScalarTest.APIntConstructor (1915 of 2172)
PASS: lldb-unit :: Utility/Release/UtilityTests/ScalarTest.CastOperations (1916 of 2172)
PASS: lldb-unit :: Utility/Release/UtilityTests/ScalarTest.Comparison (1917 of 2172)
PASS: lldb-unit :: Utility/Release/UtilityTests/ScalarTest.ComparisonFloat (1918 of 2172)
PASS: lldb-unit :: Utility/Release/UtilityTests/ScalarTest.Division (1919 of 2172)
PASS: lldb-unit :: Utility/Release/UtilityTests/ScalarTest.Equality (1920 of 2172)
PASS: lldb-unit :: Utility/Release/UtilityTests/ScalarTest.ExtractBitfield (1921 of 2172)
PASS: lldb-unit :: Utility/Release/UtilityTests/ScalarTest.GetBytes (1922 of 2172)
PASS: lldb-unit :: Utility/Release/UtilityTests/RecordReplayTest.InstrumentedBar (1923 of 2172)
PASS: lldb-unit :: Utility/Release/UtilityTests/RecordReplayTest.InstrumentedBarRef (1924 of 2172)
PASS: lldb-unit :: Utility/Release/UtilityTests/RecordReplayTest.InstrumentedBarPtr (1925 of 2172)
PASS: lldb-unit :: Utility/Release/UtilityTests/ScalarTest.GetValue (1926 of 2172)
PASS: lldb-unit :: Utility/Release/UtilityTests/RecordReplayTest.InstrumentedFoo (1927 of 2172)
PASS: lldb-unit :: Utility/Release/UtilityTests/ScalarTest.Getters (1928 of 2172)
PASS: lldb-unit :: Utility/Release/UtilityTests/RecordReplayTest.InstrumentedFooSameThis (1929 of 2172)
PASS: lldb-unit :: Utility/Release/UtilityTests/ScalarTest.LongLongAssigmentOperator (1930 of 2172)
PASS: lldb-unit :: Utility/Release/UtilityTests/ScalarTest.Promotion (1931 of 2172)
PASS: lldb-unit :: Utility/Release/UtilityTests/ScalarTest.RightShiftOperator (1932 of 2172)
PASS: lldb-unit :: Utility/Release/UtilityTests/ScalarTest.Scalar_512 (1933 of 2172)
PASS: lldb-unit :: Utility/Release/UtilityTests/ScalarTest.SetValueFromCString (1934 of 2172)
PASS: lldb-unit :: Utility/Release/UtilityTests/ScalarTest.SetValueFromData (1935 of 2172)
PASS: lldb-unit :: Utility/Release/UtilityTests/ScalarTest.TruncOrExtendTo (1936 of 2172)
PASS: lldb-unit :: Utility/Release/UtilityTests/SerializationRountripTest.SerializeDeserializeCString (1937 of 2172)
PASS: lldb-unit :: Utility/Release/UtilityTests/SerializationRountripTest.SerializeDeserializeCStringArray (1938 of 2172)
PASS: lldb-unit :: Utility/Release/UtilityTests/SerializationRountripTest.SerializeDeserializeCStringArrayNullptr (1939 of 2172)
PASS: lldb-unit :: Utility/Release/UtilityTests/SerializationRountripTest.SerializeDeserializeCStringArrayNullptrElem (1940 of 2172)
PASS: lldb-unit :: Utility/Release/UtilityTests/SerializationRountripTest.SerializeDeserializeObjectPointer (1941 of 2172)
PASS: lldb-unit :: Utility/Release/UtilityTests/SerializationRountripTest.SerializeDeserializeCStringNull (1942 of 2172)
PASS: lldb-unit :: Utility/Release/UtilityTests/SerializationRountripTest.SerializeDeserializeObjectReference (1943 of 2172)
PASS: lldb-unit :: Utility/Release/UtilityTests/SerializationRountripTest.SerializeDeserializePodPointers (1944 of 2172)
PASS: lldb-unit :: Utility/Release/UtilityTests/SerializationRountripTest.SerializeDeserializePod (1945 of 2172)
PASS: lldb-unit :: Utility/Release/UtilityTests/SerializationRountripTest.SerializeDeserializePodReferences (1946 of 2172)
PASS: lldb-unit :: Utility/Release/UtilityTests/SharedCluster.ClusterManager (1947 of 2172)
PASS: lldb-unit :: Utility/Release/UtilityTests/StateTest.Formatv (1948 of 2172)
PASS: lldb-unit :: Utility/Release/UtilityTests/StatusTest.ErrorCodeConstructor (1949 of 2172)
PASS: lldb-unit :: Utility/Release/UtilityTests/StatusTest.ErrorConstructor (1950 of 2172)
PASS: lldb-unit :: Utility/Release/UtilityTests/StatusTest.ErrorConversion (1951 of 2172)
PASS: lldb-unit :: Utility/Release/UtilityTests/StatusTest.Formatv (1952 of 2172)
PASS: lldb-unit :: Utility/Release/UtilityTests/StreamTeeTest.AppendStream (1953 of 2172)
PASS: lldb-unit :: Utility/Release/UtilityTests/StreamTeeTest.Constructor1Stream (1954 of 2172)
PASS: lldb-unit :: Utility/Release/UtilityTests/StreamTeeTest.Assignment (1955 of 2172)
PASS: lldb-unit :: Utility/Release/UtilityTests/StreamTeeTest.Constructor2Streams (1956 of 2172)
PASS: lldb-unit :: Utility/Release/UtilityTests/StreamTeeTest.CopyConstructor (1957 of 2172)
PASS: lldb-unit :: Utility/Release/UtilityTests/StreamTeeTest.DefaultConstructor (1958 of 2172)
PASS: lldb-unit :: Utility/Release/UtilityTests/StreamTeeTest.Flush (1959 of 2172)
PASS: lldb-unit :: Utility/Release/UtilityTests/StreamTeeTest.GetStreamAtIndexOutOfBounds (1960 of 2172)
PASS: lldb-unit :: Utility/Release/UtilityTests/StreamTeeTest.SetStreamAtIndexOverwrite (1961 of 2172)
PASS: lldb-unit :: Utility/Release/UtilityTests/StreamTeeTest.GetStreamAtIndexOutOfBoundsEmpty (1962 of 2172)
PASS: lldb-unit :: Utility/Release/UtilityTests/StreamTeeTest.SetStreamAtIndexOutOfBounds (1963 of 2172)
PASS: lldb-unit :: Utility/Release/UtilityTests/StreamTeeTest.Write (1964 of 2172)
PASS: lldb-unit :: Utility/Release/UtilityTests/StreamTest.AddressEmptyPrefix (1965 of 2172)
PASS: lldb-unit :: Utility/Release/UtilityTests/StreamTest.AddressNoSuffix (1966 of 2172)
PASS: lldb-unit :: Utility/Release/UtilityTests/StreamTest.AddressPrefix (1967 of 2172)
PASS: lldb-unit :: Utility/Release/UtilityTests/StreamTest.AddressRange (1968 of 2172)
PASS: lldb-unit :: Utility/Release/UtilityTests/StreamTest.AddressPrefixAndSuffix (1969 of 2172)
PASS: lldb-unit :: Utility/Release/UtilityTests/StreamTest.AddressRangeEmptyRange (1970 of 2172)
PASS: lldb-unit :: Utility/Release/UtilityTests/StreamTest.AddressRangeInvalidRange (1971 of 2172)
PASS: lldb-unit :: Utility/Release/UtilityTests/StreamTest.AddressRangeSize (1972 of 2172)
PASS: lldb-unit :: Utility/Release/UtilityTests/StreamTest.AddressSize (1973 of 2172)
PASS: lldb-unit :: Utility/Release/UtilityTests/StreamTest.AddressSuffix (1974 of 2172)
PASS: lldb-unit :: Utility/Release/UtilityTests/StreamTest.ChangingByteOrder (1975 of 2172)
PASS: lldb-unit :: Utility/Release/UtilityTests/StreamTest.Indent (1976 of 2172)
PASS: lldb-unit :: Utility/Release/UtilityTests/StreamTest.PutBytesAsRawHex8ToBigEndian (1977 of 2172)
PASS: lldb-unit :: Utility/Release/UtilityTests/StreamTest.PutBytesAsRawHex8ToLittleEndian (1978 of 2172)
PASS: lldb-unit :: Utility/Release/UtilityTests/StreamTest.PutCString (1979 of 2172)
PASS: lldb-unit :: Utility/Release/UtilityTests/StreamTest.PutBytesAsRawHex8ToMixedEndian (1980 of 2172)
PASS: lldb-unit :: Utility/Release/UtilityTests/StreamTest.PutCStringWithStringRef (1981 of 2172)
PASS: lldb-unit :: Utility/Release/UtilityTests/StreamTest.PutChar (1982 of 2172)
PASS: lldb-unit :: Utility/Release/UtilityTests/StreamTest.PutCharNull (1983 of 2172)
PASS: lldb-unit :: Utility/Release/UtilityTests/StreamTest.PutCharWhitespace (1984 of 2172)
PASS: lldb-unit :: Utility/Release/UtilityTests/StreamTest.PutHex16ByteOrderBig (1985 of 2172)
PASS: lldb-unit :: Utility/Release/UtilityTests/StreamTest.PutHex16ByteOrderLittle (1986 of 2172)
PASS: lldb-unit :: Utility/Release/UtilityTests/StreamTest.PutHex32ByteOrderBig (1987 of 2172)
PASS: lldb-unit :: Utility/Release/UtilityTests/StreamTest.PutHex32ByteOrderLittle (1988 of 2172)
PASS: lldb-unit :: Utility/Release/UtilityTests/StreamTest.PutHex64ByteOrderBig (1989 of 2172)
PASS: lldb-unit :: Utility/Release/UtilityTests/StreamTest.PutHex64ByteOrderLittle (1990 of 2172)
PASS: lldb-unit :: Utility/Release/UtilityTests/StreamTest.PutHex8 (1991 of 2172)
PASS: lldb-unit :: Utility/Release/UtilityTests/StreamTest.PutNHex8 (1992 of 2172)
PASS: lldb-unit :: Utility/Release/UtilityTests/StreamTest.PutMaxHex64ByteOrderLittle (1993 of 2172)
PASS: lldb-unit :: Utility/Release/UtilityTests/StreamTest.PutMaxHex64ByteOrderBig (1994 of 2172)
PASS: lldb-unit :: Utility/Release/UtilityTests/StreamTest.PutRawBytesToBigEndian (1995 of 2172)
PASS: lldb-unit :: Utility/Release/UtilityTests/StreamTest.PutPtr (1996 of 2172)
PASS: lldb-unit :: Utility/Release/UtilityTests/StreamTest.PutRawBytesToLittleEndian (1997 of 2172)
PASS: lldb-unit :: Utility/Release/UtilityTests/StreamTest.PutRawBytesToMixedEndian (1998 of 2172)
PASS: lldb-unit :: Utility/Release/UtilityTests/StreamTest.PutSLEB128 (1999 of 2172)
PASS: lldb-unit :: Utility/Release/UtilityTests/StreamTest.PutULEB128 (2000 of 2172)
PASS: lldb-unit :: Utility/Release/UtilityTests/StreamTest.QuotedCString (2001 of 2172)
PASS: lldb-unit :: Utility/Release/UtilityTests/StreamTest.SetIndentLevel (2002 of 2172)
PASS: lldb-unit :: Utility/Release/UtilityTests/StreamTest.PutStringAsRawHex8 (2003 of 2172)
PASS: lldb-unit :: Utility/Release/UtilityTests/StreamTest.ShiftOperatorChars (2004 of 2172)
PASS: lldb-unit :: Utility/Release/UtilityTests/StreamTest.ShiftOperatorPtr (2005 of 2172)
PASS: lldb-unit :: Utility/Release/UtilityTests/StringExtractorTest.DecodeHexU8_Exact (2006 of 2172)
PASS: lldb-unit :: Utility/Release/UtilityTests/StringExtractorTest.DecodeHexU8_Extra (2007 of 2172)
PASS: lldb-unit :: Utility/Release/UtilityTests/StreamTest.ShiftOperatorStrings (2008 of 2172)
PASS: lldb-unit :: Utility/Release/UtilityTests/StringExtractorTest.DecodeHexU8_InvalidHex (2009 of 2172)
PASS: lldb-unit :: Utility/Release/UtilityTests/StringExtractorTest.DecodeHexU8_InvalidHex2 (2010 of 2172)
PASS: lldb-unit :: Utility/Release/UtilityTests/StringExtractorTest.DecodeHexU8_Underflow (2011 of 2172)
PASS: lldb-unit :: Utility/Release/UtilityTests/StringExtractorTest.DecodeHexU8_Underflow2 (2012 of 2172)
PASS: lldb-unit :: Utility/Release/UtilityTests/StringExtractorTest.GetHexBytes (2013 of 2172)
PASS: lldb-unit :: Utility/Release/UtilityTests/StringExtractorTest.GetHexBytesAvail_OddPair (2014 of 2172)
PASS: lldb-unit :: Utility/Release/UtilityTests/StringExtractorTest.GetHexBytesAvail_FullString (2015 of 2172)
PASS: lldb-unit :: Utility/Release/UtilityTests/StringExtractorTest.GetHexBytesAvail_Partial (2016 of 2172)
PASS: lldb-unit :: Utility/Release/UtilityTests/StringExtractorTest.GetHexBytesAvail (2017 of 2172)
PASS: lldb-unit :: Utility/Release/UtilityTests/StringExtractorTest.GetHexBytesAvail_OddPair2 (2018 of 2172)
PASS: lldb-unit :: Utility/Release/UtilityTests/StringExtractorTest.GetHexBytesAvail_Underflow (2019 of 2172)
PASS: lldb-unit :: Utility/Release/UtilityTests/StringExtractorTest.GetHexBytes_FullString (2020 of 2172)
PASS: lldb-unit :: Utility/Release/UtilityTests/StringExtractorTest.GetHexBytes_Underflow (2021 of 2172)
PASS: lldb-unit :: Utility/Release/UtilityTests/StringExtractorTest.GetHexBytes_OddPair (2022 of 2172)
PASS: lldb-unit :: Utility/Release/UtilityTests/StringExtractorTest.GetHexU8_Exact (2023 of 2172)
PASS: lldb-unit :: Utility/Release/UtilityTests/StringExtractorTest.GetHexBytes_Partial (2024 of 2172)
PASS: lldb-unit :: Utility/Release/UtilityTests/StringExtractorTest.GetHexBytes_OddPair2 (2025 of 2172)
PASS: lldb-unit :: Utility/Release/UtilityTests/StringExtractorTest.GetHexU8_Exact_NoEof (2026 of 2172)
PASS: lldb-unit :: Utility/Release/UtilityTests/StringExtractorTest.GetHexU8_Extra (2027 of 2172)
PASS: lldb-unit :: Utility/Release/UtilityTests/StringExtractorTest.GetHexU8_Extra_NoEof (2028 of 2172)
PASS: lldb-unit :: Utility/Release/UtilityTests/StringExtractorTest.GetHexU8_InvalidHex (2029 of 2172)
PASS: lldb-unit :: Utility/Release/UtilityTests/StringExtractorTest.GetHexU8_InvalidHex_NoEof (2030 of 2172)
PASS: lldb-unit :: Utility/Release/UtilityTests/StringExtractorTest.GetHexU8_Underflow (2031 of 2172)
PASS: lldb-unit :: Utility/Release/UtilityTests/StringExtractorTest.GetHexU8_Underflow2 (2032 of 2172)
PASS: lldb-unit :: Utility/Release/UtilityTests/StringExtractorTest.GetHexU8_Underflow2_NoEof (2033 of 2172)
PASS: lldb-unit :: Utility/Release/UtilityTests/StringExtractorTest.GetHexU8_Underflow_NoEof (2034 of 2172)
PASS: lldb-unit :: Utility/Release/UtilityTests/StringExtractorTest.GetNameColonValueNoColon (2035 of 2172)
PASS: lldb-unit :: Utility/Release/UtilityTests/StringExtractorTest.GetNameColonValueContainsColon (2036 of 2172)
PASS: lldb-unit :: Utility/Release/UtilityTests/StringExtractorTest.GetNameColonValueNoSemicolon (2037 of 2172)
PASS: lldb-unit :: Utility/Release/UtilityTests/StringExtractorTest.GetU32BigEndian (2038 of 2172)
PASS: lldb-unit :: Utility/Release/UtilityTests/StringExtractorTest.GetNameColonValueSuccess (2039 of 2172)
PASS: lldb-unit :: Utility/Release/UtilityTests/StringExtractorTest.GetU32LittleEndian (2040 of 2172)
PASS: lldb-unit :: Utility/Release/UtilityTests/StringExtractorTest.GetU64BigEndian (2041 of 2172)
PASS: lldb-unit :: Utility/Release/UtilityTests/StringExtractorTest.InitEmpty (2042 of 2172)
PASS: lldb-unit :: Utility/Release/UtilityTests/StringExtractorTest.InitMisc (2043 of 2172)
PASS: lldb-unit :: Utility/Release/UtilityTests/StringExtractorTest.GetU64LittleEndian (2044 of 2172)
PASS: lldb-unit :: Utility/Release/UtilityTests/StringLexerTest.GetUnlexed (2045 of 2172)
PASS: lldb-unit :: Utility/Release/UtilityTests/StringLexerTest.AdvanceIf (2046 of 2172)
PASS: lldb-unit :: Utility/Release/UtilityTests/StringLexerTest.HasAtLeast (2047 of 2172)
PASS: lldb-unit :: Utility/Release/UtilityTests/StringLexerTest.Next (2048 of 2172)
PASS: lldb-unit :: Utility/Release/UtilityTests/StringLexerTest.NextIf (2049 of 2172)
PASS: lldb-unit :: Utility/Release/UtilityTests/StringLexerTest.NextIfList (2050 of 2172)
PASS: lldb-unit :: Utility/Release/UtilityTests/StringLexerTest.Peek (2051 of 2172)
PASS: lldb-unit :: Utility/Release/UtilityTests/StringLexerTest.PutBack (2052 of 2172)
PASS: lldb-unit :: Utility/Release/UtilityTests/StringListTest.AppendList (2053 of 2172)
PASS: lldb-unit :: Utility/Release/UtilityTests/StringListTest.AppendListCStringArray (2054 of 2172)
PASS: lldb-unit :: Utility/Release/UtilityTests/StringListTest.AppendListCStringArrayEmpty (2055 of 2172)
PASS: lldb-unit :: Utility/Release/UtilityTests/StringListTest.AppendStringCString (2056 of 2172)
PASS: lldb-unit :: Utility/Release/UtilityTests/StringListTest.AppendStringMove (2057 of 2172)
PASS: lldb-unit :: Utility/Release/UtilityTests/StringListTest.AppendStringStdString (2058 of 2172)
PASS: lldb-unit :: Utility/Release/UtilityTests/StringListTest.Assignment (2059 of 2172)
PASS: lldb-unit :: Utility/Release/UtilityTests/StringListTest.Clear (2060 of 2172)
PASS: lldb-unit :: Utility/Release/UtilityTests/StringListTest.CopyList (2061 of 2172)
PASS: lldb-unit :: Utility/Release/UtilityTests/StringListTest.CopyListEmpty (2062 of 2172)
PASS: lldb-unit :: Utility/Release/UtilityTests/StringListTest.DefaultConstructor (2063 of 2172)
PASS: lldb-unit :: Utility/Release/UtilityTests/StringListTest.GetMaxStringLengthDecreasingSize (2064 of 2172)
PASS: lldb-unit :: Utility/Release/UtilityTests/StringListTest.CopyListSingle (2065 of 2172)
PASS: lldb-unit :: Utility/Release/UtilityTests/StringListTest.ForRangeEmpty (2066 of 2172)
PASS: lldb-unit :: Utility/Release/UtilityTests/StringListTest.ForRange (2067 of 2172)
PASS: lldb-unit :: Utility/Release/UtilityTests/StringListTest.GetMaxStringLengthEmpty (2068 of 2172)
PASS: lldb-unit :: Utility/Release/UtilityTests/StringListTest.GetMaxStringLengthEqualSize (2069 of 2172)
PASS: lldb-unit :: Utility/Release/UtilityTests/StringListTest.InsertStringAtIndexEnd (2070 of 2172)
PASS: lldb-unit :: Utility/Release/UtilityTests/StringListTest.GetSize (2071 of 2172)
PASS: lldb-unit :: Utility/Release/UtilityTests/StringListTest.InsertStringAtIndexMove (2072 of 2172)
PASS: lldb-unit :: Utility/Release/UtilityTests/StringListTest.GetMaxStringLengthMixed (2073 of 2172)
PASS: lldb-unit :: Utility/Release/UtilityTests/StringListTest.GetMaxStringLengthIncreasingSize (2074 of 2172)
PASS: lldb-unit :: Utility/Release/UtilityTests/StringListTest.InsertStringAtIndexOutOfBounds (2075 of 2172)
PASS: lldb-unit :: Utility/Release/UtilityTests/StringListTest.InsertStringAtIndexStart (2076 of 2172)
PASS: lldb-unit :: Utility/Release/UtilityTests/StringListTest.Join (2077 of 2172)
PASS: lldb-unit :: Utility/Release/UtilityTests/StringListTest.JoinEmpty (2078 of 2172)
PASS: lldb-unit :: Utility/Release/UtilityTests/StringListTest.InsertStringAtIndexStdString (2079 of 2172)
PASS: lldb-unit :: Utility/Release/UtilityTests/StringListTest.JoinNonSpace (2080 of 2172)
PASS: lldb-unit :: Utility/Release/UtilityTests/StringListTest.JoinMultiCharSeparator (2081 of 2172)
PASS: lldb-unit :: Utility/Release/UtilityTests/StringListTest.JoinSingle (2082 of 2172)
PASS: lldb-unit :: Utility/Release/UtilityTests/StringListTest.LongestCommonPrefixNoPrefix (2083 of 2172)
PASS: lldb-unit :: Utility/Release/UtilityTests/StringListTest.LongestCommonPrefixDuplicateElement (2084 of 2172)
PASS: lldb-unit :: Utility/Release/UtilityTests/StringListTest.LongestCommonPrefix (2085 of 2172)
PASS: lldb-unit :: Utility/Release/UtilityTests/StringListTest.JoinThree (2086 of 2172)
PASS: lldb-unit :: Utility/Release/UtilityTests/StringListTest.LongestCommonPrefixEmpty (2087 of 2172)
PASS: lldb-unit :: Utility/Release/UtilityTests/StringListTest.LongestCommonPrefixSingleElement (2088 of 2172)
PASS: lldb-unit :: Utility/Release/UtilityTests/StringListTest.PopBack (2089 of 2172)
PASS: lldb-unit :: Utility/Release/UtilityTests/StringListTest.ShiftCString (2090 of 2172)
PASS: lldb-unit :: Utility/Release/UtilityTests/StringListTest.SetSize (2091 of 2172)
PASS: lldb-unit :: Utility/Release/UtilityTests/StringListTest.RemoveBlankLines (2092 of 2172)
PASS: lldb-unit :: Utility/Release/UtilityTests/StringListTest.ShiftStdString (2093 of 2172)
PASS: lldb-unit :: Utility/Release/UtilityTests/StringListTest.ShiftMove (2094 of 2172)
PASS: lldb-unit :: Utility/Release/UtilityTests/StringListTest.SplitIntoLines (2095 of 2172)
PASS: lldb-unit :: Utility/Release/UtilityTests/StringListTest.SplitIntoLinesEmpty (2096 of 2172)
PASS: lldb-unit :: Utility/Release/UtilityTests/StringListTest.SplitIntoLinesSingleTrailingCR (2097 of 2172)
PASS: lldb-unit :: Utility/Release/UtilityTests/SubsystemRAIITest.SubsystemWithErrorFailure (2098 of 2172)
PASS: lldb-unit :: Utility/Release/UtilityTests/StructuredDataTest.ParseJSONFromFile (2099 of 2172)
PASS: lldb-unit :: Utility/Release/UtilityTests/SubsystemRAIITest.SubsystemWithErrorSuccess (2100 of 2172)
PASS: lldb-unit :: Utility/Release/UtilityTests/StructuredDataTest.StringDump (2101 of 2172)
PASS: lldb-unit :: Utility/Release/UtilityTests/SubsystemRAIITest.NormalSubsystem (2102 of 2172)
PASS: lldb-unit :: Utility/Release/UtilityTests/TildeExpressionResolver.ResolveFullPath (2103 of 2172)
PASS: lldb-unit :: Utility/Release/UtilityTests/TimeoutTest.Construction (2104 of 2172)
PASS: lldb-unit :: Utility/Release/UtilityTests/TimeoutTest.Format (2105 of 2172)
PASS: lldb-unit :: Utility/Release/UtilityTests/UUIDTest.RelationalOperators (2106 of 2172)
PASS: lldb-unit :: Utility/Release/UtilityTests/TimerTest.CategoryTimes (2107 of 2172)
PASS: lldb-unit :: Utility/Release/UtilityTests/UUIDTest.SetFromStringRef (2108 of 2172)
PASS: lldb-unit :: Utility/Release/UtilityTests/UUIDTest.StringConverion (2109 of 2172)
PASS: lldb-unit :: Utility/Release/UtilityTests/UUIDTest.Validity (2110 of 2172)
PASS: lldb-unit :: Utility/Release/UtilityTests/UriParserTest.BadPort (2111 of 2172)
PASS: lldb-unit :: Utility/Release/UtilityTests/UriParserTest.BadPort2 (2112 of 2172)
PASS: lldb-unit :: Utility/Release/UtilityTests/UriParserTest.BracketedHostname (2113 of 2172)
PASS: lldb-unit :: Utility/Release/UtilityTests/TimerTest.CategoryTimesNested (2114 of 2172)
PASS: lldb-unit :: Utility/Release/UtilityTests/UriParserTest.BracketedHostnamePort (2115 of 2172)
PASS: lldb-unit :: Utility/Release/UtilityTests/UriParserTest.BracketedHostnameWithColon (2116 of 2172)
PASS: lldb-unit :: Utility/Release/UtilityTests/UriParserTest.Empty (2117 of 2172)
PASS: lldb-unit :: Utility/Release/UtilityTests/UriParserTest.BracketedHostnameWithPortIPv4 (2118 of 2172)
PASS: lldb-unit :: Utility/Release/UtilityTests/UriParserTest.BracketedHostnameWithPortIPv6 (2119 of 2172)
PASS: lldb-unit :: Utility/Release/UtilityTests/UriParserTest.LongPath (2120 of 2172)
PASS: lldb-unit :: Utility/Release/UtilityTests/UriParserTest.MinimalPath (2121 of 2172)
PASS: lldb-unit :: Utility/Release/UtilityTests/UriParserTest.Minimal (2122 of 2172)
PASS: lldb-unit :: Utility/Release/UtilityTests/UriParserTest.MinimalPortPath (2123 of 2172)
PASS: lldb-unit :: Utility/Release/UtilityTests/UriParserTest.MinimalPort (2124 of 2172)
PASS: lldb-unit :: Utility/Release/UtilityTests/UriParserTest.PortOverflow (2125 of 2172)
PASS: lldb-unit :: Utility/Release/UtilityTests/UriParserTest.SchemeHostSeparator2 (2126 of 2172)
PASS: lldb-unit :: Utility/Release/UtilityTests/UriParserTest.SchemeHostSeparator (2127 of 2172)
PASS: lldb-unit :: Utility/Release/UtilityTests/UriParserTest.SchemeHostSeparator3 (2128 of 2172)
PASS: lldb-unit :: Utility/Release/UtilityTests/UriParserTest.SchemeHostSeparator4 (2129 of 2172)
PASS: lldb-unit :: Utility/Release/UtilityTests/UriParserTest.TypicalPortPathIPv4 (2130 of 2172)
PASS: lldb-unit :: Utility/Release/UtilityTests/UriParserTest.TypicalPortPathIPv6 (2131 of 2172)
PASS: lldb-unit :: Utility/Release/UtilityTests/UserIDResolver.GetGroupName (2132 of 2172)
PASS: lldb-unit :: Utility/Release/UtilityTests/UserIDResolver.GetUserName (2133 of 2172)
PASS: lldb-unit :: Utility/Release/UtilityTests/VASprintfTest.BufferResize (2134 of 2172)
PASS: lldb-unit :: Utility/Release/UtilityTests/VASprintfTest.EncodingError (2135 of 2172)
PASS: lldb-unit :: Utility/Release/UtilityTests/VASprintfTest.NoBufferResize (2136 of 2172)
PASS: lldb-unit :: Utility/Release/UtilityTests/VMRange.CollectionContains (2137 of 2172)
PASS: lldb-unit :: Utility/Release/UtilityTests/VMRange.Clear (2138 of 2172)
PASS: lldb-unit :: Utility/Release/UtilityTests/VMRange.Comparison (2139 of 2172)
PASS: lldb-unit :: Utility/Release/UtilityTests/VMRange.ContainsRange (2140 of 2172)
PASS: lldb-unit :: Utility/Release/UtilityTests/VMRange.IsValid (2141 of 2172)
PASS: lldb-unit :: Utility/Release/UtilityTests/VMRange.Ordering (2142 of 2172)
PASS: lldb-unit :: Utility/Release/UtilityTests/VMRange.ContainsAddr (2143 of 2172)
PASS: lldb-unit :: Utility/Release/UtilityTests/VMRange.Reset (2144 of 2172)
PASS: lldb-unit :: Utility/Release/UtilityTests/TimerTest.CategoryTimes2 (2145 of 2172)
PASS: lldb-unit :: Utility/Release/UtilityTests/TimerTest.CategoryTimesStats (2146 of 2172)
PASS: lldb-unit :: Utility/Release/UtilityTests/VMRange.SetEndAddress (2147 of 2172)
PASS: lldb-unit :: Utility/Release/UtilityTests/XcodeSDKTest.GetCanonicalNameAndConstruct (2148 of 2172)
PASS: lldb-unit :: Utility/Release/UtilityTests/XcodeSDKTest.GetSDKTypeForTriple (2149 of 2172)
PASS: lldb-unit :: Utility/Release/UtilityTests/XcodeSDKTest.MergeTest (2150 of 2172)
PASS: lldb-unit :: Utility/Release/UtilityTests/XcodeSDKTest.FindXcodeContentsDirectoryInPath (2151 of 2172)
PASS: lldb-unit :: Utility/Release/UtilityTests/XcodeSDKTest.ParseTest (2152 of 2172)
PASS: lldb-shell :: Reproducer/TestReuseDirectory.test (2153 of 2172)
PASS: lldb-unit :: debugserver/Release/debugserverTests/JSON.Parse (2154 of 2172)
PASS: lldb-unit :: debugserver/Release/debugserverTests/RNBSocket.LoopBackConnectIPv6 (2155 of 2172)
PASS: lldb-unit :: Utility/Release/UtilityTests/XcodeSDKTest.SDKSupportsModules (2156 of 2172)
PASS: lldb-unit :: debugserver/Release/debugserverTests/RNBSocket.LoopBackConnectIPv4 (2157 of 2172)
PASS: lldb-unit :: Utility/Release/UtilityTests/XcodeSDKTest.SDKSupportsSwift (2158 of 2172)
PASS: lldb-unit :: debugserver/Release/debugserverTests/RNBSocket.LoopBackListenIPv4 (2159 of 2172)
PASS: lldb-unit :: debugserver/Release/debugserverTests/RNBSocket.AnyListen (2160 of 2172)
PASS: lldb-unit :: debugserver/Release/debugserverTests/RNBSocket.LoopBackListenIPv6 (2161 of 2172)
PASS: lldb-unit :: SymbolFile/DWARF/Release/SymbolFileDWARFTests/XcodeSDKModuleTests.TestModuleGetXcodeSDK (2162 of 2172)
PASS: lldb-unit :: tools/lldb-server/tests/Release/LLDBServerTests/TestBase.DebugserverEnv (2163 of 2172)
PASS: lldb-unit :: tools/lldb-server/tests/Release/LLDBServerTests/TestBase.LaunchModePreservesEnvironment (2164 of 2172)
PASS: lldb-unit :: tools/lldb-server/tests/Release/LLDBServerTests/StandardStartupTest.TestStopReplyContainsThreadPcs (2165 of 2172)
PASS: lldb-unit :: Platform/Release/LLDBPlatformTests/PlatformAppleSimulatorTest.TestHostPlatformToSim (2166 of 2172)
PASS: lldb-unit :: Platform/Release/LLDBPlatformTests/PlatformAppleSimulatorTest.TestSimHasSimEnvionament (2167 of 2172)
PASS: lldb-unit :: Process/gdb-remote/Release/ProcessGdbRemoteTests/GDBRemoteClientBaseTest.InterruptNoResponse (2168 of 2172)
PASS: lldb-shell :: Reproducer/TestVersionCheck.test (2169 of 2172)
PASS: lldb-shell :: Reproducer/TestVerify.test (2170 of 2172)
PASS: lldb-api :: types/TestLongTypesExpr.py (2171 of 2172)
PASS: lldb-api :: tools/lldb-server/TestLldbGdbServer.py (2172 of 2172)
********************
Failed Tests (1):
  lldb-shell :: lldb-server/TestErrorMessages.test

Hide Details

Hide Details

Testing Time: 439.21s Unsupported : 228 Passed : 1935 Expectedly Failed: 8 Failed : 1 make: *** [/Users/buildslave/jenkins/workspace/lldb-cmake-standalone/lldb-xcode-build/test/CMakeFiles/check-lldb-lit] Error 1

Hide Details

** BUILD FAILED **

Hide Details

Hide Details

The following build commands failed: PhaseScriptExecution CMake\ Rules /Users/buildslave/jenkins/workspace/lldb-cmake-standalone/lldb-xcode-build/test/lldb.build/Release/check-lldb-lit.build/Script-AE1328CCCE2848348C3707EC.sh (1 failure) Command failed: Command '['/usr/bin/env', 'TERM=vt100', '/usr/local/bin/cmake', '--build', '.', '--config', 'Release', '--target', 'check-lldb']' returned non-zero exit status 65. Command: ['/usr/bin/env', 'TERM=vt100', '/usr/local/bin/cmake', '--build', '.', '--config', 'Release', '--target', 'check-lldb'] [Pipeline] } [Pipeline] // timeout [Pipeline] } [Pipeline] // stage [Pipeline] } [Pipeline] // withEnv [Pipeline] } [Pipeline] // node [Pipeline] End of Pipeline [Checks API] No suitable checks publisher found. ERROR: script returned exit code 1 Finished: FAILURE