Started 3 days 12 hr ago
Took 54 min

Failed Build clang-d333053-g6ed9cef25f9-t4278-b4278.tar.gz (Dec 3, 2019 10:40:57 AM)

Issues

Found 4 issues:
Ninja target: main.c.o
[7335/8583] /Users/buildslave/jenkins/workspace/test-suite-verify-machineinstrs-aarch64-globalisel-O0-g/test-suite-build/tools/timeit --summary MultiSource/Benchmarks/TSVC/ControlLoops-flt/CMakeFiles/ControlLoops-flt.dir/dummy.c.o.time /Users/buildslave/jenkins/workspace/test-suite-verify-machineinstrs-aarch64-globalisel-O0-g/compiler/bin/clang -DNDEBUG  -B /Applications/Xcode.app/Contents/Developer/Toolchains/XcodeDefault.xctoolchain/usr/bin    -Wno-unused-command-line-argument -mllvm -verify-machineinstrs -O0 -g -arch arm64 -isysroot /Applications/Xcode.app/Contents/Developer/Platforms/iPhoneOS.platform/Developer/SDKs/iPhoneOS11.4.sdk   -w -Werror=date-time -std=gnu99 -MD -MT MultiSource/Benchmarks/TSVC/ControlLoops-flt/CMakeFiles/ControlLoops-flt.dir/dummy.c.o -MF MultiSource/Benchmarks/TSVC/ControlLoops-flt/CMakeFiles/ControlLoops-flt.dir/dummy.c.o.d -o MultiSource/Benchmarks/TSVC/ControlLoops-flt/CMakeFiles/ControlLoops-flt.dir/dummy.c.o   -c /Users/buildslave/jenkins/workspace/test-suite-verify-machineinstrs-aarch64-globalisel-O0-g/test-suite/MultiSource/Benchmarks/TSVC/ControlLoops-flt/dummy.c
[7336/8583] /Users/buildslave/jenkins/workspace/test-suite-verify-machineinstrs-aarch64-globalisel-O0-g/test-suite-build/tools/timeit --summary MultiSource/Benchmarks/TSVC/CrossingThresholds-dbl/CMakeFiles/CrossingThresholds-dbl.dir/dummy.c.o.time /Users/buildslave/jenkins/workspace/test-suite-verify-machineinstrs-aarch64-globalisel-O0-g/compiler/bin/clang -DNDEBUG  -B /Applications/Xcode.app/Contents/Developer/Toolchains/XcodeDefault.xctoolchain/usr/bin    -Wno-unused-command-line-argument -mllvm -verify-machineinstrs -O0 -g -arch arm64 -isysroot /Applications/Xcode.app/Contents/Developer/Platforms/iPhoneOS.platform/Developer/SDKs/iPhoneOS11.4.sdk   -w -Werror=date-time -std=gnu99 -MD -MT MultiSource/Benchmarks/TSVC/CrossingThresholds-dbl/CMakeFiles/CrossingThresholds-dbl.dir/dummy.c.o -MF MultiSource/Benchmarks/TSVC/CrossingThresholds-dbl/CMakeFiles/CrossingThresholds-dbl.dir/dummy.c.o.d -o MultiSource/Benchmarks/TSVC/CrossingThresholds-dbl/CMakeFiles/CrossingThresholds-dbl.dir/dummy.c.o   -c /Users/buildslave/jenkins/workspace/test-suite-verify-machineinstrs-aarch64-globalisel-O0-g/test-suite/MultiSource/Benchmarks/TSVC/CrossingThresholds-dbl/dummy.c
[7337/8583] /Users/buildslave/jenkins/workspace/test-suite-verify-machineinstrs-aarch64-globalisel-O0-g/test-suite-build/tools/timeit --summary MultiSource/Benchmarks/TSVC/CrossingThresholds-flt/CMakeFiles/CrossingThresholds-flt.dir/dummy.c.o.time /Users/buildslave/jenkins/workspace/test-suite-verify-machineinstrs-aarch64-globalisel-O0-g/compiler/bin/clang -DNDEBUG  -B /Applications/Xcode.app/Contents/Developer/Toolchains/XcodeDefault.xctoolchain/usr/bin    -Wno-unused-command-line-argument -mllvm -verify-machineinstrs -O0 -g -arch arm64 -isysroot /Applications/Xcode.app/Contents/Developer/Platforms/iPhoneOS.platform/Developer/SDKs/iPhoneOS11.4.sdk   -w -Werror=date-time -std=gnu99 -MD -MT MultiSource/Benchmarks/TSVC/CrossingThresholds-flt/CMakeFiles/CrossingThresholds-flt.dir/dummy.c.o -MF MultiSource/Benchmarks/TSVC/CrossingThresholds-flt/CMakeFiles/CrossingThresholds-flt.dir/dummy.c.o.d -o MultiSource/Benchmarks/TSVC/CrossingThresholds-flt/CMakeFiles/CrossingThresholds-flt.dir/dummy.c.o   -c /Users/buildslave/jenkins/workspace/test-suite-verify-machineinstrs-aarch64-globalisel-O0-g/test-suite/MultiSource/Benchmarks/TSVC/CrossingThresholds-flt/dummy.c
[7338/8583] /Users/buildslave/jenkins/workspace/test-suite-verify-machineinstrs-aarch64-globalisel-O0-g/test-suite-build/tools/timeit --summary MultiSource/Benchmarks/TSVC/Equivalencing-dbl/CMakeFiles/Equivalencing-dbl.dir/dummy.c.o.time /Users/buildslave/jenkins/workspace/test-suite-verify-machineinstrs-aarch64-globalisel-O0-g/compiler/bin/clang -DNDEBUG  -B /Applications/Xcode.app/Contents/Developer/Toolchains/XcodeDefault.xctoolchain/usr/bin    -Wno-unused-command-line-argument -mllvm -verify-machineinstrs -O0 -g -arch arm64 -isysroot /Applications/Xcode.app/Contents/Developer/Platforms/iPhoneOS.platform/Developer/SDKs/iPhoneOS11.4.sdk   -w -Werror=date-time -std=gnu99 -MD -MT MultiSource/Benchmarks/TSVC/Equivalencing-dbl/CMakeFiles/Equivalencing-dbl.dir/dummy.c.o -MF MultiSource/Benchmarks/TSVC/Equivalencing-dbl/CMakeFiles/Equivalencing-dbl.dir/dummy.c.o.d -o MultiSource/Benchmarks/TSVC/Equivalencing-dbl/CMakeFiles/Equivalencing-dbl.dir/dummy.c.o   -c /Users/buildslave/jenkins/workspace/test-suite-verify-machineinstrs-aarch64-globalisel-O0-g/test-suite/MultiSource/Benchmarks/TSVC/Equivalencing-dbl/dummy.c
[7339/8583] /Users/buildslave/jenkins/workspace/test-suite-verify-machineinstrs-aarch64-globalisel-O0-g/test-suite-build/tools/timeit --summary MultiSource/Benchmarks/Rodinia/pathfinder/CMakeFiles/pathfinder.dir/main.c.o.time /Users/buildslave/jenkins/workspace/test-suite-verify-machineinstrs-aarch64-globalisel-O0-g/compiler/bin/clang -DNDEBUG  -B /Applications/Xcode.app/Contents/Developer/Toolchains/XcodeDefault.xctoolchain/usr/bin    -Wno-unused-command-line-argument -mllvm -verify-machineinstrs -O0 -g -arch arm64 -isysroot /Applications/Xcode.app/Contents/Developer/Platforms/iPhoneOS.platform/Developer/SDKs/iPhoneOS11.4.sdk   -w -Werror=date-time -I/Users/buildslave/jenkins/workspace/test-suite-verify-machineinstrs-aarch64-globalisel-O0-g/test-suite/MultiSource/Benchmarks/Rodinia/pathfinder/../Common/ -MD -MT MultiSource/Benchmarks/Rodinia/pathfinder/CMakeFiles/pathfinder.dir/main.c.o -MF MultiSource/Benchmarks/Rodinia/pathfinder/CMakeFiles/pathfinder.dir/main.c.o.d -o MultiSource/Benchmarks/Rodinia/pathfinder/CMakeFiles/pathfinder.dir/main.c.o   -c /Users/buildslave/jenkins/workspace/test-suite-verify-machineinstrs-aarch64-globalisel-O0-g/test-suite/MultiSource/Benchmarks/Rodinia/pathfinder/main.c
FAILED: MultiSource/Benchmarks/Rodinia/pathfinder/CMakeFiles/pathfinder.dir/main.c.o 
/Users/buildslave/jenkins/workspace/test-suite-verify-machineinstrs-aarch64-globalisel-O0-g/test-suite-build/tools/timeit --summary MultiSource/Benchmarks/Rodinia/pathfinder/CMakeFiles/pathfinder.dir/main.c.o.time /Users/buildslave/jenkins/workspace/test-suite-verify-machineinstrs-aarch64-globalisel-O0-g/compiler/bin/clang -DNDEBUG  -B /Applications/Xcode.app/Contents/Developer/Toolchains/XcodeDefault.xctoolchain/usr/bin    -Wno-unused-command-line-argument -mllvm -verify-machineinstrs -O0 -g -arch arm64 -isysroot /Applications/Xcode.app/Contents/Developer/Platforms/iPhoneOS.platform/Developer/SDKs/iPhoneOS11.4.sdk   -w -Werror=date-time -I/Users/buildslave/jenkins/workspace/test-suite-verify-machineinstrs-aarch64-globalisel-O0-g/test-suite/MultiSource/Benchmarks/Rodinia/pathfinder/../Common/ -MD -MT MultiSource/Benchmarks/Rodinia/pathfinder/CMakeFiles/pathfinder.dir/main.c.o -MF MultiSource/Benchmarks/Rodinia/pathfinder/CMakeFiles/pathfinder.dir/main.c.o.d -o MultiSource/Benchmarks/Rodinia/pathfinder/CMakeFiles/pathfinder.dir/main.c.o   -c /Users/buildslave/jenkins/workspace/test-suite-verify-machineinstrs-aarch64-globalisel-O0-g/test-suite/MultiSource/Benchmarks/Rodinia/pathfinder/main.c
Assertion failed: (!KeyInfoT::isEqual(Val, EmptyKey) && !KeyInfoT::isEqual(Val, TombstoneKey) && "Empty/Tombstone value shouldn't be inserted into map!"), function LookupBucketFor, file /Users/buildslave/jenkins/workspace/clang-stage1-RA/llvm-project/llvm/include/llvm/ADT/DenseMap.h, line 594.
assertion: !KeyInfoT::isEqual(Val, EmptyKey) && !KeyInfoT::isEqual(Val, TombstoneKey) && "Empty/Tombstone value shouldn't be inserted into map!"
[7337/8583] /Users/buildslave/jenkins/workspace/test-suite-verify-machineinstrs-aarch64-globalisel-O0-g/test-suite-build/tools/timeit --summary MultiSource/Benchmarks/TSVC/CrossingThresholds-flt/CMakeFiles/CrossingThresholds-flt.dir/dummy.c.o.time /Users/buildslave/jenkins/workspace/test-suite-verify-machineinstrs-aarch64-globalisel-O0-g/compiler/bin/clang -DNDEBUG  -B /Applications/Xcode.app/Contents/Developer/Toolchains/XcodeDefault.xctoolchain/usr/bin    -Wno-unused-command-line-argument -mllvm -verify-machineinstrs -O0 -g -arch arm64 -isysroot /Applications/Xcode.app/Contents/Developer/Platforms/iPhoneOS.platform/Developer/SDKs/iPhoneOS11.4.sdk   -w -Werror=date-time -std=gnu99 -MD -MT MultiSource/Benchmarks/TSVC/CrossingThresholds-flt/CMakeFiles/CrossingThresholds-flt.dir/dummy.c.o -MF MultiSource/Benchmarks/TSVC/CrossingThresholds-flt/CMakeFiles/CrossingThresholds-flt.dir/dummy.c.o.d -o MultiSource/Benchmarks/TSVC/CrossingThresholds-flt/CMakeFiles/CrossingThresholds-flt.dir/dummy.c.o   -c /Users/buildslave/jenkins/workspace/test-suite-verify-machineinstrs-aarch64-globalisel-O0-g/test-suite/MultiSource/Benchmarks/TSVC/CrossingThresholds-flt/dummy.c
[7338/8583] /Users/buildslave/jenkins/workspace/test-suite-verify-machineinstrs-aarch64-globalisel-O0-g/test-suite-build/tools/timeit --summary MultiSource/Benchmarks/TSVC/Equivalencing-dbl/CMakeFiles/Equivalencing-dbl.dir/dummy.c.o.time /Users/buildslave/jenkins/workspace/test-suite-verify-machineinstrs-aarch64-globalisel-O0-g/compiler/bin/clang -DNDEBUG  -B /Applications/Xcode.app/Contents/Developer/Toolchains/XcodeDefault.xctoolchain/usr/bin    -Wno-unused-command-line-argument -mllvm -verify-machineinstrs -O0 -g -arch arm64 -isysroot /Applications/Xcode.app/Contents/Developer/Platforms/iPhoneOS.platform/Developer/SDKs/iPhoneOS11.4.sdk   -w -Werror=date-time -std=gnu99 -MD -MT MultiSource/Benchmarks/TSVC/Equivalencing-dbl/CMakeFiles/Equivalencing-dbl.dir/dummy.c.o -MF MultiSource/Benchmarks/TSVC/Equivalencing-dbl/CMakeFiles/Equivalencing-dbl.dir/dummy.c.o.d -o MultiSource/Benchmarks/TSVC/Equivalencing-dbl/CMakeFiles/Equivalencing-dbl.dir/dummy.c.o   -c /Users/buildslave/jenkins/workspace/test-suite-verify-machineinstrs-aarch64-globalisel-O0-g/test-suite/MultiSource/Benchmarks/TSVC/Equivalencing-dbl/dummy.c
[7339/8583] /Users/buildslave/jenkins/workspace/test-suite-verify-machineinstrs-aarch64-globalisel-O0-g/test-suite-build/tools/timeit --summary MultiSource/Benchmarks/Rodinia/pathfinder/CMakeFiles/pathfinder.dir/main.c.o.time /Users/buildslave/jenkins/workspace/test-suite-verify-machineinstrs-aarch64-globalisel-O0-g/compiler/bin/clang -DNDEBUG  -B /Applications/Xcode.app/Contents/Developer/Toolchains/XcodeDefault.xctoolchain/usr/bin    -Wno-unused-command-line-argument -mllvm -verify-machineinstrs -O0 -g -arch arm64 -isysroot /Applications/Xcode.app/Contents/Developer/Platforms/iPhoneOS.platform/Developer/SDKs/iPhoneOS11.4.sdk   -w -Werror=date-time -I/Users/buildslave/jenkins/workspace/test-suite-verify-machineinstrs-aarch64-globalisel-O0-g/test-suite/MultiSource/Benchmarks/Rodinia/pathfinder/../Common/ -MD -MT MultiSource/Benchmarks/Rodinia/pathfinder/CMakeFiles/pathfinder.dir/main.c.o -MF MultiSource/Benchmarks/Rodinia/pathfinder/CMakeFiles/pathfinder.dir/main.c.o.d -o MultiSource/Benchmarks/Rodinia/pathfinder/CMakeFiles/pathfinder.dir/main.c.o   -c /Users/buildslave/jenkins/workspace/test-suite-verify-machineinstrs-aarch64-globalisel-O0-g/test-suite/MultiSource/Benchmarks/Rodinia/pathfinder/main.c
FAILED: MultiSource/Benchmarks/Rodinia/pathfinder/CMakeFiles/pathfinder.dir/main.c.o 
/Users/buildslave/jenkins/workspace/test-suite-verify-machineinstrs-aarch64-globalisel-O0-g/test-suite-build/tools/timeit --summary MultiSource/Benchmarks/Rodinia/pathfinder/CMakeFiles/pathfinder.dir/main.c.o.time /Users/buildslave/jenkins/workspace/test-suite-verify-machineinstrs-aarch64-globalisel-O0-g/compiler/bin/clang -DNDEBUG  -B /Applications/Xcode.app/Contents/Developer/Toolchains/XcodeDefault.xctoolchain/usr/bin    -Wno-unused-command-line-argument -mllvm -verify-machineinstrs -O0 -g -arch arm64 -isysroot /Applications/Xcode.app/Contents/Developer/Platforms/iPhoneOS.platform/Developer/SDKs/iPhoneOS11.4.sdk   -w -Werror=date-time -I/Users/buildslave/jenkins/workspace/test-suite-verify-machineinstrs-aarch64-globalisel-O0-g/test-suite/MultiSource/Benchmarks/Rodinia/pathfinder/../Common/ -MD -MT MultiSource/Benchmarks/Rodinia/pathfinder/CMakeFiles/pathfinder.dir/main.c.o -MF MultiSource/Benchmarks/Rodinia/pathfinder/CMakeFiles/pathfinder.dir/main.c.o.d -o MultiSource/Benchmarks/Rodinia/pathfinder/CMakeFiles/pathfinder.dir/main.c.o   -c /Users/buildslave/jenkins/workspace/test-suite-verify-machineinstrs-aarch64-globalisel-O0-g/test-suite/MultiSource/Benchmarks/Rodinia/pathfinder/main.c
Assertion failed: (!KeyInfoT::isEqual(Val, EmptyKey) && !KeyInfoT::isEqual(Val, TombstoneKey) && "Empty/Tombstone value shouldn't be inserted into map!"), function LookupBucketFor, file /Users/buildslave/jenkins/workspace/clang-stage1-RA/llvm-project/llvm/include/llvm/ADT/DenseMap.h, line 594.
Stack dump:
0.	Program arguments: /Users/buildslave/jenkins/workspace/test-suite-verify-machineinstrs-aarch64-globalisel-O0-g/compiler/bin/clang-10 -cc1 -triple arm64-apple-ios11.4.0 -Wdeprecated-objc-isa-usage -Werror=deprecated-objc-isa-usage -Werror=implicit-function-declaration -emit-obj -mrelax-all -disable-free -main-file-name main.c -mrelocation-model pic -pic-level 2 -mthread-model posix -mframe-pointer=all -masm-verbose -munwind-tables -target-sdk-version=11.4 -target-cpu cyclone -target-feature +fp-armv8 -target-feature +neon -target-feature +crypto -target-feature +zcm -target-feature +zcz -target-feature +sha2 -target-feature +aes -target-abi darwinpcs -fallow-half-arguments-and-returns -dwarf-column-info -debug-info-kind=standalone -dwarf-version=4 -debugger-tuning=lldb -target-linker-version 409.12 -resource-dir /Users/buildslave/jenkins/workspace/test-suite-verify-machineinstrs-aarch64-globalisel-O0-g/compiler/lib/clang/10.0.0 -dependency-file MultiSource/Benchmarks/Rodinia/pathfinder/CMakeFiles/pathfinder.dir/main.c.o.d -MT MultiSource/Benchmarks/Rodinia/pathfinder/CMakeFiles/pathfinder.dir/main.c.o -sys-header-deps -isysroot /Applications/Xcode.app/Contents/Developer/Platforms/iPhoneOS.platform/Developer/SDKs/iPhoneOS11.4.sdk -D NDEBUG -I /Users/buildslave/jenkins/workspace/test-suite-verify-machineinstrs-aarch64-globalisel-O0-g/test-suite/MultiSource/Benchmarks/Rodinia/pathfinder/../Common/ -internal-isystem /Applications/Xcode.app/Contents/Developer/Platforms/iPhoneOS.platform/Developer/SDKs/iPhoneOS11.4.sdk/usr/local/include -internal-isystem /Users/buildslave/jenkins/workspace/test-suite-verify-machineinstrs-aarch64-globalisel-O0-g/compiler/lib/clang/10.0.0/include -internal-externc-isystem /Applications/Xcode.app/Contents/Developer/Platforms/iPhoneOS.platform/Developer/SDKs/iPhoneOS11.4.sdk/usr/include -O0 -Wno-unused-command-line-argument -Werror=date-time -w -fdebug-compilation-dir /Users/buildslave/jenkins/workspace/test-suite-verify-machineinstrs-aarch64-globalisel-O0-g/test-suite-build -ferror-limit 19 -fmessage-length 0 -stack-protector 1 -fblocks -fencode-extended-block-signature -fregister-global-dtors-with-atexit -fgnuc-version=4.2.1 -fobjc-runtime=ios-11.4.0 -fmax-type-align=16 -fdiagnostics-show-option -mllvm -verify-machineinstrs -o MultiSource/Benchmarks/Rodinia/pathfinder/CMakeFiles/pathfinder.dir/main.c.o -x c /Users/buildslave/jenkins/workspace/test-suite-verify-machineinstrs-aarch64-globalisel-O0-g/test-suite/MultiSource/Benchmarks/Rodinia/pathfinder/main.c 
Error: unable to execute command: Abort trap: 6
19 clang-10                 0x000000010df45a85 clang::CompilerInstance::ExecuteAction(clang::FrontendAction&) + 1557
20 clang-10                 0x000000010e010bdf clang::ExecuteCompilerInvocation(clang::CompilerInstance*) + 1759
21 clang-10                 0x000000010ba81ab6 cc1_main(llvm::ArrayRef<char const*>, char const*, void*) + 2438
22 clang-10                 0x000000010ba7f1d3 main + 10819
23 libdyld.dylib            0x00007fff67140015 start + 1
clang-10: error: unable to execute command: Abort trap: 6
clang-10: error: clang frontend command failed due to signal (use -v to see invocation)
clang version 10.0.0 (https://github.com/llvm/llvm-project.git 6ed9cef25f915d4533f261c401cee29d8d8012d5)
Error: clang frontend command failed due to signal (use -v to see invocation)
20 clang-10                 0x000000010e010bdf clang::ExecuteCompilerInvocation(clang::CompilerInstance*) + 1759
21 clang-10                 0x000000010ba81ab6 cc1_main(llvm::ArrayRef<char const*>, char const*, void*) + 2438
22 clang-10                 0x000000010ba7f1d3 main + 10819
23 libdyld.dylib            0x00007fff67140015 start + 1
clang-10: error: unable to execute command: Abort trap: 6
clang-10: error: clang frontend command failed due to signal (use -v to see invocation)
clang version 10.0.0 (https://github.com/llvm/llvm-project.git 6ed9cef25f915d4533f261c401cee29d8d8012d5)
Target: aarch64-apple-darwin17.6.0

Build Log

Changes
  1. [AArch64] Fix over-eager fusing of NEON SIMD MUL/ADD (detail)
  2. [lldb/Reproducer] Add version check (detail)
  3. [OpenCL] Use generic addr space for lambda call operator (detail)
  4. [EditLine] Fix RecallHistory to make it go in the right direction. (detail)
  5. [SYCL] Add sycl_kernel attribute for accelerated code outlining (detail)
  6. [SLP] Enhance SLPVectorizer to vectorize different combinations of (detail)
  7. [scudo][standalone] Add chunk ownership function (detail)
  8. Reland [clangd] Rethink how SelectionTree deals with macros and (detail)
  9. llvm-config: do not link absolute paths with `-l` (detail)
  10. [NFC][KnownBits] Add getMinValue() / getMaxValue() methods (detail)
  11. [clang-format] Add new option to add spaces around conditions Summary: (detail)
  12. Revert "Temporarily revert "build: avoid hardcoding the libxml2 library (detail)
  13. Revert "[libomptarget] Build a minimal deviceRTL for amdgcn" (detail)
  14. Rename `tsan/race_range_pc.cc` to `test/tsan/race_range_pc.cpp`. (detail)
  15. [LV] Scalar with predication must not be uniform (detail)

Started by upstream project relay-test-suite-verify-machineinstrs build number 6857
originally caused by:

This run spent:

  • 37 min waiting;
  • 54 min build duration;
  • 54 min total from scheduled to completion.
Revision: 6ed9cef25f915d4533f261c401cee29d8d8012d5
  • detached

Identified problems

Compile Error

This build failed because of a compile error. Below is a list of all errors in the build log:
Indication 1

Ninja target failed

Below is a link to the first failed ninja target.
Indication 2

Assertion failure

This build failed because of an assertion failure. Below is a list of all errors in the build log:
Indication 3