FailedConsole Output

Skipping 15,072 KB.. Full Log
f interest for this run) 
runCmd: settings clear -all
output: 

Hide Details

runCmd: settings set symbols.enable-external-lookup false output:

Hide Details

runCmd: settings set target.inherit-tcc true output:

Hide Details

runCmd: settings set target.auto-apply-fixits false output:

Hide Details

runCmd: settings set plugin.process.gdb-remote.packet-timeout 60 output:

Hide Details

runCmd: settings set symbols.clang-modules-cache-path "/Users/buildslave/jenkins/workspace/lldb-cmake/lldb-build/lldb-test-build.noindex/module-cache-lldb/lldb-api" output:

Hide Details

runCmd: settings set use-color false output:

Hide Details

runCmd: setting set target.prefer-dynamic-value no-dynamic-values output:

Hide Details

XFAIL: LLDB (/Users/buildslave/jenkins/workspace/lldb-cmake/lldb-build/bin/clang-x86_64) :: test_scope_ambiguity_after_using_lookup_with_run_command_gmodules (TestNamespaceLookup.NamespaceLookupTestCase) runCmd: settings clear -all output:

Hide Details

runCmd: settings set symbols.enable-external-lookup false output:

Hide Details

runCmd: settings set target.inherit-tcc true output:

Hide Details

runCmd: settings set target.auto-apply-fixits false output:

Hide Details

runCmd: settings set plugin.process.gdb-remote.packet-timeout 60 output:

Hide Details

runCmd: settings set symbols.clang-modules-cache-path "/Users/buildslave/jenkins/workspace/lldb-cmake/lldb-build/lldb-test-build.noindex/module-cache-lldb/lldb-api" output:

Hide Details

runCmd: settings set use-color false output:

Hide Details

runCmd: setting set target.prefer-dynamic-value no-dynamic-values output:

Hide Details

runCmd: file /Users/buildslave/jenkins/workspace/lldb-cmake/lldb-build/lldb-test-build.noindex/lang/cpp/namespace/TestNamespaceLookup.test_scope_lookup_before_using_with_run_command_dsym/a.out output: Current executable set to '/Users/buildslave/jenkins/workspace/lldb-cmake/lldb-build/lldb-test-build.noindex/lang/cpp/namespace/TestNamespaceLookup.test_scope_lookup_before_using_with_run_command_dsym/a.out' (x86_64).

Hide Details

Hide Details

runCmd: breakpoint set -f "ns3.cpp" -l 7 output: Breakpoint 1: where = a.out`test_lookup_before_using_directive() + 4 at ns3.cpp:8:56, address = 0x0000000100001c64

Hide Details

Hide Details

Expecting pattern: ^Breakpoint (?P<bpno>[0-9]+): (?P<num_locations>[0-9]+) locations\.$ Not matched

Hide Details

Expecting pattern: ^Breakpoint (?P<bpno>[0-9]+): (?P<num_locations>no) locations \(pending\)\. Not matched

Hide Details

Expecting pattern: ^Breakpoint (?P<bpno>[0-9]+): where = (?P<module>.*)`(?P<symbol>[+\-]{0,1}[^+]+)( \+ (?P<offset>[0-9]+)){0,1}( \[inlined\] (?P<inline_symbol>.*)){0,1} at (?P<file>[^:]+):(?P<line_no>[0-9]+)(?P<column>(:[0-9]+)?), address = (?P<address>0x[0-9a-fA-F]+)$ Matched

Hide Details

runCmd: run output: Process 115 stopped * thread #1, queue = 'com.apple.main-thread', stop reason = breakpoint 1.1 frame #0: 0x0000000100001c64 a.out`test_lookup_before_using_directive() at ns3.cpp:8:56 5 void test_lookup_before_using_directive() 6 { 7 // BP_before_using_directive -> 8 std::printf("before using directive: func() = %d\n", func()); // eval func(), exp: 1 ^ 9 } 10 using namespace A; 11 void test_lookup_after_using_directive()

Hide Details

Process 115 launched: '/Users/buildslave/jenkins/workspace/lldb-cmake/lldb-build/lldb-test-build.noindex/lang/cpp/namespace/TestNamespaceLookup.test_scope_lookup_before_using_with_run_command_dsym/a.out' (x86_64)

Hide Details

Hide Details

runCmd: thread list output: Process 115 stopped * thread #1: tid = 0x3083f4, 0x0000000100001c64 a.out`test_lookup_before_using_directive() at ns3.cpp:8:56, queue = 'com.apple.main-thread', stop reason = breakpoint 1.1

Hide Details

Hide Details

Ran command: "thread list"

Hide Details

Got output: Process 115 stopped * thread #1: tid = 0x3083f4, 0x0000000100001c64 a.out`test_lookup_before_using_directive() at ns3.cpp:8:56, queue = 'com.apple.main-thread', stop reason = breakpoint 1.1

Hide Details

Expecting sub string: "stopped" (was found) Expecting sub string: "stop reason = breakpoint" (was found)

Hide Details

runCmd: expr -- func() output: (int) $0 = 1

Hide Details

Hide Details

Ran command: "expr -- func()"

Hide Details

Got output: (int) $0 = 1

Hide Details

Expecting start string: "(int) $0 = 1" (was found)

Hide Details

<bound method SBProcess.Kill of <lldb.SBProcess; proxy of <Swig Object of type 'lldb::SBProcess *' at 0x100cec690> >>: success

Hide Details

PASS: LLDB (/Users/buildslave/jenkins/workspace/lldb-cmake/lldb-build/bin/clang-x86_64) :: test_scope_lookup_before_using_with_run_command_dsym (TestNamespaceLookup.NamespaceLookupTestCase) runCmd: settings clear -all output:

Hide Details

runCmd: settings set symbols.enable-external-lookup false output:

Hide Details

runCmd: settings set target.inherit-tcc true output:

Hide Details

runCmd: settings set target.auto-apply-fixits false output:

Hide Details

runCmd: settings set plugin.process.gdb-remote.packet-timeout 60 output:

Hide Details

runCmd: settings set symbols.clang-modules-cache-path "/Users/buildslave/jenkins/workspace/lldb-cmake/lldb-build/lldb-test-build.noindex/module-cache-lldb/lldb-api" output:

Hide Details

runCmd: settings set use-color false output:

Hide Details

runCmd: setting set target.prefer-dynamic-value no-dynamic-values output:

Hide Details

runCmd: file /Users/buildslave/jenkins/workspace/lldb-cmake/lldb-build/lldb-test-build.noindex/lang/cpp/namespace/TestNamespaceLookup.test_scope_lookup_before_using_with_run_command_dwarf/a.out output: Current executable set to '/Users/buildslave/jenkins/workspace/lldb-cmake/lldb-build/lldb-test-build.noindex/lang/cpp/namespace/TestNamespaceLookup.test_scope_lookup_before_using_with_run_command_dwarf/a.out' (x86_64).

Hide Details

Hide Details

runCmd: breakpoint set -f "ns3.cpp" -l 7 output: Breakpoint 1: where = a.out`test_lookup_before_using_directive() + 4 at ns3.cpp:8:56, address = 0x0000000100001c64

Hide Details

Hide Details

Expecting pattern: ^Breakpoint (?P<bpno>[0-9]+): (?P<num_locations>[0-9]+) locations\.$ Not matched

Hide Details

Expecting pattern: ^Breakpoint (?P<bpno>[0-9]+): (?P<num_locations>no) locations \(pending\)\. Not matched

Hide Details

Expecting pattern: ^Breakpoint (?P<bpno>[0-9]+): where = (?P<module>.*)`(?P<symbol>[+\-]{0,1}[^+]+)( \+ (?P<offset>[0-9]+)){0,1}( \[inlined\] (?P<inline_symbol>.*)){0,1} at (?P<file>[^:]+):(?P<line_no>[0-9]+)(?P<column>(:[0-9]+)?), address = (?P<address>0x[0-9a-fA-F]+)$ Matched

Hide Details

runCmd: run output: Process 355 stopped * thread #1, queue = 'com.apple.main-thread', stop reason = breakpoint 1.1 frame #0: 0x0000000100001c64 a.out`test_lookup_before_using_directive() at ns3.cpp:8:56 5 void test_lookup_before_using_directive() 6 { 7 // BP_before_using_directive -> 8 std::printf("before using directive: func() = %d\n", func()); // eval func(), exp: 1 ^ 9 } 10 using namespace A; 11 void test_lookup_after_using_directive()

Hide Details

Process 355 launched: '/Users/buildslave/jenkins/workspace/lldb-cmake/lldb-build/lldb-test-build.noindex/lang/cpp/namespace/TestNamespaceLookup.test_scope_lookup_before_using_with_run_command_dwarf/a.out' (x86_64)

Hide Details

Hide Details

runCmd: thread list output: Process 355 stopped * thread #1: tid = 0x308534, 0x0000000100001c64 a.out`test_lookup_before_using_directive() at ns3.cpp:8:56, queue = 'com.apple.main-thread', stop reason = breakpoint 1.1

Hide Details

Hide Details

Ran command: "thread list"

Hide Details

Got output: Process 355 stopped * thread #1: tid = 0x308534, 0x0000000100001c64 a.out`test_lookup_before_using_directive() at ns3.cpp:8:56, queue = 'com.apple.main-thread', stop reason = breakpoint 1.1

Hide Details

Expecting sub string: "stopped" (was found) Expecting sub string: "stop reason = breakpoint" (was found)

Hide Details

runCmd: expr -- func() output: (int) $0 = 1

Hide Details

Hide Details

Ran command: "expr -- func()"

Hide Details

Got output: (int) $0 = 1

Hide Details

Expecting start string: "(int) $0 = 1" (was found)

Hide Details

<bound method SBProcess.Kill of <lldb.SBProcess; proxy of <Swig Object of type 'lldb::SBProcess *' at 0x108258e70> >>: success

Hide Details

PASS: LLDB (/Users/buildslave/jenkins/workspace/lldb-cmake/lldb-build/bin/clang-x86_64) :: test_scope_lookup_before_using_with_run_command_dwarf (TestNamespaceLookup.NamespaceLookupTestCase) UNSUPPORTED: LLDB (/Users/buildslave/jenkins/workspace/lldb-cmake/lldb-build/bin/clang-x86_64) :: test_scope_lookup_before_using_with_run_command_dwo (TestNamespaceLookup.NamespaceLookupTestCase) (test case does not fall in any category of interest for this run) runCmd: settings clear -all output:

Hide Details

runCmd: settings set symbols.enable-external-lookup false output:

Hide Details

runCmd: settings set target.inherit-tcc true output:

Hide Details

runCmd: settings set target.auto-apply-fixits false output:

Hide Details

runCmd: settings set plugin.process.gdb-remote.packet-timeout 60 output:

Hide Details

runCmd: settings set symbols.clang-modules-cache-path "/Users/buildslave/jenkins/workspace/lldb-cmake/lldb-build/lldb-test-build.noindex/module-cache-lldb/lldb-api" output:

Hide Details

runCmd: settings set use-color false output:

Hide Details

runCmd: setting set target.prefer-dynamic-value no-dynamic-values output:

Hide Details

FAIL: LLDB (/Users/buildslave/jenkins/workspace/lldb-cmake/lldb-build/bin/clang-x86_64) :: test_scope_lookup_before_using_with_run_command_gmodules (TestNamespaceLookup.NamespaceLookupTestCase) runCmd: settings clear -all output:

Hide Details

runCmd: settings set symbols.enable-external-lookup false output:

Hide Details

runCmd: settings set target.inherit-tcc true output:

Hide Details

runCmd: settings set target.auto-apply-fixits false output:

Hide Details

runCmd: settings set plugin.process.gdb-remote.packet-timeout 60 output:

Hide Details

runCmd: settings set symbols.clang-modules-cache-path "/Users/buildslave/jenkins/workspace/lldb-cmake/lldb-build/lldb-test-build.noindex/module-cache-lldb/lldb-api" output:

Hide Details

runCmd: settings set use-color false output:

Hide Details

runCmd: setting set target.prefer-dynamic-value no-dynamic-values output:

Hide Details

runCmd: file /Users/buildslave/jenkins/workspace/lldb-cmake/lldb-build/lldb-test-build.noindex/lang/cpp/namespace/TestNamespaceLookup.test_scope_lookup_shadowed_by_using_with_run_command_dsym/a.out output: Current executable set to '/Users/buildslave/jenkins/workspace/lldb-cmake/lldb-build/lldb-test-build.noindex/lang/cpp/namespace/TestNamespaceLookup.test_scope_lookup_shadowed_by_using_with_run_command_dsym/a.out' (x86_64).

Hide Details

Hide Details

runCmd: breakpoint set -f "ns2.cpp" -l 23 output: Breakpoint 1: where = a.out`A::B::test_lookup_at_nested_ns_scope() + 4 at ns2.cpp:24:62, address = 0x0000000100001b34

Hide Details

Hide Details

Expecting pattern: ^Breakpoint (?P<bpno>[0-9]+): (?P<num_locations>[0-9]+) locations\.$ Not matched

Hide Details

Expecting pattern: ^Breakpoint (?P<bpno>[0-9]+): (?P<num_locations>no) locations \(pending\)\. Not matched

Hide Details

Expecting pattern: ^Breakpoint (?P<bpno>[0-9]+): where = (?P<module>.*)`(?P<symbol>[+\-]{0,1}[^+]+)( \+ (?P<offset>[0-9]+)){0,1}( \[inlined\] (?P<inline_symbol>.*)){0,1} at (?P<file>[^:]+):(?P<line_no>[0-9]+)(?P<column>(:[0-9]+)?), address = (?P<address>0x[0-9a-fA-F]+)$ Matched

Hide Details

runCmd: run output: Process 800 stopped * thread #1, queue = 'com.apple.main-thread', stop reason = breakpoint 1.1 frame #0: 0x0000000100001b34 a.out`A::B::test_lookup_at_nested_ns_scope() at ns2.cpp:24:62 21 void test_lookup_at_nested_ns_scope() 22 { 23 // BP_nested_ns_scope -> 24 std::printf("at nested ns scope: func() = %d\n", func()); // eval func(), exp: 4 ^ 25 26 //printf("func(10) = %d\n", func(10)); // eval func(10), exp: 13 27 // NOTE: Under the rules of C++, this test would normally get an error

Hide Details

Process 800 launched: '/Users/buildslave/jenkins/workspace/lldb-cmake/lldb-build/lldb-test-build.noindex/lang/cpp/namespace/TestNamespaceLookup.test_scope_lookup_shadowed_by_using_with_run_command_dsym/a.out' (x86_64)

Hide Details

Hide Details

runCmd: thread list output: Process 800 stopped * thread #1: tid = 0x308a56, 0x0000000100001b34 a.out`A::B::test_lookup_at_nested_ns_scope() at ns2.cpp:24:62, queue = 'com.apple.main-thread', stop reason = breakpoint 1.1

Hide Details

Hide Details

Ran command: "thread list"

Hide Details

Got output: Process 800 stopped * thread #1: tid = 0x308a56, 0x0000000100001b34 a.out`A::B::test_lookup_at_nested_ns_scope() at ns2.cpp:24:62, queue = 'com.apple.main-thread', stop reason = breakpoint 1.1

Hide Details

Expecting sub string: "stopped" (was found) Expecting sub string: "stop reason = breakpoint" (was found)

Hide Details

runCmd: expr -- func(10) output: (int) $0 = 13

Hide Details

Hide Details

Ran command: "expr -- func(10)"

Hide Details

Got output: (int) $0 = 13

Hide Details

Expecting start string: "(int) $0 = 13" (was found)

Hide Details

<bound method SBProcess.Kill of <lldb.SBProcess; proxy of <Swig Object of type 'lldb::SBProcess *' at 0x108258e70> >>: success

Hide Details

PASS: LLDB (/Users/buildslave/jenkins/workspace/lldb-cmake/lldb-build/bin/clang-x86_64) :: test_scope_lookup_shadowed_by_using_with_run_command_dsym (TestNamespaceLookup.NamespaceLookupTestCase) runCmd: settings clear -all output:

Hide Details

runCmd: settings set symbols.enable-external-lookup false output:

Hide Details

runCmd: settings set target.inherit-tcc true output:

Hide Details

runCmd: settings set target.auto-apply-fixits false output:

Hide Details

runCmd: settings set plugin.process.gdb-remote.packet-timeout 60 output:

Hide Details

runCmd: settings set symbols.clang-modules-cache-path "/Users/buildslave/jenkins/workspace/lldb-cmake/lldb-build/lldb-test-build.noindex/module-cache-lldb/lldb-api" output:

Hide Details

runCmd: settings set use-color false output:

Hide Details

runCmd: setting set target.prefer-dynamic-value no-dynamic-values output:

Hide Details

runCmd: file /Users/buildslave/jenkins/workspace/lldb-cmake/lldb-build/lldb-test-build.noindex/lang/cpp/namespace/TestNamespaceLookup.test_scope_lookup_shadowed_by_using_with_run_command_dwarf/a.out output: Current executable set to '/Users/buildslave/jenkins/workspace/lldb-cmake/lldb-build/lldb-test-build.noindex/lang/cpp/namespace/TestNamespaceLookup.test_scope_lookup_shadowed_by_using_with_run_command_dwarf/a.out' (x86_64).

Hide Details

Hide Details

runCmd: breakpoint set -f "ns2.cpp" -l 23 output: Breakpoint 1: where = a.out`A::B::test_lookup_at_nested_ns_scope() + 4 at ns2.cpp:24:62, address = 0x0000000100001b34

Hide Details

Hide Details

Expecting pattern: ^Breakpoint (?P<bpno>[0-9]+): (?P<num_locations>[0-9]+) locations\.$ Not matched

Hide Details

Expecting pattern: ^Breakpoint (?P<bpno>[0-9]+): (?P<num_locations>no) locations \(pending\)\. Not matched

Hide Details

Expecting pattern: ^Breakpoint (?P<bpno>[0-9]+): where = (?P<module>.*)`(?P<symbol>[+\-]{0,1}[^+]+)( \+ (?P<offset>[0-9]+)){0,1}( \[inlined\] (?P<inline_symbol>.*)){0,1} at (?P<file>[^:]+):(?P<line_no>[0-9]+)(?P<column>(:[0-9]+)?), address = (?P<address>0x[0-9a-fA-F]+)$ Matched

Hide Details

runCmd: run output: Process 893 stopped * thread #1, queue = 'com.apple.main-thread', stop reason = breakpoint 1.1 frame #0: 0x0000000100001b34 a.out`A::B::test_lookup_at_nested_ns_scope() at ns2.cpp:24:62 21 void test_lookup_at_nested_ns_scope() 22 { 23 // BP_nested_ns_scope -> 24 std::printf("at nested ns scope: func() = %d\n", func()); // eval func(), exp: 4 ^ 25 26 //printf("func(10) = %d\n", func(10)); // eval func(10), exp: 13 27 // NOTE: Under the rules of C++, this test would normally get an error

Hide Details

Process 893 launched: '/Users/buildslave/jenkins/workspace/lldb-cmake/lldb-build/lldb-test-build.noindex/lang/cpp/namespace/TestNamespaceLookup.test_scope_lookup_shadowed_by_using_with_run_command_dwarf/a.out' (x86_64)

Hide Details

Hide Details

runCmd: thread list output: Process 893 stopped * thread #1: tid = 0x308b3e, 0x0000000100001b34 a.out`A::B::test_lookup_at_nested_ns_scope() at ns2.cpp:24:62, queue = 'com.apple.main-thread', stop reason = breakpoint 1.1

Hide Details

Hide Details

Ran command: "thread list"

Hide Details

Got output: Process 893 stopped * thread #1: tid = 0x308b3e, 0x0000000100001b34 a.out`A::B::test_lookup_at_nested_ns_scope() at ns2.cpp:24:62, queue = 'com.apple.main-thread', stop reason = breakpoint 1.1

Hide Details

Expecting sub string: "stopped" (was found) Expecting sub string: "stop reason = breakpoint" (was found)

Hide Details

runCmd: expr -- func(10) output: (int) $0 = 13

Hide Details

Hide Details

Ran command: "expr -- func(10)"

Hide Details

Got output: (int) $0 = 13

Hide Details

Expecting start string: "(int) $0 = 13" (was found)

Hide Details

<bound method SBProcess.Kill of <lldb.SBProcess; proxy of <Swig Object of type 'lldb::SBProcess *' at 0x100cec690> >>: success

Hide Details

PASS: LLDB (/Users/buildslave/jenkins/workspace/lldb-cmake/lldb-build/bin/clang-x86_64) :: test_scope_lookup_shadowed_by_using_with_run_command_dwarf (TestNamespaceLookup.NamespaceLookupTestCase) UNSUPPORTED: LLDB (/Users/buildslave/jenkins/workspace/lldb-cmake/lldb-build/bin/clang-x86_64) :: test_scope_lookup_shadowed_by_using_with_run_command_dwo (TestNamespaceLookup.NamespaceLookupTestCase) (test case does not fall in any category of interest for this run) runCmd: settings clear -all output:

Hide Details

runCmd: settings set symbols.enable-external-lookup false output:

Hide Details

runCmd: settings set target.inherit-tcc true output:

Hide Details

runCmd: settings set target.auto-apply-fixits false output:

Hide Details

runCmd: settings set plugin.process.gdb-remote.packet-timeout 60 output:

Hide Details

runCmd: settings set symbols.clang-modules-cache-path "/Users/buildslave/jenkins/workspace/lldb-cmake/lldb-build/lldb-test-build.noindex/module-cache-lldb/lldb-api" output:

Hide Details

runCmd: settings set use-color false output:

Hide Details

runCmd: setting set target.prefer-dynamic-value no-dynamic-values output:

Hide Details

FAIL: LLDB (/Users/buildslave/jenkins/workspace/lldb-cmake/lldb-build/bin/clang-x86_64) :: test_scope_lookup_shadowed_by_using_with_run_command_gmodules (TestNamespaceLookup.NamespaceLookupTestCase) runCmd: settings clear -all output:

Hide Details

runCmd: settings set symbols.enable-external-lookup false output:

Hide Details

runCmd: settings set target.inherit-tcc true output:

Hide Details

runCmd: settings set target.auto-apply-fixits false output:

Hide Details

runCmd: settings set plugin.process.gdb-remote.packet-timeout 60 output:

Hide Details

runCmd: settings set symbols.clang-modules-cache-path "/Users/buildslave/jenkins/workspace/lldb-cmake/lldb-build/lldb-test-build.noindex/module-cache-lldb/lldb-api" output:

Hide Details

runCmd: settings set use-color false output:

Hide Details

runCmd: setting set target.prefer-dynamic-value no-dynamic-values output:

Hide Details

runCmd: file /Users/buildslave/jenkins/workspace/lldb-cmake/lldb-build/lldb-test-build.noindex/lang/cpp/namespace/TestNamespaceLookup.test_scope_lookup_with_run_command_dsym/a.out output: Current executable set to '/Users/buildslave/jenkins/workspace/lldb-cmake/lldb-build/lldb-test-build.noindex/lang/cpp/namespace/TestNamespaceLookup.test_scope_lookup_with_run_command_dsym/a.out' (x86_64).

Hide Details

Hide Details

runCmd: breakpoint set -f "ns.cpp" -l 20 output: Breakpoint 1: where = a.out`test_lookup_at_global_scope() + 8 at ns.cpp:21:48, address = 0x0000000100001a58

Hide Details

Hide Details

Expecting pattern: ^Breakpoint (?P<bpno>[0-9]+): (?P<num_locations>[0-9]+) locations\.$ Not matched

Hide Details

Expecting pattern: ^Breakpoint (?P<bpno>[0-9]+): (?P<num_locations>no) locations \(pending\)\. Not matched

Hide Details

Expecting pattern: ^Breakpoint (?P<bpno>[0-9]+): where = (?P<module>.*)`(?P<symbol>[+\-]{0,1}[^+]+)( \+ (?P<offset>[0-9]+)){0,1}( \[inlined\] (?P<inline_symbol>.*)){0,1} at (?P<file>[^:]+):(?P<line_no>[0-9]+)(?P<column>(:[0-9]+)?), address = (?P<address>0x[0-9a-fA-F]+)$ Matched

Hide Details

runCmd: breakpoint set -f "ns2.cpp" -l 52 output: Breakpoint 2: where = a.out`A::test_lookup_at_ns_scope() + 8 at ns2.cpp:53:52, address = 0x0000000100001c08

Hide Details

Hide Details

Expecting pattern: ^Breakpoint (?P<bpno>[0-9]+): (?P<num_locations>[0-9]+) locations\.$ Not matched

Hide Details

Expecting pattern: ^Breakpoint (?P<bpno>[0-9]+): (?P<num_locations>no) locations \(pending\)\. Not matched

Hide Details

Expecting pattern: ^Breakpoint (?P<bpno>[0-9]+): where = (?P<module>.*)`(?P<symbol>[+\-]{0,1}[^+]+)( \+ (?P<offset>[0-9]+)){0,1}( \[inlined\] (?P<inline_symbol>.*)){0,1} at (?P<file>[^:]+):(?P<line_no>[0-9]+)(?P<column>(:[0-9]+)?), address = (?P<address>0x[0-9a-fA-F]+)$ Matched

Hide Details

runCmd: breakpoint set -f "ns2.cpp" -l 23 output: Breakpoint 3: where = a.out`A::B::test_lookup_at_nested_ns_scope() + 4 at ns2.cpp:24:62, address = 0x0000000100001b34

Hide Details

Hide Details

Expecting pattern: ^Breakpoint (?P<bpno>[0-9]+): (?P<num_locations>[0-9]+) locations\.$ Not matched

Hide Details

Expecting pattern: ^Breakpoint (?P<bpno>[0-9]+): (?P<num_locations>no) locations \(pending\)\. Not matched

Hide Details

Expecting pattern: ^Breakpoint (?P<bpno>[0-9]+): where = (?P<module>.*)`(?P<symbol>[+\-]{0,1}[^+]+)( \+ (?P<offset>[0-9]+)){0,1}( \[inlined\] (?P<inline_symbol>.*)){0,1} at (?P<file>[^:]+):(?P<line_no>[0-9]+)(?P<column>(:[0-9]+)?), address = (?P<address>0x[0-9a-fA-F]+)$ Matched

Hide Details

runCmd: breakpoint set -f "ns2.cpp" -l 34 output: Breakpoint 4: where = a.out`A::B::test_lookup_at_nested_ns_scope_after_using() + 4 at ns2.cpp:36:74, address = 0x0000000100001b54

Hide Details

Hide Details

Expecting pattern: ^Breakpoint (?P<bpno>[0-9]+): (?P<num_locations>[0-9]+) locations\.$ Not matched

Hide Details

Expecting pattern: ^Breakpoint (?P<bpno>[0-9]+): (?P<num_locations>no) locations \(pending\)\. Not matched

Hide Details

Expecting pattern: ^Breakpoint (?P<bpno>[0-9]+): where = (?P<module>.*)`(?P<symbol>[+\-]{0,1}[^+]+)( \+ (?P<offset>[0-9]+)){0,1}( \[inlined\] (?P<inline_symbol>.*)){0,1} at (?P<file>[^:]+):(?P<line_no>[0-9]+)(?P<column>(:[0-9]+)?), address = (?P<address>0x[0-9a-fA-F]+)$ Matched

Hide Details

runCmd: breakpoint set -f "ns3.cpp" -l 7 output: Breakpoint 5: where = a.out`test_lookup_before_using_directive() + 4 at ns3.cpp:8:56, address = 0x0000000100001c64

Hide Details

Hide Details

Expecting pattern: ^Breakpoint (?P<bpno>[0-9]+): (?P<num_locations>[0-9]+) locations\.$ Not matched

Hide Details

Expecting pattern: ^Breakpoint (?P<bpno>[0-9]+): (?P<num_locations>no) locations \(pending\)\. Not matched

Hide Details

Expecting pattern: ^Breakpoint (?P<bpno>[0-9]+): where = (?P<module>.*)`(?P<symbol>[+\-]{0,1}[^+]+)( \+ (?P<offset>[0-9]+)){0,1}( \[inlined\] (?P<inline_symbol>.*)){0,1} at (?P<file>[^:]+):(?P<line_no>[0-9]+)(?P<column>(:[0-9]+)?), address = (?P<address>0x[0-9a-fA-F]+)$ Matched

Hide Details

runCmd: breakpoint set -f "ns3.cpp" -l 13 output: Breakpoint 6: where = a.out`test_lookup_after_using_directive() + 8 at ns3.cpp:15:56, address = 0x0000000100001c88

Hide Details

Hide Details

Expecting pattern: ^Breakpoint (?P<bpno>[0-9]+): (?P<num_locations>[0-9]+) locations\.$ Not matched

Hide Details

Expecting pattern: ^Breakpoint (?P<bpno>[0-9]+): (?P<num_locations>no) locations \(pending\)\. Not matched

Hide Details

Expecting pattern: ^Breakpoint (?P<bpno>[0-9]+): where = (?P<module>.*)`(?P<symbol>[+\-]{0,1}[^+]+)( \+ (?P<offset>[0-9]+)){0,1}( \[inlined\] (?P<inline_symbol>.*)){0,1} at (?P<file>[^:]+):(?P<line_no>[0-9]+)(?P<column>(:[0-9]+)?), address = (?P<address>0x[0-9a-fA-F]+)$ Matched

Hide Details

runCmd: run output: Process 1273 stopped * thread #1, queue = 'com.apple.main-thread', stop reason = breakpoint 1.1 frame #0: 0x0000000100001a58 a.out`test_lookup_at_global_scope() at ns.cpp:21:48 18 void test_lookup_at_global_scope() 19 { 20 // BP_global_scope -> 21 std::printf("at global scope: foo() = %d\n", foo()); // eval foo(), exp: 42 ^ 22 std::printf("at global scope: func() = %d\n", func()); // eval func(), exp: 1 23 }

Hide Details

Process 1273 launched: '/Users/buildslave/jenkins/workspace/lldb-cmake/lldb-build/lldb-test-build.noindex/lang/cpp/namespace/TestNamespaceLookup.test_scope_lookup_with_run_command_dsym/a.out' (x86_64)

Hide Details

Hide Details

runCmd: thread list output: Process 1273 stopped * thread #1: tid = 0x309000, 0x0000000100001a58 a.out`test_lookup_at_global_scope() at ns.cpp:21:48, queue = 'com.apple.main-thread', stop reason = breakpoint 1.1

Hide Details

Hide Details

Ran command: "thread list"

Hide Details

Got output: Process 1273 stopped * thread #1: tid = 0x309000, 0x0000000100001a58 a.out`test_lookup_at_global_scope() at ns.cpp:21:48, queue = 'com.apple.main-thread', stop reason = breakpoint 1.1

Hide Details

Expecting sub string: "stopped" (was found) Expecting sub string: "stop reason = breakpoint" (was found)

Hide Details

runCmd: expr -- func() output: (int) $0 = 1

Hide Details

Hide Details

Ran command: "expr -- func()"

Hide Details

Got output: (int) $0 = 1

Hide Details

Expecting start string: "(int) $0 = 1" (was found)

Hide Details

runCmd: expr -- A::B::func() output: (int) $1 = 4

Hide Details

Hide Details

Ran command: "expr -- A::B::func()"

Hide Details

Got output: (int) $1 = 4

Hide Details

Expecting start string: "(int) $1 = 4" (was found)

Hide Details

runCmd: expr -- func(10) output: (int) $2 = 11

Hide Details

Hide Details

Ran command: "expr -- func(10)"

Hide Details

Got output: (int) $2 = 11

Hide Details

Expecting start string: "(int) $2 = 11" (was found)

Hide Details

runCmd: expr -- ::func() output: (int) $3 = 1

Hide Details

Hide Details

Ran command: "expr -- ::func()"

Hide Details

Got output: (int) $3 = 1

Hide Details

Expecting start string: "(int) $3 = 1" (was found)

Hide Details

runCmd: expr -- A::foo() output: (int) $4 = 42

Hide Details

Hide Details

Ran command: "expr -- A::foo()"

Hide Details

Got output: (int) $4 = 42

Hide Details

Expecting start string: "(int) $4 = 42" (was found)

Hide Details

runCmd: continue output: Process 1273 resuming Process 1273 stopped * thread #1, queue = 'com.apple.main-thread', stop reason = breakpoint 2.1 frame #0: 0x0000000100001c08 a.out`A::test_lookup_at_ns_scope() at ns2.cpp:53:52 50 void A::test_lookup_at_ns_scope() 51 { 52 // BP_ns_scope -> 53 std::printf("at nested ns scope: func() = %d\n", func()); // eval func(), exp: 3 ^ 54 std::printf("at nested ns scope: func(10) = %d\n", func(10)); // eval func(10), exp: 13 55 std::printf("at nested ns scope: foo() = %d\n", foo()); // eval foo(), exp: 42 56 }

Hide Details

Hide Details

Hide Details

runCmd: thread list output: Process 1273 stopped * thread #1: tid = 0x309000, 0x0000000100001c08 a.out`A::test_lookup_at_ns_scope() at ns2.cpp:53:52, queue = 'com.apple.main-thread', stop reason = breakpoint 2.1

Hide Details

Hide Details

Ran command: "thread list"

Hide Details

Got output: Process 1273 stopped * thread #1: tid = 0x309000, 0x0000000100001c08 a.out`A::test_lookup_at_ns_scope() at ns2.cpp:53:52, queue = 'com.apple.main-thread', stop reason = breakpoint 2.1

Hide Details

Expecting sub string: "stopped" (was found) Expecting sub string: "stop reason = breakpoint" (was found)

Hide Details

runCmd: expr -- func(10) output: (int) $5 = 13

Hide Details

Hide Details

Ran command: "expr -- func(10)"

Hide Details

Got output: (int) $5 = 13

Hide Details

Expecting start string: "(int) $5 = 13" (was found)

Hide Details

runCmd: expr -- B::func() output: (int) $6 = 4

Hide Details

Hide Details

Ran command: "expr -- B::func()"

Hide Details

Got output: (int) $6 = 4

Hide Details

Expecting start string: "(int) $6 = 4" (was found)

Hide Details

runCmd: expr -- func() output: (int) $7 = 3

Hide Details

Hide Details

Ran command: "expr -- func()"

Hide Details

Got output: (int) $7 = 3

Hide Details

Expecting start string: "(int) $7 = 3" (was found)

Hide Details

runCmd: continue output: Process 1273 resuming Process 1273 stopped * thread #1, queue = 'com.apple.main-thread', stop reason = breakpoint 3.1 frame #0: 0x0000000100001b34 a.out`A::B::test_lookup_at_nested_ns_scope() at ns2.cpp:24:62 21 void test_lookup_at_nested_ns_scope() 22 { 23 // BP_nested_ns_scope -> 24 std::printf("at nested ns scope: func() = %d\n", func()); // eval func(), exp: 4 ^ 25 26 //printf("func(10) = %d\n", func(10)); // eval func(10), exp: 13 27 // NOTE: Under the rules of C++, this test would normally get an error

Hide Details

Hide Details

Hide Details

runCmd: thread list output: Process 1273 stopped * thread #1: tid = 0x309000, 0x0000000100001b34 a.out`A::B::test_lookup_at_nested_ns_scope() at ns2.cpp:24:62, queue = 'com.apple.main-thread', stop reason = breakpoint 3.1

Hide Details

Hide Details

Ran command: "thread list"

Hide Details

Got output: Process 1273 stopped * thread #1: tid = 0x309000, 0x0000000100001b34 a.out`A::B::test_lookup_at_nested_ns_scope() at ns2.cpp:24:62, queue = 'com.apple.main-thread', stop reason = breakpoint 3.1

Hide Details

Expecting sub string: "stopped" (was found) Expecting sub string: "stop reason = breakpoint" (was found)

Hide Details

runCmd: expr -- func() output: (int) $8 = 4

Hide Details

Hide Details

Ran command: "expr -- func()"

Hide Details

Got output: (int) $8 = 4

Hide Details

Expecting start string: "(int) $8 = 4" (was found)

Hide Details

runCmd: expr -- A::func() output: (int) $9 = 3

Hide Details

Hide Details

Ran command: "expr -- A::func()"

Hide Details

Got output: (int) $9 = 3

Hide Details

Expecting start string: "(int) $9 = 3" (was found)

Hide Details

runCmd: expr -- func(10) output: (int) $10 = 13

Hide Details

Hide Details

Ran command: "expr -- func(10)"

Hide Details

Got output: (int) $10 = 13

Hide Details

Expecting start string: "(int) $10 = 13" (was found)

Hide Details

runCmd: continue output: Process 1273 resuming Process 1273 stopped * thread #1, queue = 'com.apple.main-thread', stop reason = breakpoint 4.1 frame #0: 0x0000000100001b54 a.out`A::B::test_lookup_at_nested_ns_scope_after_using() at ns2.cpp:36:74 33 { 34 // BP_nested_ns_scope_after_using 35 using A::func; -> 36 std::printf("at nested ns scope after using: func() = %d\n", func()); // eval func(), exp: 3 ^ 37 } 38 } 39 }

Hide Details

Hide Details

Hide Details

runCmd: thread list output: Process 1273 stopped * thread #1: tid = 0x309000, 0x0000000100001b54 a.out`A::B::test_lookup_at_nested_ns_scope_after_using() at ns2.cpp:36:74, queue = 'com.apple.main-thread', stop reason = breakpoint 4.1

Hide Details

Hide Details

Ran command: "thread list"

Hide Details

Got output: Process 1273 stopped * thread #1: tid = 0x309000, 0x0000000100001b54 a.out`A::B::test_lookup_at_nested_ns_scope_after_using() at ns2.cpp:36:74, queue = 'com.apple.main-thread', stop reason = breakpoint 4.1

Hide Details

Expecting sub string: "stopped" (was found) Expecting sub string: "stop reason = breakpoint" (was found)

Hide Details

runCmd: expr -- A::func(10) output: (int) $11 = 13

Hide Details

Hide Details

Ran command: "expr -- A::func(10)"

Hide Details

Got output: (int) $11 = 13

Hide Details

Expecting start string: "(int) $11 = 13" (was found)

Hide Details

runCmd: continue output: Process 1273 resuming Process 1273 stopped * thread #1, queue = 'com.apple.main-thread', stop reason = breakpoint 5.1 frame #0: 0x0000000100001c64 a.out`test_lookup_before_using_directive() at ns3.cpp:8:56 5 void test_lookup_before_using_directive() 6 { 7 // BP_before_using_directive -> 8 std::printf("before using directive: func() = %d\n", func()); // eval func(), exp: 1 ^ 9 } 10 using namespace A; 11 void test_lookup_after_using_directive()

Hide Details

Hide Details

Hide Details

runCmd: thread list output: Process 1273 stopped * thread #1: tid = 0x309000, 0x0000000100001c64 a.out`test_lookup_before_using_directive() at ns3.cpp:8:56, queue = 'com.apple.main-thread', stop reason = breakpoint 5.1

Hide Details

Hide Details

Ran command: "thread list"

Hide Details

Got output: Process 1273 stopped * thread #1: tid = 0x309000, 0x0000000100001c64 a.out`test_lookup_before_using_directive() at ns3.cpp:8:56, queue = 'com.apple.main-thread', stop reason = breakpoint 5.1

Hide Details

Expecting sub string: "stopped" (was found) Expecting sub string: "stop reason = breakpoint" (was found)

Hide Details

runCmd: expr -- ::func() output: (int) $12 = 1

Hide Details

Hide Details

Ran command: "expr -- ::func()"

Hide Details

Got output: (int) $12 = 1

Hide Details

Expecting start string: "(int) $12 = 1" (was found)

Hide Details

runCmd: expr -- B::func() output: (int) $13 = 4

Hide Details

Hide Details

Ran command: "expr -- B::func()"

Hide Details

Got output: (int) $13 = 4

Hide Details

Expecting start string: "(int) $13 = 4" (was found)

Hide Details

runCmd: continue output: Process 1273 resuming Process 1273 stopped * thread #1, queue = 'com.apple.main-thread', stop reason = breakpoint 6.1 frame #0: 0x0000000100001c88 a.out`test_lookup_after_using_directive() at ns3.cpp:15:56 12 { 13 // BP_after_using_directive 14 //printf("func() = %d\n", func()); // eval func(), exp: error, ambiguous -> 15 std::printf("after using directive: func2() = %d\n", func2()); // eval func2(), exp: 3 ^ 16 std::printf("after using directive: ::func() = %d\n", ::func()); // eval ::func(), exp: 1 17 std::printf("after using directive: B::func() = %d\n", B::func()); // eval B::func(), exp: 4 18 }

Hide Details

Hide Details

Hide Details

runCmd: thread list output: Process 1273 stopped * thread #1: tid = 0x309000, 0x0000000100001c88 a.out`test_lookup_after_using_directive() at ns3.cpp:15:56, queue = 'com.apple.main-thread', stop reason = breakpoint 6.1

Hide Details

Hide Details

Ran command: "thread list"

Hide Details

Got output: Process 1273 stopped * thread #1: tid = 0x309000, 0x0000000100001c88 a.out`test_lookup_after_using_directive() at ns3.cpp:15:56, queue = 'com.apple.main-thread', stop reason = breakpoint 6.1

Hide Details

Expecting sub string: "stopped" (was found) Expecting sub string: "stop reason = breakpoint" (was found)

Hide Details

runCmd: expr -- ::func() output: (int) $14 = 1

Hide Details

Hide Details

Ran command: "expr -- ::func()"

Hide Details

Got output: (int) $14 = 1

Hide Details

Expecting start string: "(int) $14 = 1" (was found)

Hide Details

runCmd: expr -- B::func() output: (int) $15 = 4

Hide Details

Hide Details

Ran command: "expr -- B::func()"

Hide Details

Got output: (int) $15 = 4

Hide Details

Expecting start string: "(int) $15 = 4" (was found)

Hide Details

<bound method SBProcess.Kill of <lldb.SBProcess; proxy of <Swig Object of type 'lldb::SBProcess *' at 0x100cec690> >>: success

Hide Details

PASS: LLDB (/Users/buildslave/jenkins/workspace/lldb-cmake/lldb-build/bin/clang-x86_64) :: test_scope_lookup_with_run_command_dsym (TestNamespaceLookup.NamespaceLookupTestCase) runCmd: settings clear -all output:

Hide Details

runCmd: settings set symbols.enable-external-lookup false output:

Hide Details

runCmd: settings set target.inherit-tcc true output:

Hide Details

runCmd: settings set target.auto-apply-fixits false output:

Hide Details

runCmd: settings set plugin.process.gdb-remote.packet-timeout 60 output:

Hide Details

runCmd: settings set symbols.clang-modules-cache-path "/Users/buildslave/jenkins/workspace/lldb-cmake/lldb-build/lldb-test-build.noindex/module-cache-lldb/lldb-api" output:

Hide Details

runCmd: settings set use-color false output:

Hide Details

runCmd: setting set target.prefer-dynamic-value no-dynamic-values output:

Hide Details

runCmd: file /Users/buildslave/jenkins/workspace/lldb-cmake/lldb-build/lldb-test-build.noindex/lang/cpp/namespace/TestNamespaceLookup.test_scope_lookup_with_run_command_dwarf/a.out output: Current executable set to '/Users/buildslave/jenkins/workspace/lldb-cmake/lldb-build/lldb-test-build.noindex/lang/cpp/namespace/TestNamespaceLookup.test_scope_lookup_with_run_command_dwarf/a.out' (x86_64).

Hide Details

Hide Details

runCmd: breakpoint set -f "ns.cpp" -l 20 output: Breakpoint 1: where = a.out`test_lookup_at_global_scope() + 8 at ns.cpp:21:48, address = 0x0000000100001a58

Hide Details

Hide Details

Expecting pattern: ^Breakpoint (?P<bpno>[0-9]+): (?P<num_locations>[0-9]+) locations\.$ Not matched

Hide Details

Expecting pattern: ^Breakpoint (?P<bpno>[0-9]+): (?P<num_locations>no) locations \(pending\)\. Not matched

Hide Details

Expecting pattern: ^Breakpoint (?P<bpno>[0-9]+): where = (?P<module>.*)`(?P<symbol>[+\-]{0,1}[^+]+)( \+ (?P<offset>[0-9]+)){0,1}( \[inlined\] (?P<inline_symbol>.*)){0,1} at (?P<file>[^:]+):(?P<line_no>[0-9]+)(?P<column>(:[0-9]+)?), address = (?P<address>0x[0-9a-fA-F]+)$ Matched

Hide Details

runCmd: breakpoint set -f "ns2.cpp" -l 52 output: Breakpoint 2: where = a.out`A::test_lookup_at_ns_scope() + 8 at ns2.cpp:53:52, address = 0x0000000100001c08

Hide Details

Hide Details

Expecting pattern: ^Breakpoint (?P<bpno>[0-9]+): (?P<num_locations>[0-9]+) locations\.$ Not matched

Hide Details

Expecting pattern: ^Breakpoint (?P<bpno>[0-9]+): (?P<num_locations>no) locations \(pending\)\. Not matched

Hide Details

Expecting pattern: ^Breakpoint (?P<bpno>[0-9]+): where = (?P<module>.*)`(?P<symbol>[+\-]{0,1}[^+]+)( \+ (?P<offset>[0-9]+)){0,1}( \[inlined\] (?P<inline_symbol>.*)){0,1} at (?P<file>[^:]+):(?P<line_no>[0-9]+)(?P<column>(:[0-9]+)?), address = (?P<address>0x[0-9a-fA-F]+)$ Matched

Hide Details

runCmd: breakpoint set -f "ns2.cpp" -l 23 output: Breakpoint 3: where = a.out`A::B::test_lookup_at_nested_ns_scope() + 4 at ns2.cpp:24:62, address = 0x0000000100001b34

Hide Details

Hide Details

Expecting pattern: ^Breakpoint (?P<bpno>[0-9]+): (?P<num_locations>[0-9]+) locations\.$ Not matched

Hide Details

Expecting pattern: ^Breakpoint (?P<bpno>[0-9]+): (?P<num_locations>no) locations \(pending\)\. Not matched

Hide Details

Expecting pattern: ^Breakpoint (?P<bpno>[0-9]+): where = (?P<module>.*)`(?P<symbol>[+\-]{0,1}[^+]+)( \+ (?P<offset>[0-9]+)){0,1}( \[inlined\] (?P<inline_symbol>.*)){0,1} at (?P<file>[^:]+):(?P<line_no>[0-9]+)(?P<column>(:[0-9]+)?), address = (?P<address>0x[0-9a-fA-F]+)$ Matched

Hide Details

runCmd: breakpoint set -f "ns2.cpp" -l 34 output: Breakpoint 4: where = a.out`A::B::test_lookup_at_nested_ns_scope_after_using() + 4 at ns2.cpp:36:74, address = 0x0000000100001b54

Hide Details

Hide Details

Expecting pattern: ^Breakpoint (?P<bpno>[0-9]+): (?P<num_locations>[0-9]+) locations\.$ Not matched

Hide Details

Expecting pattern: ^Breakpoint (?P<bpno>[0-9]+): (?P<num_locations>no) locations \(pending\)\. Not matched

Hide Details

Expecting pattern: ^Breakpoint (?P<bpno>[0-9]+): where = (?P<module>.*)`(?P<symbol>[+\-]{0,1}[^+]+)( \+ (?P<offset>[0-9]+)){0,1}( \[inlined\] (?P<inline_symbol>.*)){0,1} at (?P<file>[^:]+):(?P<line_no>[0-9]+)(?P<column>(:[0-9]+)?), address = (?P<address>0x[0-9a-fA-F]+)$ Matched

Hide Details

runCmd: breakpoint set -f "ns3.cpp" -l 7 output: Breakpoint 5: where = a.out`test_lookup_before_using_directive() + 4 at ns3.cpp:8:56, address = 0x0000000100001c64

Hide Details

Hide Details

Expecting pattern: ^Breakpoint (?P<bpno>[0-9]+): (?P<num_locations>[0-9]+) locations\.$ Not matched

Hide Details

Expecting pattern: ^Breakpoint (?P<bpno>[0-9]+): (?P<num_locations>no) locations \(pending\)\. Not matched

Hide Details

Expecting pattern: ^Breakpoint (?P<bpno>[0-9]+): where = (?P<module>.*)`(?P<symbol>[+\-]{0,1}[^+]+)( \+ (?P<offset>[0-9]+)){0,1}( \[inlined\] (?P<inline_symbol>.*)){0,1} at (?P<file>[^:]+):(?P<line_no>[0-9]+)(?P<column>(:[0-9]+)?), address = (?P<address>0x[0-9a-fA-F]+)$ Matched

Hide Details

runCmd: breakpoint set -f "ns3.cpp" -l 13 output: Breakpoint 6: where = a.out`test_lookup_after_using_directive() + 8 at ns3.cpp:15:56, address = 0x0000000100001c88

Hide Details

Hide Details

Expecting pattern: ^Breakpoint (?P<bpno>[0-9]+): (?P<num_locations>[0-9]+) locations\.$ Not matched

Hide Details

Expecting pattern: ^Breakpoint (?P<bpno>[0-9]+): (?P<num_locations>no) locations \(pending\)\. Not matched

Hide Details

Expecting pattern: ^Breakpoint (?P<bpno>[0-9]+): where = (?P<module>.*)`(?P<symbol>[+\-]{0,1}[^+]+)( \+ (?P<offset>[0-9]+)){0,1}( \[inlined\] (?P<inline_symbol>.*)){0,1} at (?P<file>[^:]+):(?P<line_no>[0-9]+)(?P<column>(:[0-9]+)?), address = (?P<address>0x[0-9a-fA-F]+)$ Matched

Hide Details

runCmd: run output: Process 1555 stopped * thread #1, queue = 'com.apple.main-thread', stop reason = breakpoint 1.1 frame #0: 0x0000000100001a58 a.out`test_lookup_at_global_scope() at ns.cpp:21:48 18 void test_lookup_at_global_scope() 19 { 20 // BP_global_scope -> 21 std::printf("at global scope: foo() = %d\n", foo()); // eval foo(), exp: 42 ^ 22 std::printf("at global scope: func() = %d\n", func()); // eval func(), exp: 1 23 }

Hide Details

Process 1555 launched: '/Users/buildslave/jenkins/workspace/lldb-cmake/lldb-build/lldb-test-build.noindex/lang/cpp/namespace/TestNamespaceLookup.test_scope_lookup_with_run_command_dwarf/a.out' (x86_64)

Hide Details

Hide Details

runCmd: thread list output: Process 1555 stopped * thread #1: tid = 0x309218, 0x0000000100001a58 a.out`test_lookup_at_global_scope() at ns.cpp:21:48, queue = 'com.apple.main-thread', stop reason = breakpoint 1.1

Hide Details

Hide Details

Ran command: "thread list"

Hide Details

Got output: Process 1555 stopped * thread #1: tid = 0x309218, 0x0000000100001a58 a.out`test_lookup_at_global_scope() at ns.cpp:21:48, queue = 'com.apple.main-thread', stop reason = breakpoint 1.1

Hide Details

Expecting sub string: "stopped" (was found) Expecting sub string: "stop reason = breakpoint" (was found)

Hide Details

runCmd: expr -- func() output: (int) $0 = 1

Hide Details

Hide Details

Ran command: "expr -- func()"

Hide Details

Got output: (int) $0 = 1

Hide Details

Expecting start string: "(int) $0 = 1" (was found)

Hide Details

runCmd: expr -- A::B::func() output: (int) $1 = 4

Hide Details

Hide Details

Ran command: "expr -- A::B::func()"

Hide Details

Got output: (int) $1 = 4

Hide Details

Expecting start string: "(int) $1 = 4" (was found)

Hide Details

runCmd: expr -- func(10) output: (int) $2 = 11

Hide Details

Hide Details

Ran command: "expr -- func(10)"

Hide Details

Got output: (int) $2 = 11

Hide Details

Expecting start string: "(int) $2 = 11" (was found)

Hide Details

runCmd: expr -- ::func() output: (int) $3 = 1

Hide Details

Hide Details

Ran command: "expr -- ::func()"

Hide Details

Got output: (int) $3 = 1

Hide Details

Expecting start string: "(int) $3 = 1" (was found)

Hide Details

runCmd: expr -- A::foo() output: (int) $4 = 42

Hide Details

Hide Details

Ran command: "expr -- A::foo()"

Hide Details

Got output: (int) $4 = 42

Hide Details

Expecting start string: "(int) $4 = 42" (was found)

Hide Details

runCmd: continue output: Process 1555 resuming Process 1555 stopped * thread #1, queue = 'com.apple.main-thread', stop reason = breakpoint 2.1 frame #0: 0x0000000100001c08 a.out`A::test_lookup_at_ns_scope() at ns2.cpp:53:52 50 void A::test_lookup_at_ns_scope() 51 { 52 // BP_ns_scope -> 53 std::printf("at nested ns scope: func() = %d\n", func()); // eval func(), exp: 3 ^ 54 std::printf("at nested ns scope: func(10) = %d\n", func(10)); // eval func(10), exp: 13 55 std::printf("at nested ns scope: foo() = %d\n", foo()); // eval foo(), exp: 42 56 }

Hide Details

Hide Details

Hide Details

runCmd: thread list output: Process 1555 stopped * thread #1: tid = 0x309218, 0x0000000100001c08 a.out`A::test_lookup_at_ns_scope() at ns2.cpp:53:52, queue = 'com.apple.main-thread', stop reason = breakpoint 2.1

Hide Details

Hide Details

Ran command: "thread list"

Hide Details

Got output: Process 1555 stopped * thread #1: tid = 0x309218, 0x0000000100001c08 a.out`A::test_lookup_at_ns_scope() at ns2.cpp:53:52, queue = 'com.apple.main-thread', stop reason = breakpoint 2.1

Hide Details

Expecting sub string: "stopped" (was found) Expecting sub string: "stop reason = breakpoint" (was found)

Hide Details

runCmd: expr -- func(10) output: (int) $5 = 13

Hide Details

Hide Details

Ran command: "expr -- func(10)"

Hide Details

Got output: (int) $5 = 13

Hide Details

Expecting start string: "(int) $5 = 13" (was found)

Hide Details

runCmd: expr -- B::func() output: (int) $6 = 4

Hide Details

Hide Details

Ran command: "expr -- B::func()"

Hide Details

Got output: (int) $6 = 4

Hide Details

Expecting start string: "(int) $6 = 4" (was found)

Hide Details

runCmd: expr -- func() output: (int) $7 = 3

Hide Details

Hide Details

Ran command: "expr -- func()"

Hide Details

Got output: (int) $7 = 3

Hide Details

Expecting start string: "(int) $7 = 3" (was found)

Hide Details

runCmd: continue output: Process 1555 resuming Process 1555 stopped * thread #1, queue = 'com.apple.main-thread', stop reason = breakpoint 3.1 frame #0: 0x0000000100001b34 a.out`A::B::test_lookup_at_nested_ns_scope() at ns2.cpp:24:62 21 void test_lookup_at_nested_ns_scope() 22 { 23 // BP_nested_ns_scope -> 24 std::printf("at nested ns scope: func() = %d\n", func()); // eval func(), exp: 4 ^ 25 26 //printf("func(10) = %d\n", func(10)); // eval func(10), exp: 13 27 // NOTE: Under the rules of C++, this test would normally get an error

Hide Details

Hide Details

Hide Details

runCmd: thread list output: Process 1555 stopped * thread #1: tid = 0x309218, 0x0000000100001b34 a.out`A::B::test_lookup_at_nested_ns_scope() at ns2.cpp:24:62, queue = 'com.apple.main-thread', stop reason = breakpoint 3.1

Hide Details

Hide Details

Ran command: "thread list"

Hide Details

Got output: Process 1555 stopped * thread #1: tid = 0x309218, 0x0000000100001b34 a.out`A::B::test_lookup_at_nested_ns_scope() at ns2.cpp:24:62, queue = 'com.apple.main-thread', stop reason = breakpoint 3.1

Hide Details

Expecting sub string: "stopped" (was found) Expecting sub string: "stop reason = breakpoint" (was found)

Hide Details

runCmd: expr -- func() output: (int) $8 = 4

Hide Details

Hide Details

Ran command: "expr -- func()"

Hide Details

Got output: (int) $8 = 4

Hide Details

Expecting start string: "(int) $8 = 4" (was found)

Hide Details

runCmd: expr -- A::func() output: (int) $9 = 3

Hide Details

Hide Details

Ran command: "expr -- A::func()"

Hide Details

Got output: (int) $9 = 3

Hide Details

Expecting start string: "(int) $9 = 3" (was found)

Hide Details

runCmd: expr -- func(10) output: (int) $10 = 13

Hide Details

Hide Details

Ran command: "expr -- func(10)"

Hide Details

Got output: (int) $10 = 13

Hide Details

Expecting start string: "(int) $10 = 13" (was found)

Hide Details

runCmd: continue output: Process 1555 resuming Process 1555 stopped * thread #1, queue = 'com.apple.main-thread', stop reason = breakpoint 4.1 frame #0: 0x0000000100001b54 a.out`A::B::test_lookup_at_nested_ns_scope_after_using() at ns2.cpp:36:74 33 { 34 // BP_nested_ns_scope_after_using 35 using A::func; -> 36 std::printf("at nested ns scope after using: func() = %d\n", func()); // eval func(), exp: 3 ^ 37 } 38 } 39 }

Hide Details

Hide Details

Hide Details

runCmd: thread list output: Process 1555 stopped * thread #1: tid = 0x309218, 0x0000000100001b54 a.out`A::B::test_lookup_at_nested_ns_scope_after_using() at ns2.cpp:36:74, queue = 'com.apple.main-thread', stop reason = breakpoint 4.1

Hide Details

Hide Details

Ran command: "thread list"

Hide Details

Got output: Process 1555 stopped * thread #1: tid = 0x309218, 0x0000000100001b54 a.out`A::B::test_lookup_at_nested_ns_scope_after_using() at ns2.cpp:36:74, queue = 'com.apple.main-thread', stop reason = breakpoint 4.1

Hide Details

Expecting sub string: "stopped" (was found) Expecting sub string: "stop reason = breakpoint" (was found)

Hide Details

runCmd: expr -- A::func(10) output: (int) $11 = 13

Hide Details

Hide Details

Ran command: "expr -- A::func(10)"

Hide Details

Got output: (int) $11 = 13

Hide Details

Expecting start string: "(int) $11 = 13" (was found)

Hide Details

runCmd: continue output: Process 1555 resuming Process 1555 stopped * thread #1, queue = 'com.apple.main-thread', stop reason = breakpoint 5.1 frame #0: 0x0000000100001c64 a.out`test_lookup_before_using_directive() at ns3.cpp:8:56 5 void test_lookup_before_using_directive() 6 { 7 // BP_before_using_directive -> 8 std::printf("before using directive: func() = %d\n", func()); // eval func(), exp: 1 ^ 9 } 10 using namespace A; 11 void test_lookup_after_using_directive()

Hide Details

Hide Details

Hide Details

runCmd: thread list output: Process 1555 stopped * thread #1: tid = 0x309218, 0x0000000100001c64 a.out`test_lookup_before_using_directive() at ns3.cpp:8:56, queue = 'com.apple.main-thread', stop reason = breakpoint 5.1

Hide Details

Hide Details

Ran command: "thread list"

Hide Details

Got output: Process 1555 stopped * thread #1: tid = 0x309218, 0x0000000100001c64 a.out`test_lookup_before_using_directive() at ns3.cpp:8:56, queue = 'com.apple.main-thread', stop reason = breakpoint 5.1

Hide Details

Expecting sub string: "stopped" (was found) Expecting sub string: "stop reason = breakpoint" (was found)

Hide Details

runCmd: expr -- ::func() output: (int) $12 = 1

Hide Details

Hide Details

Ran command: "expr -- ::func()"

Hide Details

Got output: (int) $12 = 1

Hide Details

Expecting start string: "(int) $12 = 1" (was found)

Hide Details

runCmd: expr -- B::func() output: (int) $13 = 4

Hide Details

Hide Details

Ran command: "expr -- B::func()"

Hide Details

Got output: (int) $13 = 4

Hide Details

Expecting start string: "(int) $13 = 4" (was found)

Hide Details

runCmd: continue output: Process 1555 resuming Process 1555 stopped * thread #1, queue = 'com.apple.main-thread', stop reason = breakpoint 6.1 frame #0: 0x0000000100001c88 a.out`test_lookup_after_using_directive() at ns3.cpp:15:56 12 { 13 // BP_after_using_directive 14 //printf("func() = %d\n", func()); // eval func(), exp: error, ambiguous -> 15 std::printf("after using directive: func2() = %d\n", func2()); // eval func2(), exp: 3 ^ 16 std::printf("after using directive: ::func() = %d\n", ::func()); // eval ::func(), exp: 1 17 std::printf("after using directive: B::func() = %d\n", B::func()); // eval B::func(), exp: 4 18 }

Hide Details

Hide Details

Hide Details

runCmd: thread list output: Process 1555 stopped * thread #1: tid = 0x309218, 0x0000000100001c88 a.out`test_lookup_after_using_directive() at ns3.cpp:15:56, queue = 'com.apple.main-thread', stop reason = breakpoint 6.1

Hide Details

Hide Details

Ran command: "thread list"

Hide Details

Got output: Process 1555 stopped * thread #1: tid = 0x309218, 0x0000000100001c88 a.out`test_lookup_after_using_directive() at ns3.cpp:15:56, queue = 'com.apple.main-thread', stop reason = breakpoint 6.1

Hide Details

Expecting sub string: "stopped" (was found) Expecting sub string: "stop reason = breakpoint" (was found)

Hide Details

runCmd: expr -- ::func() output: (int) $14 = 1

Hide Details

Hide Details

Ran command: "expr -- ::func()"

Hide Details

Got output: (int) $14 = 1

Hide Details

Expecting start string: "(int) $14 = 1" (was found)

Hide Details

runCmd: expr -- B::func() output: (int) $15 = 4

Hide Details

Hide Details

Ran command: "expr -- B::func()"

Hide Details

Got output: (int) $15 = 4

Hide Details

Expecting start string: "(int) $15 = 4" (was found)

Hide Details

<bound method SBProcess.Kill of <lldb.SBProcess; proxy of <Swig Object of type 'lldb::SBProcess *' at 0x108866ab0> >>: success

Hide Details

PASS: LLDB (/Users/buildslave/jenkins/workspace/lldb-cmake/lldb-build/bin/clang-x86_64) :: test_scope_lookup_with_run_command_dwarf (TestNamespaceLookup.NamespaceLookupTestCase) UNSUPPORTED: LLDB (/Users/buildslave/jenkins/workspace/lldb-cmake/lldb-build/bin/clang-x86_64) :: test_scope_lookup_with_run_command_dwo (TestNamespaceLookup.NamespaceLookupTestCase) (test case does not fall in any category of interest for this run) runCmd: settings clear -all output:

Hide Details

runCmd: settings set symbols.enable-external-lookup false output:

Hide Details

runCmd: settings set target.inherit-tcc true output:

Hide Details

runCmd: settings set target.auto-apply-fixits false output:

Hide Details

runCmd: settings set plugin.process.gdb-remote.packet-timeout 60 output:

Hide Details

runCmd: settings set symbols.clang-modules-cache-path "/Users/buildslave/jenkins/workspace/lldb-cmake/lldb-build/lldb-test-build.noindex/module-cache-lldb/lldb-api" output:

Hide Details

runCmd: settings set use-color false output:

Hide Details

runCmd: setting set target.prefer-dynamic-value no-dynamic-values output:

Hide Details

FAIL: LLDB (/Users/buildslave/jenkins/workspace/lldb-cmake/lldb-build/bin/clang-x86_64) :: test_scope_lookup_with_run_command_gmodules (TestNamespaceLookup.NamespaceLookupTestCase) Restore dir to: /Users/buildslave/jenkins/workspace/lldb-cmake/lldb-build/tools/lldb/test ====================================================================== ERROR: test_scope_after_using_directive_lookup_with_run_command_gmodules (TestNamespaceLookup.NamespaceLookupTestCase) Test scope lookup after using directive in lldb. ---------------------------------------------------------------------- Error when building test subject.

Hide Details

Build Command: make VPATH=/Users/buildslave/jenkins/workspace/lldb-cmake/llvm-project/lldb/test/API/lang/cpp/namespace -C /Users/buildslave/jenkins/workspace/lldb-cmake/lldb-build/lldb-test-build.noindex/lang/cpp/namespace/TestNamespaceLookup.test_scope_after_using_directive_lookup_with_run_command_gmodules -I /Users/buildslave/jenkins/workspace/lldb-cmake/llvm-project/lldb/test/API/lang/cpp/namespace -I /Users/buildslave/jenkins/workspace/lldb-cmake/llvm-project/lldb/packages/Python/lldbsuite/test/make -f /Users/buildslave/jenkins/workspace/lldb-cmake/llvm-project/lldb/test/API/lang/cpp/namespace/Makefile MAKE_DSYM=NO MAKE_GMODULES=YES ARCH=x86_64 CC="/Users/buildslave/jenkins/workspace/lldb-cmake/lldb-build/bin/clang" DSYMUTIL="/Users/buildslave/jenkins/workspace/lldb-cmake/lldb-build/./bin/dsymutil" CLANG_MODULE_CACHE_DIR=/Users/buildslave/jenkins/workspace/lldb-cmake/lldb-build/lldb-test-build.noindex/module-cache-clang/lldb-api

Hide Details

Build Command Output: While building module 'std' imported from /Users/buildslave/jenkins/workspace/lldb-cmake/llvm-project/lldb/test/API/lang/cpp/namespace/ns.h:1: In file included from <module-includes>:31: In file included from /Users/buildslave/jenkins/workspace/lldb-cmake/lldb-build/bin/../include/c++/v1/complex.h:28: In file included from /Users/buildslave/jenkins/workspace/lldb-cmake/lldb-build/bin/../include/c++/v1/ccomplex:20: In file included from /Users/buildslave/jenkins/workspace/lldb-cmake/lldb-build/bin/../include/c++/v1/complex:247: In file included from /Users/buildslave/jenkins/workspace/lldb-cmake/lldb-build/bin/../include/c++/v1/sstream:173: /Users/buildslave/jenkins/workspace/lldb-cmake/lldb-build/bin/../include/c++/v1/ostream:1038:45: error: no template named 'enable_if_t'; did you mean 'enable_if'? template <class _Stream, class _Tp, class = enable_if_t< ^ /Users/buildslave/jenkins/workspace/lldb-cmake/lldb-build/bin/../include/c++/v1/type_traits:538:63: note: 'enable_if' declared here template <bool, class _Tp = void> struct _LIBCPP_TEMPLATE_VIS enable_if {}; ^ While building module 'std' imported from /Users/buildslave/jenkins/workspace/lldb-cmake/llvm-project/lldb/test/API/lang/cpp/namespace/ns.h:1: In file included from <module-includes>:31: In file included from /Users/buildslave/jenkins/workspace/lldb-cmake/lldb-build/bin/../include/c++/v1/complex.h:28: In file included from /Users/buildslave/jenkins/workspace/lldb-cmake/lldb-build/bin/../include/c++/v1/ccomplex:20: In file included from /Users/buildslave/jenkins/workspace/lldb-cmake/lldb-build/bin/../include/c++/v1/complex:247: In file included from /Users/buildslave/jenkins/workspace/lldb-cmake/lldb-build/bin/../include/c++/v1/sstream:174: /Users/buildslave/jenkins/workspace/lldb-cmake/lldb-build/bin/../include/c++/v1/istream:1389:45: error: no template named 'enable_if_t'; did you mean 'enable_if'? template <class _Stream, class _Tp, class = enable_if_t< ^ /Users/buildslave/jenkins/workspace/lldb-cmake/lldb-build/bin/../include/c++/v1/type_traits:538:63: note: 'enable_if' declared here template <bool, class _Tp = void> struct _LIBCPP_TEMPLATE_VIS enable_if {}; ^ In file included from /Users/buildslave/jenkins/workspace/lldb-cmake/llvm-project/lldb/test/API/lang/cpp/namespace/ns3.cpp:1: /Users/buildslave/jenkins/workspace/lldb-cmake/llvm-project/lldb/test/API/lang/cpp/namespace/ns.h:1:10: fatal error: could not build module 'std' #include <cstdio> ~~~~~~~~^ 3 errors generated. While building module 'std' imported from /Users/buildslave/jenkins/workspace/lldb-cmake/llvm-project/lldb/test/API/lang/cpp/namespace/ns.h:1: In file included from <module-includes>:31: In file included from /Users/buildslave/jenkins/workspace/lldb-cmake/lldb-build/bin/../include/c++/v1/complex.h:28: In file included from /Users/buildslave/jenkins/workspace/lldb-cmake/lldb-build/bin/../include/c++/v1/ccomplex:20: In file included from /Users/buildslave/jenkins/workspace/lldb-cmake/lldb-build/bin/../include/c++/v1/complex:247: In file included from /Users/buildslave/jenkins/workspace/lldb-cmake/lldb-build/bin/../include/c++/v1/sstream:173: /Users/buildslave/jenkins/workspace/lldb-cmake/lldb-build/bin/../include/c++/v1/ostream:1038:45: error: no template named 'enable_if_t'; did you mean 'enable_if'? template <class _Stream, class _Tp, class = enable_if_t< ^ /Users/buildslave/jenkins/workspace/lldb-cmake/lldb-build/bin/../include/c++/v1/type_traits:538:63: note: 'enable_if' declared here template <bool, class _Tp = void> struct _LIBCPP_TEMPLATE_VIS enable_if {}; ^ While building module 'std' imported from /Users/buildslave/jenkins/workspace/lldb-cmake/llvm-project/lldb/test/API/lang/cpp/namespace/ns.h:1: In file included from <module-includes>:31: In file included from /Users/buildslave/jenkins/workspace/lldb-cmake/lldb-build/bin/../include/c++/v1/complex.h:28: In file included from /Users/buildslave/jenkins/workspace/lldb-cmake/lldb-build/bin/../include/c++/v1/ccomplex:20: In file included from /Users/buildslave/jenkins/workspace/lldb-cmake/lldb-build/bin/../include/c++/v1/complex:247: In file included from /Users/buildslave/jenkins/workspace/lldb-cmake/lldb-build/bin/../include/c++/v1/sstream:174: /Users/buildslave/jenkins/workspace/lldb-cmake/lldb-build/bin/../include/c++/v1/istream:1389:45: error: no template named 'enable_if_t'; did you mean 'enable_if'? template <class _Stream, class _Tp, class = enable_if_t< ^ /Users/buildslave/jenkins/workspace/lldb-cmake/lldb-build/bin/../include/c++/v1/type_traits:538:63: note: 'enable_if' declared here template <bool, class _Tp = void> struct _LIBCPP_TEMPLATE_VIS enable_if {}; ^ In file included from /Users/buildslave/jenkins/workspace/lldb-cmake/llvm-project/lldb/test/API/lang/cpp/namespace/ns2.cpp:1: /Users/buildslave/jenkins/workspace/lldb-cmake/llvm-project/lldb/test/API/lang/cpp/namespace/ns.h:1:10: fatal error: could not build module 'std' #include <cstdio> ~~~~~~~~^ 3 errors generated. While building module 'std' imported from /Users/buildslave/jenkins/workspace/lldb-cmake/llvm-project/lldb/test/API/lang/cpp/namespace/ns.h:1: In file included from <module-includes>:31: In file included from /Users/buildslave/jenkins/workspace/lldb-cmake/lldb-build/bin/../include/c++/v1/complex.h:28: In file included from /Users/buildslave/jenkins/workspace/lldb-cmake/lldb-build/bin/../include/c++/v1/ccomplex:20: In file included from /Users/buildslave/jenkins/workspace/lldb-cmake/lldb-build/bin/../include/c++/v1/complex:247: In file included from /Users/buildslave/jenkins/workspace/lldb-cmake/lldb-build/bin/../include/c++/v1/sstream:173: /Users/buildslave/jenkins/workspace/lldb-cmake/lldb-build/bin/../include/c++/v1/ostream:1038:45: error: no template named 'enable_if_t'; did you mean 'enable_if'? template <class _Stream, class _Tp, class = enable_if_t< ^ /Users/buildslave/jenkins/workspace/lldb-cmake/lldb-build/bin/../include/c++/v1/type_traits:538:63: note: 'enable_if' declared here template <bool, class _Tp = void> struct _LIBCPP_TEMPLATE_VIS enable_if {}; ^ While building module 'std' imported from /Users/buildslave/jenkins/workspace/lldb-cmake/llvm-project/lldb/test/API/lang/cpp/namespace/ns.h:1: In file included from <module-includes>:31: In file included from /Users/buildslave/jenkins/workspace/lldb-cmake/lldb-build/bin/../include/c++/v1/complex.h:28: In file included from /Users/buildslave/jenkins/workspace/lldb-cmake/lldb-build/bin/../include/c++/v1/ccomplex:20: In file included from /Users/buildslave/jenkins/workspace/lldb-cmake/lldb-build/bin/../include/c++/v1/complex:247: In file included from /Users/buildslave/jenkins/workspace/lldb-cmake/lldb-build/bin/../include/c++/v1/sstream:174: /Users/buildslave/jenkins/workspace/lldb-cmake/lldb-build/bin/../include/c++/v1/istream:1389:45: error: no template named 'enable_if_t'; did you mean 'enable_if'? template <class _Stream, class _Tp, class = enable_if_t< ^ /Users/buildslave/jenkins/workspace/lldb-cmake/lldb-build/bin/../include/c++/v1/type_traits:538:63: note: 'enable_if' declared here template <bool, class _Tp = void> struct _LIBCPP_TEMPLATE_VIS enable_if {}; ^ In file included from /Users/buildslave/jenkins/workspace/lldb-cmake/llvm-project/lldb/test/API/lang/cpp/namespace/ns.cpp:1: /Users/buildslave/jenkins/workspace/lldb-cmake/llvm-project/lldb/test/API/lang/cpp/namespace/ns.h:1:10: fatal error: could not build module 'std' #include <cstdio> ~~~~~~~~^ 3 errors generated. While building module 'std' imported from /Users/buildslave/jenkins/workspace/lldb-cmake/llvm-project/lldb/test/API/lang/cpp/namespace/main.cpp:1: In file included from <module-includes>:31: In file included from /Users/buildslave/jenkins/workspace/lldb-cmake/lldb-build/bin/../include/c++/v1/complex.h:28: In file included from /Users/buildslave/jenkins/workspace/lldb-cmake/lldb-build/bin/../include/c++/v1/ccomplex:20: In file included from /Users/buildslave/jenkins/workspace/lldb-cmake/lldb-build/bin/../include/c++/v1/complex:247: In file included from /Users/buildslave/jenkins/workspace/lldb-cmake/lldb-build/bin/../include/c++/v1/sstream:173: /Users/buildslave/jenkins/workspace/lldb-cmake/lldb-build/bin/../include/c++/v1/ostream:1038:45: error: no template named 'enable_if_t'; did you mean 'enable_if'? template <class _Stream, class _Tp, class = enable_if_t< ^ /Users/buildslave/jenkins/workspace/lldb-cmake/lldb-build/bin/../include/c++/v1/type_traits:538:63: note: 'enable_if' declared here template <bool, class _Tp = void> struct _LIBCPP_TEMPLATE_VIS enable_if {}; ^ While building module 'std' imported from /Users/buildslave/jenkins/workspace/lldb-cmake/llvm-project/lldb/test/API/lang/cpp/namespace/main.cpp:1: In file included from <module-includes>:31: In file included from /Users/buildslave/jenkins/workspace/lldb-cmake/lldb-build/bin/../include/c++/v1/complex.h:28: In file included from /Users/buildslave/jenkins/workspace/lldb-cmake/lldb-build/bin/../include/c++/v1/ccomplex:20: In file included from /Users/buildslave/jenkins/workspace/lldb-cmake/lldb-build/bin/../include/c++/v1/complex:247: In file included from /Users/buildslave/jenkins/workspace/lldb-cmake/lldb-build/bin/../include/c++/v1/sstream:174: /Users/buildslave/jenkins/workspace/lldb-cmake/lldb-build/bin/../include/c++/v1/istream:1389:45: error: no template named 'enable_if_t'; did you mean 'enable_if'? template <class _Stream, class _Tp, class = enable_if_t< ^ /Users/buildslave/jenkins/workspace/lldb-cmake/lldb-build/bin/../include/c++/v1/type_traits:538:63: note: 'enable_if' declared here template <bool, class _Tp = void> struct _LIBCPP_TEMPLATE_VIS enable_if {}; ^ /Users/buildslave/jenkins/workspace/lldb-cmake/llvm-project/lldb/test/API/lang/cpp/namespace/main.cpp:1:10: fatal error: could not build module 'std' #include <cstdarg> ~~~~~~~~^ 3 errors generated. /Users/buildslave/jenkins/workspace/lldb-cmake/lldb-build/bin/clang -fmodules -gmodules -fmodules-cache-path=/Users/buildslave/jenkins/workspace/lldb-cmake/lldb-build/lldb-test-build.noindex/module-cache-clang/lldb-api -gmodules -fcxx-modules -std=c++11 -g -O0 -fno-builtin -isysroot "/Applications/Xcode.app/Contents/Developer/Platforms/MacOSX.platform/Developer/SDKs/MacOSX10.15.sdk" -arch x86_64 -I/Users/buildslave/jenkins/workspace/lldb-cmake/llvm-project/lldb/packages/Python/lldbsuite/test/make/../../../../../include -I/Users/buildslave/jenkins/workspace/lldb-cmake/llvm-project/lldb/test/API/lang/cpp/namespace -I/Users/buildslave/jenkins/workspace/lldb-cmake/llvm-project/lldb/packages/Python/lldbsuite/test/make -include /Users/buildslave/jenkins/workspace/lldb-cmake/llvm-project/lldb/packages/Python/lldbsuite/test/make/test_common.h -fno-limit-debug-info -fmodules -gmodules -fmodules-cache-path=/Users/buildslave/jenkins/workspace/lldb-cmake/lldb-build/lldb-test-build.noindex/module-cache-clang/lldb-api -gmodules -fcxx-modules --driver-mode=g++ -c -o main.o /Users/buildslave/jenkins/workspace/lldb-cmake/llvm-project/lldb/test/API/lang/cpp/namespace/main.cpp While building module 'std' imported from /Users/buildslave/jenkins/workspace/lldb-cmake/llvm-project/lldb/test/API/lang/cpp/namespace/main.cpp:1: In file included from <module-includes>:31: In file included from /Users/buildslave/jenkins/workspace/lldb-cmake/lldb-build/bin/../include/c++/v1/complex.h:28: In file included from /Users/buildslave/jenkins/workspace/lldb-cmake/lldb-build/bin/../include/c++/v1/ccomplex:20: In file included from /Users/buildslave/jenkins/workspace/lldb-cmake/lldb-build/bin/../include/c++/v1/complex:247: In file included from /Users/buildslave/jenkins/workspace/lldb-cmake/lldb-build/bin/../include/c++/v1/sstream:173: /Users/buildslave/jenkins/workspace/lldb-cmake/lldb-build/bin/../include/c++/v1/ostream:1038:45: error: no template named 'enable_if_t'; did you mean 'enable_if'? template <class _Stream, class _Tp, class = enable_if_t< ^ /Users/buildslave/jenkins/workspace/lldb-cmake/lldb-build/bin/../include/c++/v1/type_traits:538:63: note: 'enable_if' declared here template <bool, class _Tp = void> struct _LIBCPP_TEMPLATE_VIS enable_if {}; ^ While building module 'std' imported from /Users/buildslave/jenkins/workspace/lldb-cmake/llvm-project/lldb/test/API/lang/cpp/namespace/main.cpp:1: In file included from <module-includes>:31: In file included from /Users/buildslave/jenkins/workspace/lldb-cmake/lldb-build/bin/../include/c++/v1/complex.h:28: In file included from /Users/buildslave/jenkins/workspace/lldb-cmake/lldb-build/bin/../include/c++/v1/ccomplex:20: In file included from /Users/buildslave/jenkins/workspace/lldb-cmake/lldb-build/bin/../include/c++/v1/complex:247: In file included from /Users/buildslave/jenkins/workspace/lldb-cmake/lldb-build/bin/../include/c++/v1/sstream:174: /Users/buildslave/jenkins/workspace/lldb-cmake/lldb-build/bin/../include/c++/v1/istream:1389:45: error: no template named 'enable_if_t'; did you mean 'enable_if'? template <class _Stream, class _Tp, class = enable_if_t< ^ /Users/buildslave/jenkins/workspace/lldb-cmake/lldb-build/bin/../include/c++/v1/type_traits:538:63: note: 'enable_if' declared here template <bool, class _Tp = void> struct _LIBCPP_TEMPLATE_VIS enable_if {}; ^ /Users/buildslave/jenkins/workspace/lldb-cmake/llvm-project/lldb/test/API/lang/cpp/namespace/main.cpp:1:10: fatal error: could not build module 'std' #include <cstdarg> ~~~~~~~~^ 3 errors generated. make: *** [main.o] Error 1

Hide Details

Test Directory: /Users/buildslave/jenkins/workspace/lldb-cmake/llvm-project/lldb/test/API/lang/cpp/namespace ====================================================================== ERROR: test_scope_lookup_before_using_with_run_command_gmodules (TestNamespaceLookup.NamespaceLookupTestCase) Test scope lookup before using in lldb. ---------------------------------------------------------------------- Error when building test subject.

Hide Details

Build Command: make VPATH=/Users/buildslave/jenkins/workspace/lldb-cmake/llvm-project/lldb/test/API/lang/cpp/namespace -C /Users/buildslave/jenkins/workspace/lldb-cmake/lldb-build/lldb-test-build.noindex/lang/cpp/namespace/TestNamespaceLookup.test_scope_lookup_before_using_with_run_command_gmodules -I /Users/buildslave/jenkins/workspace/lldb-cmake/llvm-project/lldb/test/API/lang/cpp/namespace -I /Users/buildslave/jenkins/workspace/lldb-cmake/llvm-project/lldb/packages/Python/lldbsuite/test/make -f /Users/buildslave/jenkins/workspace/lldb-cmake/llvm-project/lldb/test/API/lang/cpp/namespace/Makefile MAKE_DSYM=NO MAKE_GMODULES=YES ARCH=x86_64 CC="/Users/buildslave/jenkins/workspace/lldb-cmake/lldb-build/bin/clang" DSYMUTIL="/Users/buildslave/jenkins/workspace/lldb-cmake/lldb-build/./bin/dsymutil" CLANG_MODULE_CACHE_DIR=/Users/buildslave/jenkins/workspace/lldb-cmake/lldb-build/lldb-test-build.noindex/module-cache-clang/lldb-api

Hide Details

Build Command Output: While building module 'std' imported from /Users/buildslave/jenkins/workspace/lldb-cmake/llvm-project/lldb/test/API/lang/cpp/namespace/ns.h:1: In file included from <module-includes>:31: In file included from /Users/buildslave/jenkins/workspace/lldb-cmake/lldb-build/bin/../include/c++/v1/complex.h:28: In file included from /Users/buildslave/jenkins/workspace/lldb-cmake/lldb-build/bin/../include/c++/v1/ccomplex:20: In file included from /Users/buildslave/jenkins/workspace/lldb-cmake/lldb-build/bin/../include/c++/v1/complex:247: In file included from /Users/buildslave/jenkins/workspace/lldb-cmake/lldb-build/bin/../include/c++/v1/sstream:173: /Users/buildslave/jenkins/workspace/lldb-cmake/lldb-build/bin/../include/c++/v1/ostream:1038:45: error: no template named 'enable_if_t'; did you mean 'enable_if'? template <class _Stream, class _Tp, class = enable_if_t< ^ /Users/buildslave/jenkins/workspace/lldb-cmake/lldb-build/bin/../include/c++/v1/type_traits:538:63: note: 'enable_if' declared here template <bool, class _Tp = void> struct _LIBCPP_TEMPLATE_VIS enable_if {}; ^ While building module 'std' imported from /Users/buildslave/jenkins/workspace/lldb-cmake/llvm-project/lldb/test/API/lang/cpp/namespace/ns.h:1: In file included from <module-includes>:31: In file included from /Users/buildslave/jenkins/workspace/lldb-cmake/lldb-build/bin/../include/c++/v1/complex.h:28: In file included from /Users/buildslave/jenkins/workspace/lldb-cmake/lldb-build/bin/../include/c++/v1/ccomplex:20: In file included from /Users/buildslave/jenkins/workspace/lldb-cmake/lldb-build/bin/../include/c++/v1/complex:247: In file included from /Users/buildslave/jenkins/workspace/lldb-cmake/lldb-build/bin/../include/c++/v1/sstream:174: /Users/buildslave/jenkins/workspace/lldb-cmake/lldb-build/bin/../include/c++/v1/istream:1389:45: error: no template named 'enable_if_t'; did you mean 'enable_if'? template <class _Stream, class _Tp, class = enable_if_t< ^ /Users/buildslave/jenkins/workspace/lldb-cmake/lldb-build/bin/../include/c++/v1/type_traits:538:63: note: 'enable_if' declared here template <bool, class _Tp = void> struct _LIBCPP_TEMPLATE_VIS enable_if {}; ^ In file included from /Users/buildslave/jenkins/workspace/lldb-cmake/llvm-project/lldb/test/API/lang/cpp/namespace/ns3.cpp:1: /Users/buildslave/jenkins/workspace/lldb-cmake/llvm-project/lldb/test/API/lang/cpp/namespace/ns.h:1:10: fatal error: could not build module 'std' #include <cstdio> ~~~~~~~~^ 3 errors generated. While building module 'std' imported from /Users/buildslave/jenkins/workspace/lldb-cmake/llvm-project/lldb/test/API/lang/cpp/namespace/ns.h:1: In file included from <module-includes>:31: In file included from /Users/buildslave/jenkins/workspace/lldb-cmake/lldb-build/bin/../include/c++/v1/complex.h:28: In file included from /Users/buildslave/jenkins/workspace/lldb-cmake/lldb-build/bin/../include/c++/v1/ccomplex:20: In file included from /Users/buildslave/jenkins/workspace/lldb-cmake/lldb-build/bin/../include/c++/v1/complex:247: In file included from /Users/buildslave/jenkins/workspace/lldb-cmake/lldb-build/bin/../include/c++/v1/sstream:173: /Users/buildslave/jenkins/workspace/lldb-cmake/lldb-build/bin/../include/c++/v1/ostream:1038:45: error: no template named 'enable_if_t'; did you mean 'enable_if'? template <class _Stream, class _Tp, class = enable_if_t< ^ /Users/buildslave/jenkins/workspace/lldb-cmake/lldb-build/bin/../include/c++/v1/type_traits:538:63: note: 'enable_if' declared here template <bool, class _Tp = void> struct _LIBCPP_TEMPLATE_VIS enable_if {}; ^ While building module 'std' imported from /Users/buildslave/jenkins/workspace/lldb-cmake/llvm-project/lldb/test/API/lang/cpp/namespace/ns.h:1: In file included from <module-includes>:31: In file included from /Users/buildslave/jenkins/workspace/lldb-cmake/lldb-build/bin/../include/c++/v1/complex.h:28: In file included from /Users/buildslave/jenkins/workspace/lldb-cmake/lldb-build/bin/../include/c++/v1/ccomplex:20: In file included from /Users/buildslave/jenkins/workspace/lldb-cmake/lldb-build/bin/../include/c++/v1/complex:247: In file included from /Users/buildslave/jenkins/workspace/lldb-cmake/lldb-build/bin/../include/c++/v1/sstream:174: /Users/buildslave/jenkins/workspace/lldb-cmake/lldb-build/bin/../include/c++/v1/istream:1389:45: error: no template named 'enable_if_t'; did you mean 'enable_if'? template <class _Stream, class _Tp, class = enable_if_t< ^ /Users/buildslave/jenkins/workspace/lldb-cmake/lldb-build/bin/../include/c++/v1/type_traits:538:63: note: 'enable_if' declared here template <bool, class _Tp = void> struct _LIBCPP_TEMPLATE_VIS enable_if {}; ^ In file included from /Users/buildslave/jenkins/workspace/lldb-cmake/llvm-project/lldb/test/API/lang/cpp/namespace/ns2.cpp:1: /Users/buildslave/jenkins/workspace/lldb-cmake/llvm-project/lldb/test/API/lang/cpp/namespace/ns.h:1:10: fatal error: could not build module 'std' #include <cstdio> ~~~~~~~~^ 3 errors generated. While building module 'std' imported from /Users/buildslave/jenkins/workspace/lldb-cmake/llvm-project/lldb/test/API/lang/cpp/namespace/ns.h:1: In file included from <module-includes>:31: In file included from /Users/buildslave/jenkins/workspace/lldb-cmake/lldb-build/bin/../include/c++/v1/complex.h:28: In file included from /Users/buildslave/jenkins/workspace/lldb-cmake/lldb-build/bin/../include/c++/v1/ccomplex:20: In file included from /Users/buildslave/jenkins/workspace/lldb-cmake/lldb-build/bin/../include/c++/v1/complex:247: In file included from /Users/buildslave/jenkins/workspace/lldb-cmake/lldb-build/bin/../include/c++/v1/sstream:173: /Users/buildslave/jenkins/workspace/lldb-cmake/lldb-build/bin/../include/c++/v1/ostream:1038:45: error: no template named 'enable_if_t'; did you mean 'enable_if'? template <class _Stream, class _Tp, class = enable_if_t< ^ /Users/buildslave/jenkins/workspace/lldb-cmake/lldb-build/bin/../include/c++/v1/type_traits:538:63: note: 'enable_if' declared here template <bool, class _Tp = void> struct _LIBCPP_TEMPLATE_VIS enable_if {}; ^ While building module 'std' imported from /Users/buildslave/jenkins/workspace/lldb-cmake/llvm-project/lldb/test/API/lang/cpp/namespace/ns.h:1: In file included from <module-includes>:31: In file included from /Users/buildslave/jenkins/workspace/lldb-cmake/lldb-build/bin/../include/c++/v1/complex.h:28: In file included from /Users/buildslave/jenkins/workspace/lldb-cmake/lldb-build/bin/../include/c++/v1/ccomplex:20: In file included from /Users/buildslave/jenkins/workspace/lldb-cmake/lldb-build/bin/../include/c++/v1/complex:247: In file included from /Users/buildslave/jenkins/workspace/lldb-cmake/lldb-build/bin/../include/c++/v1/sstream:174: /Users/buildslave/jenkins/workspace/lldb-cmake/lldb-build/bin/../include/c++/v1/istream:1389:45: error: no template named 'enable_if_t'; did you mean 'enable_if'? template <class _Stream, class _Tp, class = enable_if_t< ^ /Users/buildslave/jenkins/workspace/lldb-cmake/lldb-build/bin/../include/c++/v1/type_traits:538:63: note: 'enable_if' declared here template <bool, class _Tp = void> struct _LIBCPP_TEMPLATE_VIS enable_if {}; ^ In file included from /Users/buildslave/jenkins/workspace/lldb-cmake/llvm-project/lldb/test/API/lang/cpp/namespace/ns.cpp:1: /Users/buildslave/jenkins/workspace/lldb-cmake/llvm-project/lldb/test/API/lang/cpp/namespace/ns.h:1:10: fatal error: could not build module 'std' #include <cstdio> ~~~~~~~~^ 3 errors generated. While building module 'std' imported from /Users/buildslave/jenkins/workspace/lldb-cmake/llvm-project/lldb/test/API/lang/cpp/namespace/main.cpp:1: In file included from <module-includes>:31: In file included from /Users/buildslave/jenkins/workspace/lldb-cmake/lldb-build/bin/../include/c++/v1/complex.h:28: In file included from /Users/buildslave/jenkins/workspace/lldb-cmake/lldb-build/bin/../include/c++/v1/ccomplex:20: In file included from /Users/buildslave/jenkins/workspace/lldb-cmake/lldb-build/bin/../include/c++/v1/complex:247: In file included from /Users/buildslave/jenkins/workspace/lldb-cmake/lldb-build/bin/../include/c++/v1/sstream:173: /Users/buildslave/jenkins/workspace/lldb-cmake/lldb-build/bin/../include/c++/v1/ostream:1038:45: error: no template named 'enable_if_t'; did you mean 'enable_if'? template <class _Stream, class _Tp, class = enable_if_t< ^ /Users/buildslave/jenkins/workspace/lldb-cmake/lldb-build/bin/../include/c++/v1/type_traits:538:63: note: 'enable_if' declared here template <bool, class _Tp = void> struct _LIBCPP_TEMPLATE_VIS enable_if {}; ^ While building module 'std' imported from /Users/buildslave/jenkins/workspace/lldb-cmake/llvm-project/lldb/test/API/lang/cpp/namespace/main.cpp:1: In file included from <module-includes>:31: In file included from /Users/buildslave/jenkins/workspace/lldb-cmake/lldb-build/bin/../include/c++/v1/complex.h:28: In file included from /Users/buildslave/jenkins/workspace/lldb-cmake/lldb-build/bin/../include/c++/v1/ccomplex:20: In file included from /Users/buildslave/jenkins/workspace/lldb-cmake/lldb-build/bin/../include/c++/v1/complex:247: In file included from /Users/buildslave/jenkins/workspace/lldb-cmake/lldb-build/bin/../include/c++/v1/sstream:174: /Users/buildslave/jenkins/workspace/lldb-cmake/lldb-build/bin/../include/c++/v1/istream:1389:45: error: no template named 'enable_if_t'; did you mean 'enable_if'? template <class _Stream, class _Tp, class = enable_if_t< ^ /Users/buildslave/jenkins/workspace/lldb-cmake/lldb-build/bin/../include/c++/v1/type_traits:538:63: note: 'enable_if' declared here template <bool, class _Tp = void> struct _LIBCPP_TEMPLATE_VIS enable_if {}; ^ /Users/buildslave/jenkins/workspace/lldb-cmake/llvm-project/lldb/test/API/lang/cpp/namespace/main.cpp:1:10: fatal error: could not build module 'std' #include <cstdarg> ~~~~~~~~^ 3 errors generated. /Users/buildslave/jenkins/workspace/lldb-cmake/lldb-build/bin/clang -fmodules -gmodules -fmodules-cache-path=/Users/buildslave/jenkins/workspace/lldb-cmake/lldb-build/lldb-test-build.noindex/module-cache-clang/lldb-api -gmodules -fcxx-modules -std=c++11 -g -O0 -fno-builtin -isysroot "/Applications/Xcode.app/Contents/Developer/Platforms/MacOSX.platform/Developer/SDKs/MacOSX10.15.sdk" -arch x86_64 -I/Users/buildslave/jenkins/workspace/lldb-cmake/llvm-project/lldb/packages/Python/lldbsuite/test/make/../../../../../include -I/Users/buildslave/jenkins/workspace/lldb-cmake/llvm-project/lldb/test/API/lang/cpp/namespace -I/Users/buildslave/jenkins/workspace/lldb-cmake/llvm-project/lldb/packages/Python/lldbsuite/test/make -include /Users/buildslave/jenkins/workspace/lldb-cmake/llvm-project/lldb/packages/Python/lldbsuite/test/make/test_common.h -fno-limit-debug-info -fmodules -gmodules -fmodules-cache-path=/Users/buildslave/jenkins/workspace/lldb-cmake/lldb-build/lldb-test-build.noindex/module-cache-clang/lldb-api -gmodules -fcxx-modules --driver-mode=g++ -c -o main.o /Users/buildslave/jenkins/workspace/lldb-cmake/llvm-project/lldb/test/API/lang/cpp/namespace/main.cpp While building module 'std' imported from /Users/buildslave/jenkins/workspace/lldb-cmake/llvm-project/lldb/test/API/lang/cpp/namespace/main.cpp:1: In file included from <module-includes>:31: In file included from /Users/buildslave/jenkins/workspace/lldb-cmake/lldb-build/bin/../include/c++/v1/complex.h:28: In file included from /Users/buildslave/jenkins/workspace/lldb-cmake/lldb-build/bin/../include/c++/v1/ccomplex:20: In file included from /Users/buildslave/jenkins/workspace/lldb-cmake/lldb-build/bin/../include/c++/v1/complex:247: In file included from /Users/buildslave/jenkins/workspace/lldb-cmake/lldb-build/bin/../include/c++/v1/sstream:173: /Users/buildslave/jenkins/workspace/lldb-cmake/lldb-build/bin/../include/c++/v1/ostream:1038:45: error: no template named 'enable_if_t'; did you mean 'enable_if'? template <class _Stream, class _Tp, class = enable_if_t< ^ /Users/buildslave/jenkins/workspace/lldb-cmake/lldb-build/bin/../include/c++/v1/type_traits:538:63: note: 'enable_if' declared here template <bool, class _Tp = void> struct _LIBCPP_TEMPLATE_VIS enable_if {}; ^ While building module 'std' imported from /Users/buildslave/jenkins/workspace/lldb-cmake/llvm-project/lldb/test/API/lang/cpp/namespace/main.cpp:1: In file included from <module-includes>:31: In file included from /Users/buildslave/jenkins/workspace/lldb-cmake/lldb-build/bin/../include/c++/v1/complex.h:28: In file included from /Users/buildslave/jenkins/workspace/lldb-cmake/lldb-build/bin/../include/c++/v1/ccomplex:20: In file included from /Users/buildslave/jenkins/workspace/lldb-cmake/lldb-build/bin/../include/c++/v1/complex:247: In file included from /Users/buildslave/jenkins/workspace/lldb-cmake/lldb-build/bin/../include/c++/v1/sstream:174: /Users/buildslave/jenkins/workspace/lldb-cmake/lldb-build/bin/../include/c++/v1/istream:1389:45: error: no template named 'enable_if_t'; did you mean 'enable_if'? template <class _Stream, class _Tp, class = enable_if_t< ^ /Users/buildslave/jenkins/workspace/lldb-cmake/lldb-build/bin/../include/c++/v1/type_traits:538:63: note: 'enable_if' declared here template <bool, class _Tp = void> struct _LIBCPP_TEMPLATE_VIS enable_if {}; ^ /Users/buildslave/jenkins/workspace/lldb-cmake/llvm-project/lldb/test/API/lang/cpp/namespace/main.cpp:1:10: fatal error: could not build module 'std' #include <cstdarg> ~~~~~~~~^ 3 errors generated. make: *** [main.o] Error 1

Hide Details

Test Directory: /Users/buildslave/jenkins/workspace/lldb-cmake/llvm-project/lldb/test/API/lang/cpp/namespace ====================================================================== ERROR: test_scope_lookup_shadowed_by_using_with_run_command_gmodules (TestNamespaceLookup.NamespaceLookupTestCase) Test scope lookup shadowed by using in lldb. ---------------------------------------------------------------------- Error when building test subject.

Hide Details

Build Command: make VPATH=/Users/buildslave/jenkins/workspace/lldb-cmake/llvm-project/lldb/test/API/lang/cpp/namespace -C /Users/buildslave/jenkins/workspace/lldb-cmake/lldb-build/lldb-test-build.noindex/lang/cpp/namespace/TestNamespaceLookup.test_scope_lookup_shadowed_by_using_with_run_command_gmodules -I /Users/buildslave/jenkins/workspace/lldb-cmake/llvm-project/lldb/test/API/lang/cpp/namespace -I /Users/buildslave/jenkins/workspace/lldb-cmake/llvm-project/lldb/packages/Python/lldbsuite/test/make -f /Users/buildslave/jenkins/workspace/lldb-cmake/llvm-project/lldb/test/API/lang/cpp/namespace/Makefile MAKE_DSYM=NO MAKE_GMODULES=YES ARCH=x86_64 CC="/Users/buildslave/jenkins/workspace/lldb-cmake/lldb-build/bin/clang" DSYMUTIL="/Users/buildslave/jenkins/workspace/lldb-cmake/lldb-build/./bin/dsymutil" CLANG_MODULE_CACHE_DIR=/Users/buildslave/jenkins/workspace/lldb-cmake/lldb-build/lldb-test-build.noindex/module-cache-clang/lldb-api

Hide Details

Build Command Output: While building module 'std' imported from /Users/buildslave/jenkins/workspace/lldb-cmake/llvm-project/lldb/test/API/lang/cpp/namespace/ns.h:1: In file included from <module-includes>:31: In file included from /Users/buildslave/jenkins/workspace/lldb-cmake/lldb-build/bin/../include/c++/v1/complex.h:28: In file included from /Users/buildslave/jenkins/workspace/lldb-cmake/lldb-build/bin/../include/c++/v1/ccomplex:20: In file included from /Users/buildslave/jenkins/workspace/lldb-cmake/lldb-build/bin/../include/c++/v1/complex:247: In file included from /Users/buildslave/jenkins/workspace/lldb-cmake/lldb-build/bin/../include/c++/v1/sstream:173: /Users/buildslave/jenkins/workspace/lldb-cmake/lldb-build/bin/../include/c++/v1/ostream:1038:45: error: no template named 'enable_if_t'; did you mean 'enable_if'? template <class _Stream, class _Tp, class = enable_if_t< ^ /Users/buildslave/jenkins/workspace/lldb-cmake/lldb-build/bin/../include/c++/v1/type_traits:538:63: note: 'enable_if' declared here template <bool, class _Tp = void> struct _LIBCPP_TEMPLATE_VIS enable_if {}; ^ While building module 'std' imported from /Users/buildslave/jenkins/workspace/lldb-cmake/llvm-project/lldb/test/API/lang/cpp/namespace/ns.h:1: In file included from <module-includes>:31: In file included from /Users/buildslave/jenkins/workspace/lldb-cmake/lldb-build/bin/../include/c++/v1/complex.h:28: In file included from /Users/buildslave/jenkins/workspace/lldb-cmake/lldb-build/bin/../include/c++/v1/ccomplex:20: In file included from /Users/buildslave/jenkins/workspace/lldb-cmake/lldb-build/bin/../include/c++/v1/complex:247: In file included from /Users/buildslave/jenkins/workspace/lldb-cmake/lldb-build/bin/../include/c++/v1/sstream:174: /Users/buildslave/jenkins/workspace/lldb-cmake/lldb-build/bin/../include/c++/v1/istream:1389:45: error: no template named 'enable_if_t'; did you mean 'enable_if'? template <class _Stream, class _Tp, class = enable_if_t< ^ /Users/buildslave/jenkins/workspace/lldb-cmake/lldb-build/bin/../include/c++/v1/type_traits:538:63: note: 'enable_if' declared here template <bool, class _Tp = void> struct _LIBCPP_TEMPLATE_VIS enable_if {}; ^ In file included from /Users/buildslave/jenkins/workspace/lldb-cmake/llvm-project/lldb/test/API/lang/cpp/namespace/ns3.cpp:1: /Users/buildslave/jenkins/workspace/lldb-cmake/llvm-project/lldb/test/API/lang/cpp/namespace/ns.h:1:10: fatal error: could not build module 'std' #include <cstdio> ~~~~~~~~^ 3 errors generated. While building module 'std' imported from /Users/buildslave/jenkins/workspace/lldb-cmake/llvm-project/lldb/test/API/lang/cpp/namespace/ns.h:1: In file included from <module-includes>:31: In file included from /Users/buildslave/jenkins/workspace/lldb-cmake/lldb-build/bin/../include/c++/v1/complex.h:28: In file included from /Users/buildslave/jenkins/workspace/lldb-cmake/lldb-build/bin/../include/c++/v1/ccomplex:20: In file included from /Users/buildslave/jenkins/workspace/lldb-cmake/lldb-build/bin/../include/c++/v1/complex:247: In file included from /Users/buildslave/jenkins/workspace/lldb-cmake/lldb-build/bin/../include/c++/v1/sstream:173: /Users/buildslave/jenkins/workspace/lldb-cmake/lldb-build/bin/../include/c++/v1/ostream:1038:45: error: no template named 'enable_if_t'; did you mean 'enable_if'? template <class _Stream, class _Tp, class = enable_if_t< ^ /Users/buildslave/jenkins/workspace/lldb-cmake/lldb-build/bin/../include/c++/v1/type_traits:538:63: note: 'enable_if' declared here template <bool, class _Tp = void> struct _LIBCPP_TEMPLATE_VIS enable_if {}; ^ While building module 'std' imported from /Users/buildslave/jenkins/workspace/lldb-cmake/llvm-project/lldb/test/API/lang/cpp/namespace/ns.h:1: In file included from <module-includes>:31: In file included from /Users/buildslave/jenkins/workspace/lldb-cmake/lldb-build/bin/../include/c++/v1/complex.h:28: In file included from /Users/buildslave/jenkins/workspace/lldb-cmake/lldb-build/bin/../include/c++/v1/ccomplex:20: In file included from /Users/buildslave/jenkins/workspace/lldb-cmake/lldb-build/bin/../include/c++/v1/complex:247: In file included from /Users/buildslave/jenkins/workspace/lldb-cmake/lldb-build/bin/../include/c++/v1/sstream:174: /Users/buildslave/jenkins/workspace/lldb-cmake/lldb-build/bin/../include/c++/v1/istream:1389:45: error: no template named 'enable_if_t'; did you mean 'enable_if'? template <class _Stream, class _Tp, class = enable_if_t< ^ /Users/buildslave/jenkins/workspace/lldb-cmake/lldb-build/bin/../include/c++/v1/type_traits:538:63: note: 'enable_if' declared here template <bool, class _Tp = void> struct _LIBCPP_TEMPLATE_VIS enable_if {}; ^ In file included from /Users/buildslave/jenkins/workspace/lldb-cmake/llvm-project/lldb/test/API/lang/cpp/namespace/ns2.cpp:1: /Users/buildslave/jenkins/workspace/lldb-cmake/llvm-project/lldb/test/API/lang/cpp/namespace/ns.h:1:10: fatal error: could not build module 'std' #include <cstdio> ~~~~~~~~^ 3 errors generated. While building module 'std' imported from /Users/buildslave/jenkins/workspace/lldb-cmake/llvm-project/lldb/test/API/lang/cpp/namespace/ns.h:1: In file included from <module-includes>:31: In file included from /Users/buildslave/jenkins/workspace/lldb-cmake/lldb-build/bin/../include/c++/v1/complex.h:28: In file included from /Users/buildslave/jenkins/workspace/lldb-cmake/lldb-build/bin/../include/c++/v1/ccomplex:20: In file included from /Users/buildslave/jenkins/workspace/lldb-cmake/lldb-build/bin/../include/c++/v1/complex:247: In file included from /Users/buildslave/jenkins/workspace/lldb-cmake/lldb-build/bin/../include/c++/v1/sstream:173: /Users/buildslave/jenkins/workspace/lldb-cmake/lldb-build/bin/../include/c++/v1/ostream:1038:45: error: no template named 'enable_if_t'; did you mean 'enable_if'? template <class _Stream, class _Tp, class = enable_if_t< ^ /Users/buildslave/jenkins/workspace/lldb-cmake/lldb-build/bin/../include/c++/v1/type_traits:538:63: note: 'enable_if' declared here template <bool, class _Tp = void> struct _LIBCPP_TEMPLATE_VIS enable_if {}; ^ While building module 'std' imported from /Users/buildslave/jenkins/workspace/lldb-cmake/llvm-project/lldb/test/API/lang/cpp/namespace/ns.h:1: In file included from <module-includes>:31: In file included from /Users/buildslave/jenkins/workspace/lldb-cmake/lldb-build/bin/../include/c++/v1/complex.h:28: In file included from /Users/buildslave/jenkins/workspace/lldb-cmake/lldb-build/bin/../include/c++/v1/ccomplex:20: In file included from /Users/buildslave/jenkins/workspace/lldb-cmake/lldb-build/bin/../include/c++/v1/complex:247: In file included from /Users/buildslave/jenkins/workspace/lldb-cmake/lldb-build/bin/../include/c++/v1/sstream:174: /Users/buildslave/jenkins/workspace/lldb-cmake/lldb-build/bin/../include/c++/v1/istream:1389:45: error: no template named 'enable_if_t'; did you mean 'enable_if'? template <class _Stream, class _Tp, class = enable_if_t< ^ /Users/buildslave/jenkins/workspace/lldb-cmake/lldb-build/bin/../include/c++/v1/type_traits:538:63: note: 'enable_if' declared here template <bool, class _Tp = void> struct _LIBCPP_TEMPLATE_VIS enable_if {}; ^ In file included from /Users/buildslave/jenkins/workspace/lldb-cmake/llvm-project/lldb/test/API/lang/cpp/namespace/ns.cpp:1: /Users/buildslave/jenkins/workspace/lldb-cmake/llvm-project/lldb/test/API/lang/cpp/namespace/ns.h:1:10: fatal error: could not build module 'std' #include <cstdio> ~~~~~~~~^ 3 errors generated. While building module 'std' imported from /Users/buildslave/jenkins/workspace/lldb-cmake/llvm-project/lldb/test/API/lang/cpp/namespace/main.cpp:1: In file included from <module-includes>:31: In file included from /Users/buildslave/jenkins/workspace/lldb-cmake/lldb-build/bin/../include/c++/v1/complex.h:28: In file included from /Users/buildslave/jenkins/workspace/lldb-cmake/lldb-build/bin/../include/c++/v1/ccomplex:20: In file included from /Users/buildslave/jenkins/workspace/lldb-cmake/lldb-build/bin/../include/c++/v1/complex:247: In file included from /Users/buildslave/jenkins/workspace/lldb-cmake/lldb-build/bin/../include/c++/v1/sstream:173: /Users/buildslave/jenkins/workspace/lldb-cmake/lldb-build/bin/../include/c++/v1/ostream:1038:45: error: no template named 'enable_if_t'; did you mean 'enable_if'? template <class _Stream, class _Tp, class = enable_if_t< ^ /Users/buildslave/jenkins/workspace/lldb-cmake/lldb-build/bin/../include/c++/v1/type_traits:538:63: note: 'enable_if' declared here template <bool, class _Tp = void> struct _LIBCPP_TEMPLATE_VIS enable_if {}; ^ While building module 'std' imported from /Users/buildslave/jenkins/workspace/lldb-cmake/llvm-project/lldb/test/API/lang/cpp/namespace/main.cpp:1: In file included from <module-includes>:31: In file included from /Users/buildslave/jenkins/workspace/lldb-cmake/lldb-build/bin/../include/c++/v1/complex.h:28: In file included from /Users/buildslave/jenkins/workspace/lldb-cmake/lldb-build/bin/../include/c++/v1/ccomplex:20: In file included from /Users/buildslave/jenkins/workspace/lldb-cmake/lldb-build/bin/../include/c++/v1/complex:247: In file included from /Users/buildslave/jenkins/workspace/lldb-cmake/lldb-build/bin/../include/c++/v1/sstream:174: /Users/buildslave/jenkins/workspace/lldb-cmake/lldb-build/bin/../include/c++/v1/istream:1389:45: error: no template named 'enable_if_t'; did you mean 'enable_if'? template <class _Stream, class _Tp, class = enable_if_t< ^ /Users/buildslave/jenkins/workspace/lldb-cmake/lldb-build/bin/../include/c++/v1/type_traits:538:63: note: 'enable_if' declared here template <bool, class _Tp = void> struct _LIBCPP_TEMPLATE_VIS enable_if {}; ^ /Users/buildslave/jenkins/workspace/lldb-cmake/llvm-project/lldb/test/API/lang/cpp/namespace/main.cpp:1:10: fatal error: could not build module 'std' #include <cstdarg> ~~~~~~~~^ 3 errors generated. /Users/buildslave/jenkins/workspace/lldb-cmake/lldb-build/bin/clang -fmodules -gmodules -fmodules-cache-path=/Users/buildslave/jenkins/workspace/lldb-cmake/lldb-build/lldb-test-build.noindex/module-cache-clang/lldb-api -gmodules -fcxx-modules -std=c++11 -g -O0 -fno-builtin -isysroot "/Applications/Xcode.app/Contents/Developer/Platforms/MacOSX.platform/Developer/SDKs/MacOSX10.15.sdk" -arch x86_64 -I/Users/buildslave/jenkins/workspace/lldb-cmake/llvm-project/lldb/packages/Python/lldbsuite/test/make/../../../../../include -I/Users/buildslave/jenkins/workspace/lldb-cmake/llvm-project/lldb/test/API/lang/cpp/namespace -I/Users/buildslave/jenkins/workspace/lldb-cmake/llvm-project/lldb/packages/Python/lldbsuite/test/make -include /Users/buildslave/jenkins/workspace/lldb-cmake/llvm-project/lldb/packages/Python/lldbsuite/test/make/test_common.h -fno-limit-debug-info -fmodules -gmodules -fmodules-cache-path=/Users/buildslave/jenkins/workspace/lldb-cmake/lldb-build/lldb-test-build.noindex/module-cache-clang/lldb-api -gmodules -fcxx-modules --driver-mode=g++ -c -o main.o /Users/buildslave/jenkins/workspace/lldb-cmake/llvm-project/lldb/test/API/lang/cpp/namespace/main.cpp While building module 'std' imported from /Users/buildslave/jenkins/workspace/lldb-cmake/llvm-project/lldb/test/API/lang/cpp/namespace/main.cpp:1: In file included from <module-includes>:31: In file included from /Users/buildslave/jenkins/workspace/lldb-cmake/lldb-build/bin/../include/c++/v1/complex.h:28: In file included from /Users/buildslave/jenkins/workspace/lldb-cmake/lldb-build/bin/../include/c++/v1/ccomplex:20: In file included from /Users/buildslave/jenkins/workspace/lldb-cmake/lldb-build/bin/../include/c++/v1/complex:247: In file included from /Users/buildslave/jenkins/workspace/lldb-cmake/lldb-build/bin/../include/c++/v1/sstream:173: /Users/buildslave/jenkins/workspace/lldb-cmake/lldb-build/bin/../include/c++/v1/ostream:1038:45: error: no template named 'enable_if_t'; did you mean 'enable_if'? template <class _Stream, class _Tp, class = enable_if_t< ^ /Users/buildslave/jenkins/workspace/lldb-cmake/lldb-build/bin/../include/c++/v1/type_traits:538:63: note: 'enable_if' declared here template <bool, class _Tp = void> struct _LIBCPP_TEMPLATE_VIS enable_if {}; ^ While building module 'std' imported from /Users/buildslave/jenkins/workspace/lldb-cmake/llvm-project/lldb/test/API/lang/cpp/namespace/main.cpp:1: In file included from <module-includes>:31: In file included from /Users/buildslave/jenkins/workspace/lldb-cmake/lldb-build/bin/../include/c++/v1/complex.h:28: In file included from /Users/buildslave/jenkins/workspace/lldb-cmake/lldb-build/bin/../include/c++/v1/ccomplex:20: In file included from /Users/buildslave/jenkins/workspace/lldb-cmake/lldb-build/bin/../include/c++/v1/complex:247: In file included from /Users/buildslave/jenkins/workspace/lldb-cmake/lldb-build/bin/../include/c++/v1/sstream:174: /Users/buildslave/jenkins/workspace/lldb-cmake/lldb-build/bin/../include/c++/v1/istream:1389:45: error: no template named 'enable_if_t'; did you mean 'enable_if'? template <class _Stream, class _Tp, class = enable_if_t< ^ /Users/buildslave/jenkins/workspace/lldb-cmake/lldb-build/bin/../include/c++/v1/type_traits:538:63: note: 'enable_if' declared here template <bool, class _Tp = void> struct _LIBCPP_TEMPLATE_VIS enable_if {}; ^ /Users/buildslave/jenkins/workspace/lldb-cmake/llvm-project/lldb/test/API/lang/cpp/namespace/main.cpp:1:10: fatal error: could not build module 'std' #include <cstdarg> ~~~~~~~~^ 3 errors generated. make: *** [main.o] Error 1

Hide Details

Test Directory: /Users/buildslave/jenkins/workspace/lldb-cmake/llvm-project/lldb/test/API/lang/cpp/namespace ====================================================================== ERROR: test_scope_lookup_with_run_command_gmodules (TestNamespaceLookup.NamespaceLookupTestCase) Test scope lookup of functions in lldb. ---------------------------------------------------------------------- Error when building test subject.

Hide Details

Build Command: make VPATH=/Users/buildslave/jenkins/workspace/lldb-cmake/llvm-project/lldb/test/API/lang/cpp/namespace -C /Users/buildslave/jenkins/workspace/lldb-cmake/lldb-build/lldb-test-build.noindex/lang/cpp/namespace/TestNamespaceLookup.test_scope_lookup_with_run_command_gmodules -I /Users/buildslave/jenkins/workspace/lldb-cmake/llvm-project/lldb/test/API/lang/cpp/namespace -I /Users/buildslave/jenkins/workspace/lldb-cmake/llvm-project/lldb/packages/Python/lldbsuite/test/make -f /Users/buildslave/jenkins/workspace/lldb-cmake/llvm-project/lldb/test/API/lang/cpp/namespace/Makefile MAKE_DSYM=NO MAKE_GMODULES=YES ARCH=x86_64 CC="/Users/buildslave/jenkins/workspace/lldb-cmake/lldb-build/bin/clang" DSYMUTIL="/Users/buildslave/jenkins/workspace/lldb-cmake/lldb-build/./bin/dsymutil" CLANG_MODULE_CACHE_DIR=/Users/buildslave/jenkins/workspace/lldb-cmake/lldb-build/lldb-test-build.noindex/module-cache-clang/lldb-api

Hide Details

Build Command Output: While building module 'std' imported from /Users/buildslave/jenkins/workspace/lldb-cmake/llvm-project/lldb/test/API/lang/cpp/namespace/ns.h:1: In file included from <module-includes>:31: In file included from /Users/buildslave/jenkins/workspace/lldb-cmake/lldb-build/bin/../include/c++/v1/complex.h:28: In file included from /Users/buildslave/jenkins/workspace/lldb-cmake/lldb-build/bin/../include/c++/v1/ccomplex:20: In file included from /Users/buildslave/jenkins/workspace/lldb-cmake/lldb-build/bin/../include/c++/v1/complex:247: In file included from /Users/buildslave/jenkins/workspace/lldb-cmake/lldb-build/bin/../include/c++/v1/sstream:173: /Users/buildslave/jenkins/workspace/lldb-cmake/lldb-build/bin/../include/c++/v1/ostream:1038:45: error: no template named 'enable_if_t'; did you mean 'enable_if'? template <class _Stream, class _Tp, class = enable_if_t< ^ /Users/buildslave/jenkins/workspace/lldb-cmake/lldb-build/bin/../include/c++/v1/type_traits:538:63: note: 'enable_if' declared here template <bool, class _Tp = void> struct _LIBCPP_TEMPLATE_VIS enable_if {}; ^ While building module 'std' imported from /Users/buildslave/jenkins/workspace/lldb-cmake/llvm-project/lldb/test/API/lang/cpp/namespace/ns.h:1: In file included from <module-includes>:31: In file included from /Users/buildslave/jenkins/workspace/lldb-cmake/lldb-build/bin/../include/c++/v1/complex.h:28: In file included from /Users/buildslave/jenkins/workspace/lldb-cmake/lldb-build/bin/../include/c++/v1/ccomplex:20: In file included from /Users/buildslave/jenkins/workspace/lldb-cmake/lldb-build/bin/../include/c++/v1/complex:247: In file included from /Users/buildslave/jenkins/workspace/lldb-cmake/lldb-build/bin/../include/c++/v1/sstream:174: /Users/buildslave/jenkins/workspace/lldb-cmake/lldb-build/bin/../include/c++/v1/istream:1389:45: error: no template named 'enable_if_t'; did you mean 'enable_if'? template <class _Stream, class _Tp, class = enable_if_t< ^ /Users/buildslave/jenkins/workspace/lldb-cmake/lldb-build/bin/../include/c++/v1/type_traits:538:63: note: 'enable_if' declared here template <bool, class _Tp = void> struct _LIBCPP_TEMPLATE_VIS enable_if {}; ^ In file included from /Users/buildslave/jenkins/workspace/lldb-cmake/llvm-project/lldb/test/API/lang/cpp/namespace/ns3.cpp:1: /Users/buildslave/jenkins/workspace/lldb-cmake/llvm-project/lldb/test/API/lang/cpp/namespace/ns.h:1:10: fatal error: could not build module 'std' #include <cstdio> ~~~~~~~~^ 3 errors generated. While building module 'std' imported from /Users/buildslave/jenkins/workspace/lldb-cmake/llvm-project/lldb/test/API/lang/cpp/namespace/ns.h:1: In file included from <module-includes>:31: In file included from /Users/buildslave/jenkins/workspace/lldb-cmake/lldb-build/bin/../include/c++/v1/complex.h:28: In file included from /Users/buildslave/jenkins/workspace/lldb-cmake/lldb-build/bin/../include/c++/v1/ccomplex:20: In file included from /Users/buildslave/jenkins/workspace/lldb-cmake/lldb-build/bin/../include/c++/v1/complex:247: In file included from /Users/buildslave/jenkins/workspace/lldb-cmake/lldb-build/bin/../include/c++/v1/sstream:173: /Users/buildslave/jenkins/workspace/lldb-cmake/lldb-build/bin/../include/c++/v1/ostream:1038:45: error: no template named 'enable_if_t'; did you mean 'enable_if'? template <class _Stream, class _Tp, class = enable_if_t< ^ /Users/buildslave/jenkins/workspace/lldb-cmake/lldb-build/bin/../include/c++/v1/type_traits:538:63: note: 'enable_if' declared here template <bool, class _Tp = void> struct _LIBCPP_TEMPLATE_VIS enable_if {}; ^ While building module 'std' imported from /Users/buildslave/jenkins/workspace/lldb-cmake/llvm-project/lldb/test/API/lang/cpp/namespace/ns.h:1: In file included from <module-includes>:31: In file included from /Users/buildslave/jenkins/workspace/lldb-cmake/lldb-build/bin/../include/c++/v1/complex.h:28: In file included from /Users/buildslave/jenkins/workspace/lldb-cmake/lldb-build/bin/../include/c++/v1/ccomplex:20: In file included from /Users/buildslave/jenkins/workspace/lldb-cmake/lldb-build/bin/../include/c++/v1/complex:247: In file included from /Users/buildslave/jenkins/workspace/lldb-cmake/lldb-build/bin/../include/c++/v1/sstream:174: /Users/buildslave/jenkins/workspace/lldb-cmake/lldb-build/bin/../include/c++/v1/istream:1389:45: error: no template named 'enable_if_t'; did you mean 'enable_if'? template <class _Stream, class _Tp, class = enable_if_t< ^ /Users/buildslave/jenkins/workspace/lldb-cmake/lldb-build/bin/../include/c++/v1/type_traits:538:63: note: 'enable_if' declared here template <bool, class _Tp = void> struct _LIBCPP_TEMPLATE_VIS enable_if {}; ^ In file included from /Users/buildslave/jenkins/workspace/lldb-cmake/llvm-project/lldb/test/API/lang/cpp/namespace/ns2.cpp:1: /Users/buildslave/jenkins/workspace/lldb-cmake/llvm-project/lldb/test/API/lang/cpp/namespace/ns.h:1:10: fatal error: could not build module 'std' #include <cstdio> ~~~~~~~~^ 3 errors generated. While building module 'std' imported from /Users/buildslave/jenkins/workspace/lldb-cmake/llvm-project/lldb/test/API/lang/cpp/namespace/ns.h:1: In file included from <module-includes>:31: In file included from /Users/buildslave/jenkins/workspace/lldb-cmake/lldb-build/bin/../include/c++/v1/complex.h:28: In file included from /Users/buildslave/jenkins/workspace/lldb-cmake/lldb-build/bin/../include/c++/v1/ccomplex:20: In file included from /Users/buildslave/jenkins/workspace/lldb-cmake/lldb-build/bin/../include/c++/v1/complex:247: In file included from /Users/buildslave/jenkins/workspace/lldb-cmake/lldb-build/bin/../include/c++/v1/sstream:173: /Users/buildslave/jenkins/workspace/lldb-cmake/lldb-build/bin/../include/c++/v1/ostream:1038:45: error: no template named 'enable_if_t'; did you mean 'enable_if'? template <class _Stream, class _Tp, class = enable_if_t< ^ /Users/buildslave/jenkins/workspace/lldb-cmake/lldb-build/bin/../include/c++/v1/type_traits:538:63: note: 'enable_if' declared here template <bool, class _Tp = void> struct _LIBCPP_TEMPLATE_VIS enable_if {}; ^ While building module 'std' imported from /Users/buildslave/jenkins/workspace/lldb-cmake/llvm-project/lldb/test/API/lang/cpp/namespace/ns.h:1: In file included from <module-includes>:31: In file included from /Users/buildslave/jenkins/workspace/lldb-cmake/lldb-build/bin/../include/c++/v1/complex.h:28: In file included from /Users/buildslave/jenkins/workspace/lldb-cmake/lldb-build/bin/../include/c++/v1/ccomplex:20: In file included from /Users/buildslave/jenkins/workspace/lldb-cmake/lldb-build/bin/../include/c++/v1/complex:247: In file included from /Users/buildslave/jenkins/workspace/lldb-cmake/lldb-build/bin/../include/c++/v1/sstream:174: /Users/buildslave/jenkins/workspace/lldb-cmake/lldb-build/bin/../include/c++/v1/istream:1389:45: error: no template named 'enable_if_t'; did you mean 'enable_if'? template <class _Stream, class _Tp, class = enable_if_t< ^ /Users/buildslave/jenkins/workspace/lldb-cmake/lldb-build/bin/../include/c++/v1/type_traits:538:63: note: 'enable_if' declared here template <bool, class _Tp = void> struct _LIBCPP_TEMPLATE_VIS enable_if {}; ^ In file included from /Users/buildslave/jenkins/workspace/lldb-cmake/llvm-project/lldb/test/API/lang/cpp/namespace/ns.cpp:1: /Users/buildslave/jenkins/workspace/lldb-cmake/llvm-project/lldb/test/API/lang/cpp/namespace/ns.h:1:10: fatal error: could not build module 'std' #include <cstdio> ~~~~~~~~^ 3 errors generated. While building module 'std' imported from /Users/buildslave/jenkins/workspace/lldb-cmake/llvm-project/lldb/test/API/lang/cpp/namespace/main.cpp:1: In file included from <module-includes>:31: In file included from /Users/buildslave/jenkins/workspace/lldb-cmake/lldb-build/bin/../include/c++/v1/complex.h:28: In file included from /Users/buildslave/jenkins/workspace/lldb-cmake/lldb-build/bin/../include/c++/v1/ccomplex:20: In file included from /Users/buildslave/jenkins/workspace/lldb-cmake/lldb-build/bin/../include/c++/v1/complex:247: In file included from /Users/buildslave/jenkins/workspace/lldb-cmake/lldb-build/bin/../include/c++/v1/sstream:173: /Users/buildslave/jenkins/workspace/lldb-cmake/lldb-build/bin/../include/c++/v1/ostream:1038:45: error: no template named 'enable_if_t'; did you mean 'enable_if'? template <class _Stream, class _Tp, class = enable_if_t< ^ /Users/buildslave/jenkins/workspace/lldb-cmake/lldb-build/bin/../include/c++/v1/type_traits:538:63: note: 'enable_if' declared here template <bool, class _Tp = void> struct _LIBCPP_TEMPLATE_VIS enable_if {}; ^ While building module 'std' imported from /Users/buildslave/jenkins/workspace/lldb-cmake/llvm-project/lldb/test/API/lang/cpp/namespace/main.cpp:1: In file included from <module-includes>:31: In file included from /Users/buildslave/jenkins/workspace/lldb-cmake/lldb-build/bin/../include/c++/v1/complex.h:28: In file included from /Users/buildslave/jenkins/workspace/lldb-cmake/lldb-build/bin/../include/c++/v1/ccomplex:20: In file included from /Users/buildslave/jenkins/workspace/lldb-cmake/lldb-build/bin/../include/c++/v1/complex:247: In file included from /Users/buildslave/jenkins/workspace/lldb-cmake/lldb-build/bin/../include/c++/v1/sstream:174: /Users/buildslave/jenkins/workspace/lldb-cmake/lldb-build/bin/../include/c++/v1/istream:1389:45: error: no template named 'enable_if_t'; did you mean 'enable_if'? template <class _Stream, class _Tp, class = enable_if_t< ^ /Users/buildslave/jenkins/workspace/lldb-cmake/lldb-build/bin/../include/c++/v1/type_traits:538:63: note: 'enable_if' declared here template <bool, class _Tp = void> struct _LIBCPP_TEMPLATE_VIS enable_if {}; ^ /Users/buildslave/jenkins/workspace/lldb-cmake/llvm-project/lldb/test/API/lang/cpp/namespace/main.cpp:1:10: fatal error: could not build module 'std' #include <cstdarg> ~~~~~~~~^ 3 errors generated. /Users/buildslave/jenkins/workspace/lldb-cmake/lldb-build/bin/clang -fmodules -gmodules -fmodules-cache-path=/Users/buildslave/jenkins/workspace/lldb-cmake/lldb-build/lldb-test-build.noindex/module-cache-clang/lldb-api -gmodules -fcxx-modules -std=c++11 -g -O0 -fno-builtin -isysroot "/Applications/Xcode.app/Contents/Developer/Platforms/MacOSX.platform/Developer/SDKs/MacOSX10.15.sdk" -arch x86_64 -I/Users/buildslave/jenkins/workspace/lldb-cmake/llvm-project/lldb/packages/Python/lldbsuite/test/make/../../../../../include -I/Users/buildslave/jenkins/workspace/lldb-cmake/llvm-project/lldb/test/API/lang/cpp/namespace -I/Users/buildslave/jenkins/workspace/lldb-cmake/llvm-project/lldb/packages/Python/lldbsuite/test/make -include /Users/buildslave/jenkins/workspace/lldb-cmake/llvm-project/lldb/packages/Python/lldbsuite/test/make/test_common.h -fno-limit-debug-info -fmodules -gmodules -fmodules-cache-path=/Users/buildslave/jenkins/workspace/lldb-cmake/lldb-build/lldb-test-build.noindex/module-cache-clang/lldb-api -gmodules -fcxx-modules --driver-mode=g++ -c -o main.o /Users/buildslave/jenkins/workspace/lldb-cmake/llvm-project/lldb/test/API/lang/cpp/namespace/main.cpp While building module 'std' imported from /Users/buildslave/jenkins/workspace/lldb-cmake/llvm-project/lldb/test/API/lang/cpp/namespace/main.cpp:1: In file included from <module-includes>:31: In file included from /Users/buildslave/jenkins/workspace/lldb-cmake/lldb-build/bin/../include/c++/v1/complex.h:28: In file included from /Users/buildslave/jenkins/workspace/lldb-cmake/lldb-build/bin/../include/c++/v1/ccomplex:20: In file included from /Users/buildslave/jenkins/workspace/lldb-cmake/lldb-build/bin/../include/c++/v1/complex:247: In file included from /Users/buildslave/jenkins/workspace/lldb-cmake/lldb-build/bin/../include/c++/v1/sstream:173: /Users/buildslave/jenkins/workspace/lldb-cmake/lldb-build/bin/../include/c++/v1/ostream:1038:45: error: no template named 'enable_if_t'; did you mean 'enable_if'? template <class _Stream, class _Tp, class = enable_if_t< ^ /Users/buildslave/jenkins/workspace/lldb-cmake/lldb-build/bin/../include/c++/v1/type_traits:538:63: note: 'enable_if' declared here template <bool, class _Tp = void> struct _LIBCPP_TEMPLATE_VIS enable_if {}; ^ While building module 'std' imported from /Users/buildslave/jenkins/workspace/lldb-cmake/llvm-project/lldb/test/API/lang/cpp/namespace/main.cpp:1: In file included from <module-includes>:31: In file included from /Users/buildslave/jenkins/workspace/lldb-cmake/lldb-build/bin/../include/c++/v1/complex.h:28: In file included from /Users/buildslave/jenkins/workspace/lldb-cmake/lldb-build/bin/../include/c++/v1/ccomplex:20: In file included from /Users/buildslave/jenkins/workspace/lldb-cmake/lldb-build/bin/../include/c++/v1/complex:247: In file included from /Users/buildslave/jenkins/workspace/lldb-cmake/lldb-build/bin/../include/c++/v1/sstream:174: /Users/buildslave/jenkins/workspace/lldb-cmake/lldb-build/bin/../include/c++/v1/istream:1389:45: error: no template named 'enable_if_t'; did you mean 'enable_if'? template <class _Stream, class _Tp, class = enable_if_t< ^ /Users/buildslave/jenkins/workspace/lldb-cmake/lldb-build/bin/../include/c++/v1/type_traits:538:63: note: 'enable_if' declared here template <bool, class _Tp = void> struct _LIBCPP_TEMPLATE_VIS enable_if {}; ^ /Users/buildslave/jenkins/workspace/lldb-cmake/llvm-project/lldb/test/API/lang/cpp/namespace/main.cpp:1:10: fatal error: could not build module 'std' #include <cstdarg> ~~~~~~~~^ 3 errors generated. make: *** [main.o] Error 1

Hide Details

Test Directory: /Users/buildslave/jenkins/workspace/lldb-cmake/llvm-project/lldb/test/API/lang/cpp/namespace ---------------------------------------------------------------------- Ran 32 tests in 144.064s

Hide Details

RESULT: FAILED (8 passes, 0 failures, 4 errors, 8 skipped, 12 expected failures, 0 unexpected successes)

Hide Details

--

Hide Details

******************** FAIL: lldb-api :: lang/cpp/unique-types/TestUniqueTypes.py (2150 of 2150) ******************** TEST 'lldb-api :: lang/cpp/unique-types/TestUniqueTypes.py' FAILED ******************** Script: -- /usr/local/Frameworks/Python.framework/Versions/3.7/bin/python3.7 /Users/buildslave/jenkins/workspace/lldb-cmake/llvm-project/lldb/test/API/dotest.py -s /Users/buildslave/jenkins/workspace/lldb-cmake/lldb-build/lldb-test-traces -S nm -u CXXFLAGS -u CFLAGS --codesign-identity - --server /Users/buildslave/jenkins/workspace/lldb-cmake/lldb-build/./bin/debugserver --arch x86_64 --build-dir /Users/buildslave/jenkins/workspace/lldb-cmake/lldb-build/lldb-test-build.noindex -s=/Users/buildslave/jenkins/workspace/lldb-cmake/test/logs -t --env TERM=vt100 --env LLVM_LIBS_DIR=/Users/buildslave/jenkins/workspace/lldb-cmake/lldb-build/./lib --arch x86_64 --build-dir /Users/buildslave/jenkins/workspace/lldb-cmake/lldb-build/lldb-test-build.noindex --lldb-module-cache-dir /Users/buildslave/jenkins/workspace/lldb-cmake/lldb-build/lldb-test-build.noindex/module-cache-lldb/lldb-api --clang-module-cache-dir /Users/buildslave/jenkins/workspace/lldb-cmake/lldb-build/lldb-test-build.noindex/module-cache-clang/lldb-api --executable /Users/buildslave/jenkins/workspace/lldb-cmake/lldb-build/./bin/lldb --compiler /Users/buildslave/jenkins/workspace/lldb-cmake/lldb-build/./bin/clang --dsymutil /Users/buildslave/jenkins/workspace/lldb-cmake/lldb-build/./bin/dsymutil --filecheck /Users/buildslave/jenkins/workspace/lldb-cmake/lldb-build/./bin/FileCheck --yaml2obj /Users/buildslave/jenkins/workspace/lldb-cmake/lldb-build/./bin/yaml2obj --lldb-libs-dir /Users/buildslave/jenkins/workspace/lldb-cmake/lldb-build/./lib /Users/buildslave/jenkins/workspace/lldb-cmake/llvm-project/lldb/test/API/lang/cpp/unique-types -p TestUniqueTypes.py -- Exit Code: 1

Hide Details

Command Output (stdout): -- lldb version 12.0.99 clang revision 61ac58e10ae1fbb18416cac20119725803b9ad6f llvm revision 61ac58e10ae1fbb18416cac20119725803b9ad6f libstdcxx tests will not be run because: Don't know how to build with libstdcxx on macosx Skipping following debug info categories: ['dwo']

Hide Details

-- Command Output (stderr): --

Hide Details

Session logs for test failures/errors/unexpected successes will go into directory '/Users/buildslave/jenkins/workspace/lldb-cmake/test/logs' Change dir to: /Users/buildslave/jenkins/workspace/lldb-cmake/llvm-project/lldb/test/API/lang/cpp/unique-types runCmd: settings clear -all output:

Hide Details

runCmd: settings set symbols.enable-external-lookup false output:

Hide Details

runCmd: settings set target.inherit-tcc true output:

Hide Details

runCmd: settings set target.auto-apply-fixits false output:

Hide Details

runCmd: settings set plugin.process.gdb-remote.packet-timeout 60 output:

Hide Details

runCmd: settings set symbols.clang-modules-cache-path "/Users/buildslave/jenkins/workspace/lldb-cmake/lldb-build/lldb-test-build.noindex/module-cache-lldb/lldb-api" output:

Hide Details

runCmd: settings set use-color false output:

Hide Details

runCmd: setting set target.prefer-dynamic-value no-dynamic-values output:

Hide Details

runCmd: frame variable --show-types longs output: (std::vector<long, std::allocator<long> >) longs = size=12 { (long) [0] = 0 (long) [1] = 1 (long) [2] = 2 (long) [3] = 3 (long) [4] = 4 (long) [5] = 5 (long) [6] = 6 (long) [7] = 7 (long) [8] = 8 (long) [9] = 9 (long) [10] = 10 (long) [11] = 11 }

Hide Details

Hide Details

looking at: (std::vector<long, std::allocator<long> >) longs = size=12 {

Hide Details

Checking string: "(std::vector<long, std::allocator<long> >) longs = size=12 {"

Hide Details

Expecting sub string: "long" (was found)

Hide Details

looking at: (long) [0] = 0

Hide Details

Checking string: "(long) [0] = 0"

Hide Details

Expecting sub string: "long" (was found)

Hide Details

looking at: (long) [1] = 1

Hide Details

Checking string: "(long) [1] = 1"

Hide Details

Expecting sub string: "long" (was found)

Hide Details

looking at: (long) [2] = 2

Hide Details

Checking string: "(long) [2] = 2"

Hide Details

Expecting sub string: "long" (was found)

Hide Details

looking at: (long) [3] = 3

Hide Details

Checking string: "(long) [3] = 3"

Hide Details

Expecting sub string: "long" (was found)

Hide Details

looking at: (long) [4] = 4

Hide Details

Checking string: "(long) [4] = 4"

Hide Details

Expecting sub string: "long" (was found)

Hide Details

looking at: (long) [5] = 5

Hide Details

Checking string: "(long) [5] = 5"

Hide Details

Expecting sub string: "long" (was found)

Hide Details

looking at: (long) [6] = 6

Hide Details

Checking string: "(long) [6] = 6"

Hide Details

Expecting sub string: "long" (was found)

Hide Details

looking at: (long) [7] = 7

Hide Details

Checking string: "(long) [7] = 7"

Hide Details

Expecting sub string: "long" (was found)

Hide Details

looking at: (long) [8] = 8

Hide Details

Checking string: "(long) [8] = 8"

Hide Details

Expecting sub string: "long" (was found)

Hide Details

looking at: (long) [9] = 9

Hide Details

Checking string: "(long) [9] = 9"

Hide Details

Expecting sub string: "long" (was found)

Hide Details

looking at: (long) [10] = 10

Hide Details

Checking string: "(long) [10] = 10"

Hide Details

Expecting sub string: "long" (was found)

Hide Details

looking at: (long) [11] = 11

Hide Details

Checking string: "(long) [11] = 11"

Hide Details

Expecting sub string: "long" (was found)

Hide Details

runCmd: frame variable --show-types shorts output: (std::vector<short, std::allocator<short> >) shorts = size=12 { (short) [0] = 0 (short) [1] = 1 (short) [2] = 2 (short) [3] = 3 (short) [4] = 4 (short) [5] = 5 (short) [6] = 6 (short) [7] = 7 (short) [8] = 8 (short) [9] = 9 (short) [10] = 10 (short) [11] = 11 }

Hide Details

Hide Details

looking at: (std::vector<short, std::allocator<short> >) shorts = size=12 {

Hide Details

Checking string: "(std::vector<short, std::allocator<short> >) shorts = size=12 {"

Hide Details

Expecting sub string: "short" (was found)

Hide Details

looking at: (short) [0] = 0

Hide Details

Checking string: "(short) [0] = 0"

Hide Details

Expecting sub string: "short" (was found)

Hide Details

looking at: (short) [1] = 1

Hide Details

Checking string: "(short) [1] = 1"

Hide Details

Expecting sub string: "short" (was found)

Hide Details

looking at: (short) [2] = 2

Hide Details

Checking string: "(short) [2] = 2"

Hide Details

Expecting sub string: "short" (was found)

Hide Details

looking at: (short) [3] = 3

Hide Details

Checking string: "(short) [3] = 3"

Hide Details

Expecting sub string: "short" (was found)

Hide Details

looking at: (short) [4] = 4

Hide Details

Checking string: "(short) [4] = 4"

Hide Details

Expecting sub string: "short" (was found)

Hide Details

looking at: (short) [5] = 5

Hide Details

Checking string: "(short) [5] = 5"

Hide Details

Expecting sub string: "short" (was found)

Hide Details

looking at: (short) [6] = 6

Hide Details

Checking string: "(short) [6] = 6"

Hide Details

Expecting sub string: "short" (was found)

Hide Details

looking at: (short) [7] = 7

Hide Details

Checking string: "(short) [7] = 7"

Hide Details

Expecting sub string: "short" (was found)

Hide Details

looking at: (short) [8] = 8

Hide Details

Checking string: "(short) [8] = 8"

Hide Details

Expecting sub string: "short" (was found)

Hide Details

looking at: (short) [9] = 9

Hide Details

Checking string: "(short) [9] = 9"

Hide Details

Expecting sub string: "short" (was found)

Hide Details

looking at: (short) [10] = 10

Hide Details

Checking string: "(short) [10] = 10"

Hide Details

Expecting sub string: "short" (was found)

Hide Details

looking at: (short) [11] = 11

Hide Details

Checking string: "(short) [11] = 11"

Hide Details

Expecting sub string: "short" (was found)

Hide Details

<bound method SBProcess.Kill of <lldb.SBProcess; proxy of <Swig Object of type 'lldb::SBProcess *' at 0x10dcbbb10> >>: success

Hide Details

PASS: LLDB (/Users/buildslave/jenkins/workspace/lldb-cmake/lldb-build/bin/clang-x86_64) :: test_dsym (TestUniqueTypes.UniqueTypesTestCase) runCmd: settings clear -all output:

Hide Details

runCmd: settings set symbols.enable-external-lookup false output:

Hide Details

runCmd: settings set target.inherit-tcc true output:

Hide Details

runCmd: settings set target.auto-apply-fixits false output:

Hide Details

runCmd: settings set plugin.process.gdb-remote.packet-timeout 60 output:

Hide Details

runCmd: settings set symbols.clang-modules-cache-path "/Users/buildslave/jenkins/workspace/lldb-cmake/lldb-build/lldb-test-build.noindex/module-cache-lldb/lldb-api" output:

Hide Details

runCmd: settings set use-color false output:

Hide Details

runCmd: setting set target.prefer-dynamic-value no-dynamic-values output:

Hide Details

runCmd: frame variable --show-types longs output: (std::vector<long, std::allocator<long> >) longs = size=12 { (long) [0] = 0 (long) [1] = 1 (long) [2] = 2 (long) [3] = 3 (long) [4] = 4 (long) [5] = 5 (long) [6] = 6 (long) [7] = 7 (long) [8] = 8 (long) [9] = 9 (long) [10] = 10 (long) [11] = 11 }

Hide Details

Hide Details

looking at: (std::vector<long, std::allocator<long> >) longs = size=12 {

Hide Details

Checking string: "(std::vector<long, std::allocator<long> >) longs = size=12 {"

Hide Details

Expecting sub string: "long" (was found)

Hide Details

looking at: (long) [0] = 0

Hide Details

Checking string: "(long) [0] = 0"

Hide Details

Expecting sub string: "long" (was found)

Hide Details

looking at: (long) [1] = 1

Hide Details

Checking string: "(long) [1] = 1"

Hide Details

Expecting sub string: "long" (was found)

Hide Details

looking at: (long) [2] = 2

Hide Details

Checking string: "(long) [2] = 2"

Hide Details

Expecting sub string: "long" (was found)

Hide Details

looking at: (long) [3] = 3

Hide Details

Checking string: "(long) [3] = 3"

Hide Details

Expecting sub string: "long" (was found)

Hide Details

looking at: (long) [4] = 4

Hide Details

Checking string: "(long) [4] = 4"

Hide Details

Expecting sub string: "long" (was found)

Hide Details

looking at: (long) [5] = 5

Hide Details

Checking string: "(long) [5] = 5"

Hide Details

Expecting sub string: "long" (was found)

Hide Details

looking at: (long) [6] = 6

Hide Details

Checking string: "(long) [6] = 6"

Hide Details

Expecting sub string: "long" (was found)

Hide Details

looking at: (long) [7] = 7

Hide Details

Checking string: "(long) [7] = 7"

Hide Details

Expecting sub string: "long" (was found)

Hide Details

looking at: (long) [8] = 8

Hide Details

Checking string: "(long) [8] = 8"

Hide Details

Expecting sub string: "long" (was found)

Hide Details

looking at: (long) [9] = 9

Hide Details

Checking string: "(long) [9] = 9"

Hide Details

Expecting sub string: "long" (was found)

Hide Details

looking at: (long) [10] = 10

Hide Details

Checking string: "(long) [10] = 10"

Hide Details

Expecting sub string: "long" (was found)

Hide Details

looking at: (long) [11] = 11

Hide Details

Checking string: "(long) [11] = 11"

Hide Details

Expecting sub string: "long" (was found)

Hide Details

runCmd: frame variable --show-types shorts output: (std::vector<short, std::allocator<short> >) shorts = size=12 { (short) [0] = 0 (short) [1] = 1 (short) [2] = 2 (short) [3] = 3 (short) [4] = 4 (short) [5] = 5 (short) [6] = 6 (short) [7] = 7 (short) [8] = 8 (short) [9] = 9 (short) [10] = 10 (short) [11] = 11 }

Hide Details

Hide Details

looking at: (std::vector<short, std::allocator<short> >) shorts = size=12 {

Hide Details

Checking string: "(std::vector<short, std::allocator<short> >) shorts = size=12 {"

Hide Details

Expecting sub string: "short" (was found)

Hide Details

looking at: (short) [0] = 0

Hide Details

Checking string: "(short) [0] = 0"

Hide Details

Expecting sub string: "short" (was found)

Hide Details

looking at: (short) [1] = 1

Hide Details

Checking string: "(short) [1] = 1"

Hide Details

Expecting sub string: "short" (was found)

Hide Details

looking at: (short) [2] = 2

Hide Details

Checking string: "(short) [2] = 2"

Hide Details

Expecting sub string: "short" (was found)

Hide Details

looking at: (short) [3] = 3

Hide Details

Checking string: "(short) [3] = 3"

Hide Details

Expecting sub string: "short" (was found)

Hide Details

looking at: (short) [4] = 4

Hide Details

Checking string: "(short) [4] = 4"

Hide Details

Expecting sub string: "short" (was found)

Hide Details

looking at: (short) [5] = 5

Hide Details

Checking string: "(short) [5] = 5"

Hide Details

Expecting sub string: "short" (was found)

Hide Details

looking at: (short) [6] = 6

Hide Details

Checking string: "(short) [6] = 6"

Hide Details

Expecting sub string: "short" (was found)

Hide Details

looking at: (short) [7] = 7

Hide Details

Checking string: "(short) [7] = 7"

Hide Details

Expecting sub string: "short" (was found)

Hide Details

looking at: (short) [8] = 8

Hide Details

Checking string: "(short) [8] = 8"

Hide Details

Expecting sub string: "short" (was found)

Hide Details

looking at: (short) [9] = 9

Hide Details

Checking string: "(short) [9] = 9"

Hide Details

Expecting sub string: "short" (was found)

Hide Details

looking at: (short) [10] = 10

Hide Details

Checking string: "(short) [10] = 10"

Hide Details

Expecting sub string: "short" (was found)

Hide Details

looking at: (short) [11] = 11

Hide Details

Checking string: "(short) [11] = 11"

Hide Details

Expecting sub string: "short" (was found)

Hide Details

<bound method SBProcess.Kill of <lldb.SBProcess; proxy of <Swig Object of type 'lldb::SBProcess *' at 0x10617fc30> >>: success

Hide Details

PASS: LLDB (/Users/buildslave/jenkins/workspace/lldb-cmake/lldb-build/bin/clang-x86_64) :: test_dwarf (TestUniqueTypes.UniqueTypesTestCase) UNSUPPORTED: LLDB (/Users/buildslave/jenkins/workspace/lldb-cmake/lldb-build/bin/clang-x86_64) :: test_dwo (TestUniqueTypes.UniqueTypesTestCase) (test case does not fall in any category of interest for this run) runCmd: settings clear -all output:

Hide Details

runCmd: settings set symbols.enable-external-lookup false output:

Hide Details

runCmd: settings set target.inherit-tcc true output:

Hide Details

runCmd: settings set target.auto-apply-fixits false output:

Hide Details

runCmd: settings set plugin.process.gdb-remote.packet-timeout 60 output:

Hide Details

runCmd: settings set symbols.clang-modules-cache-path "/Users/buildslave/jenkins/workspace/lldb-cmake/lldb-build/lldb-test-build.noindex/module-cache-lldb/lldb-api" output:

Hide Details

runCmd: settings set use-color false output:

Hide Details

runCmd: setting set target.prefer-dynamic-value no-dynamic-values output:

Hide Details

FAIL: LLDB (/Users/buildslave/jenkins/workspace/lldb-cmake/lldb-build/bin/clang-x86_64) :: test_gmodules (TestUniqueTypes.UniqueTypesTestCase) Restore dir to: /Users/buildslave/jenkins/workspace/lldb-cmake/lldb-build/tools/lldb/test ====================================================================== ERROR: test_gmodules (TestUniqueTypes.UniqueTypesTestCase) Test for unique types of std::vector<long> and std::vector<short>. ---------------------------------------------------------------------- Error when building test subject.

Hide Details

Build Command: make VPATH=/Users/buildslave/jenkins/workspace/lldb-cmake/llvm-project/lldb/test/API/lang/cpp/unique-types -C /Users/buildslave/jenkins/workspace/lldb-cmake/lldb-build/lldb-test-build.noindex/lang/cpp/unique-types/TestUniqueTypes.test_gmodules -I /Users/buildslave/jenkins/workspace/lldb-cmake/llvm-project/lldb/test/API/lang/cpp/unique-types -I /Users/buildslave/jenkins/workspace/lldb-cmake/llvm-project/lldb/packages/Python/lldbsuite/test/make -f /Users/buildslave/jenkins/workspace/lldb-cmake/llvm-project/lldb/test/API/lang/cpp/unique-types/Makefile MAKE_DSYM=NO MAKE_GMODULES=YES ARCH=x86_64 CC="/Users/buildslave/jenkins/workspace/lldb-cmake/lldb-build/bin/clang" DSYMUTIL="/Users/buildslave/jenkins/workspace/lldb-cmake/lldb-build/./bin/dsymutil" CLANG_MODULE_CACHE_DIR=/Users/buildslave/jenkins/workspace/lldb-cmake/lldb-build/lldb-test-build.noindex/module-cache-clang/lldb-api

Hide Details

Build Command Output: While building module 'std' imported from /Users/buildslave/jenkins/workspace/lldb-cmake/llvm-project/lldb/test/API/lang/cpp/unique-types/main.cpp:1: In file included from <module-includes>:31: In file included from /Users/buildslave/jenkins/workspace/lldb-cmake/lldb-build/bin/../include/c++/v1/complex.h:28: In file included from /Users/buildslave/jenkins/workspace/lldb-cmake/lldb-build/bin/../include/c++/v1/ccomplex:20: In file included from /Users/buildslave/jenkins/workspace/lldb-cmake/lldb-build/bin/../include/c++/v1/complex:247: In file included from /Users/buildslave/jenkins/workspace/lldb-cmake/lldb-build/bin/../include/c++/v1/sstream:173: /Users/buildslave/jenkins/workspace/lldb-cmake/lldb-build/bin/../include/c++/v1/ostream:1038:45: error: no template named 'enable_if_t'; did you mean 'enable_if'? template <class _Stream, class _Tp, class = enable_if_t< ^ /Users/buildslave/jenkins/workspace/lldb-cmake/lldb-build/bin/../include/c++/v1/type_traits:538:63: note: 'enable_if' declared here template <bool, class _Tp = void> struct _LIBCPP_TEMPLATE_VIS enable_if {}; ^ While building module 'std' imported from /Users/buildslave/jenkins/workspace/lldb-cmake/llvm-project/lldb/test/API/lang/cpp/unique-types/main.cpp:1: In file included from <module-includes>:31: In file included from /Users/buildslave/jenkins/workspace/lldb-cmake/lldb-build/bin/../include/c++/v1/complex.h:28: In file included from /Users/buildslave/jenkins/workspace/lldb-cmake/lldb-build/bin/../include/c++/v1/ccomplex:20: In file included from /Users/buildslave/jenkins/workspace/lldb-cmake/lldb-build/bin/../include/c++/v1/complex:247: In file included from /Users/buildslave/jenkins/workspace/lldb-cmake/lldb-build/bin/../include/c++/v1/sstream:174: /Users/buildslave/jenkins/workspace/lldb-cmake/lldb-build/bin/../include/c++/v1/istream:1389:45: error: no template named 'enable_if_t'; did you mean 'enable_if'? template <class _Stream, class _Tp, class = enable_if_t< ^ /Users/buildslave/jenkins/workspace/lldb-cmake/lldb-build/bin/../include/c++/v1/type_traits:538:63: note: 'enable_if' declared here template <bool, class _Tp = void> struct _LIBCPP_TEMPLATE_VIS enable_if {}; ^ /Users/buildslave/jenkins/workspace/lldb-cmake/llvm-project/lldb/test/API/lang/cpp/unique-types/main.cpp:1:10: fatal error: could not build module 'std' #include <vector> ~~~~~~~~^ 3 errors generated. /Users/buildslave/jenkins/workspace/lldb-cmake/lldb-build/bin/clang -fmodules -gmodules -fmodules-cache-path=/Users/buildslave/jenkins/workspace/lldb-cmake/lldb-build/lldb-test-build.noindex/module-cache-clang/lldb-api -gmodules -fcxx-modules -std=c++11 -g -O0 -fno-builtin -isysroot "/Applications/Xcode.app/Contents/Developer/Platforms/MacOSX.platform/Developer/SDKs/MacOSX10.15.sdk" -arch x86_64 -I/Users/buildslave/jenkins/workspace/lldb-cmake/llvm-project/lldb/packages/Python/lldbsuite/test/make/../../../../../include -I/Users/buildslave/jenkins/workspace/lldb-cmake/llvm-project/lldb/test/API/lang/cpp/unique-types -I/Users/buildslave/jenkins/workspace/lldb-cmake/llvm-project/lldb/packages/Python/lldbsuite/test/make -include /Users/buildslave/jenkins/workspace/lldb-cmake/llvm-project/lldb/packages/Python/lldbsuite/test/make/test_common.h -fno-limit-debug-info -fmodules -gmodules -fmodules-cache-path=/Users/buildslave/jenkins/workspace/lldb-cmake/lldb-build/lldb-test-build.noindex/module-cache-clang/lldb-api -gmodules -fcxx-modules --driver-mode=g++ -c -o main.o /Users/buildslave/jenkins/workspace/lldb-cmake/llvm-project/lldb/test/API/lang/cpp/unique-types/main.cpp While building module 'std' imported from /Users/buildslave/jenkins/workspace/lldb-cmake/llvm-project/lldb/test/API/lang/cpp/unique-types/main.cpp:1: In file included from <module-includes>:31: In file included from /Users/buildslave/jenkins/workspace/lldb-cmake/lldb-build/bin/../include/c++/v1/complex.h:28: In file included from /Users/buildslave/jenkins/workspace/lldb-cmake/lldb-build/bin/../include/c++/v1/ccomplex:20: In file included from /Users/buildslave/jenkins/workspace/lldb-cmake/lldb-build/bin/../include/c++/v1/complex:247: In file included from /Users/buildslave/jenkins/workspace/lldb-cmake/lldb-build/bin/../include/c++/v1/sstream:173: /Users/buildslave/jenkins/workspace/lldb-cmake/lldb-build/bin/../include/c++/v1/ostream:1038:45: error: no template named 'enable_if_t'; did you mean 'enable_if'? template <class _Stream, class _Tp, class = enable_if_t< ^ /Users/buildslave/jenkins/workspace/lldb-cmake/lldb-build/bin/../include/c++/v1/type_traits:538:63: note: 'enable_if' declared here template <bool, class _Tp = void> struct _LIBCPP_TEMPLATE_VIS enable_if {}; ^ While building module 'std' imported from /Users/buildslave/jenkins/workspace/lldb-cmake/llvm-project/lldb/test/API/lang/cpp/unique-types/main.cpp:1: In file included from <module-includes>:31: In file included from /Users/buildslave/jenkins/workspace/lldb-cmake/lldb-build/bin/../include/c++/v1/complex.h:28: In file included from /Users/buildslave/jenkins/workspace/lldb-cmake/lldb-build/bin/../include/c++/v1/ccomplex:20: In file included from /Users/buildslave/jenkins/workspace/lldb-cmake/lldb-build/bin/../include/c++/v1/complex:247: In file included from /Users/buildslave/jenkins/workspace/lldb-cmake/lldb-build/bin/../include/c++/v1/sstream:174: /Users/buildslave/jenkins/workspace/lldb-cmake/lldb-build/bin/../include/c++/v1/istream:1389:45: error: no template named 'enable_if_t'; did you mean 'enable_if'? template <class _Stream, class _Tp, class = enable_if_t< ^ /Users/buildslave/jenkins/workspace/lldb-cmake/lldb-build/bin/../include/c++/v1/type_traits:538:63: note: 'enable_if' declared here template <bool, class _Tp = void> struct _LIBCPP_TEMPLATE_VIS enable_if {}; ^ /Users/buildslave/jenkins/workspace/lldb-cmake/llvm-project/lldb/test/API/lang/cpp/unique-types/main.cpp:1:10: fatal error: could not build module 'std' #include <vector> ~~~~~~~~^ 3 errors generated. make: *** [main.o] Error 1

Hide Details

Test Directory: /Users/buildslave/jenkins/workspace/lldb-cmake/llvm-project/lldb/test/API/lang/cpp/unique-types ---------------------------------------------------------------------- Ran 4 tests in 11.430s

Hide Details

RESULT: FAILED (2 passes, 0 failures, 1 errors, 1 skipped, 0 expected failures, 0 unexpected successes)

Hide Details

--

Hide Details

******************** Slowest Tests: -------------------------------------------------------------------------- 395.16s: lldb-api :: macosx/simulator/TestSimulatorPlatform.py 252.43s: lldb-api :: functionalities/data-formatter/boolreference/TestFormattersBoolRefPtr.py 205.70s: lldb-api :: functionalities/return-value/TestReturnValue.py 144.64s: lldb-api :: lang/cpp/namespace/TestNamespaceLookup.py 124.36s: lldb-api :: functionalities/thread/create_after_attach/TestCreateAfterAttach.py 102.57s: lldb-api :: lang/objc/objc-new-syntax/TestObjCNewSyntaxArray.py 101.07s: lldb-api :: tools/lldb-server/TestLldbGdbServer.py 87.46s: lldb-api :: types/TestLongTypes.py 76.81s: lldb-api :: lang/cpp/namespace/TestNamespace.py 73.08s: lldb-api :: api/command-return-object/TestSBCommandReturnObject.py 72.96s: lldb-api :: types/TestLongTypesExpr.py 66.32s: lldb-api :: functionalities/thread/create_during_step/TestCreateDuringStep.py 65.87s: lldb-api :: lang/objc/exceptions/TestObjCExceptions.py 57.88s: lldb-api :: commands/target/basic/TestTargetCommand.py 57.53s: lldb-api :: functionalities/gdb_remote_client/TestRegDefinitionInParts.py 56.04s: lldb-api :: lang/objc/foundation/TestFoundationDisassembly.py 53.29s: lldb-api :: lang/objc/hidden-ivars/TestHiddenIvars.py 50.74s: lldb-api :: lang/objc/foundation/TestObjCMethods.py 49.30s: lldb-shell :: SymbolFile/NativePDB/disassembly.cpp 46.46s: lldb-api :: types/TestIntegerTypeExpr.py

Hide Details

Tests Times: -------------------------------------------------------------------------- [ Range ] :: [ Percentage ] :: [ Count ] -------------------------------------------------------------------------- [380s,400s) :: [ ] :: [ 1/2150] [360s,380s) :: [ ] :: [ 0/2150] [340s,360s) :: [ ] :: [ 0/2150] [320s,340s) :: [ ] :: [ 0/2150] [300s,320s) :: [ ] :: [ 0/2150] [280s,300s) :: [ ] :: [ 0/2150] [260s,280s) :: [ ] :: [ 0/2150] [240s,260s) :: [ ] :: [ 1/2150] [220s,240s) :: [ ] :: [ 0/2150] [200s,220s) :: [ ] :: [ 1/2150] [180s,200s) :: [ ] :: [ 0/2150] [160s,180s) :: [ ] :: [ 0/2150] [140s,160s) :: [ ] :: [ 1/2150] [120s,140s) :: [ ] :: [ 1/2150] [100s,120s) :: [ ] :: [ 2/2150] [ 80s,100s) :: [ ] :: [ 1/2150] [ 60s, 80s) :: [ ] :: [ 5/2150] [ 40s, 60s) :: [ ] :: [ 14/2150] [ 20s, 40s) :: [ ] :: [ 40/2150] [ 0s, 20s) :: [************************************** ] :: [2083/2150] -------------------------------------------------------------------------- ******************** Failed Tests (136): lldb-api :: commands/expression/import-std-module/vector/TestVectorFromStdModule.py lldb-api :: python_api/sbvalue_const_addrof/TestSBValueConstAddrOf.py lldb-api :: functionalities/data-formatter/stringprinter/TestStringPrinter.py lldb-api :: types/TestLongTypes.py lldb-api :: lang/cpp/namespace/TestNamespace.py lldb-api :: functionalities/data-formatter/data-formatter-categories/TestDataFormatterCategories.py lldb-api :: functionalities/thread/backtrace_all/TestBacktraceAll.py lldb-api :: python_api/lldbutil/iter/TestLLDBIterator.py lldb-api :: functionalities/data-formatter/data-formatter-disabling/TestDataFormatterDisabling.py lldb-api :: functionalities/breakpoint/breakpoint_set_restart/TestBreakpointSetRestart.py lldb-shell :: Process/TestEnvironment.test lldb-api :: functionalities/data-formatter/data-formatter-stl/libcxx/iterator/TestDataFormatterLibccIterator.py lldb-api :: lang/cpp/template/TestTemplateArgs.py lldb-api :: lang/cpp/operators/TestCppOperators.py lldb-api :: functionalities/breakpoint/cpp_exception/TestCPPExceptionBreakpoint.py lldb-api :: functionalities/data-formatter/data-formatter-stl/libcxx/atomic/TestLibCxxAtomic.py lldb-api :: types/TestShortTypeExpr.py lldb-api :: commands/expression/vector_of_enums/TestVectorOfEnums.py lldb-api :: types/TestCharType.py lldb-api :: commands/expression/import-std-module/vector-bool/TestVectorBoolFromStdModule.py lldb-api :: functionalities/thread/state_after_expression/TestStateAfterExpression.py lldb-api :: commands/expression/import-std-module/list/TestListFromStdModule.py lldb-api :: lang/objcxx/hide-runtime-values/TestObjCXXHideRuntimeValues.py lldb-api :: functionalities/data-formatter/data-formatter-script/TestDataFormatterScript.py lldb-api :: lang/objcxx/objcxx-ivar-vector/TestIvarVector.py lldb-api :: lang/cpp/wchar_t/TestCxxWCharT.py lldb-api :: commands/expression/call-function/TestCallStdStringFunction.py lldb-api :: commands/expression/call-function/TestCallUserDefinedFunction.py lldb-api :: commands/expression/import-std-module/weak_ptr-dbg-info-content/TestDbgInfoContentWeakPtrFromStdModule.py lldb-api :: functionalities/data-formatter/data-formatter-stl/libcxx/initializerlist/TestInitializerList.py lldb-api :: commands/expression/no-deadlock/TestExprDoesntBlock.py lldb-api :: lang/objcxx/cxx-bridged-po/TestObjCXXBridgedPO.py lldb-api :: functionalities/data-formatter/data-formatter-named-summaries/TestDataFormatterNamedSummaries.py lldb-api :: types/TestCharTypeExpr.py lldb-api :: lang/cpp/exceptions/TestCPPExceptionBreakpoints.py lldb-api :: lang/objcxx/class-name-clash/TestNameClash.py lldb-api :: lang/cpp/extern_c/TestExternCSymbols.py lldb-api :: types/TestIntegerTypeExpr.py lldb-api :: commands/expression/expr-in-syscall/TestExpressionInSyscall.py lldb-api :: api/multithreaded/TestMultithreaded.py lldb-api :: lang/cpp/dynamic-value/TestDynamicValue.py lldb-api :: functionalities/breakpoint/hardware_breakpoints/hardware_breakpoint_on_multiple_threads/TestHWBreakMultiThread.py lldb-api :: types/TestIntegerType.py lldb-api :: functionalities/thread/exit_during_step/TestExitDuringStep.py lldb-api :: functionalities/data-formatter/data-formatter-stl/libcxx/unordered/TestDataFormatterUnordered.py lldb-api :: python_api/exprpath_synthetic/TestExprPathSynthetic.py lldb-api :: functionalities/data-formatter/data-formatter-advanced/TestDataFormatterAdv.py lldb-api :: functionalities/data-formatter/data-formatter-stl/libcxx/tuple/TestDataFormatterLibcxxTuple.py lldb-api :: commands/expression/import-std-module/deque-dbg-info-content/TestDbgInfoContentDequeFromStdModule.py lldb-api :: tools/lldb-server/inferior-crash/TestGdbRemoteSegFault.py lldb-api :: commands/expression/import-std-module/forward_list/TestForwardListFromStdModule.py lldb-api :: commands/expression/import-std-module/unique_ptr/TestUniquePtrFromStdModule.py lldb-api :: functionalities/data-formatter/data-formatter-stl/libcxx/queue/TestDataFormatterLibcxxQueue.py lldb-api :: commands/expression/issue_11588/Test11588.py lldb-api :: functionalities/dynamic_value_child_count/TestDynamicValueChildCount.py lldb-api :: functionalities/type_completion/TestTypeCompletion.py lldb-api :: functionalities/data-formatter/data-formatter-stl/libcxx/string/TestDataFormatterLibcxxString.py lldb-api :: commands/expression/formatters/TestFormatters.py lldb-api :: functionalities/data-formatter/data-formatter-stl/libcxx/set/TestDataFormatterLibcxxSet.py lldb-api :: lang/objc/exceptions/TestObjCExceptions.py lldb-api :: functionalities/data-formatter/data-formatter-stl/libcxx/multiset/TestDataFormatterLibcxxMultiSet.py lldb-api :: types/TestDoubleTypesExpr.py lldb-api :: lang/cpp/bitfields/TestCppBitfields.py lldb-api :: functionalities/data-formatter/data-formatter-synth/TestDataFormatterSynth.py lldb-api :: lang/cpp/class_types/TestClassTypes.py lldb-api :: commands/expression/import-std-module/deque-basic/TestDequeFromStdModule.py lldb-api :: functionalities/data-formatter/data-formatter-smart-array/TestDataFormatterSmartArray.py lldb-api :: functionalities/deleted-executable/TestDeletedExecutable.py lldb-api :: python_api/lldbutil/iter/TestRegistersIterator.py lldb-api :: commands/expression/import-std-module/basic/TestImportStdModule.py lldb-api :: functionalities/memory/find/TestMemoryFind.py lldb-api :: types/TestShortType.py lldb-api :: functionalities/data-formatter/data-formatter-stl/libcxx/forward_list/TestDataFormatterLibcxxForwardList.py lldb-api :: types/TestDoubleTypes.py lldb-api :: commands/expression/import-std-module/forward_list-dbg-info-content/TestDbgInfoContentForwardListFromStdModule.py lldb-api :: tools/lldb-server/inferior-crash/TestGdbRemoteAbort.py lldb-api :: types/TestFloatTypesExpr.py lldb-api :: types/TestLongTypesExpr.py lldb-api :: commands/command/script/TestCommandScript.py lldb-api :: commands/expression/import-std-module/vector-of-vectors/TestVectorOfVectorsFromStdModule.py lldb-api :: commands/expression/import-std-module/shared_ptr/TestSharedPtrFromStdModule.py lldb-api :: lang/cpp/stl/TestStdCXXDisassembly.py lldb-api :: functionalities/data-formatter/parray/TestPrintArray.py lldb-api :: lang/cpp/class_types/TestClassTypesDisassembly.py lldb-api :: functionalities/breakpoint/breakpoint_ids/TestBreakpointIDs.py lldb-api :: lang/c/step_over_no_deadlock/TestStepOverDoesntBlock.py lldb-api :: commands/expression/import-std-module/stack/TestStackFromStdModule.py lldb-api :: commands/settings/TestSettings.py lldb-api :: functionalities/thread/thread_exit/TestThreadExit.py lldb-api :: commands/expression/timeout/TestCallWithTimeout.py lldb-api :: functionalities/completion/TestCompletion.py lldb-api :: functionalities/data-formatter/poarray/TestPrintObjectArray.py lldb-api :: commands/expression/call-function/TestCallStopAndContinue.py lldb-api :: lang/cpp/global_operators/TestCppGlobalOperators.py lldb-api :: commands/expression/import-std-module/vector-dbg-info-content/TestDbgInfoContentVectorFromStdModule.py lldb-api :: types/TestFloatTypes.py lldb-api :: functionalities/breakpoint/inlined_breakpoints/TestInlinedBreakpoints.py lldb-api :: functionalities/data-formatter/ostypeformatting/TestFormattersOsType.py lldb-api :: functionalities/breakpoint/cpp/TestCPPBreakpointLocations.py lldb-api :: functionalities/data-formatter/compactvectors/TestCompactVectors.py lldb-api :: python_api/watchpoint/watchlocation/TestSetWatchlocation.py lldb-api :: functionalities/data-formatter/data-formatter-stl/libcxx/map/TestDataFormatterLibccMap.py lldb-api :: functionalities/data-formatter/data-formatter-stl/libcxx/multimap/TestDataFormatterLibccMultiMap.py lldb-api :: lang/cpp/stl/TestSTL.py lldb-api :: functionalities/type_lookup/TestTypeLookup.py lldb-api :: functionalities/memory/read/TestMemoryRead.py lldb-api :: lang/cpp/breakpoint_in_member_func_w_non_primitive_params/TestBreakpointInMemberFuncWNonPrimitiveParams.py lldb-api :: python_api/watchpoint/watchlocation/TestTargetWatchAddress.py lldb-api :: python_api/process/TestProcessAPI.py lldb-api :: commands/log/basic/TestLogging.py lldb-api :: functionalities/data-formatter/data-formatter-skip-summary/TestDataFormatterSkipSummary.py lldb-api :: python_api/class_members/TestSBTypeClassMembers.py lldb-api :: commands/expression/import-std-module/pair/TestPairFromStdModule.py lldb-api :: lang/objc/objc++/TestObjCXX.py lldb-api :: commands/frame/diagnose/inheritance/TestDiagnoseInheritance.py lldb-api :: commands/expression/namespace_local_var_same_name_obj_c/TestNamespaceLocalVarSameNameObjC.py lldb-api :: functionalities/thread/step_out/TestThreadStepOut.py lldb-api :: functionalities/data-formatter/data-formatter-stl/libcxx/vector/TestDataFormatterLibcxxVector.py lldb-api :: functionalities/data-formatter/boolreference/TestFormattersBoolRefPtr.py lldb-api :: functionalities/thread/exit_during_break/TestExitDuringBreak.py lldb-api :: functionalities/thread/create_after_attach/TestCreateAfterAttach.py lldb-api :: functionalities/data-formatter/data-formatter-stl/libcxx/function/TestLibCxxFunction.py lldb-api :: commands/expression/static-initializers/TestStaticInitializers.py lldb-api :: functionalities/data-formatter/data-formatter-stl/libcxx/bitset/TestDataFormatterLibcxxBitset.py lldb-api :: commands/expression/import-std-module/unique_ptr-dbg-info-content/TestUniquePtrDbgInfoContent.py lldb-api :: functionalities/data-formatter/data-formatter-stl/libcxx/vbool/TestDataFormatterLibcxxVBool.py lldb-api :: functionalities/inline-stepping/TestInlineStepping.py lldb-api :: lang/cpp/namespace/TestNamespaceLookup.py lldb-api :: commands/expression/import-std-module/conflicts/TestStdModuleWithConflicts.py lldb-api :: commands/expression/import-std-module/shared_ptr-dbg-info-content/TestSharedPtrDbgInfoContentFromStdModule.py lldb-api :: lang/cpp/char1632_t/TestChar1632T.py lldb-api :: commands/expression/import-std-module/weak_ptr/TestWeakPtrFromStdModule.py lldb-api :: commands/expression/import-std-module/list-dbg-info-content/TestDbgInfoContentListFromStdModule.py lldb-api :: commands/expression/import-std-module/queue/TestQueueFromStdModule.py lldb-api :: functionalities/memory-region/TestMemoryRegion.py lldb-api :: lang/cpp/unique-types/TestUniqueTypes.py

Hide Details

Hide Details

Testing Time: 2059.71s Unsupported : 152 Passed : 1856 Expectedly Failed: 6 Failed : 136 FAILED: tools/lldb/test/CMakeFiles/check-lldb-lit cd /Users/buildslave/jenkins/workspace/lldb-cmake/lldb-build/tools/lldb/test && /usr/local/Frameworks/Python.framework/Versions/3.7/bin/python3.7 /Users/buildslave/jenkins/workspace/lldb-cmake/lldb-build/./bin/llvm-lit -v --time-tests --shuffle --xunit-xml-output=/Users/buildslave/jenkins/workspace/lldb-cmake/test/results.xml -v -j 4 /Users/buildslave/jenkins/workspace/lldb-cmake/lldb-build/tools/lldb/test ninja: build stopped: subcommand failed. Command failed: Command '['/usr/bin/env', 'TERM=vt100', '/usr/local/bin/ninja', '-v', 'check-lldb']' returned non-zero exit status 1 Command: ['/usr/bin/env', 'TERM=vt100', '/usr/local/bin/ninja', '-v', 'check-lldb'] [Pipeline] } [Pipeline] // timeout [Pipeline] } [Pipeline] // stage [Pipeline] stage [Pipeline] { (Declarative: Post Actions) [Pipeline] scanForIssues [Clang (LLVM based)] Sleeping for 5 seconds due to JENKINS-32191... [Clang (LLVM based)] Parsing console log (workspace: '/Users/buildslave/jenkins/workspace/lldb-cmake') [Clang (LLVM based)] Successfully parsed console log [Clang (LLVM based)] -> found 101 issues (skipped 1747 duplicates) [Clang (LLVM based)] Post processing issues on 'green-dragon-10' with source code encoding 'UTF-8' [Clang (LLVM based)] Creating SCM blamer to obtain author and commit information for affected files [Clang (LLVM based)] Creating SCM miner to obtain statistics for affected repository files [Clang (LLVM based)] Resolving file names for all issues in source directory '/Users/buildslave/jenkins/workspace/lldb-cmake' [Clang (LLVM based)] -> resolved paths in source directory (98 found, 0 not found) [Clang (LLVM based)] Resolving module names from module definitions (build.xml, pom.xml, or Manifest.mf files) [Clang (LLVM based)] -> resolved module names for 101 issues [Clang (LLVM based)] Resolving package names (or namespaces) by parsing the affected files [Clang (LLVM based)] -> resolved package names of 98 affected files [Clang (LLVM based)] No filter has been set, publishing all 101 issues [Clang (LLVM based)] Creating fingerprints for all affected code blocks to track issues over different builds [Clang (LLVM based)] -> created fingerprints for 101 issues (skipped 0 issues) [Clang (LLVM based)] Copying affected files to Jenkins' build folder '/Users/Shared/Jenkins/Home/jobs/lldb-cmake/builds/23939/files-with-issues' [Clang (LLVM based)] -> 77 copied, 22 not in workspace, 0 not-found, 0 with I/O error [Pipeline] junit Recording test results [Pipeline] } [Pipeline] // stage [Pipeline] } [Pipeline] // withEnv [Pipeline] } [Pipeline] // node [Pipeline] End of Pipeline ERROR: script returned exit code 1 Finished: FAILURE