FailedConsole Output

Skipping 8,742 KB.. Full Log
-time -Werror=unguarded-availability-new -fmodules -fmodules-cache-path=/Users/buildslave/jenkins/workspace/lldb-cmake/lldb-build/module.cache -fcxx-modules -Xclang -fmodules-local-submodule-visibility -Wall -Wextra -Wno-unused-parameter -Wwrite-strings -Wcast-qual -Wmissing-field-initializers -pedantic -Wno-long-long -Wimplicit-fallthrough -Wcovered-switch-default -Wno-noexcept-type -Wnon-virtual-dtor -Wdelete-non-virtual-dtor -Wsuggest-override -Wstring-conversion -fdiagnostics-color -O3  -isysroot /Applications/Xcode.app/Contents/Developer/Platforms/MacOSX.platform/Developer/SDKs/MacOSX10.15.sdk    -fno-exceptions -fno-rtti -UNDEBUG -std=c++14 -MD -MT tools/lld/ELF/CMakeFiles/lldELF.dir/Arch/Hexagon.cpp.o -MF tools/lld/ELF/CMakeFiles/lldELF.dir/Arch/Hexagon.cpp.o.d -o tools/lld/ELF/CMakeFiles/lldELF.dir/Arch/Hexagon.cpp.o -c /Users/buildslave/jenkins/workspace/lldb-cmake/llvm-project/lld/ELF/Arch/Hexagon.cpp
[5081/5150] /Users/buildslave/jenkins/workspace/lldb-cmake/host-compiler/bin/clang++  -DGTEST_HAS_RTTI=0 -D_DEBUG -D__STDC_CONSTANT_MACROS -D__STDC_FORMAT_MACROS -D__STDC_LIMIT_MACROS -Itools/lld/ELF -I/Users/buildslave/jenkins/workspace/lldb-cmake/llvm-project/lld/ELF -I/Users/buildslave/jenkins/workspace/lldb-cmake/llvm-project/lld/include -Itools/lld/include -I/Applications/Xcode.app/Contents/Developer/Platforms/MacOSX.platform/Developer/SDKs/MacOSX10.15.sdk/usr/include/libxml2 -Iinclude -I/Users/buildslave/jenkins/workspace/lldb-cmake/llvm-project/llvm/include -Wdocumentation -fPIC -fvisibility-inlines-hidden -Werror=date-time -Werror=unguarded-availability-new -fmodules -fmodules-cache-path=/Users/buildslave/jenkins/workspace/lldb-cmake/lldb-build/module.cache -fcxx-modules -Xclang -fmodules-local-submodule-visibility -Wall -Wextra -Wno-unused-parameter -Wwrite-strings -Wcast-qual -Wmissing-field-initializers -pedantic -Wno-long-long -Wimplicit-fallthrough -Wcovered-switch-default -Wno-noexcept-type -Wnon-virtual-dtor -Wdelete-non-virtual-dtor -Wsuggest-override -Wstring-conversion -fdiagnostics-color -O3  -isysroot /Applications/Xcode.app/Contents/Developer/Platforms/MacOSX.platform/Developer/SDKs/MacOSX10.15.sdk    -fno-exceptions -fno-rtti -UNDEBUG -std=c++14 -MD -MT tools/lld/ELF/CMakeFiles/lldELF.dir/Arch/MSP430.cpp.o -MF tools/lld/ELF/CMakeFiles/lldELF.dir/Arch/MSP430.cpp.o.d -o tools/lld/ELF/CMakeFiles/lldELF.dir/Arch/MSP430.cpp.o -c /Users/buildslave/jenkins/workspace/lldb-cmake/llvm-project/lld/ELF/Arch/MSP430.cpp
[5082/5150] /Users/buildslave/jenkins/workspace/lldb-cmake/host-compiler/bin/clang++  -DGTEST_HAS_RTTI=0 -D_DEBUG -D__STDC_CONSTANT_MACROS -D__STDC_FORMAT_MACROS -D__STDC_LIMIT_MACROS -Itools/lld/ELF -I/Users/buildslave/jenkins/workspace/lldb-cmake/llvm-project/lld/ELF -I/Users/buildslave/jenkins/workspace/lldb-cmake/llvm-project/lld/include -Itools/lld/include -I/Applications/Xcode.app/Contents/Developer/Platforms/MacOSX.platform/Developer/SDKs/MacOSX10.15.sdk/usr/include/libxml2 -Iinclude -I/Users/buildslave/jenkins/workspace/lldb-cmake/llvm-project/llvm/include -Wdocumentation -fPIC -fvisibility-inlines-hidden -Werror=date-time -Werror=unguarded-availability-new -fmodules -fmodules-cache-path=/Users/buildslave/jenkins/workspace/lldb-cmake/lldb-build/module.cache -fcxx-modules -Xclang -fmodules-local-submodule-visibility -Wall -Wextra -Wno-unused-parameter -Wwrite-strings -Wcast-qual -Wmissing-field-initializers -pedantic -Wno-long-long -Wimplicit-fallthrough -Wcovered-switch-default -Wno-noexcept-type -Wnon-virtual-dtor -Wdelete-non-virtual-dtor -Wsuggest-override -Wstring-conversion -fdiagnostics-color -O3  -isysroot /Applications/Xcode.app/Contents/Developer/Platforms/MacOSX.platform/Developer/SDKs/MacOSX10.15.sdk    -fno-exceptions -fno-rtti -UNDEBUG -std=c++14 -MD -MT tools/lld/ELF/CMakeFiles/lldELF.dir/Arch/PPC.cpp.o -MF tools/lld/ELF/CMakeFiles/lldELF.dir/Arch/PPC.cpp.o.d -o tools/lld/ELF/CMakeFiles/lldELF.dir/Arch/PPC.cpp.o -c /Users/buildslave/jenkins/workspace/lldb-cmake/llvm-project/lld/ELF/Arch/PPC.cpp
[5083/5150] /Users/buildslave/jenkins/workspace/lldb-cmake/host-compiler/bin/clang++  -DGTEST_HAS_RTTI=0 -D_DEBUG -D__STDC_CONSTANT_MACROS -D__STDC_FORMAT_MACROS -D__STDC_LIMIT_MACROS -Itools/lld/COFF -I/Users/buildslave/jenkins/workspace/lldb-cmake/llvm-project/lld/COFF -I/Users/buildslave/jenkins/workspace/lldb-cmake/llvm-project/lld/include -Itools/lld/include -I/Applications/Xcode.app/Contents/Developer/Platforms/MacOSX.platform/Developer/SDKs/MacOSX10.15.sdk/usr/include/libxml2 -Iinclude -I/Users/buildslave/jenkins/workspace/lldb-cmake/llvm-project/llvm/include -Wdocumentation -fPIC -fvisibility-inlines-hidden -Werror=date-time -Werror=unguarded-availability-new -fmodules -fmodules-cache-path=/Users/buildslave/jenkins/workspace/lldb-cmake/lldb-build/module.cache -fcxx-modules -Xclang -fmodules-local-submodule-visibility -Wall -Wextra -Wno-unused-parameter -Wwrite-strings -Wcast-qual -Wmissing-field-initializers -pedantic -Wno-long-long -Wimplicit-fallthrough -Wcovered-switch-default -Wno-noexcept-type -Wnon-virtual-dtor -Wdelete-non-virtual-dtor -Wsuggest-override -Wstring-conversion -fdiagnostics-color -O3  -isysroot /Applications/Xcode.app/Contents/Developer/Platforms/MacOSX.platform/Developer/SDKs/MacOSX10.15.sdk    -fno-exceptions -fno-rtti -UNDEBUG -std=c++14 -MD -MT tools/lld/COFF/CMakeFiles/lldCOFF.dir/SymbolTable.cpp.o -MF tools/lld/COFF/CMakeFiles/lldCOFF.dir/SymbolTable.cpp.o.d -o tools/lld/COFF/CMakeFiles/lldCOFF.dir/SymbolTable.cpp.o -c /Users/buildslave/jenkins/workspace/lldb-cmake/llvm-project/lld/COFF/SymbolTable.cpp
[5084/5150] /Users/buildslave/jenkins/workspace/lldb-cmake/host-compiler/bin/clang++  -DGTEST_HAS_RTTI=0 -D_DEBUG -D__STDC_CONSTANT_MACROS -D__STDC_FORMAT_MACROS -D__STDC_LIMIT_MACROS -Itools/lld/ELF -I/Users/buildslave/jenkins/workspace/lldb-cmake/llvm-project/lld/ELF -I/Users/buildslave/jenkins/workspace/lldb-cmake/llvm-project/lld/include -Itools/lld/include -I/Applications/Xcode.app/Contents/Developer/Platforms/MacOSX.platform/Developer/SDKs/MacOSX10.15.sdk/usr/include/libxml2 -Iinclude -I/Users/buildslave/jenkins/workspace/lldb-cmake/llvm-project/llvm/include -Wdocumentation -fPIC -fvisibility-inlines-hidden -Werror=date-time -Werror=unguarded-availability-new -fmodules -fmodules-cache-path=/Users/buildslave/jenkins/workspace/lldb-cmake/lldb-build/module.cache -fcxx-modules -Xclang -fmodules-local-submodule-visibility -Wall -Wextra -Wno-unused-parameter -Wwrite-strings -Wcast-qual -Wmissing-field-initializers -pedantic -Wno-long-long -Wimplicit-fallthrough -Wcovered-switch-default -Wno-noexcept-type -Wnon-virtual-dtor -Wdelete-non-virtual-dtor -Wsuggest-override -Wstring-conversion -fdiagnostics-color -O3  -isysroot /Applications/Xcode.app/Contents/Developer/Platforms/MacOSX.platform/Developer/SDKs/MacOSX10.15.sdk    -fno-exceptions -fno-rtti -UNDEBUG -std=c++14 -MD -MT tools/lld/ELF/CMakeFiles/lldELF.dir/Arch/MipsArchTree.cpp.o -MF tools/lld/ELF/CMakeFiles/lldELF.dir/Arch/MipsArchTree.cpp.o.d -o tools/lld/ELF/CMakeFiles/lldELF.dir/Arch/MipsArchTree.cpp.o -c /Users/buildslave/jenkins/workspace/lldb-cmake/llvm-project/lld/ELF/Arch/MipsArchTree.cpp
[5085/5150] /Users/buildslave/jenkins/workspace/lldb-cmake/host-compiler/bin/clang++  -DGTEST_HAS_RTTI=0 -D_DEBUG -D__STDC_CONSTANT_MACROS -D__STDC_FORMAT_MACROS -D__STDC_LIMIT_MACROS -Itools/lld/ELF -I/Users/buildslave/jenkins/workspace/lldb-cmake/llvm-project/lld/ELF -I/Users/buildslave/jenkins/workspace/lldb-cmake/llvm-project/lld/include -Itools/lld/include -I/Applications/Xcode.app/Contents/Developer/Platforms/MacOSX.platform/Developer/SDKs/MacOSX10.15.sdk/usr/include/libxml2 -Iinclude -I/Users/buildslave/jenkins/workspace/lldb-cmake/llvm-project/llvm/include -Wdocumentation -fPIC -fvisibility-inlines-hidden -Werror=date-time -Werror=unguarded-availability-new -fmodules -fmodules-cache-path=/Users/buildslave/jenkins/workspace/lldb-cmake/lldb-build/module.cache -fcxx-modules -Xclang -fmodules-local-submodule-visibility -Wall -Wextra -Wno-unused-parameter -Wwrite-strings -Wcast-qual -Wmissing-field-initializers -pedantic -Wno-long-long -Wimplicit-fallthrough -Wcovered-switch-default -Wno-noexcept-type -Wnon-virtual-dtor -Wdelete-non-virtual-dtor -Wsuggest-override -Wstring-conversion -fdiagnostics-color -O3  -isysroot /Applications/Xcode.app/Contents/Developer/Platforms/MacOSX.platform/Developer/SDKs/MacOSX10.15.sdk    -fno-exceptions -fno-rtti -UNDEBUG -std=c++14 -MD -MT tools/lld/ELF/CMakeFiles/lldELF.dir/Arch/SPARCV9.cpp.o -MF tools/lld/ELF/CMakeFiles/lldELF.dir/Arch/SPARCV9.cpp.o.d -o tools/lld/ELF/CMakeFiles/lldELF.dir/Arch/SPARCV9.cpp.o -c /Users/buildslave/jenkins/workspace/lldb-cmake/llvm-project/lld/ELF/Arch/SPARCV9.cpp
[5086/5150] /Users/buildslave/jenkins/workspace/lldb-cmake/host-compiler/bin/clang++  -DGTEST_HAS_RTTI=0 -D_DEBUG -D__STDC_CONSTANT_MACROS -D__STDC_FORMAT_MACROS -D__STDC_LIMIT_MACROS -Itools/lld/ELF -I/Users/buildslave/jenkins/workspace/lldb-cmake/llvm-project/lld/ELF -I/Users/buildslave/jenkins/workspace/lldb-cmake/llvm-project/lld/include -Itools/lld/include -I/Applications/Xcode.app/Contents/Developer/Platforms/MacOSX.platform/Developer/SDKs/MacOSX10.15.sdk/usr/include/libxml2 -Iinclude -I/Users/buildslave/jenkins/workspace/lldb-cmake/llvm-project/llvm/include -Wdocumentation -fPIC -fvisibility-inlines-hidden -Werror=date-time -Werror=unguarded-availability-new -fmodules -fmodules-cache-path=/Users/buildslave/jenkins/workspace/lldb-cmake/lldb-build/module.cache -fcxx-modules -Xclang -fmodules-local-submodule-visibility -Wall -Wextra -Wno-unused-parameter -Wwrite-strings -Wcast-qual -Wmissing-field-initializers -pedantic -Wno-long-long -Wimplicit-fallthrough -Wcovered-switch-default -Wno-noexcept-type -Wnon-virtual-dtor -Wdelete-non-virtual-dtor -Wsuggest-override -Wstring-conversion -fdiagnostics-color -O3  -isysroot /Applications/Xcode.app/Contents/Developer/Platforms/MacOSX.platform/Developer/SDKs/MacOSX10.15.sdk    -fno-exceptions -fno-rtti -UNDEBUG -std=c++14 -MD -MT tools/lld/ELF/CMakeFiles/lldELF.dir/Arch/RISCV.cpp.o -MF tools/lld/ELF/CMakeFiles/lldELF.dir/Arch/RISCV.cpp.o.d -o tools/lld/ELF/CMakeFiles/lldELF.dir/Arch/RISCV.cpp.o -c /Users/buildslave/jenkins/workspace/lldb-cmake/llvm-project/lld/ELF/Arch/RISCV.cpp
[5087/5150] /Users/buildslave/jenkins/workspace/lldb-cmake/host-compiler/bin/clang++  -DGTEST_HAS_RTTI=0 -D_DEBUG -D__STDC_CONSTANT_MACROS -D__STDC_FORMAT_MACROS -D__STDC_LIMIT_MACROS -Itools/lld/ELF -I/Users/buildslave/jenkins/workspace/lldb-cmake/llvm-project/lld/ELF -I/Users/buildslave/jenkins/workspace/lldb-cmake/llvm-project/lld/include -Itools/lld/include -I/Applications/Xcode.app/Contents/Developer/Platforms/MacOSX.platform/Developer/SDKs/MacOSX10.15.sdk/usr/include/libxml2 -Iinclude -I/Users/buildslave/jenkins/workspace/lldb-cmake/llvm-project/llvm/include -Wdocumentation -fPIC -fvisibility-inlines-hidden -Werror=date-time -Werror=unguarded-availability-new -fmodules -fmodules-cache-path=/Users/buildslave/jenkins/workspace/lldb-cmake/lldb-build/module.cache -fcxx-modules -Xclang -fmodules-local-submodule-visibility -Wall -Wextra -Wno-unused-parameter -Wwrite-strings -Wcast-qual -Wmissing-field-initializers -pedantic -Wno-long-long -Wimplicit-fallthrough -Wcovered-switch-default -Wno-noexcept-type -Wnon-virtual-dtor -Wdelete-non-virtual-dtor -Wsuggest-override -Wstring-conversion -fdiagnostics-color -O3  -isysroot /Applications/Xcode.app/Contents/Developer/Platforms/MacOSX.platform/Developer/SDKs/MacOSX10.15.sdk    -fno-exceptions -fno-rtti -UNDEBUG -std=c++14 -MD -MT tools/lld/ELF/CMakeFiles/lldELF.dir/Arch/X86.cpp.o -MF tools/lld/ELF/CMakeFiles/lldELF.dir/Arch/X86.cpp.o.d -o tools/lld/ELF/CMakeFiles/lldELF.dir/Arch/X86.cpp.o -c /Users/buildslave/jenkins/workspace/lldb-cmake/llvm-project/lld/ELF/Arch/X86.cpp
[5088/5150] /Users/buildslave/jenkins/workspace/lldb-cmake/host-compiler/bin/clang++  -DGTEST_HAS_RTTI=0 -D_DEBUG -D__STDC_CONSTANT_MACROS -D__STDC_FORMAT_MACROS -D__STDC_LIMIT_MACROS -Itools/lld/COFF -I/Users/buildslave/jenkins/workspace/lldb-cmake/llvm-project/lld/COFF -I/Users/buildslave/jenkins/workspace/lldb-cmake/llvm-project/lld/include -Itools/lld/include -I/Applications/Xcode.app/Contents/Developer/Platforms/MacOSX.platform/Developer/SDKs/MacOSX10.15.sdk/usr/include/libxml2 -Iinclude -I/Users/buildslave/jenkins/workspace/lldb-cmake/llvm-project/llvm/include -Wdocumentation -fPIC -fvisibility-inlines-hidden -Werror=date-time -Werror=unguarded-availability-new -fmodules -fmodules-cache-path=/Users/buildslave/jenkins/workspace/lldb-cmake/lldb-build/module.cache -fcxx-modules -Xclang -fmodules-local-submodule-visibility -Wall -Wextra -Wno-unused-parameter -Wwrite-strings -Wcast-qual -Wmissing-field-initializers -pedantic -Wno-long-long -Wimplicit-fallthrough -Wcovered-switch-default -Wno-noexcept-type -Wnon-virtual-dtor -Wdelete-non-virtual-dtor -Wsuggest-override -Wstring-conversion -fdiagnostics-color -O3  -isysroot /Applications/Xcode.app/Contents/Developer/Platforms/MacOSX.platform/Developer/SDKs/MacOSX10.15.sdk    -fno-exceptions -fno-rtti -UNDEBUG -std=c++14 -MD -MT tools/lld/COFF/CMakeFiles/lldCOFF.dir/PDB.cpp.o -MF tools/lld/COFF/CMakeFiles/lldCOFF.dir/PDB.cpp.o.d -o tools/lld/COFF/CMakeFiles/lldCOFF.dir/PDB.cpp.o -c /Users/buildslave/jenkins/workspace/lldb-cmake/llvm-project/lld/COFF/PDB.cpp
[5089/5150] /Users/buildslave/jenkins/workspace/lldb-cmake/host-compiler/bin/clang++  -DGTEST_HAS_RTTI=0 -D_DEBUG -D__STDC_CONSTANT_MACROS -D__STDC_FORMAT_MACROS -D__STDC_LIMIT_MACROS -Itools/lld/ELF -I/Users/buildslave/jenkins/workspace/lldb-cmake/llvm-project/lld/ELF -I/Users/buildslave/jenkins/workspace/lldb-cmake/llvm-project/lld/include -Itools/lld/include -I/Applications/Xcode.app/Contents/Developer/Platforms/MacOSX.platform/Developer/SDKs/MacOSX10.15.sdk/usr/include/libxml2 -Iinclude -I/Users/buildslave/jenkins/workspace/lldb-cmake/llvm-project/llvm/include -Wdocumentation -fPIC -fvisibility-inlines-hidden -Werror=date-time -Werror=unguarded-availability-new -fmodules -fmodules-cache-path=/Users/buildslave/jenkins/workspace/lldb-cmake/lldb-build/module.cache -fcxx-modules -Xclang -fmodules-local-submodule-visibility -Wall -Wextra -Wno-unused-parameter -Wwrite-strings -Wcast-qual -Wmissing-field-initializers -pedantic -Wno-long-long -Wimplicit-fallthrough -Wcovered-switch-default -Wno-noexcept-type -Wnon-virtual-dtor -Wdelete-non-virtual-dtor -Wsuggest-override -Wstring-conversion -fdiagnostics-color -O3  -isysroot /Applications/Xcode.app/Contents/Developer/Platforms/MacOSX.platform/Developer/SDKs/MacOSX10.15.sdk    -fno-exceptions -fno-rtti -UNDEBUG -std=c++14 -MD -MT tools/lld/ELF/CMakeFiles/lldELF.dir/Arch/X86_64.cpp.o -MF tools/lld/ELF/CMakeFiles/lldELF.dir/Arch/X86_64.cpp.o.d -o tools/lld/ELF/CMakeFiles/lldELF.dir/Arch/X86_64.cpp.o -c /Users/buildslave/jenkins/workspace/lldb-cmake/llvm-project/lld/ELF/Arch/X86_64.cpp
[5090/5150] /Users/buildslave/jenkins/workspace/lldb-cmake/host-compiler/bin/clang++  -DGTEST_HAS_RTTI=0 -D_DEBUG -D__STDC_CONSTANT_MACROS -D__STDC_FORMAT_MACROS -D__STDC_LIMIT_MACROS -Itools/lld/ELF -I/Users/buildslave/jenkins/workspace/lldb-cmake/llvm-project/lld/ELF -I/Users/buildslave/jenkins/workspace/lldb-cmake/llvm-project/lld/include -Itools/lld/include -I/Applications/Xcode.app/Contents/Developer/Platforms/MacOSX.platform/Developer/SDKs/MacOSX10.15.sdk/usr/include/libxml2 -Iinclude -I/Users/buildslave/jenkins/workspace/lldb-cmake/llvm-project/llvm/include -Wdocumentation -fPIC -fvisibility-inlines-hidden -Werror=date-time -Werror=unguarded-availability-new -fmodules -fmodules-cache-path=/Users/buildslave/jenkins/workspace/lldb-cmake/lldb-build/module.cache -fcxx-modules -Xclang -fmodules-local-submodule-visibility -Wall -Wextra -Wno-unused-parameter -Wwrite-strings -Wcast-qual -Wmissing-field-initializers -pedantic -Wno-long-long -Wimplicit-fallthrough -Wcovered-switch-default -Wno-noexcept-type -Wnon-virtual-dtor -Wdelete-non-virtual-dtor -Wsuggest-override -Wstring-conversion -fdiagnostics-color -O3  -isysroot /Applications/Xcode.app/Contents/Developer/Platforms/MacOSX.platform/Developer/SDKs/MacOSX10.15.sdk    -fno-exceptions -fno-rtti -UNDEBUG -std=c++14 -MD -MT tools/lld/ELF/CMakeFiles/lldELF.dir/Arch/PPC64.cpp.o -MF tools/lld/ELF/CMakeFiles/lldELF.dir/Arch/PPC64.cpp.o.d -o tools/lld/ELF/CMakeFiles/lldELF.dir/Arch/PPC64.cpp.o -c /Users/buildslave/jenkins/workspace/lldb-cmake/llvm-project/lld/ELF/Arch/PPC64.cpp
[5091/5150] /Users/buildslave/jenkins/workspace/lldb-cmake/host-compiler/bin/clang++  -DGTEST_HAS_RTTI=0 -D_DEBUG -D__STDC_CONSTANT_MACROS -D__STDC_FORMAT_MACROS -D__STDC_LIMIT_MACROS -Itools/lld/ELF -I/Users/buildslave/jenkins/workspace/lldb-cmake/llvm-project/lld/ELF -I/Users/buildslave/jenkins/workspace/lldb-cmake/llvm-project/lld/include -Itools/lld/include -I/Applications/Xcode.app/Contents/Developer/Platforms/MacOSX.platform/Developer/SDKs/MacOSX10.15.sdk/usr/include/libxml2 -Iinclude -I/Users/buildslave/jenkins/workspace/lldb-cmake/llvm-project/llvm/include -Wdocumentation -fPIC -fvisibility-inlines-hidden -Werror=date-time -Werror=unguarded-availability-new -fmodules -fmodules-cache-path=/Users/buildslave/jenkins/workspace/lldb-cmake/lldb-build/module.cache -fcxx-modules -Xclang -fmodules-local-submodule-visibility -Wall -Wextra -Wno-unused-parameter -Wwrite-strings -Wcast-qual -Wmissing-field-initializers -pedantic -Wno-long-long -Wimplicit-fallthrough -Wcovered-switch-default -Wno-noexcept-type -Wnon-virtual-dtor -Wdelete-non-virtual-dtor -Wsuggest-override -Wstring-conversion -fdiagnostics-color -O3  -isysroot /Applications/Xcode.app/Contents/Developer/Platforms/MacOSX.platform/Developer/SDKs/MacOSX10.15.sdk    -fno-exceptions -fno-rtti -UNDEBUG -std=c++14 -MD -MT tools/lld/ELF/CMakeFiles/lldELF.dir/EhFrame.cpp.o -MF tools/lld/ELF/CMakeFiles/lldELF.dir/EhFrame.cpp.o.d -o tools/lld/ELF/CMakeFiles/lldELF.dir/EhFrame.cpp.o -c /Users/buildslave/jenkins/workspace/lldb-cmake/llvm-project/lld/ELF/EhFrame.cpp
[5092/5150] /Users/buildslave/jenkins/workspace/lldb-cmake/host-compiler/bin/clang++  -DGTEST_HAS_RTTI=0 -D_DEBUG -D__STDC_CONSTANT_MACROS -D__STDC_FORMAT_MACROS -D__STDC_LIMIT_MACROS -Itools/lld/ELF -I/Users/buildslave/jenkins/workspace/lldb-cmake/llvm-project/lld/ELF -I/Users/buildslave/jenkins/workspace/lldb-cmake/llvm-project/lld/include -Itools/lld/include -I/Applications/Xcode.app/Contents/Developer/Platforms/MacOSX.platform/Developer/SDKs/MacOSX10.15.sdk/usr/include/libxml2 -Iinclude -I/Users/buildslave/jenkins/workspace/lldb-cmake/llvm-project/llvm/include -Wdocumentation -fPIC -fvisibility-inlines-hidden -Werror=date-time -Werror=unguarded-availability-new -fmodules -fmodules-cache-path=/Users/buildslave/jenkins/workspace/lldb-cmake/lldb-build/module.cache -fcxx-modules -Xclang -fmodules-local-submodule-visibility -Wall -Wextra -Wno-unused-parameter -Wwrite-strings -Wcast-qual -Wmissing-field-initializers -pedantic -Wno-long-long -Wimplicit-fallthrough -Wcovered-switch-default -Wno-noexcept-type -Wnon-virtual-dtor -Wdelete-non-virtual-dtor -Wsuggest-override -Wstring-conversion -fdiagnostics-color -O3  -isysroot /Applications/Xcode.app/Contents/Developer/Platforms/MacOSX.platform/Developer/SDKs/MacOSX10.15.sdk    -fno-exceptions -fno-rtti -UNDEBUG -std=c++14 -MD -MT tools/lld/ELF/CMakeFiles/lldELF.dir/DriverUtils.cpp.o -MF tools/lld/ELF/CMakeFiles/lldELF.dir/DriverUtils.cpp.o.d -o tools/lld/ELF/CMakeFiles/lldELF.dir/DriverUtils.cpp.o -c /Users/buildslave/jenkins/workspace/lldb-cmake/llvm-project/lld/ELF/DriverUtils.cpp
[5093/5150] /Users/buildslave/jenkins/workspace/lldb-cmake/host-compiler/bin/clang++  -DGTEST_HAS_RTTI=0 -D_DEBUG -D__STDC_CONSTANT_MACROS -D__STDC_FORMAT_MACROS -D__STDC_LIMIT_MACROS -Itools/lld/COFF -I/Users/buildslave/jenkins/workspace/lldb-cmake/llvm-project/lld/COFF -I/Users/buildslave/jenkins/workspace/lldb-cmake/llvm-project/lld/include -Itools/lld/include -I/Applications/Xcode.app/Contents/Developer/Platforms/MacOSX.platform/Developer/SDKs/MacOSX10.15.sdk/usr/include/libxml2 -Iinclude -I/Users/buildslave/jenkins/workspace/lldb-cmake/llvm-project/llvm/include -Wdocumentation -fPIC -fvisibility-inlines-hidden -Werror=date-time -Werror=unguarded-availability-new -fmodules -fmodules-cache-path=/Users/buildslave/jenkins/workspace/lldb-cmake/lldb-build/module.cache -fcxx-modules -Xclang -fmodules-local-submodule-visibility -Wall -Wextra -Wno-unused-parameter -Wwrite-strings -Wcast-qual -Wmissing-field-initializers -pedantic -Wno-long-long -Wimplicit-fallthrough -Wcovered-switch-default -Wno-noexcept-type -Wnon-virtual-dtor -Wdelete-non-virtual-dtor -Wsuggest-override -Wstring-conversion -fdiagnostics-color -O3  -isysroot /Applications/Xcode.app/Contents/Developer/Platforms/MacOSX.platform/Developer/SDKs/MacOSX10.15.sdk    -fno-exceptions -fno-rtti -UNDEBUG -std=c++14 -MD -MT tools/lld/COFF/CMakeFiles/lldCOFF.dir/Driver.cpp.o -MF tools/lld/COFF/CMakeFiles/lldCOFF.dir/Driver.cpp.o.d -o tools/lld/COFF/CMakeFiles/lldCOFF.dir/Driver.cpp.o -c /Users/buildslave/jenkins/workspace/lldb-cmake/llvm-project/lld/COFF/Driver.cpp
[5094/5150] /Users/buildslave/jenkins/workspace/lldb-cmake/host-compiler/bin/clang++  -DGTEST_HAS_RTTI=0 -D_DEBUG -D__STDC_CONSTANT_MACROS -D__STDC_FORMAT_MACROS -D__STDC_LIMIT_MACROS -Itools/lld/ELF -I/Users/buildslave/jenkins/workspace/lldb-cmake/llvm-project/lld/ELF -I/Users/buildslave/jenkins/workspace/lldb-cmake/llvm-project/lld/include -Itools/lld/include -I/Applications/Xcode.app/Contents/Developer/Platforms/MacOSX.platform/Developer/SDKs/MacOSX10.15.sdk/usr/include/libxml2 -Iinclude -I/Users/buildslave/jenkins/workspace/lldb-cmake/llvm-project/llvm/include -Wdocumentation -fPIC -fvisibility-inlines-hidden -Werror=date-time -Werror=unguarded-availability-new -fmodules -fmodules-cache-path=/Users/buildslave/jenkins/workspace/lldb-cmake/lldb-build/module.cache -fcxx-modules -Xclang -fmodules-local-submodule-visibility -Wall -Wextra -Wno-unused-parameter -Wwrite-strings -Wcast-qual -Wmissing-field-initializers -pedantic -Wno-long-long -Wimplicit-fallthrough -Wcovered-switch-default -Wno-noexcept-type -Wnon-virtual-dtor -Wdelete-non-virtual-dtor -Wsuggest-override -Wstring-conversion -fdiagnostics-color -O3  -isysroot /Applications/Xcode.app/Contents/Developer/Platforms/MacOSX.platform/Developer/SDKs/MacOSX10.15.sdk    -fno-exceptions -fno-rtti -UNDEBUG -std=c++14 -MD -MT tools/lld/ELF/CMakeFiles/lldELF.dir/CallGraphSort.cpp.o -MF tools/lld/ELF/CMakeFiles/lldELF.dir/CallGraphSort.cpp.o.d -o tools/lld/ELF/CMakeFiles/lldELF.dir/CallGraphSort.cpp.o -c /Users/buildslave/jenkins/workspace/lldb-cmake/llvm-project/lld/ELF/CallGraphSort.cpp
[5095/5150] /Users/buildslave/jenkins/workspace/lldb-cmake/host-compiler/bin/clang++  -DGTEST_HAS_RTTI=0 -D_DEBUG -D__STDC_CONSTANT_MACROS -D__STDC_FORMAT_MACROS -D__STDC_LIMIT_MACROS -Itools/lld/ELF -I/Users/buildslave/jenkins/workspace/lldb-cmake/llvm-project/lld/ELF -I/Users/buildslave/jenkins/workspace/lldb-cmake/llvm-project/lld/include -Itools/lld/include -I/Applications/Xcode.app/Contents/Developer/Platforms/MacOSX.platform/Developer/SDKs/MacOSX10.15.sdk/usr/include/libxml2 -Iinclude -I/Users/buildslave/jenkins/workspace/lldb-cmake/llvm-project/llvm/include -Wdocumentation -fPIC -fvisibility-inlines-hidden -Werror=date-time -Werror=unguarded-availability-new -fmodules -fmodules-cache-path=/Users/buildslave/jenkins/workspace/lldb-cmake/lldb-build/module.cache -fcxx-modules -Xclang -fmodules-local-submodule-visibility -Wall -Wextra -Wno-unused-parameter -Wwrite-strings -Wcast-qual -Wmissing-field-initializers -pedantic -Wno-long-long -Wimplicit-fallthrough -Wcovered-switch-default -Wno-noexcept-type -Wnon-virtual-dtor -Wdelete-non-virtual-dtor -Wsuggest-override -Wstring-conversion -fdiagnostics-color -O3  -isysroot /Applications/Xcode.app/Contents/Developer/Platforms/MacOSX.platform/Developer/SDKs/MacOSX10.15.sdk    -fno-exceptions -fno-rtti -UNDEBUG -std=c++14 -MD -MT tools/lld/ELF/CMakeFiles/lldELF.dir/DWARF.cpp.o -MF tools/lld/ELF/CMakeFiles/lldELF.dir/DWARF.cpp.o.d -o tools/lld/ELF/CMakeFiles/lldELF.dir/DWARF.cpp.o -c /Users/buildslave/jenkins/workspace/lldb-cmake/llvm-project/lld/ELF/DWARF.cpp
[5096/5150] /Users/buildslave/jenkins/workspace/lldb-cmake/host-compiler/bin/clang++  -DGTEST_HAS_RTTI=0 -D_DEBUG -D__STDC_CONSTANT_MACROS -D__STDC_FORMAT_MACROS -D__STDC_LIMIT_MACROS -Itools/lld/ELF -I/Users/buildslave/jenkins/workspace/lldb-cmake/llvm-project/lld/ELF -I/Users/buildslave/jenkins/workspace/lldb-cmake/llvm-project/lld/include -Itools/lld/include -I/Applications/Xcode.app/Contents/Developer/Platforms/MacOSX.platform/Developer/SDKs/MacOSX10.15.sdk/usr/include/libxml2 -Iinclude -I/Users/buildslave/jenkins/workspace/lldb-cmake/llvm-project/llvm/include -Wdocumentation -fPIC -fvisibility-inlines-hidden -Werror=date-time -Werror=unguarded-availability-new -fmodules -fmodules-cache-path=/Users/buildslave/jenkins/workspace/lldb-cmake/lldb-build/module.cache -fcxx-modules -Xclang -fmodules-local-submodule-visibility -Wall -Wextra -Wno-unused-parameter -Wwrite-strings -Wcast-qual -Wmissing-field-initializers -pedantic -Wno-long-long -Wimplicit-fallthrough -Wcovered-switch-default -Wno-noexcept-type -Wnon-virtual-dtor -Wdelete-non-virtual-dtor -Wsuggest-override -Wstring-conversion -fdiagnostics-color -O3  -isysroot /Applications/Xcode.app/Contents/Developer/Platforms/MacOSX.platform/Developer/SDKs/MacOSX10.15.sdk    -fno-exceptions -fno-rtti -UNDEBUG -std=c++14 -MD -MT tools/lld/ELF/CMakeFiles/lldELF.dir/ARMErrataFix.cpp.o -MF tools/lld/ELF/CMakeFiles/lldELF.dir/ARMErrataFix.cpp.o.d -o tools/lld/ELF/CMakeFiles/lldELF.dir/ARMErrataFix.cpp.o -c /Users/buildslave/jenkins/workspace/lldb-cmake/llvm-project/lld/ELF/ARMErrataFix.cpp
[5097/5150] /Users/buildslave/jenkins/workspace/lldb-cmake/host-compiler/bin/clang++  -DGTEST_HAS_RTTI=0 -D_DEBUG -D__STDC_CONSTANT_MACROS -D__STDC_FORMAT_MACROS -D__STDC_LIMIT_MACROS -Itools/lld/COFF -I/Users/buildslave/jenkins/workspace/lldb-cmake/llvm-project/lld/COFF -I/Users/buildslave/jenkins/workspace/lldb-cmake/llvm-project/lld/include -Itools/lld/include -I/Applications/Xcode.app/Contents/Developer/Platforms/MacOSX.platform/Developer/SDKs/MacOSX10.15.sdk/usr/include/libxml2 -Iinclude -I/Users/buildslave/jenkins/workspace/lldb-cmake/llvm-project/llvm/include -Wdocumentation -fPIC -fvisibility-inlines-hidden -Werror=date-time -Werror=unguarded-availability-new -fmodules -fmodules-cache-path=/Users/buildslave/jenkins/workspace/lldb-cmake/lldb-build/module.cache -fcxx-modules -Xclang -fmodules-local-submodule-visibility -Wall -Wextra -Wno-unused-parameter -Wwrite-strings -Wcast-qual -Wmissing-field-initializers -pedantic -Wno-long-long -Wimplicit-fallthrough -Wcovered-switch-default -Wno-noexcept-type -Wnon-virtual-dtor -Wdelete-non-virtual-dtor -Wsuggest-override -Wstring-conversion -fdiagnostics-color -O3  -isysroot /Applications/Xcode.app/Contents/Developer/Platforms/MacOSX.platform/Developer/SDKs/MacOSX10.15.sdk    -fno-exceptions -fno-rtti -UNDEBUG -std=c++14 -MD -MT tools/lld/COFF/CMakeFiles/lldCOFF.dir/Writer.cpp.o -MF tools/lld/COFF/CMakeFiles/lldCOFF.dir/Writer.cpp.o.d -o tools/lld/COFF/CMakeFiles/lldCOFF.dir/Writer.cpp.o -c /Users/buildslave/jenkins/workspace/lldb-cmake/llvm-project/lld/COFF/Writer.cpp
[5098/5150] : && "/Applications/Xcode.app/Contents/Developer/Toolchains/XcodeDefault.xctoolchain/usr/bin/libtool" -static -no_warning_for_no_symbols -o lib/liblldCOFF.a  tools/lld/COFF/CMakeFiles/lldCOFF.dir/CallGraphSort.cpp.o tools/lld/COFF/CMakeFiles/lldCOFF.dir/Chunks.cpp.o tools/lld/COFF/CMakeFiles/lldCOFF.dir/DebugTypes.cpp.o tools/lld/COFF/CMakeFiles/lldCOFF.dir/DLL.cpp.o tools/lld/COFF/CMakeFiles/lldCOFF.dir/Driver.cpp.o tools/lld/COFF/CMakeFiles/lldCOFF.dir/DriverUtils.cpp.o tools/lld/COFF/CMakeFiles/lldCOFF.dir/ICF.cpp.o tools/lld/COFF/CMakeFiles/lldCOFF.dir/InputFiles.cpp.o tools/lld/COFF/CMakeFiles/lldCOFF.dir/LLDMapFile.cpp.o tools/lld/COFF/CMakeFiles/lldCOFF.dir/LTO.cpp.o tools/lld/COFF/CMakeFiles/lldCOFF.dir/MapFile.cpp.o tools/lld/COFF/CMakeFiles/lldCOFF.dir/MarkLive.cpp.o tools/lld/COFF/CMakeFiles/lldCOFF.dir/MinGW.cpp.o tools/lld/COFF/CMakeFiles/lldCOFF.dir/PDB.cpp.o tools/lld/COFF/CMakeFiles/lldCOFF.dir/SymbolTable.cpp.o tools/lld/COFF/CMakeFiles/lldCOFF.dir/Symbols.cpp.o tools/lld/COFF/CMakeFiles/lldCOFF.dir/Writer.cpp.o && :
[5099/5150] /Users/buildslave/jenkins/workspace/lldb-cmake/host-compiler/bin/clang++  -DGTEST_HAS_RTTI=0 -D_DEBUG -D__STDC_CONSTANT_MACROS -D__STDC_FORMAT_MACROS -D__STDC_LIMIT_MACROS -Itools/lld/ELF -I/Users/buildslave/jenkins/workspace/lldb-cmake/llvm-project/lld/ELF -I/Users/buildslave/jenkins/workspace/lldb-cmake/llvm-project/lld/include -Itools/lld/include -I/Applications/Xcode.app/Contents/Developer/Platforms/MacOSX.platform/Developer/SDKs/MacOSX10.15.sdk/usr/include/libxml2 -Iinclude -I/Users/buildslave/jenkins/workspace/lldb-cmake/llvm-project/llvm/include -Wdocumentation -fPIC -fvisibility-inlines-hidden -Werror=date-time -Werror=unguarded-availability-new -fmodules -fmodules-cache-path=/Users/buildslave/jenkins/workspace/lldb-cmake/lldb-build/module.cache -fcxx-modules -Xclang -fmodules-local-submodule-visibility -Wall -Wextra -Wno-unused-parameter -Wwrite-strings -Wcast-qual -Wmissing-field-initializers -pedantic -Wno-long-long -Wimplicit-fallthrough -Wcovered-switch-default -Wno-noexcept-type -Wnon-virtual-dtor -Wdelete-non-virtual-dtor -Wsuggest-override -Wstring-conversion -fdiagnostics-color -O3  -isysroot /Applications/Xcode.app/Contents/Developer/Platforms/MacOSX.platform/Developer/SDKs/MacOSX10.15.sdk    -fno-exceptions -fno-rtti -UNDEBUG -std=c++14 -MD -MT tools/lld/ELF/CMakeFiles/lldELF.dir/MarkLive.cpp.o -MF tools/lld/ELF/CMakeFiles/lldELF.dir/MarkLive.cpp.o.d -o tools/lld/ELF/CMakeFiles/lldELF.dir/MarkLive.cpp.o -c /Users/buildslave/jenkins/workspace/lldb-cmake/llvm-project/lld/ELF/MarkLive.cpp
[5100/5150] /Users/buildslave/jenkins/workspace/lldb-cmake/host-compiler/bin/clang++  -DGTEST_HAS_RTTI=0 -D_DEBUG -D__STDC_CONSTANT_MACROS -D__STDC_FORMAT_MACROS -D__STDC_LIMIT_MACROS -Itools/lld/ELF -I/Users/buildslave/jenkins/workspace/lldb-cmake/llvm-project/lld/ELF -I/Users/buildslave/jenkins/workspace/lldb-cmake/llvm-project/lld/include -Itools/lld/include -I/Applications/Xcode.app/Contents/Developer/Platforms/MacOSX.platform/Developer/SDKs/MacOSX10.15.sdk/usr/include/libxml2 -Iinclude -I/Users/buildslave/jenkins/workspace/lldb-cmake/llvm-project/llvm/include -Wdocumentation -fPIC -fvisibility-inlines-hidden -Werror=date-time -Werror=unguarded-availability-new -fmodules -fmodules-cache-path=/Users/buildslave/jenkins/workspace/lldb-cmake/lldb-build/module.cache -fcxx-modules -Xclang -fmodules-local-submodule-visibility -Wall -Wextra -Wno-unused-parameter -Wwrite-strings -Wcast-qual -Wmissing-field-initializers -pedantic -Wno-long-long -Wimplicit-fallthrough -Wcovered-switch-default -Wno-noexcept-type -Wnon-virtual-dtor -Wdelete-non-virtual-dtor -Wsuggest-override -Wstring-conversion -fdiagnostics-color -O3  -isysroot /Applications/Xcode.app/Contents/Developer/Platforms/MacOSX.platform/Developer/SDKs/MacOSX10.15.sdk    -fno-exceptions -fno-rtti -UNDEBUG -std=c++14 -MD -MT tools/lld/ELF/CMakeFiles/lldELF.dir/MapFile.cpp.o -MF tools/lld/ELF/CMakeFiles/lldELF.dir/MapFile.cpp.o.d -o tools/lld/ELF/CMakeFiles/lldELF.dir/MapFile.cpp.o -c /Users/buildslave/jenkins/workspace/lldb-cmake/llvm-project/lld/ELF/MapFile.cpp
[5101/5150] /Users/buildslave/jenkins/workspace/lldb-cmake/host-compiler/bin/clang++  -DGTEST_HAS_RTTI=0 -D_DEBUG -D__STDC_CONSTANT_MACROS -D__STDC_FORMAT_MACROS -D__STDC_LIMIT_MACROS -Itools/lld/ELF -I/Users/buildslave/jenkins/workspace/lldb-cmake/llvm-project/lld/ELF -I/Users/buildslave/jenkins/workspace/lldb-cmake/llvm-project/lld/include -Itools/lld/include -I/Applications/Xcode.app/Contents/Developer/Platforms/MacOSX.platform/Developer/SDKs/MacOSX10.15.sdk/usr/include/libxml2 -Iinclude -I/Users/buildslave/jenkins/workspace/lldb-cmake/llvm-project/llvm/include -Wdocumentation -fPIC -fvisibility-inlines-hidden -Werror=date-time -Werror=unguarded-availability-new -fmodules -fmodules-cache-path=/Users/buildslave/jenkins/workspace/lldb-cmake/lldb-build/module.cache -fcxx-modules -Xclang -fmodules-local-submodule-visibility -Wall -Wextra -Wno-unused-parameter -Wwrite-strings -Wcast-qual -Wmissing-field-initializers -pedantic -Wno-long-long -Wimplicit-fallthrough -Wcovered-switch-default -Wno-noexcept-type -Wnon-virtual-dtor -Wdelete-non-virtual-dtor -Wsuggest-override -Wstring-conversion -fdiagnostics-color -O3  -isysroot /Applications/Xcode.app/Contents/Developer/Platforms/MacOSX.platform/Developer/SDKs/MacOSX10.15.sdk    -fno-exceptions -fno-rtti -UNDEBUG -std=c++14 -MD -MT tools/lld/ELF/CMakeFiles/lldELF.dir/ScriptLexer.cpp.o -MF tools/lld/ELF/CMakeFiles/lldELF.dir/ScriptLexer.cpp.o.d -o tools/lld/ELF/CMakeFiles/lldELF.dir/ScriptLexer.cpp.o -c /Users/buildslave/jenkins/workspace/lldb-cmake/llvm-project/lld/ELF/ScriptLexer.cpp
[5102/5150] /Users/buildslave/jenkins/workspace/lldb-cmake/host-compiler/bin/clang++  -DGTEST_HAS_RTTI=0 -D_DEBUG -D__STDC_CONSTANT_MACROS -D__STDC_FORMAT_MACROS -D__STDC_LIMIT_MACROS -Itools/lld/ELF -I/Users/buildslave/jenkins/workspace/lldb-cmake/llvm-project/lld/ELF -I/Users/buildslave/jenkins/workspace/lldb-cmake/llvm-project/lld/include -Itools/lld/include -I/Applications/Xcode.app/Contents/Developer/Platforms/MacOSX.platform/Developer/SDKs/MacOSX10.15.sdk/usr/include/libxml2 -Iinclude -I/Users/buildslave/jenkins/workspace/lldb-cmake/llvm-project/llvm/include -Wdocumentation -fPIC -fvisibility-inlines-hidden -Werror=date-time -Werror=unguarded-availability-new -fmodules -fmodules-cache-path=/Users/buildslave/jenkins/workspace/lldb-cmake/lldb-build/module.cache -fcxx-modules -Xclang -fmodules-local-submodule-visibility -Wall -Wextra -Wno-unused-parameter -Wwrite-strings -Wcast-qual -Wmissing-field-initializers -pedantic -Wno-long-long -Wimplicit-fallthrough -Wcovered-switch-default -Wno-noexcept-type -Wnon-virtual-dtor -Wdelete-non-virtual-dtor -Wsuggest-override -Wstring-conversion -fdiagnostics-color -O3  -isysroot /Applications/Xcode.app/Contents/Developer/Platforms/MacOSX.platform/Developer/SDKs/MacOSX10.15.sdk    -fno-exceptions -fno-rtti -UNDEBUG -std=c++14 -MD -MT tools/lld/ELF/CMakeFiles/lldELF.dir/LinkerScript.cpp.o -MF tools/lld/ELF/CMakeFiles/lldELF.dir/LinkerScript.cpp.o.d -o tools/lld/ELF/CMakeFiles/lldELF.dir/LinkerScript.cpp.o -c /Users/buildslave/jenkins/workspace/lldb-cmake/llvm-project/lld/ELF/LinkerScript.cpp
[5103/5150] /Users/buildslave/jenkins/workspace/lldb-cmake/host-compiler/bin/clang++  -DGTEST_HAS_RTTI=0 -D_DEBUG -D__STDC_CONSTANT_MACROS -D__STDC_FORMAT_MACROS -D__STDC_LIMIT_MACROS -Itools/lld/ELF -I/Users/buildslave/jenkins/workspace/lldb-cmake/llvm-project/lld/ELF -I/Users/buildslave/jenkins/workspace/lldb-cmake/llvm-project/lld/include -Itools/lld/include -I/Applications/Xcode.app/Contents/Developer/Platforms/MacOSX.platform/Developer/SDKs/MacOSX10.15.sdk/usr/include/libxml2 -Iinclude -I/Users/buildslave/jenkins/workspace/lldb-cmake/llvm-project/llvm/include -Wdocumentation -fPIC -fvisibility-inlines-hidden -Werror=date-time -Werror=unguarded-availability-new -fmodules -fmodules-cache-path=/Users/buildslave/jenkins/workspace/lldb-cmake/lldb-build/module.cache -fcxx-modules -Xclang -fmodules-local-submodule-visibility -Wall -Wextra -Wno-unused-parameter -Wwrite-strings -Wcast-qual -Wmissing-field-initializers -pedantic -Wno-long-long -Wimplicit-fallthrough -Wcovered-switch-default -Wno-noexcept-type -Wnon-virtual-dtor -Wdelete-non-virtual-dtor -Wsuggest-override -Wstring-conversion -fdiagnostics-color -O3  -isysroot /Applications/Xcode.app/Contents/Developer/Platforms/MacOSX.platform/Developer/SDKs/MacOSX10.15.sdk    -fno-exceptions -fno-rtti -UNDEBUG -std=c++14 -MD -MT tools/lld/ELF/CMakeFiles/lldELF.dir/LTO.cpp.o -MF tools/lld/ELF/CMakeFiles/lldELF.dir/LTO.cpp.o.d -o tools/lld/ELF/CMakeFiles/lldELF.dir/LTO.cpp.o -c /Users/buildslave/jenkins/workspace/lldb-cmake/llvm-project/lld/ELF/LTO.cpp
[5104/5150] /Users/buildslave/jenkins/workspace/lldb-cmake/host-compiler/bin/clang++  -DGTEST_HAS_RTTI=0 -D_DEBUG -D__STDC_CONSTANT_MACROS -D__STDC_FORMAT_MACROS -D__STDC_LIMIT_MACROS -Itools/lld/ELF -I/Users/buildslave/jenkins/workspace/lldb-cmake/llvm-project/lld/ELF -I/Users/buildslave/jenkins/workspace/lldb-cmake/llvm-project/lld/include -Itools/lld/include -I/Applications/Xcode.app/Contents/Developer/Platforms/MacOSX.platform/Developer/SDKs/MacOSX10.15.sdk/usr/include/libxml2 -Iinclude -I/Users/buildslave/jenkins/workspace/lldb-cmake/llvm-project/llvm/include -Wdocumentation -fPIC -fvisibility-inlines-hidden -Werror=date-time -Werror=unguarded-availability-new -fmodules -fmodules-cache-path=/Users/buildslave/jenkins/workspace/lldb-cmake/lldb-build/module.cache -fcxx-modules -Xclang -fmodules-local-submodule-visibility -Wall -Wextra -Wno-unused-parameter -Wwrite-strings -Wcast-qual -Wmissing-field-initializers -pedantic -Wno-long-long -Wimplicit-fallthrough -Wcovered-switch-default -Wno-noexcept-type -Wnon-virtual-dtor -Wdelete-non-virtual-dtor -Wsuggest-override -Wstring-conversion -fdiagnostics-color -O3  -isysroot /Applications/Xcode.app/Contents/Developer/Platforms/MacOSX.platform/Developer/SDKs/MacOSX10.15.sdk    -fno-exceptions -fno-rtti -UNDEBUG -std=c++14 -MD -MT tools/lld/ELF/CMakeFiles/lldELF.dir/SymbolTable.cpp.o -MF tools/lld/ELF/CMakeFiles/lldELF.dir/SymbolTable.cpp.o.d -o tools/lld/ELF/CMakeFiles/lldELF.dir/SymbolTable.cpp.o -c /Users/buildslave/jenkins/workspace/lldb-cmake/llvm-project/lld/ELF/SymbolTable.cpp
[5105/5150] /Users/buildslave/jenkins/workspace/lldb-cmake/host-compiler/bin/clang++  -DGTEST_HAS_RTTI=0 -D_DEBUG -D__STDC_CONSTANT_MACROS -D__STDC_FORMAT_MACROS -D__STDC_LIMIT_MACROS -Itools/lld/ELF -I/Users/buildslave/jenkins/workspace/lldb-cmake/llvm-project/lld/ELF -I/Users/buildslave/jenkins/workspace/lldb-cmake/llvm-project/lld/include -Itools/lld/include -I/Applications/Xcode.app/Contents/Developer/Platforms/MacOSX.platform/Developer/SDKs/MacOSX10.15.sdk/usr/include/libxml2 -Iinclude -I/Users/buildslave/jenkins/workspace/lldb-cmake/llvm-project/llvm/include -Wdocumentation -fPIC -fvisibility-inlines-hidden -Werror=date-time -Werror=unguarded-availability-new -fmodules -fmodules-cache-path=/Users/buildslave/jenkins/workspace/lldb-cmake/lldb-build/module.cache -fcxx-modules -Xclang -fmodules-local-submodule-visibility -Wall -Wextra -Wno-unused-parameter -Wwrite-strings -Wcast-qual -Wmissing-field-initializers -pedantic -Wno-long-long -Wimplicit-fallthrough -Wcovered-switch-default -Wno-noexcept-type -Wnon-virtual-dtor -Wdelete-non-virtual-dtor -Wsuggest-override -Wstring-conversion -fdiagnostics-color -O3  -isysroot /Applications/Xcode.app/Contents/Developer/Platforms/MacOSX.platform/Developer/SDKs/MacOSX10.15.sdk    -fno-exceptions -fno-rtti -UNDEBUG -std=c++14 -MD -MT tools/lld/ELF/CMakeFiles/lldELF.dir/InputSection.cpp.o -MF tools/lld/ELF/CMakeFiles/lldELF.dir/InputSection.cpp.o.d -o tools/lld/ELF/CMakeFiles/lldELF.dir/InputSection.cpp.o -c /Users/buildslave/jenkins/workspace/lldb-cmake/llvm-project/lld/ELF/InputSection.cpp
[5106/5150] /Users/buildslave/jenkins/workspace/lldb-cmake/host-compiler/bin/clang++  -DGTEST_HAS_RTTI=0 -D_DEBUG -D__STDC_CONSTANT_MACROS -D__STDC_FORMAT_MACROS -D__STDC_LIMIT_MACROS -Itools/lld/ELF -I/Users/buildslave/jenkins/workspace/lldb-cmake/llvm-project/lld/ELF -I/Users/buildslave/jenkins/workspace/lldb-cmake/llvm-project/lld/include -Itools/lld/include -I/Applications/Xcode.app/Contents/Developer/Platforms/MacOSX.platform/Developer/SDKs/MacOSX10.15.sdk/usr/include/libxml2 -Iinclude -I/Users/buildslave/jenkins/workspace/lldb-cmake/llvm-project/llvm/include -Wdocumentation -fPIC -fvisibility-inlines-hidden -Werror=date-time -Werror=unguarded-availability-new -fmodules -fmodules-cache-path=/Users/buildslave/jenkins/workspace/lldb-cmake/lldb-build/module.cache -fcxx-modules -Xclang -fmodules-local-submodule-visibility -Wall -Wextra -Wno-unused-parameter -Wwrite-strings -Wcast-qual -Wmissing-field-initializers -pedantic -Wno-long-long -Wimplicit-fallthrough -Wcovered-switch-default -Wno-noexcept-type -Wnon-virtual-dtor -Wdelete-non-virtual-dtor -Wsuggest-override -Wstring-conversion -fdiagnostics-color -O3  -isysroot /Applications/Xcode.app/Contents/Developer/Platforms/MacOSX.platform/Developer/SDKs/MacOSX10.15.sdk    -fno-exceptions -fno-rtti -UNDEBUG -std=c++14 -MD -MT tools/lld/ELF/CMakeFiles/lldELF.dir/ICF.cpp.o -MF tools/lld/ELF/CMakeFiles/lldELF.dir/ICF.cpp.o.d -o tools/lld/ELF/CMakeFiles/lldELF.dir/ICF.cpp.o -c /Users/buildslave/jenkins/workspace/lldb-cmake/llvm-project/lld/ELF/ICF.cpp
[5107/5150] /Users/buildslave/jenkins/workspace/lldb-cmake/host-compiler/bin/clang++  -DGTEST_HAS_RTTI=0 -D_DEBUG -D__STDC_CONSTANT_MACROS -D__STDC_FORMAT_MACROS -D__STDC_LIMIT_MACROS -Itools/lld/ELF -I/Users/buildslave/jenkins/workspace/lldb-cmake/llvm-project/lld/ELF -I/Users/buildslave/jenkins/workspace/lldb-cmake/llvm-project/lld/include -Itools/lld/include -I/Applications/Xcode.app/Contents/Developer/Platforms/MacOSX.platform/Developer/SDKs/MacOSX10.15.sdk/usr/include/libxml2 -Iinclude -I/Users/buildslave/jenkins/workspace/lldb-cmake/llvm-project/llvm/include -Wdocumentation -fPIC -fvisibility-inlines-hidden -Werror=date-time -Werror=unguarded-availability-new -fmodules -fmodules-cache-path=/Users/buildslave/jenkins/workspace/lldb-cmake/lldb-build/module.cache -fcxx-modules -Xclang -fmodules-local-submodule-visibility -Wall -Wextra -Wno-unused-parameter -Wwrite-strings -Wcast-qual -Wmissing-field-initializers -pedantic -Wno-long-long -Wimplicit-fallthrough -Wcovered-switch-default -Wno-noexcept-type -Wnon-virtual-dtor -Wdelete-non-virtual-dtor -Wsuggest-override -Wstring-conversion -fdiagnostics-color -O3  -isysroot /Applications/Xcode.app/Contents/Developer/Platforms/MacOSX.platform/Developer/SDKs/MacOSX10.15.sdk    -fno-exceptions -fno-rtti -UNDEBUG -std=c++14 -MD -MT tools/lld/ELF/CMakeFiles/lldELF.dir/Symbols.cpp.o -MF tools/lld/ELF/CMakeFiles/lldELF.dir/Symbols.cpp.o.d -o tools/lld/ELF/CMakeFiles/lldELF.dir/Symbols.cpp.o -c /Users/buildslave/jenkins/workspace/lldb-cmake/llvm-project/lld/ELF/Symbols.cpp
[5108/5150] cd /Users/buildslave/jenkins/workspace/lldb-cmake/lldb-build && /Users/buildslave/jenkins/workspace/lldb-cmake/lldb-build/bin/llvm-tblgen -gen-opt-parser-defs -I /Users/buildslave/jenkins/workspace/lldb-cmake/llvm-project/lld/MachO -I /Users/buildslave/jenkins/workspace/lldb-cmake/llvm-project/lld/include -I /Users/buildslave/jenkins/workspace/lldb-cmake/lldb-build/tools/lld/include -I /Applications/Xcode.app/Contents/Developer/Platforms/MacOSX.platform/Developer/SDKs/MacOSX10.15.sdk/usr/include/libxml2 -I /Users/buildslave/jenkins/workspace/lldb-cmake/lldb-build/include -I /Users/buildslave/jenkins/workspace/lldb-cmake/llvm-project/llvm/include /Users/buildslave/jenkins/workspace/lldb-cmake/llvm-project/lld/MachO/Options.td --write-if-changed -o tools/lld/MachO/Options.inc -d tools/lld/MachO/Options.inc.d
[5109/5150] /Users/buildslave/jenkins/workspace/lldb-cmake/host-compiler/bin/clang++  -DGTEST_HAS_RTTI=0 -D_DEBUG -D__STDC_CONSTANT_MACROS -D__STDC_FORMAT_MACROS -D__STDC_LIMIT_MACROS -Itools/lld/ELF -I/Users/buildslave/jenkins/workspace/lldb-cmake/llvm-project/lld/ELF -I/Users/buildslave/jenkins/workspace/lldb-cmake/llvm-project/lld/include -Itools/lld/include -I/Applications/Xcode.app/Contents/Developer/Platforms/MacOSX.platform/Developer/SDKs/MacOSX10.15.sdk/usr/include/libxml2 -Iinclude -I/Users/buildslave/jenkins/workspace/lldb-cmake/llvm-project/llvm/include -Wdocumentation -fPIC -fvisibility-inlines-hidden -Werror=date-time -Werror=unguarded-availability-new -fmodules -fmodules-cache-path=/Users/buildslave/jenkins/workspace/lldb-cmake/lldb-build/module.cache -fcxx-modules -Xclang -fmodules-local-submodule-visibility -Wall -Wextra -Wno-unused-parameter -Wwrite-strings -Wcast-qual -Wmissing-field-initializers -pedantic -Wno-long-long -Wimplicit-fallthrough -Wcovered-switch-default -Wno-noexcept-type -Wnon-virtual-dtor -Wdelete-non-virtual-dtor -Wsuggest-override -Wstring-conversion -fdiagnostics-color -O3  -isysroot /Applications/Xcode.app/Contents/Developer/Platforms/MacOSX.platform/Developer/SDKs/MacOSX10.15.sdk    -fno-exceptions -fno-rtti -UNDEBUG -std=c++14 -MD -MT tools/lld/ELF/CMakeFiles/lldELF.dir/Target.cpp.o -MF tools/lld/ELF/CMakeFiles/lldELF.dir/Target.cpp.o.d -o tools/lld/ELF/CMakeFiles/lldELF.dir/Target.cpp.o -c /Users/buildslave/jenkins/workspace/lldb-cmake/llvm-project/lld/ELF/Target.cpp
[5110/5150] /Users/buildslave/jenkins/workspace/lldb-cmake/host-compiler/bin/clang++  -DGTEST_HAS_RTTI=0 -D_DEBUG -D__STDC_CONSTANT_MACROS -D__STDC_FORMAT_MACROS -D__STDC_LIMIT_MACROS -Itools/lld/ELF -I/Users/buildslave/jenkins/workspace/lldb-cmake/llvm-project/lld/ELF -I/Users/buildslave/jenkins/workspace/lldb-cmake/llvm-project/lld/include -Itools/lld/include -I/Applications/Xcode.app/Contents/Developer/Platforms/MacOSX.platform/Developer/SDKs/MacOSX10.15.sdk/usr/include/libxml2 -Iinclude -I/Users/buildslave/jenkins/workspace/lldb-cmake/llvm-project/llvm/include -Wdocumentation -fPIC -fvisibility-inlines-hidden -Werror=date-time -Werror=unguarded-availability-new -fmodules -fmodules-cache-path=/Users/buildslave/jenkins/workspace/lldb-cmake/lldb-build/module.cache -fcxx-modules -Xclang -fmodules-local-submodule-visibility -Wall -Wextra -Wno-unused-parameter -Wwrite-strings -Wcast-qual -Wmissing-field-initializers -pedantic -Wno-long-long -Wimplicit-fallthrough -Wcovered-switch-default -Wno-noexcept-type -Wnon-virtual-dtor -Wdelete-non-virtual-dtor -Wsuggest-override -Wstring-conversion -fdiagnostics-color -O3  -isysroot /Applications/Xcode.app/Contents/Developer/Platforms/MacOSX.platform/Developer/SDKs/MacOSX10.15.sdk    -fno-exceptions -fno-rtti -UNDEBUG -std=c++14 -MD -MT tools/lld/ELF/CMakeFiles/lldELF.dir/OutputSections.cpp.o -MF tools/lld/ELF/CMakeFiles/lldELF.dir/OutputSections.cpp.o.d -o tools/lld/ELF/CMakeFiles/lldELF.dir/OutputSections.cpp.o -c /Users/buildslave/jenkins/workspace/lldb-cmake/llvm-project/lld/ELF/OutputSections.cpp
[5111/5150] /Users/buildslave/jenkins/workspace/lldb-cmake/host-compiler/bin/clang++  -DGTEST_HAS_RTTI=0 -D_DEBUG -D__STDC_CONSTANT_MACROS -D__STDC_FORMAT_MACROS -D__STDC_LIMIT_MACROS -Itools/lld/MachO -I/Users/buildslave/jenkins/workspace/lldb-cmake/llvm-project/lld/MachO -I/Users/buildslave/jenkins/workspace/lldb-cmake/llvm-project/lld/include -Itools/lld/include -I/Applications/Xcode.app/Contents/Developer/Platforms/MacOSX.platform/Developer/SDKs/MacOSX10.15.sdk/usr/include/libxml2 -Iinclude -I/Users/buildslave/jenkins/workspace/lldb-cmake/llvm-project/llvm/include -Wdocumentation -fPIC -fvisibility-inlines-hidden -Werror=date-time -Werror=unguarded-availability-new -fmodules -fmodules-cache-path=/Users/buildslave/jenkins/workspace/lldb-cmake/lldb-build/module.cache -fcxx-modules -Xclang -fmodules-local-submodule-visibility -Wall -Wextra -Wno-unused-parameter -Wwrite-strings -Wcast-qual -Wmissing-field-initializers -pedantic -Wno-long-long -Wimplicit-fallthrough -Wcovered-switch-default -Wno-noexcept-type -Wnon-virtual-dtor -Wdelete-non-virtual-dtor -Wsuggest-override -Wstring-conversion -fdiagnostics-color -O3  -isysroot /Applications/Xcode.app/Contents/Developer/Platforms/MacOSX.platform/Developer/SDKs/MacOSX10.15.sdk    -fno-exceptions -fno-rtti -UNDEBUG -std=c++14 -MD -MT tools/lld/MachO/CMakeFiles/lldMachO2.dir/ExportTrie.cpp.o -MF tools/lld/MachO/CMakeFiles/lldMachO2.dir/ExportTrie.cpp.o.d -o tools/lld/MachO/CMakeFiles/lldMachO2.dir/ExportTrie.cpp.o -c /Users/buildslave/jenkins/workspace/lldb-cmake/llvm-project/lld/MachO/ExportTrie.cpp
[5112/5150] /Users/buildslave/jenkins/workspace/lldb-cmake/host-compiler/bin/clang++  -DGTEST_HAS_RTTI=0 -D_DEBUG -D__STDC_CONSTANT_MACROS -D__STDC_FORMAT_MACROS -D__STDC_LIMIT_MACROS -Itools/lld/MachO -I/Users/buildslave/jenkins/workspace/lldb-cmake/llvm-project/lld/MachO -I/Users/buildslave/jenkins/workspace/lldb-cmake/llvm-project/lld/include -Itools/lld/include -I/Applications/Xcode.app/Contents/Developer/Platforms/MacOSX.platform/Developer/SDKs/MacOSX10.15.sdk/usr/include/libxml2 -Iinclude -I/Users/buildslave/jenkins/workspace/lldb-cmake/llvm-project/llvm/include -Wdocumentation -fPIC -fvisibility-inlines-hidden -Werror=date-time -Werror=unguarded-availability-new -fmodules -fmodules-cache-path=/Users/buildslave/jenkins/workspace/lldb-cmake/lldb-build/module.cache -fcxx-modules -Xclang -fmodules-local-submodule-visibility -Wall -Wextra -Wno-unused-parameter -Wwrite-strings -Wcast-qual -Wmissing-field-initializers -pedantic -Wno-long-long -Wimplicit-fallthrough -Wcovered-switch-default -Wno-noexcept-type -Wnon-virtual-dtor -Wdelete-non-virtual-dtor -Wsuggest-override -Wstring-conversion -fdiagnostics-color -O3  -isysroot /Applications/Xcode.app/Contents/Developer/Platforms/MacOSX.platform/Developer/SDKs/MacOSX10.15.sdk    -fno-exceptions -fno-rtti -UNDEBUG -std=c++14 -MD -MT tools/lld/MachO/CMakeFiles/lldMachO2.dir/Arch/X86_64.cpp.o -MF tools/lld/MachO/CMakeFiles/lldMachO2.dir/Arch/X86_64.cpp.o.d -o tools/lld/MachO/CMakeFiles/lldMachO2.dir/Arch/X86_64.cpp.o -c /Users/buildslave/jenkins/workspace/lldb-cmake/llvm-project/lld/MachO/Arch/X86_64.cpp
[5113/5150] /Users/buildslave/jenkins/workspace/lldb-cmake/host-compiler/bin/clang++  -DGTEST_HAS_RTTI=0 -D_DEBUG -D__STDC_CONSTANT_MACROS -D__STDC_FORMAT_MACROS -D__STDC_LIMIT_MACROS -Itools/lld/ELF -I/Users/buildslave/jenkins/workspace/lldb-cmake/llvm-project/lld/ELF -I/Users/buildslave/jenkins/workspace/lldb-cmake/llvm-project/lld/include -Itools/lld/include -I/Applications/Xcode.app/Contents/Developer/Platforms/MacOSX.platform/Developer/SDKs/MacOSX10.15.sdk/usr/include/libxml2 -Iinclude -I/Users/buildslave/jenkins/workspace/lldb-cmake/llvm-project/llvm/include -Wdocumentation -fPIC -fvisibility-inlines-hidden -Werror=date-time -Werror=unguarded-availability-new -fmodules -fmodules-cache-path=/Users/buildslave/jenkins/workspace/lldb-cmake/lldb-build/module.cache -fcxx-modules -Xclang -fmodules-local-submodule-visibility -Wall -Wextra -Wno-unused-parameter -Wwrite-strings -Wcast-qual -Wmissing-field-initializers -pedantic -Wno-long-long -Wimplicit-fallthrough -Wcovered-switch-default -Wno-noexcept-type -Wnon-virtual-dtor -Wdelete-non-virtual-dtor -Wsuggest-override -Wstring-conversion -fdiagnostics-color -O3  -isysroot /Applications/Xcode.app/Contents/Developer/Platforms/MacOSX.platform/Developer/SDKs/MacOSX10.15.sdk    -fno-exceptions -fno-rtti -UNDEBUG -std=c++14 -MD -MT tools/lld/ELF/CMakeFiles/lldELF.dir/Thunks.cpp.o -MF tools/lld/ELF/CMakeFiles/lldELF.dir/Thunks.cpp.o.d -o tools/lld/ELF/CMakeFiles/lldELF.dir/Thunks.cpp.o -c /Users/buildslave/jenkins/workspace/lldb-cmake/llvm-project/lld/ELF/Thunks.cpp
[5114/5150] /Users/buildslave/jenkins/workspace/lldb-cmake/host-compiler/bin/clang++  -DGTEST_HAS_RTTI=0 -D_DEBUG -D__STDC_CONSTANT_MACROS -D__STDC_FORMAT_MACROS -D__STDC_LIMIT_MACROS -Itools/lld/MachO -I/Users/buildslave/jenkins/workspace/lldb-cmake/llvm-project/lld/MachO -I/Users/buildslave/jenkins/workspace/lldb-cmake/llvm-project/lld/include -Itools/lld/include -I/Applications/Xcode.app/Contents/Developer/Platforms/MacOSX.platform/Developer/SDKs/MacOSX10.15.sdk/usr/include/libxml2 -Iinclude -I/Users/buildslave/jenkins/workspace/lldb-cmake/llvm-project/llvm/include -Wdocumentation -fPIC -fvisibility-inlines-hidden -Werror=date-time -Werror=unguarded-availability-new -fmodules -fmodules-cache-path=/Users/buildslave/jenkins/workspace/lldb-cmake/lldb-build/module.cache -fcxx-modules -Xclang -fmodules-local-submodule-visibility -Wall -Wextra -Wno-unused-parameter -Wwrite-strings -Wcast-qual -Wmissing-field-initializers -pedantic -Wno-long-long -Wimplicit-fallthrough -Wcovered-switch-default -Wno-noexcept-type -Wnon-virtual-dtor -Wdelete-non-virtual-dtor -Wsuggest-override -Wstring-conversion -fdiagnostics-color -O3  -isysroot /Applications/Xcode.app/Contents/Developer/Platforms/MacOSX.platform/Developer/SDKs/MacOSX10.15.sdk    -fno-exceptions -fno-rtti -UNDEBUG -std=c++14 -MD -MT tools/lld/MachO/CMakeFiles/lldMachO2.dir/OutputSection.cpp.o -MF tools/lld/MachO/CMakeFiles/lldMachO2.dir/OutputSection.cpp.o.d -o tools/lld/MachO/CMakeFiles/lldMachO2.dir/OutputSection.cpp.o -c /Users/buildslave/jenkins/workspace/lldb-cmake/llvm-project/lld/MachO/OutputSection.cpp
[5115/5150] /Users/buildslave/jenkins/workspace/lldb-cmake/host-compiler/bin/clang++  -DGTEST_HAS_RTTI=0 -D_DEBUG -D__STDC_CONSTANT_MACROS -D__STDC_FORMAT_MACROS -D__STDC_LIMIT_MACROS -Itools/lld/MachO -I/Users/buildslave/jenkins/workspace/lldb-cmake/llvm-project/lld/MachO -I/Users/buildslave/jenkins/workspace/lldb-cmake/llvm-project/lld/include -Itools/lld/include -I/Applications/Xcode.app/Contents/Developer/Platforms/MacOSX.platform/Developer/SDKs/MacOSX10.15.sdk/usr/include/libxml2 -Iinclude -I/Users/buildslave/jenkins/workspace/lldb-cmake/llvm-project/llvm/include -Wdocumentation -fPIC -fvisibility-inlines-hidden -Werror=date-time -Werror=unguarded-availability-new -fmodules -fmodules-cache-path=/Users/buildslave/jenkins/workspace/lldb-cmake/lldb-build/module.cache -fcxx-modules -Xclang -fmodules-local-submodule-visibility -Wall -Wextra -Wno-unused-parameter -Wwrite-strings -Wcast-qual -Wmissing-field-initializers -pedantic -Wno-long-long -Wimplicit-fallthrough -Wcovered-switch-default -Wno-noexcept-type -Wnon-virtual-dtor -Wdelete-non-virtual-dtor -Wsuggest-override -Wstring-conversion -fdiagnostics-color -O3  -isysroot /Applications/Xcode.app/Contents/Developer/Platforms/MacOSX.platform/Developer/SDKs/MacOSX10.15.sdk    -fno-exceptions -fno-rtti -UNDEBUG -std=c++14 -MD -MT tools/lld/MachO/CMakeFiles/lldMachO2.dir/InputSection.cpp.o -MF tools/lld/MachO/CMakeFiles/lldMachO2.dir/InputSection.cpp.o.d -o tools/lld/MachO/CMakeFiles/lldMachO2.dir/InputSection.cpp.o -c /Users/buildslave/jenkins/workspace/lldb-cmake/llvm-project/lld/MachO/InputSection.cpp
[5116/5150] /Users/buildslave/jenkins/workspace/lldb-cmake/host-compiler/bin/clang++  -DGTEST_HAS_RTTI=0 -D_DEBUG -D__STDC_CONSTANT_MACROS -D__STDC_FORMAT_MACROS -D__STDC_LIMIT_MACROS -Itools/lld/MachO -I/Users/buildslave/jenkins/workspace/lldb-cmake/llvm-project/lld/MachO -I/Users/buildslave/jenkins/workspace/lldb-cmake/llvm-project/lld/include -Itools/lld/include -I/Applications/Xcode.app/Contents/Developer/Platforms/MacOSX.platform/Developer/SDKs/MacOSX10.15.sdk/usr/include/libxml2 -Iinclude -I/Users/buildslave/jenkins/workspace/lldb-cmake/llvm-project/llvm/include -Wdocumentation -fPIC -fvisibility-inlines-hidden -Werror=date-time -Werror=unguarded-availability-new -fmodules -fmodules-cache-path=/Users/buildslave/jenkins/workspace/lldb-cmake/lldb-build/module.cache -fcxx-modules -Xclang -fmodules-local-submodule-visibility -Wall -Wextra -Wno-unused-parameter -Wwrite-strings -Wcast-qual -Wmissing-field-initializers -pedantic -Wno-long-long -Wimplicit-fallthrough -Wcovered-switch-default -Wno-noexcept-type -Wnon-virtual-dtor -Wdelete-non-virtual-dtor -Wsuggest-override -Wstring-conversion -fdiagnostics-color -O3  -isysroot /Applications/Xcode.app/Contents/Developer/Platforms/MacOSX.platform/Developer/SDKs/MacOSX10.15.sdk    -fno-exceptions -fno-rtti -UNDEBUG -std=c++14 -MD -MT tools/lld/MachO/CMakeFiles/lldMachO2.dir/MergedOutputSection.cpp.o -MF tools/lld/MachO/CMakeFiles/lldMachO2.dir/MergedOutputSection.cpp.o.d -o tools/lld/MachO/CMakeFiles/lldMachO2.dir/MergedOutputSection.cpp.o -c /Users/buildslave/jenkins/workspace/lldb-cmake/llvm-project/lld/MachO/MergedOutputSection.cpp
[5117/5150] /Users/buildslave/jenkins/workspace/lldb-cmake/host-compiler/bin/clang++  -DGTEST_HAS_RTTI=0 -D_DEBUG -D__STDC_CONSTANT_MACROS -D__STDC_FORMAT_MACROS -D__STDC_LIMIT_MACROS -Itools/lld/ELF -I/Users/buildslave/jenkins/workspace/lldb-cmake/llvm-project/lld/ELF -I/Users/buildslave/jenkins/workspace/lldb-cmake/llvm-project/lld/include -Itools/lld/include -I/Applications/Xcode.app/Contents/Developer/Platforms/MacOSX.platform/Developer/SDKs/MacOSX10.15.sdk/usr/include/libxml2 -Iinclude -I/Users/buildslave/jenkins/workspace/lldb-cmake/llvm-project/llvm/include -Wdocumentation -fPIC -fvisibility-inlines-hidden -Werror=date-time -Werror=unguarded-availability-new -fmodules -fmodules-cache-path=/Users/buildslave/jenkins/workspace/lldb-cmake/lldb-build/module.cache -fcxx-modules -Xclang -fmodules-local-submodule-visibility -Wall -Wextra -Wno-unused-parameter -Wwrite-strings -Wcast-qual -Wmissing-field-initializers -pedantic -Wno-long-long -Wimplicit-fallthrough -Wcovered-switch-default -Wno-noexcept-type -Wnon-virtual-dtor -Wdelete-non-virtual-dtor -Wsuggest-override -Wstring-conversion -fdiagnostics-color -O3  -isysroot /Applications/Xcode.app/Contents/Developer/Platforms/MacOSX.platform/Developer/SDKs/MacOSX10.15.sdk    -fno-exceptions -fno-rtti -UNDEBUG -std=c++14 -MD -MT tools/lld/ELF/CMakeFiles/lldELF.dir/Driver.cpp.o -MF tools/lld/ELF/CMakeFiles/lldELF.dir/Driver.cpp.o.d -o tools/lld/ELF/CMakeFiles/lldELF.dir/Driver.cpp.o -c /Users/buildslave/jenkins/workspace/lldb-cmake/llvm-project/lld/ELF/Driver.cpp
[5118/5150] /Users/buildslave/jenkins/workspace/lldb-cmake/host-compiler/bin/clang++  -DGTEST_HAS_RTTI=0 -D_DEBUG -D__STDC_CONSTANT_MACROS -D__STDC_FORMAT_MACROS -D__STDC_LIMIT_MACROS -Itools/lld/MachO -I/Users/buildslave/jenkins/workspace/lldb-cmake/llvm-project/lld/MachO -I/Users/buildslave/jenkins/workspace/lldb-cmake/llvm-project/lld/include -Itools/lld/include -I/Applications/Xcode.app/Contents/Developer/Platforms/MacOSX.platform/Developer/SDKs/MacOSX10.15.sdk/usr/include/libxml2 -Iinclude -I/Users/buildslave/jenkins/workspace/lldb-cmake/llvm-project/llvm/include -Wdocumentation -fPIC -fvisibility-inlines-hidden -Werror=date-time -Werror=unguarded-availability-new -fmodules -fmodules-cache-path=/Users/buildslave/jenkins/workspace/lldb-cmake/lldb-build/module.cache -fcxx-modules -Xclang -fmodules-local-submodule-visibility -Wall -Wextra -Wno-unused-parameter -Wwrite-strings -Wcast-qual -Wmissing-field-initializers -pedantic -Wno-long-long -Wimplicit-fallthrough -Wcovered-switch-default -Wno-noexcept-type -Wnon-virtual-dtor -Wdelete-non-virtual-dtor -Wsuggest-override -Wstring-conversion -fdiagnostics-color -O3  -isysroot /Applications/Xcode.app/Contents/Developer/Platforms/MacOSX.platform/Developer/SDKs/MacOSX10.15.sdk    -fno-exceptions -fno-rtti -UNDEBUG -std=c++14 -MD -MT tools/lld/MachO/CMakeFiles/lldMachO2.dir/InputFiles.cpp.o -MF tools/lld/MachO/CMakeFiles/lldMachO2.dir/InputFiles.cpp.o.d -o tools/lld/MachO/CMakeFiles/lldMachO2.dir/InputFiles.cpp.o -c /Users/buildslave/jenkins/workspace/lldb-cmake/llvm-project/lld/MachO/InputFiles.cpp
[5119/5150] /Users/buildslave/jenkins/workspace/lldb-cmake/host-compiler/bin/clang++  -DGTEST_HAS_RTTI=0 -D_DEBUG -D__STDC_CONSTANT_MACROS -D__STDC_FORMAT_MACROS -D__STDC_LIMIT_MACROS -Itools/lld/MachO -I/Users/buildslave/jenkins/workspace/lldb-cmake/llvm-project/lld/MachO -I/Users/buildslave/jenkins/workspace/lldb-cmake/llvm-project/lld/include -Itools/lld/include -I/Applications/Xcode.app/Contents/Developer/Platforms/MacOSX.platform/Developer/SDKs/MacOSX10.15.sdk/usr/include/libxml2 -Iinclude -I/Users/buildslave/jenkins/workspace/lldb-cmake/llvm-project/llvm/include -Wdocumentation -fPIC -fvisibility-inlines-hidden -Werror=date-time -Werror=unguarded-availability-new -fmodules -fmodules-cache-path=/Users/buildslave/jenkins/workspace/lldb-cmake/lldb-build/module.cache -fcxx-modules -Xclang -fmodules-local-submodule-visibility -Wall -Wextra -Wno-unused-parameter -Wwrite-strings -Wcast-qual -Wmissing-field-initializers -pedantic -Wno-long-long -Wimplicit-fallthrough -Wcovered-switch-default -Wno-noexcept-type -Wnon-virtual-dtor -Wdelete-non-virtual-dtor -Wsuggest-override -Wstring-conversion -fdiagnostics-color -O3  -isysroot /Applications/Xcode.app/Contents/Developer/Platforms/MacOSX.platform/Developer/SDKs/MacOSX10.15.sdk    -fno-exceptions -fno-rtti -UNDEBUG -std=c++14 -MD -MT tools/lld/MachO/CMakeFiles/lldMachO2.dir/OutputSegment.cpp.o -MF tools/lld/MachO/CMakeFiles/lldMachO2.dir/OutputSegment.cpp.o.d -o tools/lld/MachO/CMakeFiles/lldMachO2.dir/OutputSegment.cpp.o -c /Users/buildslave/jenkins/workspace/lldb-cmake/llvm-project/lld/MachO/OutputSegment.cpp
[5120/5150] /Users/buildslave/jenkins/workspace/lldb-cmake/host-compiler/bin/clang++  -DGTEST_HAS_RTTI=0 -D_DEBUG -D__STDC_CONSTANT_MACROS -D__STDC_FORMAT_MACROS -D__STDC_LIMIT_MACROS -Itools/lld/MachO -I/Users/buildslave/jenkins/workspace/lldb-cmake/llvm-project/lld/MachO -I/Users/buildslave/jenkins/workspace/lldb-cmake/llvm-project/lld/include -Itools/lld/include -I/Applications/Xcode.app/Contents/Developer/Platforms/MacOSX.platform/Developer/SDKs/MacOSX10.15.sdk/usr/include/libxml2 -Iinclude -I/Users/buildslave/jenkins/workspace/lldb-cmake/llvm-project/llvm/include -Wdocumentation -fPIC -fvisibility-inlines-hidden -Werror=date-time -Werror=unguarded-availability-new -fmodules -fmodules-cache-path=/Users/buildslave/jenkins/workspace/lldb-cmake/lldb-build/module.cache -fcxx-modules -Xclang -fmodules-local-submodule-visibility -Wall -Wextra -Wno-unused-parameter -Wwrite-strings -Wcast-qual -Wmissing-field-initializers -pedantic -Wno-long-long -Wimplicit-fallthrough -Wcovered-switch-default -Wno-noexcept-type -Wnon-virtual-dtor -Wdelete-non-virtual-dtor -Wsuggest-override -Wstring-conversion -fdiagnostics-color -O3  -isysroot /Applications/Xcode.app/Contents/Developer/Platforms/MacOSX.platform/Developer/SDKs/MacOSX10.15.sdk    -fno-exceptions -fno-rtti -UNDEBUG -std=c++14 -MD -MT tools/lld/MachO/CMakeFiles/lldMachO2.dir/Target.cpp.o -MF tools/lld/MachO/CMakeFiles/lldMachO2.dir/Target.cpp.o.d -o tools/lld/MachO/CMakeFiles/lldMachO2.dir/Target.cpp.o -c /Users/buildslave/jenkins/workspace/lldb-cmake/llvm-project/lld/MachO/Target.cpp
[5121/5150] /Users/buildslave/jenkins/workspace/lldb-cmake/host-compiler/bin/clang++  -DGTEST_HAS_RTTI=0 -D_DEBUG -D__STDC_CONSTANT_MACROS -D__STDC_FORMAT_MACROS -D__STDC_LIMIT_MACROS -Itools/lld/MachO -I/Users/buildslave/jenkins/workspace/lldb-cmake/llvm-project/lld/MachO -I/Users/buildslave/jenkins/workspace/lldb-cmake/llvm-project/lld/include -Itools/lld/include -I/Applications/Xcode.app/Contents/Developer/Platforms/MacOSX.platform/Developer/SDKs/MacOSX10.15.sdk/usr/include/libxml2 -Iinclude -I/Users/buildslave/jenkins/workspace/lldb-cmake/llvm-project/llvm/include -Wdocumentation -fPIC -fvisibility-inlines-hidden -Werror=date-time -Werror=unguarded-availability-new -fmodules -fmodules-cache-path=/Users/buildslave/jenkins/workspace/lldb-cmake/lldb-build/module.cache -fcxx-modules -Xclang -fmodules-local-submodule-visibility -Wall -Wextra -Wno-unused-parameter -Wwrite-strings -Wcast-qual -Wmissing-field-initializers -pedantic -Wno-long-long -Wimplicit-fallthrough -Wcovered-switch-default -Wno-noexcept-type -Wnon-virtual-dtor -Wdelete-non-virtual-dtor -Wsuggest-override -Wstring-conversion -fdiagnostics-color -O3  -isysroot /Applications/Xcode.app/Contents/Developer/Platforms/MacOSX.platform/Developer/SDKs/MacOSX10.15.sdk    -fno-exceptions -fno-rtti -UNDEBUG -std=c++14 -MD -MT tools/lld/MachO/CMakeFiles/lldMachO2.dir/Driver.cpp.o -MF tools/lld/MachO/CMakeFiles/lldMachO2.dir/Driver.cpp.o.d -o tools/lld/MachO/CMakeFiles/lldMachO2.dir/Driver.cpp.o -c /Users/buildslave/jenkins/workspace/lldb-cmake/llvm-project/lld/MachO/Driver.cpp
[5122/5150] cd /Users/buildslave/jenkins/workspace/lldb-cmake/lldb-build && /Users/buildslave/jenkins/workspace/lldb-cmake/lldb-build/bin/llvm-tblgen -gen-opt-parser-defs -I /Users/buildslave/jenkins/workspace/lldb-cmake/llvm-project/lld/MinGW -I /Users/buildslave/jenkins/workspace/lldb-cmake/llvm-project/lld/include -I /Users/buildslave/jenkins/workspace/lldb-cmake/lldb-build/tools/lld/include -I /Applications/Xcode.app/Contents/Developer/Platforms/MacOSX.platform/Developer/SDKs/MacOSX10.15.sdk/usr/include/libxml2 -I /Users/buildslave/jenkins/workspace/lldb-cmake/lldb-build/include -I /Users/buildslave/jenkins/workspace/lldb-cmake/llvm-project/llvm/include /Users/buildslave/jenkins/workspace/lldb-cmake/llvm-project/lld/MinGW/Options.td --write-if-changed -o tools/lld/MinGW/Options.inc -d tools/lld/MinGW/Options.inc.d
[5123/5150] /Users/buildslave/jenkins/workspace/lldb-cmake/host-compiler/bin/clang++  -DGTEST_HAS_RTTI=0 -D_DEBUG -D__STDC_CONSTANT_MACROS -D__STDC_FORMAT_MACROS -D__STDC_LIMIT_MACROS -Itools/lld/MachO -I/Users/buildslave/jenkins/workspace/lldb-cmake/llvm-project/lld/MachO -I/Users/buildslave/jenkins/workspace/lldb-cmake/llvm-project/lld/include -Itools/lld/include -I/Applications/Xcode.app/Contents/Developer/Platforms/MacOSX.platform/Developer/SDKs/MacOSX10.15.sdk/usr/include/libxml2 -Iinclude -I/Users/buildslave/jenkins/workspace/lldb-cmake/llvm-project/llvm/include -Wdocumentation -fPIC -fvisibility-inlines-hidden -Werror=date-time -Werror=unguarded-availability-new -fmodules -fmodules-cache-path=/Users/buildslave/jenkins/workspace/lldb-cmake/lldb-build/module.cache -fcxx-modules -Xclang -fmodules-local-submodule-visibility -Wall -Wextra -Wno-unused-parameter -Wwrite-strings -Wcast-qual -Wmissing-field-initializers -pedantic -Wno-long-long -Wimplicit-fallthrough -Wcovered-switch-default -Wno-noexcept-type -Wnon-virtual-dtor -Wdelete-non-virtual-dtor -Wsuggest-override -Wstring-conversion -fdiagnostics-color -O3  -isysroot /Applications/Xcode.app/Contents/Developer/Platforms/MacOSX.platform/Developer/SDKs/MacOSX10.15.sdk    -fno-exceptions -fno-rtti -UNDEBUG -std=c++14 -MD -MT tools/lld/MachO/CMakeFiles/lldMachO2.dir/SymbolTable.cpp.o -MF tools/lld/MachO/CMakeFiles/lldMachO2.dir/SymbolTable.cpp.o.d -o tools/lld/MachO/CMakeFiles/lldMachO2.dir/SymbolTable.cpp.o -c /Users/buildslave/jenkins/workspace/lldb-cmake/llvm-project/lld/MachO/SymbolTable.cpp
[5124/5150] /Users/buildslave/jenkins/workspace/lldb-cmake/host-compiler/bin/clang++  -DGTEST_HAS_RTTI=0 -D_DEBUG -D__STDC_CONSTANT_MACROS -D__STDC_FORMAT_MACROS -D__STDC_LIMIT_MACROS -Itools/lld/MachO -I/Users/buildslave/jenkins/workspace/lldb-cmake/llvm-project/lld/MachO -I/Users/buildslave/jenkins/workspace/lldb-cmake/llvm-project/lld/include -Itools/lld/include -I/Applications/Xcode.app/Contents/Developer/Platforms/MacOSX.platform/Developer/SDKs/MacOSX10.15.sdk/usr/include/libxml2 -Iinclude -I/Users/buildslave/jenkins/workspace/lldb-cmake/llvm-project/llvm/include -Wdocumentation -fPIC -fvisibility-inlines-hidden -Werror=date-time -Werror=unguarded-availability-new -fmodules -fmodules-cache-path=/Users/buildslave/jenkins/workspace/lldb-cmake/lldb-build/module.cache -fcxx-modules -Xclang -fmodules-local-submodule-visibility -Wall -Wextra -Wno-unused-parameter -Wwrite-strings -Wcast-qual -Wmissing-field-initializers -pedantic -Wno-long-long -Wimplicit-fallthrough -Wcovered-switch-default -Wno-noexcept-type -Wnon-virtual-dtor -Wdelete-non-virtual-dtor -Wsuggest-override -Wstring-conversion -fdiagnostics-color -O3  -isysroot /Applications/Xcode.app/Contents/Developer/Platforms/MacOSX.platform/Developer/SDKs/MacOSX10.15.sdk    -fno-exceptions -fno-rtti -UNDEBUG -std=c++14 -MD -MT tools/lld/MachO/CMakeFiles/lldMachO2.dir/Symbols.cpp.o -MF tools/lld/MachO/CMakeFiles/lldMachO2.dir/Symbols.cpp.o.d -o tools/lld/MachO/CMakeFiles/lldMachO2.dir/Symbols.cpp.o -c /Users/buildslave/jenkins/workspace/lldb-cmake/llvm-project/lld/MachO/Symbols.cpp
[5125/5150] /Users/buildslave/jenkins/workspace/lldb-cmake/host-compiler/bin/clang++  -DGTEST_HAS_RTTI=0 -D_DEBUG -D__STDC_CONSTANT_MACROS -D__STDC_FORMAT_MACROS -D__STDC_LIMIT_MACROS -Itools/lld/tools/lld -I/Users/buildslave/jenkins/workspace/lldb-cmake/llvm-project/lld/tools/lld -I/Users/buildslave/jenkins/workspace/lldb-cmake/llvm-project/lld/include -Itools/lld/include -I/Applications/Xcode.app/Contents/Developer/Platforms/MacOSX.platform/Developer/SDKs/MacOSX10.15.sdk/usr/include/libxml2 -Iinclude -I/Users/buildslave/jenkins/workspace/lldb-cmake/llvm-project/llvm/include -Wdocumentation -fPIC -fvisibility-inlines-hidden -Werror=date-time -Werror=unguarded-availability-new -fmodules -fmodules-cache-path=/Users/buildslave/jenkins/workspace/lldb-cmake/lldb-build/module.cache -fcxx-modules -Xclang -fmodules-local-submodule-visibility -Wall -Wextra -Wno-unused-parameter -Wwrite-strings -Wcast-qual -Wmissing-field-initializers -pedantic -Wno-long-long -Wimplicit-fallthrough -Wcovered-switch-default -Wno-noexcept-type -Wnon-virtual-dtor -Wdelete-non-virtual-dtor -Wsuggest-override -Wstring-conversion -fdiagnostics-color -O3  -isysroot /Applications/Xcode.app/Contents/Developer/Platforms/MacOSX.platform/Developer/SDKs/MacOSX10.15.sdk    -fno-exceptions -fno-rtti -UNDEBUG -std=c++14 -MD -MT tools/lld/tools/lld/CMakeFiles/lld.dir/lld.cpp.o -MF tools/lld/tools/lld/CMakeFiles/lld.dir/lld.cpp.o.d -o tools/lld/tools/lld/CMakeFiles/lld.dir/lld.cpp.o -c /Users/buildslave/jenkins/workspace/lldb-cmake/llvm-project/lld/tools/lld/lld.cpp
[5126/5150] /Users/buildslave/jenkins/workspace/lldb-cmake/host-compiler/bin/clang++  -DGTEST_HAS_RTTI=0 -D_DEBUG -D__STDC_CONSTANT_MACROS -D__STDC_FORMAT_MACROS -D__STDC_LIMIT_MACROS -Itools/lld/MinGW -I/Users/buildslave/jenkins/workspace/lldb-cmake/llvm-project/lld/MinGW -I/Users/buildslave/jenkins/workspace/lldb-cmake/llvm-project/lld/include -Itools/lld/include -I/Applications/Xcode.app/Contents/Developer/Platforms/MacOSX.platform/Developer/SDKs/MacOSX10.15.sdk/usr/include/libxml2 -Iinclude -I/Users/buildslave/jenkins/workspace/lldb-cmake/llvm-project/llvm/include -Wdocumentation -fPIC -fvisibility-inlines-hidden -Werror=date-time -Werror=unguarded-availability-new -fmodules -fmodules-cache-path=/Users/buildslave/jenkins/workspace/lldb-cmake/lldb-build/module.cache -fcxx-modules -Xclang -fmodules-local-submodule-visibility -Wall -Wextra -Wno-unused-parameter -Wwrite-strings -Wcast-qual -Wmissing-field-initializers -pedantic -Wno-long-long -Wimplicit-fallthrough -Wcovered-switch-default -Wno-noexcept-type -Wnon-virtual-dtor -Wdelete-non-virtual-dtor -Wsuggest-override -Wstring-conversion -fdiagnostics-color -O3  -isysroot /Applications/Xcode.app/Contents/Developer/Platforms/MacOSX.platform/Developer/SDKs/MacOSX10.15.sdk    -fno-exceptions -fno-rtti -UNDEBUG -std=c++14 -MD -MT tools/lld/MinGW/CMakeFiles/lldMinGW.dir/Driver.cpp.o -MF tools/lld/MinGW/CMakeFiles/lldMinGW.dir/Driver.cpp.o.d -o tools/lld/MinGW/CMakeFiles/lldMinGW.dir/Driver.cpp.o -c /Users/buildslave/jenkins/workspace/lldb-cmake/llvm-project/lld/MinGW/Driver.cpp
[5127/5150] : && "/Applications/Xcode.app/Contents/Developer/Toolchains/XcodeDefault.xctoolchain/usr/bin/libtool" -static -no_warning_for_no_symbols -o lib/liblldMinGW.a  tools/lld/MinGW/CMakeFiles/lldMinGW.dir/Driver.cpp.o && :
[5128/5150] /Users/buildslave/jenkins/workspace/lldb-cmake/host-compiler/bin/clang++  -DGTEST_HAS_RTTI=0 -D_DEBUG -D__STDC_CONSTANT_MACROS -D__STDC_FORMAT_MACROS -D__STDC_LIMIT_MACROS -Itools/lld/wasm -I/Users/buildslave/jenkins/workspace/lldb-cmake/llvm-project/lld/wasm -I/Users/buildslave/jenkins/workspace/lldb-cmake/llvm-project/lld/include -Itools/lld/include -I/Applications/Xcode.app/Contents/Developer/Platforms/MacOSX.platform/Developer/SDKs/MacOSX10.15.sdk/usr/include/libxml2 -Iinclude -I/Users/buildslave/jenkins/workspace/lldb-cmake/llvm-project/llvm/include -Wdocumentation -fPIC -fvisibility-inlines-hidden -Werror=date-time -Werror=unguarded-availability-new -fmodules -fmodules-cache-path=/Users/buildslave/jenkins/workspace/lldb-cmake/lldb-build/module.cache -fcxx-modules -Xclang -fmodules-local-submodule-visibility -Wall -Wextra -Wno-unused-parameter -Wwrite-strings -Wcast-qual -Wmissing-field-initializers -pedantic -Wno-long-long -Wimplicit-fallthrough -Wcovered-switch-default -Wno-noexcept-type -Wnon-virtual-dtor -Wdelete-non-virtual-dtor -Wsuggest-override -Wstring-conversion -fdiagnostics-color -O3  -isysroot /Applications/Xcode.app/Contents/Developer/Platforms/MacOSX.platform/Developer/SDKs/MacOSX10.15.sdk    -fno-exceptions -fno-rtti -UNDEBUG -std=c++14 -MD -MT tools/lld/wasm/CMakeFiles/lldWasm.dir/Relocations.cpp.o -MF tools/lld/wasm/CMakeFiles/lldWasm.dir/Relocations.cpp.o.d -o tools/lld/wasm/CMakeFiles/lldWasm.dir/Relocations.cpp.o -c /Users/buildslave/jenkins/workspace/lldb-cmake/llvm-project/lld/wasm/Relocations.cpp
[5129/5150] /Users/buildslave/jenkins/workspace/lldb-cmake/host-compiler/bin/clang++  -DGTEST_HAS_RTTI=0 -D_DEBUG -D__STDC_CONSTANT_MACROS -D__STDC_FORMAT_MACROS -D__STDC_LIMIT_MACROS -Itools/lld/MachO -I/Users/buildslave/jenkins/workspace/lldb-cmake/llvm-project/lld/MachO -I/Users/buildslave/jenkins/workspace/lldb-cmake/llvm-project/lld/include -Itools/lld/include -I/Applications/Xcode.app/Contents/Developer/Platforms/MacOSX.platform/Developer/SDKs/MacOSX10.15.sdk/usr/include/libxml2 -Iinclude -I/Users/buildslave/jenkins/workspace/lldb-cmake/llvm-project/llvm/include -Wdocumentation -fPIC -fvisibility-inlines-hidden -Werror=date-time -Werror=unguarded-availability-new -fmodules -fmodules-cache-path=/Users/buildslave/jenkins/workspace/lldb-cmake/lldb-build/module.cache -fcxx-modules -Xclang -fmodules-local-submodule-visibility -Wall -Wextra -Wno-unused-parameter -Wwrite-strings -Wcast-qual -Wmissing-field-initializers -pedantic -Wno-long-long -Wimplicit-fallthrough -Wcovered-switch-default -Wno-noexcept-type -Wnon-virtual-dtor -Wdelete-non-virtual-dtor -Wsuggest-override -Wstring-conversion -fdiagnostics-color -O3  -isysroot /Applications/Xcode.app/Contents/Developer/Platforms/MacOSX.platform/Developer/SDKs/MacOSX10.15.sdk    -fno-exceptions -fno-rtti -UNDEBUG -std=c++14 -MD -MT tools/lld/MachO/CMakeFiles/lldMachO2.dir/SyntheticSections.cpp.o -MF tools/lld/MachO/CMakeFiles/lldMachO2.dir/SyntheticSections.cpp.o.d -o tools/lld/MachO/CMakeFiles/lldMachO2.dir/SyntheticSections.cpp.o -c /Users/buildslave/jenkins/workspace/lldb-cmake/llvm-project/lld/MachO/SyntheticSections.cpp
[5130/5150] /Users/buildslave/jenkins/workspace/lldb-cmake/host-compiler/bin/clang++  -DGTEST_HAS_RTTI=0 -D_DEBUG -D__STDC_CONSTANT_MACROS -D__STDC_FORMAT_MACROS -D__STDC_LIMIT_MACROS -Itools/lld/wasm -I/Users/buildslave/jenkins/workspace/lldb-cmake/llvm-project/lld/wasm -I/Users/buildslave/jenkins/workspace/lldb-cmake/llvm-project/lld/include -Itools/lld/include -I/Applications/Xcode.app/Contents/Developer/Platforms/MacOSX.platform/Developer/SDKs/MacOSX10.15.sdk/usr/include/libxml2 -Iinclude -I/Users/buildslave/jenkins/workspace/lldb-cmake/llvm-project/llvm/include -Wdocumentation -fPIC -fvisibility-inlines-hidden -Werror=date-time -Werror=unguarded-availability-new -fmodules -fmodules-cache-path=/Users/buildslave/jenkins/workspace/lldb-cmake/lldb-build/module.cache -fcxx-modules -Xclang -fmodules-local-submodule-visibility -Wall -Wextra -Wno-unused-parameter -Wwrite-strings -Wcast-qual -Wmissing-field-initializers -pedantic -Wno-long-long -Wimplicit-fallthrough -Wcovered-switch-default -Wno-noexcept-type -Wnon-virtual-dtor -Wdelete-non-virtual-dtor -Wsuggest-override -Wstring-conversion -fdiagnostics-color -O3  -isysroot /Applications/Xcode.app/Contents/Developer/Platforms/MacOSX.platform/Developer/SDKs/MacOSX10.15.sdk    -fno-exceptions -fno-rtti -UNDEBUG -std=c++14 -MD -MT tools/lld/wasm/CMakeFiles/lldWasm.dir/InputChunks.cpp.o -MF tools/lld/wasm/CMakeFiles/lldWasm.dir/InputChunks.cpp.o.d -o tools/lld/wasm/CMakeFiles/lldWasm.dir/InputChunks.cpp.o -c /Users/buildslave/jenkins/workspace/lldb-cmake/llvm-project/lld/wasm/InputChunks.cpp
[5131/5150] /Users/buildslave/jenkins/workspace/lldb-cmake/host-compiler/bin/clang++  -DGTEST_HAS_RTTI=0 -D_DEBUG -D__STDC_CONSTANT_MACROS -D__STDC_FORMAT_MACROS -D__STDC_LIMIT_MACROS -Itools/lld/MachO -I/Users/buildslave/jenkins/workspace/lldb-cmake/llvm-project/lld/MachO -I/Users/buildslave/jenkins/workspace/lldb-cmake/llvm-project/lld/include -Itools/lld/include -I/Applications/Xcode.app/Contents/Developer/Platforms/MacOSX.platform/Developer/SDKs/MacOSX10.15.sdk/usr/include/libxml2 -Iinclude -I/Users/buildslave/jenkins/workspace/lldb-cmake/llvm-project/llvm/include -Wdocumentation -fPIC -fvisibility-inlines-hidden -Werror=date-time -Werror=unguarded-availability-new -fmodules -fmodules-cache-path=/Users/buildslave/jenkins/workspace/lldb-cmake/lldb-build/module.cache -fcxx-modules -Xclang -fmodules-local-submodule-visibility -Wall -Wextra -Wno-unused-parameter -Wwrite-strings -Wcast-qual -Wmissing-field-initializers -pedantic -Wno-long-long -Wimplicit-fallthrough -Wcovered-switch-default -Wno-noexcept-type -Wnon-virtual-dtor -Wdelete-non-virtual-dtor -Wsuggest-override -Wstring-conversion -fdiagnostics-color -O3  -isysroot /Applications/Xcode.app/Contents/Developer/Platforms/MacOSX.platform/Developer/SDKs/MacOSX10.15.sdk    -fno-exceptions -fno-rtti -UNDEBUG -std=c++14 -MD -MT tools/lld/MachO/CMakeFiles/lldMachO2.dir/Writer.cpp.o -MF tools/lld/MachO/CMakeFiles/lldMachO2.dir/Writer.cpp.o.d -o tools/lld/MachO/CMakeFiles/lldMachO2.dir/Writer.cpp.o -c /Users/buildslave/jenkins/workspace/lldb-cmake/llvm-project/lld/MachO/Writer.cpp
[5132/5150] : && "/Applications/Xcode.app/Contents/Developer/Toolchains/XcodeDefault.xctoolchain/usr/bin/libtool" -static -no_warning_for_no_symbols -o lib/liblldMachO2.a  tools/lld/MachO/CMakeFiles/lldMachO2.dir/Arch/X86_64.cpp.o tools/lld/MachO/CMakeFiles/lldMachO2.dir/Driver.cpp.o tools/lld/MachO/CMakeFiles/lldMachO2.dir/ExportTrie.cpp.o tools/lld/MachO/CMakeFiles/lldMachO2.dir/InputFiles.cpp.o tools/lld/MachO/CMakeFiles/lldMachO2.dir/InputSection.cpp.o tools/lld/MachO/CMakeFiles/lldMachO2.dir/MergedOutputSection.cpp.o tools/lld/MachO/CMakeFiles/lldMachO2.dir/OutputSection.cpp.o tools/lld/MachO/CMakeFiles/lldMachO2.dir/OutputSegment.cpp.o tools/lld/MachO/CMakeFiles/lldMachO2.dir/SymbolTable.cpp.o tools/lld/MachO/CMakeFiles/lldMachO2.dir/Symbols.cpp.o tools/lld/MachO/CMakeFiles/lldMachO2.dir/SyntheticSections.cpp.o tools/lld/MachO/CMakeFiles/lldMachO2.dir/Target.cpp.o tools/lld/MachO/CMakeFiles/lldMachO2.dir/Writer.cpp.o && :
[5133/5150] /Users/buildslave/jenkins/workspace/lldb-cmake/host-compiler/bin/clang++  -DGTEST_HAS_RTTI=0 -D_DEBUG -D__STDC_CONSTANT_MACROS -D__STDC_FORMAT_MACROS -D__STDC_LIMIT_MACROS -Itools/lld/wasm -I/Users/buildslave/jenkins/workspace/lldb-cmake/llvm-project/lld/wasm -I/Users/buildslave/jenkins/workspace/lldb-cmake/llvm-project/lld/include -Itools/lld/include -I/Applications/Xcode.app/Contents/Developer/Platforms/MacOSX.platform/Developer/SDKs/MacOSX10.15.sdk/usr/include/libxml2 -Iinclude -I/Users/buildslave/jenkins/workspace/lldb-cmake/llvm-project/llvm/include -Wdocumentation -fPIC -fvisibility-inlines-hidden -Werror=date-time -Werror=unguarded-availability-new -fmodules -fmodules-cache-path=/Users/buildslave/jenkins/workspace/lldb-cmake/lldb-build/module.cache -fcxx-modules -Xclang -fmodules-local-submodule-visibility -Wall -Wextra -Wno-unused-parameter -Wwrite-strings -Wcast-qual -Wmissing-field-initializers -pedantic -Wno-long-long -Wimplicit-fallthrough -Wcovered-switch-default -Wno-noexcept-type -Wnon-virtual-dtor -Wdelete-non-virtual-dtor -Wsuggest-override -Wstring-conversion -fdiagnostics-color -O3  -isysroot /Applications/Xcode.app/Contents/Developer/Platforms/MacOSX.platform/Developer/SDKs/MacOSX10.15.sdk    -fno-exceptions -fno-rtti -UNDEBUG -std=c++14 -MD -MT tools/lld/wasm/CMakeFiles/lldWasm.dir/SymbolTable.cpp.o -MF tools/lld/wasm/CMakeFiles/lldWasm.dir/SymbolTable.cpp.o.d -o tools/lld/wasm/CMakeFiles/lldWasm.dir/SymbolTable.cpp.o -c /Users/buildslave/jenkins/workspace/lldb-cmake/llvm-project/lld/wasm/SymbolTable.cpp
[5134/5150] /Users/buildslave/jenkins/workspace/lldb-cmake/host-compiler/bin/clang++  -DGTEST_HAS_RTTI=0 -D_DEBUG -D__STDC_CONSTANT_MACROS -D__STDC_FORMAT_MACROS -D__STDC_LIMIT_MACROS -Itools/lld/ELF -I/Users/buildslave/jenkins/workspace/lldb-cmake/llvm-project/lld/ELF -I/Users/buildslave/jenkins/workspace/lldb-cmake/llvm-project/lld/include -Itools/lld/include -I/Applications/Xcode.app/Contents/Developer/Platforms/MacOSX.platform/Developer/SDKs/MacOSX10.15.sdk/usr/include/libxml2 -Iinclude -I/Users/buildslave/jenkins/workspace/lldb-cmake/llvm-project/llvm/include -Wdocumentation -fPIC -fvisibility-inlines-hidden -Werror=date-time -Werror=unguarded-availability-new -fmodules -fmodules-cache-path=/Users/buildslave/jenkins/workspace/lldb-cmake/lldb-build/module.cache -fcxx-modules -Xclang -fmodules-local-submodule-visibility -Wall -Wextra -Wno-unused-parameter -Wwrite-strings -Wcast-qual -Wmissing-field-initializers -pedantic -Wno-long-long -Wimplicit-fallthrough -Wcovered-switch-default -Wno-noexcept-type -Wnon-virtual-dtor -Wdelete-non-virtual-dtor -Wsuggest-override -Wstring-conversion -fdiagnostics-color -O3  -isysroot /Applications/Xcode.app/Contents/Developer/Platforms/MacOSX.platform/Developer/SDKs/MacOSX10.15.sdk    -fno-exceptions -fno-rtti -UNDEBUG -std=c++14 -MD -MT tools/lld/ELF/CMakeFiles/lldELF.dir/InputFiles.cpp.o -MF tools/lld/ELF/CMakeFiles/lldELF.dir/InputFiles.cpp.o.d -o tools/lld/ELF/CMakeFiles/lldELF.dir/InputFiles.cpp.o -c /Users/buildslave/jenkins/workspace/lldb-cmake/llvm-project/lld/ELF/InputFiles.cpp
[5135/5150] /Users/buildslave/jenkins/workspace/lldb-cmake/host-compiler/bin/clang++  -DGTEST_HAS_RTTI=0 -D_DEBUG -D__STDC_CONSTANT_MACROS -D__STDC_FORMAT_MACROS -D__STDC_LIMIT_MACROS -Itools/lld/ELF -I/Users/buildslave/jenkins/workspace/lldb-cmake/llvm-project/lld/ELF -I/Users/buildslave/jenkins/workspace/lldb-cmake/llvm-project/lld/include -Itools/lld/include -I/Applications/Xcode.app/Contents/Developer/Platforms/MacOSX.platform/Developer/SDKs/MacOSX10.15.sdk/usr/include/libxml2 -Iinclude -I/Users/buildslave/jenkins/workspace/lldb-cmake/llvm-project/llvm/include -Wdocumentation -fPIC -fvisibility-inlines-hidden -Werror=date-time -Werror=unguarded-availability-new -fmodules -fmodules-cache-path=/Users/buildslave/jenkins/workspace/lldb-cmake/lldb-build/module.cache -fcxx-modules -Xclang -fmodules-local-submodule-visibility -Wall -Wextra -Wno-unused-parameter -Wwrite-strings -Wcast-qual -Wmissing-field-initializers -pedantic -Wno-long-long -Wimplicit-fallthrough -Wcovered-switch-default -Wno-noexcept-type -Wnon-virtual-dtor -Wdelete-non-virtual-dtor -Wsuggest-override -Wstring-conversion -fdiagnostics-color -O3  -isysroot /Applications/Xcode.app/Contents/Developer/Platforms/MacOSX.platform/Developer/SDKs/MacOSX10.15.sdk    -fno-exceptions -fno-rtti -UNDEBUG -std=c++14 -MD -MT tools/lld/ELF/CMakeFiles/lldELF.dir/Relocations.cpp.o -MF tools/lld/ELF/CMakeFiles/lldELF.dir/Relocations.cpp.o.d -o tools/lld/ELF/CMakeFiles/lldELF.dir/Relocations.cpp.o -c /Users/buildslave/jenkins/workspace/lldb-cmake/llvm-project/lld/ELF/Relocations.cpp
[5136/5150] /Users/buildslave/jenkins/workspace/lldb-cmake/host-compiler/bin/clang++  -DGTEST_HAS_RTTI=0 -D_DEBUG -D__STDC_CONSTANT_MACROS -D__STDC_FORMAT_MACROS -D__STDC_LIMIT_MACROS -Itools/lld/wasm -I/Users/buildslave/jenkins/workspace/lldb-cmake/llvm-project/lld/wasm -I/Users/buildslave/jenkins/workspace/lldb-cmake/llvm-project/lld/include -Itools/lld/include -I/Applications/Xcode.app/Contents/Developer/Platforms/MacOSX.platform/Developer/SDKs/MacOSX10.15.sdk/usr/include/libxml2 -Iinclude -I/Users/buildslave/jenkins/workspace/lldb-cmake/llvm-project/llvm/include -Wdocumentation -fPIC -fvisibility-inlines-hidden -Werror=date-time -Werror=unguarded-availability-new -fmodules -fmodules-cache-path=/Users/buildslave/jenkins/workspace/lldb-cmake/lldb-build/module.cache -fcxx-modules -Xclang -fmodules-local-submodule-visibility -Wall -Wextra -Wno-unused-parameter -Wwrite-strings -Wcast-qual -Wmissing-field-initializers -pedantic -Wno-long-long -Wimplicit-fallthrough -Wcovered-switch-default -Wno-noexcept-type -Wnon-virtual-dtor -Wdelete-non-virtual-dtor -Wsuggest-override -Wstring-conversion -fdiagnostics-color -O3  -isysroot /Applications/Xcode.app/Contents/Developer/Platforms/MacOSX.platform/Developer/SDKs/MacOSX10.15.sdk    -fno-exceptions -fno-rtti -UNDEBUG -std=c++14 -MD -MT tools/lld/wasm/CMakeFiles/lldWasm.dir/MarkLive.cpp.o -MF tools/lld/wasm/CMakeFiles/lldWasm.dir/MarkLive.cpp.o.d -o tools/lld/wasm/CMakeFiles/lldWasm.dir/MarkLive.cpp.o -c /Users/buildslave/jenkins/workspace/lldb-cmake/llvm-project/lld/wasm/MarkLive.cpp
[5137/5150] /Users/buildslave/jenkins/workspace/lldb-cmake/host-compiler/bin/clang++  -DGTEST_HAS_RTTI=0 -D_DEBUG -D__STDC_CONSTANT_MACROS -D__STDC_FORMAT_MACROS -D__STDC_LIMIT_MACROS -Itools/lld/wasm -I/Users/buildslave/jenkins/workspace/lldb-cmake/llvm-project/lld/wasm -I/Users/buildslave/jenkins/workspace/lldb-cmake/llvm-project/lld/include -Itools/lld/include -I/Applications/Xcode.app/Contents/Developer/Platforms/MacOSX.platform/Developer/SDKs/MacOSX10.15.sdk/usr/include/libxml2 -Iinclude -I/Users/buildslave/jenkins/workspace/lldb-cmake/llvm-project/llvm/include -Wdocumentation -fPIC -fvisibility-inlines-hidden -Werror=date-time -Werror=unguarded-availability-new -fmodules -fmodules-cache-path=/Users/buildslave/jenkins/workspace/lldb-cmake/lldb-build/module.cache -fcxx-modules -Xclang -fmodules-local-submodule-visibility -Wall -Wextra -Wno-unused-parameter -Wwrite-strings -Wcast-qual -Wmissing-field-initializers -pedantic -Wno-long-long -Wimplicit-fallthrough -Wcovered-switch-default -Wno-noexcept-type -Wnon-virtual-dtor -Wdelete-non-virtual-dtor -Wsuggest-override -Wstring-conversion -fdiagnostics-color -O3  -isysroot /Applications/Xcode.app/Contents/Developer/Platforms/MacOSX.platform/Developer/SDKs/MacOSX10.15.sdk    -fno-exceptions -fno-rtti -UNDEBUG -std=c++14 -MD -MT tools/lld/wasm/CMakeFiles/lldWasm.dir/InputFiles.cpp.o -MF tools/lld/wasm/CMakeFiles/lldWasm.dir/InputFiles.cpp.o.d -o tools/lld/wasm/CMakeFiles/lldWasm.dir/InputFiles.cpp.o -c /Users/buildslave/jenkins/workspace/lldb-cmake/llvm-project/lld/wasm/InputFiles.cpp
[5138/5150] /Users/buildslave/jenkins/workspace/lldb-cmake/host-compiler/bin/clang++  -DGTEST_HAS_RTTI=0 -D_DEBUG -D__STDC_CONSTANT_MACROS -D__STDC_FORMAT_MACROS -D__STDC_LIMIT_MACROS -Itools/lld/wasm -I/Users/buildslave/jenkins/workspace/lldb-cmake/llvm-project/lld/wasm -I/Users/buildslave/jenkins/workspace/lldb-cmake/llvm-project/lld/include -Itools/lld/include -I/Applications/Xcode.app/Contents/Developer/Platforms/MacOSX.platform/Developer/SDKs/MacOSX10.15.sdk/usr/include/libxml2 -Iinclude -I/Users/buildslave/jenkins/workspace/lldb-cmake/llvm-project/llvm/include -Wdocumentation -fPIC -fvisibility-inlines-hidden -Werror=date-time -Werror=unguarded-availability-new -fmodules -fmodules-cache-path=/Users/buildslave/jenkins/workspace/lldb-cmake/lldb-build/module.cache -fcxx-modules -Xclang -fmodules-local-submodule-visibility -Wall -Wextra -Wno-unused-parameter -Wwrite-strings -Wcast-qual -Wmissing-field-initializers -pedantic -Wno-long-long -Wimplicit-fallthrough -Wcovered-switch-default -Wno-noexcept-type -Wnon-virtual-dtor -Wdelete-non-virtual-dtor -Wsuggest-override -Wstring-conversion -fdiagnostics-color -O3  -isysroot /Applications/Xcode.app/Contents/Developer/Platforms/MacOSX.platform/Developer/SDKs/MacOSX10.15.sdk    -fno-exceptions -fno-rtti -UNDEBUG -std=c++14 -MD -MT tools/lld/wasm/CMakeFiles/lldWasm.dir/OutputSections.cpp.o -MF tools/lld/wasm/CMakeFiles/lldWasm.dir/OutputSections.cpp.o.d -o tools/lld/wasm/CMakeFiles/lldWasm.dir/OutputSections.cpp.o -c /Users/buildslave/jenkins/workspace/lldb-cmake/llvm-project/lld/wasm/OutputSections.cpp
[5139/5150] /Users/buildslave/jenkins/workspace/lldb-cmake/host-compiler/bin/clang++  -DGTEST_HAS_RTTI=0 -D_DEBUG -D__STDC_CONSTANT_MACROS -D__STDC_FORMAT_MACROS -D__STDC_LIMIT_MACROS -Itools/lld/wasm -I/Users/buildslave/jenkins/workspace/lldb-cmake/llvm-project/lld/wasm -I/Users/buildslave/jenkins/workspace/lldb-cmake/llvm-project/lld/include -Itools/lld/include -I/Applications/Xcode.app/Contents/Developer/Platforms/MacOSX.platform/Developer/SDKs/MacOSX10.15.sdk/usr/include/libxml2 -Iinclude -I/Users/buildslave/jenkins/workspace/lldb-cmake/llvm-project/llvm/include -Wdocumentation -fPIC -fvisibility-inlines-hidden -Werror=date-time -Werror=unguarded-availability-new -fmodules -fmodules-cache-path=/Users/buildslave/jenkins/workspace/lldb-cmake/lldb-build/module.cache -fcxx-modules -Xclang -fmodules-local-submodule-visibility -Wall -Wextra -Wno-unused-parameter -Wwrite-strings -Wcast-qual -Wmissing-field-initializers -pedantic -Wno-long-long -Wimplicit-fallthrough -Wcovered-switch-default -Wno-noexcept-type -Wnon-virtual-dtor -Wdelete-non-virtual-dtor -Wsuggest-override -Wstring-conversion -fdiagnostics-color -O3  -isysroot /Applications/Xcode.app/Contents/Developer/Platforms/MacOSX.platform/Developer/SDKs/MacOSX10.15.sdk    -fno-exceptions -fno-rtti -UNDEBUG -std=c++14 -MD -MT tools/lld/wasm/CMakeFiles/lldWasm.dir/LTO.cpp.o -MF tools/lld/wasm/CMakeFiles/lldWasm.dir/LTO.cpp.o.d -o tools/lld/wasm/CMakeFiles/lldWasm.dir/LTO.cpp.o -c /Users/buildslave/jenkins/workspace/lldb-cmake/llvm-project/lld/wasm/LTO.cpp
[5140/5150] /Users/buildslave/jenkins/workspace/lldb-cmake/host-compiler/bin/clang++  -DGTEST_HAS_RTTI=0 -D_DEBUG -D__STDC_CONSTANT_MACROS -D__STDC_FORMAT_MACROS -D__STDC_LIMIT_MACROS -Itools/lld/wasm -I/Users/buildslave/jenkins/workspace/lldb-cmake/llvm-project/lld/wasm -I/Users/buildslave/jenkins/workspace/lldb-cmake/llvm-project/lld/include -Itools/lld/include -I/Applications/Xcode.app/Contents/Developer/Platforms/MacOSX.platform/Developer/SDKs/MacOSX10.15.sdk/usr/include/libxml2 -Iinclude -I/Users/buildslave/jenkins/workspace/lldb-cmake/llvm-project/llvm/include -Wdocumentation -fPIC -fvisibility-inlines-hidden -Werror=date-time -Werror=unguarded-availability-new -fmodules -fmodules-cache-path=/Users/buildslave/jenkins/workspace/lldb-cmake/lldb-build/module.cache -fcxx-modules -Xclang -fmodules-local-submodule-visibility -Wall -Wextra -Wno-unused-parameter -Wwrite-strings -Wcast-qual -Wmissing-field-initializers -pedantic -Wno-long-long -Wimplicit-fallthrough -Wcovered-switch-default -Wno-noexcept-type -Wnon-virtual-dtor -Wdelete-non-virtual-dtor -Wsuggest-override -Wstring-conversion -fdiagnostics-color -O3  -isysroot /Applications/Xcode.app/Contents/Developer/Platforms/MacOSX.platform/Developer/SDKs/MacOSX10.15.sdk    -fno-exceptions -fno-rtti -UNDEBUG -std=c++14 -MD -MT tools/lld/wasm/CMakeFiles/lldWasm.dir/WriterUtils.cpp.o -MF tools/lld/wasm/CMakeFiles/lldWasm.dir/WriterUtils.cpp.o.d -o tools/lld/wasm/CMakeFiles/lldWasm.dir/WriterUtils.cpp.o -c /Users/buildslave/jenkins/workspace/lldb-cmake/llvm-project/lld/wasm/WriterUtils.cpp
[5141/5150] /Users/buildslave/jenkins/workspace/lldb-cmake/host-compiler/bin/clang++  -DGTEST_HAS_RTTI=0 -D_DEBUG -D__STDC_CONSTANT_MACROS -D__STDC_FORMAT_MACROS -D__STDC_LIMIT_MACROS -Itools/lld/wasm -I/Users/buildslave/jenkins/workspace/lldb-cmake/llvm-project/lld/wasm -I/Users/buildslave/jenkins/workspace/lldb-cmake/llvm-project/lld/include -Itools/lld/include -I/Applications/Xcode.app/Contents/Developer/Platforms/MacOSX.platform/Developer/SDKs/MacOSX10.15.sdk/usr/include/libxml2 -Iinclude -I/Users/buildslave/jenkins/workspace/lldb-cmake/llvm-project/llvm/include -Wdocumentation -fPIC -fvisibility-inlines-hidden -Werror=date-time -Werror=unguarded-availability-new -fmodules -fmodules-cache-path=/Users/buildslave/jenkins/workspace/lldb-cmake/lldb-build/module.cache -fcxx-modules -Xclang -fmodules-local-submodule-visibility -Wall -Wextra -Wno-unused-parameter -Wwrite-strings -Wcast-qual -Wmissing-field-initializers -pedantic -Wno-long-long -Wimplicit-fallthrough -Wcovered-switch-default -Wno-noexcept-type -Wnon-virtual-dtor -Wdelete-non-virtual-dtor -Wsuggest-override -Wstring-conversion -fdiagnostics-color -O3  -isysroot /Applications/Xcode.app/Contents/Developer/Platforms/MacOSX.platform/Developer/SDKs/MacOSX10.15.sdk    -fno-exceptions -fno-rtti -UNDEBUG -std=c++14 -MD -MT tools/lld/wasm/CMakeFiles/lldWasm.dir/Driver.cpp.o -MF tools/lld/wasm/CMakeFiles/lldWasm.dir/Driver.cpp.o.d -o tools/lld/wasm/CMakeFiles/lldWasm.dir/Driver.cpp.o -c /Users/buildslave/jenkins/workspace/lldb-cmake/llvm-project/lld/wasm/Driver.cpp
[5142/5150] /Users/buildslave/jenkins/workspace/lldb-cmake/host-compiler/bin/clang++  -DGTEST_HAS_RTTI=0 -D_DEBUG -D__STDC_CONSTANT_MACROS -D__STDC_FORMAT_MACROS -D__STDC_LIMIT_MACROS -Itools/lld/ELF -I/Users/buildslave/jenkins/workspace/lldb-cmake/llvm-project/lld/ELF -I/Users/buildslave/jenkins/workspace/lldb-cmake/llvm-project/lld/include -Itools/lld/include -I/Applications/Xcode.app/Contents/Developer/Platforms/MacOSX.platform/Developer/SDKs/MacOSX10.15.sdk/usr/include/libxml2 -Iinclude -I/Users/buildslave/jenkins/workspace/lldb-cmake/llvm-project/llvm/include -Wdocumentation -fPIC -fvisibility-inlines-hidden -Werror=date-time -Werror=unguarded-availability-new -fmodules -fmodules-cache-path=/Users/buildslave/jenkins/workspace/lldb-cmake/lldb-build/module.cache -fcxx-modules -Xclang -fmodules-local-submodule-visibility -Wall -Wextra -Wno-unused-parameter -Wwrite-strings -Wcast-qual -Wmissing-field-initializers -pedantic -Wno-long-long -Wimplicit-fallthrough -Wcovered-switch-default -Wno-noexcept-type -Wnon-virtual-dtor -Wdelete-non-virtual-dtor -Wsuggest-override -Wstring-conversion -fdiagnostics-color -O3  -isysroot /Applications/Xcode.app/Contents/Developer/Platforms/MacOSX.platform/Developer/SDKs/MacOSX10.15.sdk    -fno-exceptions -fno-rtti -UNDEBUG -std=c++14 -MD -MT tools/lld/ELF/CMakeFiles/lldELF.dir/ScriptParser.cpp.o -MF tools/lld/ELF/CMakeFiles/lldELF.dir/ScriptParser.cpp.o.d -o tools/lld/ELF/CMakeFiles/lldELF.dir/ScriptParser.cpp.o -c /Users/buildslave/jenkins/workspace/lldb-cmake/llvm-project/lld/ELF/ScriptParser.cpp
[5143/5150] /Users/buildslave/jenkins/workspace/lldb-cmake/host-compiler/bin/clang++  -DGTEST_HAS_RTTI=0 -D_DEBUG -D__STDC_CONSTANT_MACROS -D__STDC_FORMAT_MACROS -D__STDC_LIMIT_MACROS -Itools/lld/wasm -I/Users/buildslave/jenkins/workspace/lldb-cmake/llvm-project/lld/wasm -I/Users/buildslave/jenkins/workspace/lldb-cmake/llvm-project/lld/include -Itools/lld/include -I/Applications/Xcode.app/Contents/Developer/Platforms/MacOSX.platform/Developer/SDKs/MacOSX10.15.sdk/usr/include/libxml2 -Iinclude -I/Users/buildslave/jenkins/workspace/lldb-cmake/llvm-project/llvm/include -Wdocumentation -fPIC -fvisibility-inlines-hidden -Werror=date-time -Werror=unguarded-availability-new -fmodules -fmodules-cache-path=/Users/buildslave/jenkins/workspace/lldb-cmake/lldb-build/module.cache -fcxx-modules -Xclang -fmodules-local-submodule-visibility -Wall -Wextra -Wno-unused-parameter -Wwrite-strings -Wcast-qual -Wmissing-field-initializers -pedantic -Wno-long-long -Wimplicit-fallthrough -Wcovered-switch-default -Wno-noexcept-type -Wnon-virtual-dtor -Wdelete-non-virtual-dtor -Wsuggest-override -Wstring-conversion -fdiagnostics-color -O3  -isysroot /Applications/Xcode.app/Contents/Developer/Platforms/MacOSX.platform/Developer/SDKs/MacOSX10.15.sdk    -fno-exceptions -fno-rtti -UNDEBUG -std=c++14 -MD -MT tools/lld/wasm/CMakeFiles/lldWasm.dir/Symbols.cpp.o -MF tools/lld/wasm/CMakeFiles/lldWasm.dir/Symbols.cpp.o.d -o tools/lld/wasm/CMakeFiles/lldWasm.dir/Symbols.cpp.o -c /Users/buildslave/jenkins/workspace/lldb-cmake/llvm-project/lld/wasm/Symbols.cpp
[5144/5150] /Users/buildslave/jenkins/workspace/lldb-cmake/host-compiler/bin/clang++  -DGTEST_HAS_RTTI=0 -D_DEBUG -D__STDC_CONSTANT_MACROS -D__STDC_FORMAT_MACROS -D__STDC_LIMIT_MACROS -Itools/lld/wasm -I/Users/buildslave/jenkins/workspace/lldb-cmake/llvm-project/lld/wasm -I/Users/buildslave/jenkins/workspace/lldb-cmake/llvm-project/lld/include -Itools/lld/include -I/Applications/Xcode.app/Contents/Developer/Platforms/MacOSX.platform/Developer/SDKs/MacOSX10.15.sdk/usr/include/libxml2 -Iinclude -I/Users/buildslave/jenkins/workspace/lldb-cmake/llvm-project/llvm/include -Wdocumentation -fPIC -fvisibility-inlines-hidden -Werror=date-time -Werror=unguarded-availability-new -fmodules -fmodules-cache-path=/Users/buildslave/jenkins/workspace/lldb-cmake/lldb-build/module.cache -fcxx-modules -Xclang -fmodules-local-submodule-visibility -Wall -Wextra -Wno-unused-parameter -Wwrite-strings -Wcast-qual -Wmissing-field-initializers -pedantic -Wno-long-long -Wimplicit-fallthrough -Wcovered-switch-default -Wno-noexcept-type -Wnon-virtual-dtor -Wdelete-non-virtual-dtor -Wsuggest-override -Wstring-conversion -fdiagnostics-color -O3  -isysroot /Applications/Xcode.app/Contents/Developer/Platforms/MacOSX.platform/Developer/SDKs/MacOSX10.15.sdk    -fno-exceptions -fno-rtti -UNDEBUG -std=c++14 -MD -MT tools/lld/wasm/CMakeFiles/lldWasm.dir/SyntheticSections.cpp.o -MF tools/lld/wasm/CMakeFiles/lldWasm.dir/SyntheticSections.cpp.o.d -o tools/lld/wasm/CMakeFiles/lldWasm.dir/SyntheticSections.cpp.o -c /Users/buildslave/jenkins/workspace/lldb-cmake/llvm-project/lld/wasm/SyntheticSections.cpp
[5145/5150] /Users/buildslave/jenkins/workspace/lldb-cmake/host-compiler/bin/clang++  -DGTEST_HAS_RTTI=0 -D_DEBUG -D__STDC_CONSTANT_MACROS -D__STDC_FORMAT_MACROS -D__STDC_LIMIT_MACROS -Itools/lld/wasm -I/Users/buildslave/jenkins/workspace/lldb-cmake/llvm-project/lld/wasm -I/Users/buildslave/jenkins/workspace/lldb-cmake/llvm-project/lld/include -Itools/lld/include -I/Applications/Xcode.app/Contents/Developer/Platforms/MacOSX.platform/Developer/SDKs/MacOSX10.15.sdk/usr/include/libxml2 -Iinclude -I/Users/buildslave/jenkins/workspace/lldb-cmake/llvm-project/llvm/include -Wdocumentation -fPIC -fvisibility-inlines-hidden -Werror=date-time -Werror=unguarded-availability-new -fmodules -fmodules-cache-path=/Users/buildslave/jenkins/workspace/lldb-cmake/lldb-build/module.cache -fcxx-modules -Xclang -fmodules-local-submodule-visibility -Wall -Wextra -Wno-unused-parameter -Wwrite-strings -Wcast-qual -Wmissing-field-initializers -pedantic -Wno-long-long -Wimplicit-fallthrough -Wcovered-switch-default -Wno-noexcept-type -Wnon-virtual-dtor -Wdelete-non-virtual-dtor -Wsuggest-override -Wstring-conversion -fdiagnostics-color -O3  -isysroot /Applications/Xcode.app/Contents/Developer/Platforms/MacOSX.platform/Developer/SDKs/MacOSX10.15.sdk    -fno-exceptions -fno-rtti -UNDEBUG -std=c++14 -MD -MT tools/lld/wasm/CMakeFiles/lldWasm.dir/Writer.cpp.o -MF tools/lld/wasm/CMakeFiles/lldWasm.dir/Writer.cpp.o.d -o tools/lld/wasm/CMakeFiles/lldWasm.dir/Writer.cpp.o -c /Users/buildslave/jenkins/workspace/lldb-cmake/llvm-project/lld/wasm/Writer.cpp
[5146/5150] : && "/Applications/Xcode.app/Contents/Developer/Toolchains/XcodeDefault.xctoolchain/usr/bin/libtool" -static -no_warning_for_no_symbols -o lib/liblldWasm.a  tools/lld/wasm/CMakeFiles/lldWasm.dir/Driver.cpp.o tools/lld/wasm/CMakeFiles/lldWasm.dir/InputChunks.cpp.o tools/lld/wasm/CMakeFiles/lldWasm.dir/InputFiles.cpp.o tools/lld/wasm/CMakeFiles/lldWasm.dir/LTO.cpp.o tools/lld/wasm/CMakeFiles/lldWasm.dir/MarkLive.cpp.o tools/lld/wasm/CMakeFiles/lldWasm.dir/OutputSections.cpp.o tools/lld/wasm/CMakeFiles/lldWasm.dir/Relocations.cpp.o tools/lld/wasm/CMakeFiles/lldWasm.dir/SymbolTable.cpp.o tools/lld/wasm/CMakeFiles/lldWasm.dir/Symbols.cpp.o tools/lld/wasm/CMakeFiles/lldWasm.dir/SyntheticSections.cpp.o tools/lld/wasm/CMakeFiles/lldWasm.dir/Writer.cpp.o tools/lld/wasm/CMakeFiles/lldWasm.dir/WriterUtils.cpp.o && :
[5147/5150] /Users/buildslave/jenkins/workspace/lldb-cmake/host-compiler/bin/clang++  -DGTEST_HAS_RTTI=0 -D_DEBUG -D__STDC_CONSTANT_MACROS -D__STDC_FORMAT_MACROS -D__STDC_LIMIT_MACROS -Itools/lld/ELF -I/Users/buildslave/jenkins/workspace/lldb-cmake/llvm-project/lld/ELF -I/Users/buildslave/jenkins/workspace/lldb-cmake/llvm-project/lld/include -Itools/lld/include -I/Applications/Xcode.app/Contents/Developer/Platforms/MacOSX.platform/Developer/SDKs/MacOSX10.15.sdk/usr/include/libxml2 -Iinclude -I/Users/buildslave/jenkins/workspace/lldb-cmake/llvm-project/llvm/include -Wdocumentation -fPIC -fvisibility-inlines-hidden -Werror=date-time -Werror=unguarded-availability-new -fmodules -fmodules-cache-path=/Users/buildslave/jenkins/workspace/lldb-cmake/lldb-build/module.cache -fcxx-modules -Xclang -fmodules-local-submodule-visibility -Wall -Wextra -Wno-unused-parameter -Wwrite-strings -Wcast-qual -Wmissing-field-initializers -pedantic -Wno-long-long -Wimplicit-fallthrough -Wcovered-switch-default -Wno-noexcept-type -Wnon-virtual-dtor -Wdelete-non-virtual-dtor -Wsuggest-override -Wstring-conversion -fdiagnostics-color -O3  -isysroot /Applications/Xcode.app/Contents/Developer/Platforms/MacOSX.platform/Developer/SDKs/MacOSX10.15.sdk    -fno-exceptions -fno-rtti -UNDEBUG -std=c++14 -MD -MT tools/lld/ELF/CMakeFiles/lldELF.dir/Writer.cpp.o -MF tools/lld/ELF/CMakeFiles/lldELF.dir/Writer.cpp.o.d -o tools/lld/ELF/CMakeFiles/lldELF.dir/Writer.cpp.o -c /Users/buildslave/jenkins/workspace/lldb-cmake/llvm-project/lld/ELF/Writer.cpp
[5148/5150] /Users/buildslave/jenkins/workspace/lldb-cmake/host-compiler/bin/clang++  -DGTEST_HAS_RTTI=0 -D_DEBUG -D__STDC_CONSTANT_MACROS -D__STDC_FORMAT_MACROS -D__STDC_LIMIT_MACROS -Itools/lld/ELF -I/Users/buildslave/jenkins/workspace/lldb-cmake/llvm-project/lld/ELF -I/Users/buildslave/jenkins/workspace/lldb-cmake/llvm-project/lld/include -Itools/lld/include -I/Applications/Xcode.app/Contents/Developer/Platforms/MacOSX.platform/Developer/SDKs/MacOSX10.15.sdk/usr/include/libxml2 -Iinclude -I/Users/buildslave/jenkins/workspace/lldb-cmake/llvm-project/llvm/include -Wdocumentation -fPIC -fvisibility-inlines-hidden -Werror=date-time -Werror=unguarded-availability-new -fmodules -fmodules-cache-path=/Users/buildslave/jenkins/workspace/lldb-cmake/lldb-build/module.cache -fcxx-modules -Xclang -fmodules-local-submodule-visibility -Wall -Wextra -Wno-unused-parameter -Wwrite-strings -Wcast-qual -Wmissing-field-initializers -pedantic -Wno-long-long -Wimplicit-fallthrough -Wcovered-switch-default -Wno-noexcept-type -Wnon-virtual-dtor -Wdelete-non-virtual-dtor -Wsuggest-override -Wstring-conversion -fdiagnostics-color -O3  -isysroot /Applications/Xcode.app/Contents/Developer/Platforms/MacOSX.platform/Developer/SDKs/MacOSX10.15.sdk    -fno-exceptions -fno-rtti -UNDEBUG -std=c++14 -MD -MT tools/lld/ELF/CMakeFiles/lldELF.dir/SyntheticSections.cpp.o -MF tools/lld/ELF/CMakeFiles/lldELF.dir/SyntheticSections.cpp.o.d -o tools/lld/ELF/CMakeFiles/lldELF.dir/SyntheticSections.cpp.o -c /Users/buildslave/jenkins/workspace/lldb-cmake/llvm-project/lld/ELF/SyntheticSections.cpp
[5149/5150] : && "/Applications/Xcode.app/Contents/Developer/Toolchains/XcodeDefault.xctoolchain/usr/bin/libtool" -static -no_warning_for_no_symbols -o lib/liblldELF.a  tools/lld/ELF/CMakeFiles/lldELF.dir/AArch64ErrataFix.cpp.o tools/lld/ELF/CMakeFiles/lldELF.dir/Arch/AArch64.cpp.o tools/lld/ELF/CMakeFiles/lldELF.dir/Arch/AMDGPU.cpp.o tools/lld/ELF/CMakeFiles/lldELF.dir/Arch/ARM.cpp.o tools/lld/ELF/CMakeFiles/lldELF.dir/Arch/AVR.cpp.o tools/lld/ELF/CMakeFiles/lldELF.dir/Arch/Hexagon.cpp.o tools/lld/ELF/CMakeFiles/lldELF.dir/Arch/Mips.cpp.o tools/lld/ELF/CMakeFiles/lldELF.dir/Arch/MipsArchTree.cpp.o tools/lld/ELF/CMakeFiles/lldELF.dir/Arch/MSP430.cpp.o tools/lld/ELF/CMakeFiles/lldELF.dir/Arch/PPC.cpp.o tools/lld/ELF/CMakeFiles/lldELF.dir/Arch/PPC64.cpp.o tools/lld/ELF/CMakeFiles/lldELF.dir/Arch/RISCV.cpp.o tools/lld/ELF/CMakeFiles/lldELF.dir/Arch/SPARCV9.cpp.o tools/lld/ELF/CMakeFiles/lldELF.dir/Arch/X86.cpp.o tools/lld/ELF/CMakeFiles/lldELF.dir/Arch/X86_64.cpp.o tools/lld/ELF/CMakeFiles/lldELF.dir/ARMErrataFix.cpp.o tools/lld/ELF/CMakeFiles/lldELF.dir/CallGraphSort.cpp.o tools/lld/ELF/CMakeFiles/lldELF.dir/DWARF.cpp.o tools/lld/ELF/CMakeFiles/lldELF.dir/Driver.cpp.o tools/lld/ELF/CMakeFiles/lldELF.dir/DriverUtils.cpp.o tools/lld/ELF/CMakeFiles/lldELF.dir/EhFrame.cpp.o tools/lld/ELF/CMakeFiles/lldELF.dir/ICF.cpp.o tools/lld/ELF/CMakeFiles/lldELF.dir/InputFiles.cpp.o tools/lld/ELF/CMakeFiles/lldELF.dir/InputSection.cpp.o tools/lld/ELF/CMakeFiles/lldELF.dir/LTO.cpp.o tools/lld/ELF/CMakeFiles/lldELF.dir/LinkerScript.cpp.o tools/lld/ELF/CMakeFiles/lldELF.dir/MapFile.cpp.o tools/lld/ELF/CMakeFiles/lldELF.dir/MarkLive.cpp.o tools/lld/ELF/CMakeFiles/lldELF.dir/OutputSections.cpp.o tools/lld/ELF/CMakeFiles/lldELF.dir/Relocations.cpp.o tools/lld/ELF/CMakeFiles/lldELF.dir/ScriptLexer.cpp.o tools/lld/ELF/CMakeFiles/lldELF.dir/ScriptParser.cpp.o tools/lld/ELF/CMakeFiles/lldELF.dir/SymbolTable.cpp.o tools/lld/ELF/CMakeFiles/lldELF.dir/Symbols.cpp.o tools/lld/ELF/CMakeFiles/lldELF.dir/SyntheticSections.cpp.o tools/lld/ELF/CMakeFiles/lldELF.dir/Target.cpp.o tools/lld/ELF/CMakeFiles/lldELF.dir/Thunks.cpp.o tools/lld/ELF/CMakeFiles/lldELF.dir/Writer.cpp.o && :
[5150/5150] : && /Users/buildslave/jenkins/workspace/lldb-cmake/host-compiler/bin/clang++  -Wdocumentation -fPIC -fvisibility-inlines-hidden -Werror=date-time -Werror=unguarded-availability-new -fmodules -fmodules-cache-path=/Users/buildslave/jenkins/workspace/lldb-cmake/lldb-build/module.cache -fcxx-modules -Xclang -fmodules-local-submodule-visibility -Wall -Wextra -Wno-unused-parameter -Wwrite-strings -Wcast-qual -Wmissing-field-initializers -pedantic -Wno-long-long -Wimplicit-fallthrough -Wcovered-switch-default -Wno-noexcept-type -Wnon-virtual-dtor -Wdelete-non-virtual-dtor -Wsuggest-override -Wstring-conversion -fdiagnostics-color -O3  -isysroot /Applications/Xcode.app/Contents/Developer/Platforms/MacOSX.platform/Developer/SDKs/MacOSX10.15.sdk -Wl,-search_paths_first -Wl,-headerpad_max_install_names -rdynamic tools/lld/tools/lld/CMakeFiles/lld.dir/lld.cpp.o  -o bin/lld  -Wl,-rpath,@loader_path/../lib  lib/libLLVMSupport.a  lib/liblldCommon.a  lib/liblldCOFF.a  lib/liblldDriver.a  lib/liblldELF.a  lib/liblldMachO2.a  lib/liblldMinGW.a  lib/liblldWasm.a  lib/liblldMachO.a  lib/liblldReaderWriter.a  lib/liblldYAML.a  lib/liblldCore.a  lib/liblldCOFF.a  lib/libLLVMDebugInfoPDB.a  lib/libLLVMLibDriver.a  lib/libLLVMWindowsManifest.a  /usr/lib/libxml2.dylib  lib/liblldCommon.a  lib/libLLVMOption.a  lib/libLLVMAArch64CodeGen.a  lib/libLLVMAArch64AsmParser.a  lib/libLLVMAArch64Disassembler.a  lib/libLLVMAArch64Desc.a  lib/libLLVMAArch64Info.a  lib/libLLVMAArch64Utils.a  lib/libLLVMAMDGPUCodeGen.a  lib/libLLVMMIRParser.a  lib/libLLVMAMDGPUAsmParser.a  lib/libLLVMAMDGPUDisassembler.a  lib/libLLVMAMDGPUDesc.a  lib/libLLVMAMDGPUInfo.a  lib/libLLVMAMDGPUUtils.a  lib/libLLVMARMCodeGen.a  lib/libLLVMARMAsmParser.a  lib/libLLVMARMDisassembler.a  lib/libLLVMARMDesc.a  lib/libLLVMARMInfo.a  lib/libLLVMARMUtils.a  lib/libLLVMAVRCodeGen.a  lib/libLLVMAVRAsmParser.a  lib/libLLVMAVRDesc.a  lib/libLLVMAVRDisassembler.a  lib/libLLVMAVRInfo.a  lib/libLLVMBPFCodeGen.a  lib/libLLVMBPFAsmParser.a  lib/libLLVMBPFDesc.a  lib/libLLVMBPFDisassembler.a  lib/libLLVMBPFInfo.a  lib/libLLVMHexagonCodeGen.a  lib/libLLVMHexagonAsmParser.a  lib/libLLVMHexagonDisassembler.a  lib/libLLVMHexagonDesc.a  lib/libLLVMHexagonInfo.a  lib/libLLVMLanaiCodeGen.a  lib/libLLVMLanaiAsmParser.a  lib/libLLVMLanaiDisassembler.a  lib/libLLVMLanaiDesc.a  lib/libLLVMLanaiInfo.a  lib/libLLVMMipsCodeGen.a  lib/libLLVMMipsAsmParser.a  lib/libLLVMMipsDesc.a  lib/libLLVMMipsDisassembler.a  lib/libLLVMMipsInfo.a  lib/libLLVMMSP430CodeGen.a  lib/libLLVMMSP430AsmParser.a  lib/libLLVMMSP430Desc.a  lib/libLLVMMSP430Disassembler.a  lib/libLLVMMSP430Info.a  lib/libLLVMNVPTXCodeGen.a  lib/libLLVMNVPTXDesc.a  lib/libLLVMNVPTXInfo.a  lib/libLLVMPowerPCCodeGen.a  lib/libLLVMPowerPCAsmParser.a  lib/libLLVMPowerPCDesc.a  lib/libLLVMPowerPCDisassembler.a  lib/libLLVMPowerPCInfo.a  lib/libLLVMRISCVCodeGen.a  lib/libLLVMRISCVAsmParser.a  lib/libLLVMRISCVDesc.a  lib/libLLVMRISCVDisassembler.a  lib/libLLVMRISCVInfo.a  lib/libLLVMRISCVUtils.a  lib/libLLVMSparcCodeGen.a  lib/libLLVMSparcAsmParser.a  lib/libLLVMSparcDesc.a  lib/libLLVMSparcDisassembler.a  lib/libLLVMSparcInfo.a  lib/libLLVMSystemZCodeGen.a  lib/libLLVMSystemZAsmParser.a  lib/libLLVMSystemZDisassembler.a  lib/libLLVMSystemZDesc.a  lib/libLLVMSystemZInfo.a  lib/libLLVMWebAssemblyCodeGen.a  lib/libLLVMWebAssemblyAsmParser.a  lib/libLLVMWebAssemblyDisassembler.a  lib/libLLVMWebAssemblyDesc.a  lib/libLLVMWebAssemblyInfo.a  lib/libLLVMX86CodeGen.a  lib/libLLVMCFGuard.a  lib/libLLVMGlobalISel.a  lib/libLLVMX86AsmParser.a  lib/libLLVMX86Desc.a  lib/libLLVMX86Disassembler.a  lib/libLLVMX86Info.a  lib/libLLVMXCoreCodeGen.a  lib/libLLVMAsmPrinter.a  lib/libLLVMDebugInfoDWARF.a  lib/libLLVMSelectionDAG.a  lib/libLLVMXCoreDesc.a  lib/libLLVMXCoreDisassembler.a  lib/libLLVMMCDisassembler.a  lib/libLLVMXCoreInfo.a  lib/libLLVMLTO.a  lib/libLLVMCodeGen.a  lib/libLLVMExtensions.a  lib/libLLVMObjCARCOpts.a  lib/libLLVMPasses.a  lib/libLLVMTarget.a  lib/libLLVMCoroutines.a  lib/libLLVMipo.a  lib/libLLVMBitWriter.a  lib/libLLVMScalarOpts.a  lib/libLLVMVectorize.a  lib/libLLVMAggressiveInstCombine.a  lib/libLLVMInstCombine.a  lib/libLLVMLinker.a  lib/libLLVMFrontendOpenMP.a  lib/libLLVMIRReader.a  lib/libLLVMAsmParser.a  lib/libLLVMInstrumentation.a  lib/libLLVMTransformUtils.a  lib/libLLVMAnalysis.a  lib/libLLVMObject.a  lib/libLLVMTextAPI.a  lib/libLLVMBitReader.a  lib/libLLVMMCParser.a  lib/libLLVMMC.a  lib/libLLVMDebugInfoCodeView.a  lib/libLLVMDebugInfoMSF.a  lib/libLLVMProfileData.a  lib/libLLVMCore.a  lib/libLLVMBinaryFormat.a  lib/libLLVMRemarks.a  lib/libLLVMBitstreamReader.a  lib/libLLVMSupport.a  -lcurses  -lm  /usr/lib/libz.dylib  lib/libLLVMDemangle.a && cd /Users/buildslave/jenkins/workspace/lldb-cmake/lldb-build/tools/lld/tools/lld && /usr/local/Cellar/cmake/3.17.2/bin/cmake -E create_symlink lld /Users/buildslave/jenkins/workspace/lldb-cmake/lldb-build/./bin/lld-link && cd /Users/buildslave/jenkins/workspace/lldb-cmake/lldb-build/tools/lld/tools/lld && /usr/local/Cellar/cmake/3.17.2/bin/cmake -E create_symlink lld /Users/buildslave/jenkins/workspace/lldb-cmake/lldb-build/./bin/ld.lld && cd /Users/buildslave/jenkins/workspace/lldb-cmake/lldb-build/tools/lld/tools/lld && /usr/local/Cellar/cmake/3.17.2/bin/cmake -E create_symlink lld /Users/buildslave/jenkins/workspace/lldb-cmake/lldb-build/./bin/ld64.lld && cd /Users/buildslave/jenkins/workspace/lldb-cmake/lldb-build/tools/lld/tools/lld && /usr/local/Cellar/cmake/3.17.2/bin/cmake -E create_symlink lld /Users/buildslave/jenkins/workspace/lldb-cmake/lldb-build/./bin/wasm-ld
Completed at: 2020-08-03T15:03:53
@@@@@@
[Pipeline] }
[Pipeline] // timeout
[Pipeline] }
[Pipeline] // stage
[Pipeline] stage
[Pipeline] { (Test)
[Pipeline] timeout
Timeout set to expire in 1 hr 0 min
[Pipeline] {
[Pipeline] sh
+ set -u
+ export PATH=/usr/local/bin:/usr/local/sbin:/usr/bin:/bin:/usr/sbin:/sbin:/usr/bin:/usr/local/bin
+ PATH=/usr/local/bin:/usr/local/sbin:/usr/bin:/bin:/usr/sbin:/sbin:/usr/bin:/usr/local/bin
+ export LLDB_CAPTURE_REPRODUCER=1
+ LLDB_CAPTURE_REPRODUCER=1
+ rm -rf test/results.xml
+ python llvm-zorg/zorg/jenkins/monorepo_build.py lldb-cmake testlong
You are using pip version 18.1, however version 20.2 is available.
You should consider upgrading via the 'pip install --upgrade pip' command.
You are using pip version 18.1, however version 20.2 is available.
You should consider upgrading via the 'pip install --upgrade pip' command.
Dependency met os_version v10.15.5
Dependency met brew cmake v3.17.2
Dependency met brew ninja v1.8.2
Dependency met pip psutil v5.4.5
Dependency met pip six v1.11.0
Dependency met xcode v11.5
Clean

Hide Details

@@@ Clean @@@ Removing module cache: /Users/buildslave/jenkins/workspace/lldb-cmake/lldb-build/module.cache Completed at: 2020-08-03T15:05:41 @@@@@@
Run Debug Info Tests

Hide Details

@@@ Run Debug Info Tests @@@ cd /Users/buildslave/jenkins/workspace/lldb-cmake/lldb-build '/usr/local/bin/ninja' '-v' 'check-debuginfo' [1/3] cd /Users/buildslave/jenkins/workspace/lldb-cmake/lldb-build/tools/lldb && /usr/local/Cellar/cmake/3.17.2/bin/cmake -E make_directory /Users/buildslave/jenkins/workspace/lldb-cmake/lldb-build/./lib/python3.7/site-packages/lldb [2/3] cd /Users/buildslave/jenkins/workspace/lldb-cmake/lldb-build/tools/lldb && /usr/local/Cellar/cmake/3.17.2/bin/cmake -E copy /Users/buildslave/jenkins/workspace/lldb-cmake/llvm-project/lldb/third_party/Python/module/six/six.py /Users/buildslave/jenkins/workspace/lldb-cmake/lldb-build/./lib/python3.7/site-packages/lldb/../six.py && cd /Users/buildslave/jenkins/workspace/lldb-cmake/lldb-build/tools/lldb && /usr/local/Cellar/cmake/3.17.2/bin/cmake -E copy /Users/buildslave/jenkins/workspace/lldb-cmake/lldb-build/tools/lldb/bindings/lldb.py /Users/buildslave/jenkins/workspace/lldb-cmake/lldb-build/./lib/python3.7/site-packages/lldb/__init__.py && cd /Users/buildslave/jenkins/workspace/lldb-cmake/lldb-build/tools/lldb && /usr/local/Cellar/cmake/3.17.2/bin/cmake -E copy /Users/buildslave/jenkins/workspace/lldb-cmake/llvm-project/lldb/source/Interpreter/embedded_interpreter.py /Users/buildslave/jenkins/workspace/lldb-cmake/lldb-build/./lib/python3.7/site-packages/lldb && cd /Users/buildslave/jenkins/workspace/lldb-cmake/lldb-build/lib/python3.7/site-packages/lldb && /usr/local/Cellar/cmake/3.17.2/bin/cmake -E make_directory formatters/cpp && /usr/local/Cellar/cmake/3.17.2/bin/cmake -E copy /Users/buildslave/jenkins/workspace/lldb-cmake/llvm-project/lldb/examples/synthetic/gnu_libstdcpp.py /Users/buildslave/jenkins/workspace/lldb-cmake/llvm-project/lldb/examples/synthetic/libcxx.py formatters/cpp && /usr/local/Frameworks/Python.framework/Versions/3.7/bin/python3.7 /Users/buildslave/jenkins/workspace/lldb-cmake/llvm-project/lldb/bindings/python/createPythonInit.py formatters/cpp /Users/buildslave/jenkins/workspace/lldb-cmake/llvm-project/lldb/examples/synthetic/gnu_libstdcpp.py /Users/buildslave/jenkins/workspace/lldb-cmake/llvm-project/lldb/examples/synthetic/libcxx.py && cd /Users/buildslave/jenkins/workspace/lldb-cmake/lldb-build/lib/python3.7/site-packages/lldb && /usr/local/Cellar/cmake/3.17.2/bin/cmake -E make_directory formatters && /usr/local/Cellar/cmake/3.17.2/bin/cmake -E copy /Users/buildslave/jenkins/workspace/lldb-cmake/llvm-project/lldb/examples/summaries/cocoa/cache.py /Users/buildslave/jenkins/workspace/lldb-cmake/llvm-project/lldb/examples/summaries/synth.py /Users/buildslave/jenkins/workspace/lldb-cmake/llvm-project/lldb/examples/summaries/cocoa/metrics.py /Users/buildslave/jenkins/workspace/lldb-cmake/llvm-project/lldb/examples/summaries/cocoa/attrib_fromdict.py /Users/buildslave/jenkins/workspace/lldb-cmake/llvm-project/lldb/examples/summaries/cocoa/Logger.py formatters && /usr/local/Frameworks/Python.framework/Versions/3.7/bin/python3.7 /Users/buildslave/jenkins/workspace/lldb-cmake/llvm-project/lldb/bindings/python/createPythonInit.py formatters /Users/buildslave/jenkins/workspace/lldb-cmake/llvm-project/lldb/examples/summaries/cocoa/cache.py /Users/buildslave/jenkins/workspace/lldb-cmake/llvm-project/lldb/examples/summaries/synth.py /Users/buildslave/jenkins/workspace/lldb-cmake/llvm-project/lldb/examples/summaries/cocoa/metrics.py /Users/buildslave/jenkins/workspace/lldb-cmake/llvm-project/lldb/examples/summaries/cocoa/attrib_fromdict.py /Users/buildslave/jenkins/workspace/lldb-cmake/llvm-project/lldb/examples/summaries/cocoa/Logger.py && cd /Users/buildslave/jenkins/workspace/lldb-cmake/lldb-build/lib/python3.7/site-packages/lldb && /usr/local/Cellar/cmake/3.17.2/bin/cmake -E make_directory utils && /usr/local/Cellar/cmake/3.17.2/bin/cmake -E copy /Users/buildslave/jenkins/workspace/lldb-cmake/llvm-project/lldb/examples/python/in_call_stack.py /Users/buildslave/jenkins/workspace/lldb-cmake/llvm-project/lldb/examples/python/symbolication.py utils && /usr/local/Frameworks/Python.framework/Versions/3.7/bin/python3.7 /Users/buildslave/jenkins/workspace/lldb-cmake/llvm-project/lldb/bindings/python/createPythonInit.py utils /Users/buildslave/jenkins/workspace/lldb-cmake/llvm-project/lldb/examples/python/in_call_stack.py /Users/buildslave/jenkins/workspace/lldb-cmake/llvm-project/lldb/examples/python/symbolication.py && cd /Users/buildslave/jenkins/workspace/lldb-cmake/lldb-build/lib/python3.7/site-packages/lldb && /usr/local/Cellar/cmake/3.17.2/bin/cmake -E make_directory macosx && /usr/local/Cellar/cmake/3.17.2/bin/cmake -E copy /Users/buildslave/jenkins/workspace/lldb-cmake/llvm-project/lldb/examples/python/crashlog.py /Users/buildslave/jenkins/workspace/lldb-cmake/llvm-project/lldb/examples/darwin/heap_find/heap.py macosx && /usr/local/Frameworks/Python.framework/Versions/3.7/bin/python3.7 /Users/buildslave/jenkins/workspace/lldb-cmake/llvm-project/lldb/bindings/python/createPythonInit.py macosx /Users/buildslave/jenkins/workspace/lldb-cmake/llvm-project/lldb/examples/python/crashlog.py /Users/buildslave/jenkins/workspace/lldb-cmake/llvm-project/lldb/examples/darwin/heap_find/heap.py && cd /Users/buildslave/jenkins/workspace/lldb-cmake/lldb-build/lib/python3.7/site-packages/lldb && /usr/local/Cellar/cmake/3.17.2/bin/cmake -E make_directory macosx/heap && /usr/local/Cellar/cmake/3.17.2/bin/cmake -E copy /Users/buildslave/jenkins/workspace/lldb-cmake/llvm-project/lldb/examples/darwin/heap_find/heap/heap_find.cpp /Users/buildslave/jenkins/workspace/lldb-cmake/llvm-project/lldb/examples/darwin/heap_find/heap/Makefile macosx/heap && cd /Users/buildslave/jenkins/workspace/lldb-cmake/lldb-build/lib/python3.7/site-packages/lldb && /usr/local/Cellar/cmake/3.17.2/bin/cmake -E make_directory diagnose && /usr/local/Cellar/cmake/3.17.2/bin/cmake -E copy /Users/buildslave/jenkins/workspace/lldb-cmake/llvm-project/lldb/examples/python/diagnose_unwind.py /Users/buildslave/jenkins/workspace/lldb-cmake/llvm-project/lldb/examples/python/diagnose_nsstring.py diagnose && /usr/local/Frameworks/Python.framework/Versions/3.7/bin/python3.7 /Users/buildslave/jenkins/workspace/lldb-cmake/llvm-project/lldb/bindings/python/createPythonInit.py diagnose /Users/buildslave/jenkins/workspace/lldb-cmake/llvm-project/lldb/examples/python/diagnose_unwind.py /Users/buildslave/jenkins/workspace/lldb-cmake/llvm-project/lldb/examples/python/diagnose_nsstring.py && cd /Users/buildslave/jenkins/workspace/lldb-cmake/lldb-build/lib/python3.7/site-packages/lldb && /usr/local/Cellar/cmake/3.17.2/bin/cmake -E create_symlink ../../../liblldb.dylib _lldb.so && cd /Users/buildslave/jenkins/workspace/lldb-cmake/lldb-build/lib/python3.7/site-packages/lldb && /usr/local/Cellar/cmake/3.17.2/bin/cmake -E create_symlink ../../../../bin/lldb-argdumper lldb-argdumper [2/3] cd /Users/buildslave/jenkins/workspace/lldb-cmake/lldb-build/projects/debuginfo-tests && /usr/local/Frameworks/Python.framework/Versions/3.7/bin/python3.7 /Users/buildslave/jenkins/workspace/lldb-cmake/lldb-build/./bin/llvm-lit -v --time-tests --shuffle --xunit-xml-output=/Users/buildslave/jenkins/workspace/lldb-cmake/test/results.xml -v /Users/buildslave/jenkins/workspace/lldb-cmake/lldb-build/projects/debuginfo-tests -- Testing: 60 tests, 8 workers -- llvm-lit: /Users/buildslave/jenkins/workspace/lldb-cmake/lldb-build/bin/../../llvm-project/llvm/utils/lit/lit/llvm/config.py:345: note: using clang: /Users/buildslave/jenkins/workspace/lldb-cmake/lldb-build/bin/clang llvm-lit: /Users/buildslave/jenkins/workspace/lldb-cmake/lldb-build/bin/../../llvm-project/llvm/utils/lit/lit/llvm/config.py:345: note: using clang++: /Users/buildslave/jenkins/workspace/lldb-cmake/lldb-build/bin/clang++ llvm-lit: /Users/buildslave/jenkins/workspace/lldb-cmake/lldb-build/bin/../../llvm-project/llvm/utils/lit/lit/llvm/config.py:345: note: using clang-cl: /Users/buildslave/jenkins/workspace/lldb-cmake/lldb-build/bin/clang-cl llvm-lit: /Users/buildslave/jenkins/workspace/lldb-cmake/lldb-build/bin/../../llvm-project/llvm/utils/lit/lit/llvm/config.py:345: note: using lldb: /Users/buildslave/jenkins/workspace/lldb-cmake/lldb-build/bin/lldb llvm-lit: /Users/buildslave/jenkins/workspace/lldb-cmake/lldb-build/bin/../../llvm-project/llvm/utils/lit/lit/util.py:408: note: using SDKROOT: '/Applications/Xcode.app/Contents/Developer/Platforms/MacOSX.platform/Developer/SDKs/MacOSX10.15.sdk' UNSUPPORTED: debuginfo-tests :: llvm-prettyprinters/gdb/llvm-support.gdb (1 of 60) UNSUPPORTED: debuginfo-tests :: dexter/feature_tests/commands/perfect/expect_step_order.cpp (2 of 60) UNSUPPORTED: debuginfo-tests :: dexter/feature_tests/commands/perfect/limit_steps/limit_steps_same_line_conditional.cpp (3 of 60) UNSUPPORTED: debuginfo-tests :: dexter/feature_tests/commands/perfect/expect_watch_type.cpp (4 of 60) UNSUPPORTED: debuginfo-tests :: dexter/feature_tests/commands/perfect/expect_step_kind/direction.cpp (5 of 60) UNSUPPORTED: debuginfo-tests :: dexter-tests/realigned-frame.cpp (6 of 60) PASS: debuginfo-tests :: dexter/feature_tests/subtools/help/help.test (7 of 60) UNSUPPORTED: debuginfo-tests :: dexter/feature_tests/commands/perfect/limit_steps/limit_steps_expect_loop.cpp (8 of 60) PASS: debuginfo-tests :: dexter/feature_tests/unittests/run.test (9 of 60) PASS: debuginfo-tests :: dexter/feature_tests/subtools/test/err_paren.cpp (10 of 60) PASS: debuginfo-tests :: dexter/feature_tests/subtools/test/err_type_mline.cpp (11 of 60) UNSUPPORTED: debuginfo-tests :: dexter-tests/global-constant.cpp (12 of 60) UNSUPPORTED: debuginfo-tests :: dexter/feature_tests/commands/perfect/limit_steps/limit_steps_expect_value.cpp (13 of 60) UNSUPPORTED: debuginfo-tests :: dexter/feature_tests/commands/penalty/expect_step_order.cpp (14 of 60) UNSUPPORTED: debuginfo-tests :: dexter/feature_tests/commands/perfect/limit_steps/limit_steps_overlapping_ranges.cpp (15 of 60) UNSUPPORTED: debuginfo-tests :: dexter/feature_tests/commands/perfect/unreachable.cpp (16 of 60) PASS: debuginfo-tests :: dexter/feature_tests/subtools/test/err_syntax_mline.cpp (17 of 60) PASS: debuginfo-tests :: dexter/feature_tests/subtools/list-debuggers/list-debuggers.test (18 of 60) PASS: debuginfo-tests :: llgdb-tests/forward-declare-class.cpp (19 of 60) UNSUPPORTED: debuginfo-tests :: dexter-tests/inline-line-gap.cpp (20 of 60) UNSUPPORTED: debuginfo-tests :: dexter/feature_tests/commands/perfect/expect_step_kind/func.cpp (21 of 60) UNSUPPORTED: debuginfo-tests :: dexter/feature_tests/commands/perfect/expect_step_kind/func_external.cpp (22 of 60) PASS: debuginfo-tests :: llgdb-tests/block_var.m (23 of 60) UNSUPPORTED: debuginfo-tests :: dexter/feature_tests/commands/perfect/expect_step_kind/recursive.cpp (24 of 60) PASS: debuginfo-tests :: llgdb-tests/nrvo-string.cpp (25 of 60) PASS: debuginfo-tests :: llgdb-tests/blocks.m (26 of 60) UNSUPPORTED: debuginfo-tests :: dexter-tests/hello.c (27 of 60) PASS: debuginfo-tests :: dexter-tests/stack-var.c (28 of 60) UNSUPPORTED: debuginfo-tests :: dexter/feature_tests/commands/perfect/expect_step_kind/small_loop.cpp (29 of 60) PASS: debuginfo-tests :: dexter-tests/asan.c (30 of 60) UNSUPPORTED: debuginfo-tests :: dexter/feature_tests/commands/penalty/expect_watch_value.cpp (31 of 60) UNSUPPORTED: debuginfo-tests :: dexter-tests/nrvo.cpp (32 of 60) PASS: debuginfo-tests :: dexter-tests/aggregate-indirect-arg.cpp (33 of 60) PASS: debuginfo-tests :: llgdb-tests/nested-struct.cpp (34 of 60) UNSUPPORTED: debuginfo-tests :: dexter/feature_tests/commands/perfect/expect_watch_value.cpp (35 of 60) PASS: debuginfo-tests :: llgdb-tests/asan.c (36 of 60) PASS: debuginfo-tests :: dexter/feature_tests/subtools/test/err_type.cpp (37 of 60) UNSUPPORTED: debuginfo-tests :: dexter/feature_tests/commands/perfect/limit_steps/limit_steps_check_json_step_count.cpp (38 of 60) PASS: debuginfo-tests :: dexter/feature_tests/subtools/test/err_paren_mline.cpp (39 of 60) UNSUPPORTED: debuginfo-tests :: dexter/feature_tests/subtools/clang-opt-bisect/clang-opt-bisect.cpp (40 of 60) PASS: debuginfo-tests :: dexter-tests/ctor.cpp (41 of 60) UNSUPPORTED: debuginfo-tests :: llgdb-tests/safestack.c (42 of 60) PASS: debuginfo-tests :: dexter-tests/dbg-arg.c (43 of 60) PASS: debuginfo-tests :: dexter/feature_tests/subtools/view.cpp (44 of 60) UNSUPPORTED: debuginfo-tests :: dexter/feature_tests/commands/penalty/expect_watch_type.cpp (45 of 60) PASS: debuginfo-tests :: llgdb-tests/static-member.cpp (46 of 60) UNSUPPORTED: debuginfo-tests :: dexter/feature_tests/commands/perfect/expect_program_state.cpp (47 of 60) XFAIL: debuginfo-tests :: llgdb-tests/static-member-2.cpp (48 of 60) PASS: debuginfo-tests :: dexter/feature_tests/subtools/test/err_syntax.cpp (49 of 60) PASS: debuginfo-tests :: llgdb-tests/apple-accel.cpp (50 of 60) UNSUPPORTED: debuginfo-tests :: dexter/feature_tests/commands/penalty/unreachable.cpp (51 of 60) UNSUPPORTED: debuginfo-tests :: dexter/feature_tests/commands/penalty/expect_program_state.cpp (52 of 60) UNSUPPORTED: debuginfo-tests :: dexter/feature_tests/commands/penalty/expect_step_kinds.cpp (53 of 60) PASS: debuginfo-tests :: llgdb-tests/foreach.m (54 of 60) PASS: debuginfo-tests :: dexter-tests/nrvo-string.cpp (55 of 60) PASS: debuginfo-tests :: dexter/feature_tests/subtools/test/source-root-dir.cpp (56 of 60) PASS: debuginfo-tests :: dexter-tests/vla.c (57 of 60) XFAIL: debuginfo-tests :: dexter-tests/asan-deque.cpp (58 of 60) FAIL: debuginfo-tests :: llgdb-tests/asan-deque.cpp (59 of 60) ******************** TEST 'debuginfo-tests :: llgdb-tests/asan-deque.cpp' FAILED ******************** Script: -- : 'RUN: at line 1'; /Users/buildslave/jenkins/workspace/lldb-cmake/lldb-build/bin/clang --driver-mode=g++ -arch x86_64 --target=x86_64-apple-darwin19.5.0 -O1 -g /Users/buildslave/jenkins/workspace/lldb-cmake/llvm-project/debuginfo-tests/llgdb-tests/asan-deque.cpp -o /Users/buildslave/jenkins/workspace/lldb-cmake/lldb-build/projects/debuginfo-tests/llgdb-tests/Output/asan-deque.cpp.tmp.out -fsanitize=address : 'RUN: at line 2'; /Users/buildslave/jenkins/workspace/lldb-cmake/llvm-project/debuginfo-tests/llgdb-tests/test_debuginfo.pl /Users/buildslave/jenkins/workspace/lldb-cmake/llvm-project/debuginfo-tests/llgdb-tests/asan-deque.cpp /Users/buildslave/jenkins/workspace/lldb-cmake/lldb-build/projects/debuginfo-tests/llgdb-tests/Output/asan-deque.cpp.tmp.out -- Exit Code: 1

Hide Details

Command Output (stdout): -- Debugger output was: imported lldb from: "/Applications/Xcode.app/Contents/SharedFrameworks/LLDB.framework/Versions/A/Resources/Python" > break 25 SBBreakpoint: id = 1, file = '/Users/buildslave/jenkins/workspace/lldb-cmake/llvm-project/debuginfo-tests/llgdb-tests/asan-deque.cpp', line = 25, exact_match = 0, locations = 1 > break 30 SBBreakpoint: id = 2, file = '/Users/buildslave/jenkins/workspace/lldb-cmake/llvm-project/debuginfo-tests/llgdb-tests/asan-deque.cpp', line = 30, exact_match = 0, locations = 1 > r error: Process must be launched. success > p log = <could not resolve type> > c None > p log No value > quit

Hide Details

-- Command Output (stderr): -- /Users/buildslave/jenkins/workspace/lldb-cmake/llvm-project/debuginfo-tests/llgdb-tests/asan-deque.cpp:39:11: error: CHECK: expected string not found in input // CHECK: 1234 ^ /Users/buildslave/jenkins/workspace/lldb-cmake/lldb-build/projects/debuginfo-tests/llgdb-tests/Output/asan-deque.cpp.gdb.output:1:1: note: scanning from here imported lldb from: "/Applications/Xcode.app/Contents/SharedFrameworks/LLDB.framework/Versions/A/Resources/Python" ^ /Users/buildslave/jenkins/workspace/lldb-cmake/lldb-build/projects/debuginfo-tests/llgdb-tests/Output/asan-deque.cpp.gdb.output:2:9: note: possible intended match here > break 25 ^

Hide Details

Input file: /Users/buildslave/jenkins/workspace/lldb-cmake/lldb-build/projects/debuginfo-tests/llgdb-tests/Output/asan-deque.cpp.gdb.output Check file: /Users/buildslave/jenkins/workspace/lldb-cmake/llvm-project/debuginfo-tests/llgdb-tests/asan-deque.cpp

Hide Details

-dump-input=help explains the following input dump.

Hide Details

Input was: <<<<<< 1: imported lldb from: "/Applications/Xcode.app/Contents/SharedFrameworks/LLDB.framework/Versions/A/Resources/Python" check:39'0 X~~~~~~~~~~~~~~~~~~~~~~~~~~~~~~~~~~~~~~~~~~~~~~~~~~~~~~~~~~~~~~~~~~~~~~~~~~~~~~~~~~~~~~~~~~~~~~~~~~~~~~~~~~~~~~~~~ error: no match found 2: > break 25 check:39'0 ~~~~~~~~~~ check:39'1 ? possible intended match 3: SBBreakpoint: id = 1, file = '/Users/buildslave/jenkins/workspace/lldb-cmake/llvm-project/debuginfo-tests/llgdb-tests/asan-deque.cpp', line = 25, exact_match = 0, locations = 1 check:39'0 ~~~~~~~~~~~~~~~~~~~~~~~~~~~~~~~~~~~~~~~~~~~~~~~~~~~~~~~~~~~~~~~~~~~~~~~~~~~~~~~~~~~~~~~~~~~~~~~~~~~~~~~~~~~~~~~~~~~~~~~~~~~~~~~~~~~~~~~~~~~~~~~~~~~~~~~~~~~~~~~~~~~~~~~~~~~~~~~~ 4: > break 30 check:39'0 ~~~~~~~~~~ 5: SBBreakpoint: id = 2, file = '/Users/buildslave/jenkins/workspace/lldb-cmake/llvm-project/debuginfo-tests/llgdb-tests/asan-deque.cpp', line = 30, exact_match = 0, locations = 1 check:39'0 ~~~~~~~~~~~~~~~~~~~~~~~~~~~~~~~~~~~~~~~~~~~~~~~~~~~~~~~~~~~~~~~~~~~~~~~~~~~~~~~~~~~~~~~~~~~~~~~~~~~~~~~~~~~~~~~~~~~~~~~~~~~~~~~~~~~~~~~~~~~~~~~~~~~~~~~~~~~~~~~~~~~~~~~~~~~~~~~~ 6: > r check:39'0 ~~~ 7: error: Process must be launched. check:39'0 ~~~~~~~~~~~~~~~~~~~~~~~~~~~~~~~~ . . . >>>>>>

Hide Details

--

Hide Details

******************** FAIL: debuginfo-tests :: llgdb-tests/asan-blocks.c (60 of 60) ******************** TEST 'debuginfo-tests :: llgdb-tests/asan-blocks.c' FAILED ******************** Script: -- : 'RUN: at line 1'; /Users/buildslave/jenkins/workspace/lldb-cmake/lldb-build/bin/clang -fblocks --target=x86_64-apple-darwin19.5.0 -arch x86_64 /Users/buildslave/jenkins/workspace/lldb-cmake/llvm-project/debuginfo-tests/llgdb-tests/asan-blocks.c -o /Users/buildslave/jenkins/workspace/lldb-cmake/lldb-build/projects/debuginfo-tests/llgdb-tests/Output/asan-blocks.c.tmp.out -g -fsanitize=address : 'RUN: at line 2'; /Users/buildslave/jenkins/workspace/lldb-cmake/llvm-project/debuginfo-tests/llgdb-tests/test_debuginfo.pl /Users/buildslave/jenkins/workspace/lldb-cmake/llvm-project/debuginfo-tests/llgdb-tests/asan-blocks.c /Users/buildslave/jenkins/workspace/lldb-cmake/lldb-build/projects/debuginfo-tests/llgdb-tests/Output/asan-blocks.c.tmp.out -- Exit Code: 1

Hide Details

Command Output (stdout): -- Debugger output was: imported lldb from: "/Applications/Xcode.app/Contents/SharedFrameworks/LLDB.framework/Versions/A/Resources/Python" > break 17 SBBreakpoint: id = 1, file = '/Users/buildslave/jenkins/workspace/lldb-cmake/llvm-project/debuginfo-tests/llgdb-tests/asan-blocks.c', line = 17, exact_match = 0, locations = 1 > r error: Process must be launched. error: Process must be launched. success > p s = <could not resolve type> > break 27 SBBreakpoint: id = 2, file = '/Users/buildslave/jenkins/workspace/lldb-cmake/llvm-project/debuginfo-tests/llgdb-tests/asan-blocks.c', line = 27, exact_match = 0, locations = 1 > c None > p s No value > break 40 SBBreakpoint: id = 3, file = '/Users/buildslave/jenkins/workspace/lldb-cmake/llvm-project/debuginfo-tests/llgdb-tests/asan-blocks.c', line = 40, exact_match = 0, locations = 1 > c None > p x No value > quit

Hide Details

-- Command Output (stderr): -- /Users/buildslave/jenkins/workspace/lldb-cmake/llvm-project/debuginfo-tests/llgdb-tests/asan-blocks.c:16:12: error: CHECK: expected string not found in input // CHECK: a = ([0] = 0, [1] = 1, [2] = 2, [3] = 3, [4] = 4, [5] = 5, [6] = 6, [7] = 7) ^ /Users/buildslave/jenkins/workspace/lldb-cmake/lldb-build/projects/debuginfo-tests/llgdb-tests/Output/asan-blocks.c.gdb.output:1:1: note: scanning from here imported lldb from: "/Applications/Xcode.app/Contents/SharedFrameworks/LLDB.framework/Versions/A/Resources/Python" ^

Hide Details

Input file: /Users/buildslave/jenkins/workspace/lldb-cmake/lldb-build/projects/debuginfo-tests/llgdb-tests/Output/asan-blocks.c.gdb.output Check file: /Users/buildslave/jenkins/workspace/lldb-cmake/llvm-project/debuginfo-tests/llgdb-tests/asan-blocks.c

Hide Details

-dump-input=help explains the following input dump.

Hide Details

Input was: <<<<<< 1: imported lldb from: "/Applications/Xcode.app/Contents/SharedFrameworks/LLDB.framework/Versions/A/Resources/Python" check:16 X~~~~~~~~~~~~~~~~~~~~~~~~~~~~~~~~~~~~~~~~~~~~~~~~~~~~~~~~~~~~~~~~~~~~~~~~~~~~~~~~~~~~~~~~~~~~~~~~~~~~~~~~~~~~~~~~~ error: no match found 2: > break 17 check:16 ~~~~~~~~~~ 3: SBBreakpoint: id = 1, file = '/Users/buildslave/jenkins/workspace/lldb-cmake/llvm-project/debuginfo-tests/llgdb-tests/asan-blocks.c', line = 17, exact_match = 0, locations = 1 check:16 ~~~~~~~~~~~~~~~~~~~~~~~~~~~~~~~~~~~~~~~~~~~~~~~~~~~~~~~~~~~~~~~~~~~~~~~~~~~~~~~~~~~~~~~~~~~~~~~~~~~~~~~~~~~~~~~~~~~~~~~~~~~~~~~~~~~~~~~~~~~~~~~~~~~~~~~~~~~~~~~~~~~~~~~~~~~~~~~ 4: > r check:16 ~~~ 5: error: Process must be launched. check:16 ~~~~~~~~~~~~~~~~~~~~~~~~~~~~~~~~ 6: error: Process must be launched. check:16 ~~~~~~~~~~~~~~~~~~~~~~~~~~~~~~~~ . . . >>>>>>

Hide Details

--

Hide Details

******************** Slowest Tests: -------------------------------------------------------------------------- 61.06s: debuginfo-tests :: llgdb-tests/asan-blocks.c 54.07s: debuginfo-tests :: llgdb-tests/asan-deque.cpp 47.82s: debuginfo-tests :: dexter-tests/aggregate-indirect-arg.cpp 47.36s: debuginfo-tests :: dexter-tests/stack-var.c 46.43s: debuginfo-tests :: llgdb-tests/block_var.m 40.19s: debuginfo-tests :: llgdb-tests/nrvo-string.cpp 32.80s: debuginfo-tests :: llgdb-tests/blocks.m 29.22s: debuginfo-tests :: dexter-tests/asan.c 11.19s: debuginfo-tests :: llgdb-tests/forward-declare-class.cpp 7.11s: debuginfo-tests :: dexter/feature_tests/subtools/test/err_paren.cpp 7.09s: debuginfo-tests :: dexter/feature_tests/subtools/test/err_type_mline.cpp 7.01s: debuginfo-tests :: dexter/feature_tests/unittests/run.test 6.91s: debuginfo-tests :: dexter/feature_tests/subtools/help/help.test 6.40s: debuginfo-tests :: dexter-tests/asan-deque.cpp 6.28s: debuginfo-tests :: dexter/feature_tests/subtools/list-debuggers/list-debuggers.test 4.98s: debuginfo-tests :: dexter-tests/nrvo-string.cpp 3.87s: debuginfo-tests :: llgdb-tests/foreach.m 3.46s: debuginfo-tests :: dexter-tests/vla.c 2.04s: debuginfo-tests :: dexter/feature_tests/subtools/view.cpp 2.04s: debuginfo-tests :: dexter-tests/dbg-arg.c

Hide Details

Tests Times: -------------------------------------------------------------------------- [ Range ] :: [ Percentage ] :: [Count] -------------------------------------------------------------------------- [60.0s,65.0s) :: [ ] :: [ 1/60] [55.0s,60.0s) :: [ ] :: [ 1/60] [50.0s,55.0s) :: [* ] :: [ 2/60] [45.0s,50.0s) :: [ ] :: [ 1/60] [40.0s,45.0s) :: [ ] :: [ 1/60] [35.0s,40.0s) :: [ ] :: [ 0/60] [30.0s,35.0s) :: [* ] :: [ 2/60] [25.0s,30.0s) :: [ ] :: [ 0/60] [20.0s,25.0s) :: [ ] :: [ 0/60] [15.0s,20.0s) :: [ ] :: [ 0/60] [10.0s,15.0s) :: [ ] :: [ 1/60] [ 5.0s,10.0s) :: [**** ] :: [ 7/60] [ 0.0s, 5.0s) :: [***************************** ] :: [44/60] -------------------------------------------------------------------------- ******************** Failed Tests (2): debuginfo-tests :: llgdb-tests/asan-blocks.c debuginfo-tests :: llgdb-tests/asan-deque.cpp

Hide Details

Hide Details

Testing Time: 61.39s Unsupported : 29 Passed : 27 Expectedly Failed: 2 Failed : 2 FAILED: projects/debuginfo-tests/CMakeFiles/check-debuginfo cd /Users/buildslave/jenkins/workspace/lldb-cmake/lldb-build/projects/debuginfo-tests && /usr/local/Frameworks/Python.framework/Versions/3.7/bin/python3.7 /Users/buildslave/jenkins/workspace/lldb-cmake/lldb-build/./bin/llvm-lit -v --time-tests --shuffle --xunit-xml-output=/Users/buildslave/jenkins/workspace/lldb-cmake/test/results.xml -v /Users/buildslave/jenkins/workspace/lldb-cmake/lldb-build/projects/debuginfo-tests ninja: build stopped: subcommand failed. Command failed: Command '['/usr/local/bin/ninja', '-v', 'check-debuginfo']' returned non-zero exit status 1 Command: ['/usr/local/bin/ninja', '-v', 'check-debuginfo'] [Pipeline] } [Pipeline] // timeout [Pipeline] } [Pipeline] // stage [Pipeline] stage [Pipeline] { (Declarative: Post Actions) [Pipeline] scanForIssues [Clang (LLVM based)] Sleeping for 5 seconds due to JENKINS-32191... [Clang (LLVM based)] Parsing console log (workspace: '/Users/buildslave/jenkins/workspace/lldb-cmake') [Clang (LLVM based)] Successfully parsed console log [Clang (LLVM based)] -> found 16 issues (skipped 70 duplicates) [Clang (LLVM based)] Post processing issues on 'green-dragon-10' with source code encoding 'UTF-8' [Clang (LLVM based)] Creating SCM blamer to obtain author and commit information for affected files [Clang (LLVM based)] Creating SCM miner to obtain statistics for affected repository files [Clang (LLVM based)] Resolving file names for all issues in source directory '/Users/buildslave/jenkins/workspace/lldb-cmake' [Clang (LLVM based)] -> resolved paths in source directory (10 found, 0 not found) [Clang (LLVM based)] Resolving module names from module definitions (build.xml, pom.xml, or Manifest.mf files) [Clang (LLVM based)] -> resolved module names for 16 issues [Clang (LLVM based)] Resolving package names (or namespaces) by parsing the affected files [Clang (LLVM based)] -> resolved package names of 9 affected files [Clang (LLVM based)] No filter has been set, publishing all 15 issues [Clang (LLVM based)] Creating fingerprints for all affected code blocks to track issues over different builds [Clang (LLVM based)] -> created fingerprints for 15 issues (skipped 0 issues) [Clang (LLVM based)] Copying affected files to Jenkins' build folder '/Users/Shared/Jenkins/Home/jobs/lldb-cmake/builds/23216/files-with-issues' [Clang (LLVM based)] -> 7 copied, 2 not in workspace, 0 not-found, 0 with I/O error [Pipeline] junit Recording test results [Pipeline] emailext Not sending mail to unregistered user tkeith@nvidia.com because your SCM claimed this was associated with a user ID ‘tkeith' which your security realm does not recognize; you may need changes in your SCM plugin Not sending mail to unregistered user spatel@rotateright.com because your SCM claimed this was associated with a user ID ‘spatel' which your security realm does not recognize; you may need changes in your SCM plugin Not sending mail to unregistered user yamauchi@google.com because your SCM claimed this was associated with a user ID ‘yamauchi' which your security realm does not recognize; you may need changes in your SCM plugin Not sending mail to unregistered user flo@fhahn.com because your SCM claimed this was associated with a user ID ‘flo' which your security realm does not recognize; you may need changes in your SCM plugin Not sending mail to unregistered user caij2003@gmail.com because your SCM claimed this was associated with a user ID ‘caij2003' which your security realm does not recognize; you may need changes in your SCM plugin Not sending mail to unregistered user aeubanks@google.com because your SCM claimed this was associated with a user ID ‘aeubanks' which your security realm does not recognize; you may need changes in your SCM plugin Not sending mail to unregistered user daniel_l_sanders@apple.com because your SCM claimed this was associated with a user ID ‘daniel_l_sanders' which your security realm does not recognize; you may need changes in your SCM plugin Not sending mail to unregistered user jonathan_roelofs@apple.com because your SCM claimed this was associated with a user ID ‘jonathan_roelofs' which your security realm does not recognize; you may need changes in your SCM plugin Not sending mail to unregistered user efriedma@codeaurora.org because your SCM claimed this was associated with a user ID ‘efriedma' which your security realm does not recognize; you may need changes in your SCM plugin Not sending mail to unregistered user tkeith@nvidia.com because your SCM claimed this was associated with a user ID ‘tkeith' which your security realm does not recognize; you may need changes in your SCM plugin Not sending mail to unregistered user spatel@rotateright.com because your SCM claimed this was associated with a user ID ‘spatel' which your security realm does not recognize; you may need changes in your SCM plugin Not sending mail to unregistered user yamauchi@google.com because your SCM claimed this was associated with a user ID ‘yamauchi' which your security realm does not recognize; you may need changes in your SCM plugin Not sending mail to unregistered user flo@fhahn.com because your SCM claimed this was associated with a user ID ‘flo' which your security realm does not recognize; you may need changes in your SCM plugin Not sending mail to unregistered user caij2003@gmail.com because your SCM claimed this was associated with a user ID ‘caij2003' which your security realm does not recognize; you may need changes in your SCM plugin Not sending mail to unregistered user aeubanks@google.com because your SCM claimed this was associated with a user ID ‘aeubanks' which your security realm does not recognize; you may need changes in your SCM plugin Not sending mail to unregistered user daniel_l_sanders@apple.com because your SCM claimed this was associated with a user ID ‘daniel_l_sanders' which your security realm does not recognize; you may need changes in your SCM plugin Not sending mail to unregistered user jonathan_roelofs@apple.com because your SCM claimed this was associated with a user ID ‘jonathan_roelofs' which your security realm does not recognize; you may need changes in your SCM plugin Not sending mail to unregistered user efriedma@codeaurora.org because your SCM claimed this was associated with a user ID ‘efriedma' which your security realm does not recognize; you may need changes in your SCM plugin

Hide Details

Begin Pre-Send Script... Sending email to: mschifer@apple.com lhames@gmail.com Erik Pilkington <epilkington@apple.com> Azhar Mohammed <azhar@apple.com>
[Pipeline] } [Pipeline] // stage [Pipeline] } [Pipeline] // withEnv [Pipeline] } [Pipeline] // node [Pipeline] End of Pipeline ERROR: script returned exit code 1 Finished: FAILURE