FailedConsole Output

Skipping 8,441 KB.. Full Log
2153)
PASS: lldb-unit :: ScriptInterpreter/Python/./ScriptInterpreterPythonTests/PythonDataObjectsTest.TestPythonDictionaryValueEquality (659 of 2153)
PASS: lldb-api :: commands/expression/import-std-module/sysroot/TestStdModuleSysroot.py (660 of 2153)
PASS: lldb-api :: python_api/interpreter/TestCommandInterpreterAPI.py (661 of 2153)
PASS: lldb-api :: lang/c/step_over_no_deadlock/TestStepOverDoesntBlock.py (662 of 2153)
PASS: lldb-unit :: Utility/./UtilityTests/ProcessInstanceInfoList.Yaml (663 of 2153)
PASS: lldb-unit :: Interpreter/./InterpreterTests/CompletionTest.DirCompletionAbsolute (664 of 2153)
PASS: lldb-shell :: Reproducer/TestReuseDirectory.test (665 of 2153)
PASS: lldb-unit :: Symbol/./SymbolTests/TestTypeSystemClang.TestGetTypeClassNested (666 of 2153)
PASS: lldb-unit :: Utility/./UtilityTests/NameMatchesTest.EndsWith (667 of 2153)
PASS: lldb-unit :: Utility/./UtilityTests/ArgsTest.TestSingleArg (668 of 2153)
PASS: lldb-unit :: Utility/./UtilityTests/FileSpecTest.CopyByAppendingPathComponent (669 of 2153)
PASS: lldb-api :: commands/log/invalid-args/TestInvalidArgsLog.py (670 of 2153)
UNSUPPORTED: lldb-api :: arm/breakpoint-thumb-codesection/TestBreakpointThumbCodesection.py (671 of 2153)
PASS: lldb-unit :: Utility/./UtilityTests/BinaryStreamTest.PutULEB128SixBytes (672 of 2153)
PASS: lldb-api :: commands/frame/diagnose/array/TestArray.py (673 of 2153)
UNSUPPORTED: lldb-api :: functionalities/darwin_log/filter/exact_match/subsystem/TestDarwinLogFilterMatchSubsystem.py (674 of 2153)
PASS: lldb-shell :: ObjectFile/ELF/PT_LOAD.yaml (675 of 2153)
PASS: lldb-api :: python_api/signals/TestSignalsAPI.py (676 of 2153)
PASS: lldb-unit :: Expression/./ExpressionTests/CppModuleConfigurationTest.UnrelatedLibrary (677 of 2153)
PASS: lldb-api :: python_api/get-value-32bit-int/TestGetValue32BitInt.py (678 of 2153)
PASS: lldb-unit :: Utility/./UtilityTests/StatusTest.ErrorCodeConstructor (679 of 2153)
PASS: lldb-unit :: Platform/./LLDBPlatformTests/PlatformAppleSimulatorTest.TestHostPlatformToSim (680 of 2153)
PASS: lldb-unit :: Process/minidump/./LLDBMinidumpTests/MinidumpParserTest.MinidumpDuplicateModuleMinAddress (681 of 2153)
PASS: lldb-unit :: Utility/./UtilityTests/BinaryStreamTest.PutULEB128EightBytes (682 of 2153)
PASS: lldb-unit :: Platform/./LLDBPlatformTests/PlatformAppleSimulatorTest.TestSimHasSimEnvionament (683 of 2153)
PASS: lldb-api :: functionalities/data-formatter/parray/TestPrintArray.py (684 of 2153)
PASS: lldb-unit :: Utility/./UtilityTests/ScalarTest.CastOperations (685 of 2153)
PASS: lldb-shell :: SymbolFile/NativePDB/ast-functions.cpp (686 of 2153)
PASS: lldb-api :: functionalities/float-display/TestFloatDisplay.py (687 of 2153)
PASS: lldb-api :: functionalities/breakpoint/dummy_target_breakpoints/TestBreakpointsWithNoTargets.py (688 of 2153)
UNSUPPORTED: lldb-api :: functionalities/data-formatter/data-formatter-stl/libstdcpp/iterator/TestDataFormatterStdIterator.py (689 of 2153)
PASS: lldb-unit :: Utility/./UtilityTests/StreamTest.ShiftOperatorPtr (690 of 2153)
PASS: lldb-api :: tools/lldb-vscode/coreFile/TestVSCode_coreFile.py (691 of 2153)
PASS: lldb-unit :: Utility/./UtilityTests/StreamTest.QuotedCString (692 of 2153)
PASS: lldb-shell :: Commands/command-backtrace.test (693 of 2153)
PASS: lldb-unit :: Utility/./UtilityTests/SubsystemRAIITest.NormalSubsystem (694 of 2153)
UNSUPPORTED: lldb-shell :: Process/Windows/exception_access_violation.cpp (695 of 2153)
PASS: lldb-api :: functionalities/data-formatter/data-formatter-stl/libcxx/set/TestDataFormatterLibcxxSet.py (696 of 2153)
PASS: lldb-api :: python_api/process/read-mem-cstring/TestReadMemCString.py (697 of 2153)
PASS: lldb-api :: lang/c/record_decl_in_expr/TestRecordDeclInExpr.py (698 of 2153)
UNSUPPORTED: lldb-shell :: SymbolFile/PDB/udt-layout.test (699 of 2153)
PASS: lldb-unit :: Utility/./UtilityTests/StreamTest.PutHex64ByteOrderLittle (700 of 2153)
PASS: lldb-unit :: Utility/./UtilityTests/ConstStringTest.format_provider (701 of 2153)
PASS: lldb-api :: commands/help/TestHelp.py (702 of 2153)
PASS: lldb-api :: functionalities/data-formatter/data-formatter-stl/libcxx/variant/TestDataFormatterLibcxxVariant.py (703 of 2153)
PASS: lldb-api :: commands/platform/process/list/TestProcessList.py (704 of 2153)
PASS: lldb-api :: commands/expression/import-std-module/shared_ptr/TestSharedPtrFromStdModule.py (705 of 2153)
PASS: lldb-shell :: Minidump/disassemble-no-module.yaml (706 of 2153)
PASS: lldb-unit :: Utility/./UtilityTests/TimeoutTest.Format (707 of 2153)
PASS: lldb-shell :: SymbolFile/DWARF/dwarf5-debug_line.s (708 of 2153)
PASS: lldb-api :: functionalities/data-formatter/nsdictionarysynth/TestNSDictionarySynthetic.py (709 of 2153)
PASS: lldb-api :: commands/settings/use_source_cache/TestUseSourceCache.py (710 of 2153)
PASS: lldb-unit :: Utility/./UtilityTests/StringListTest.CopyListSingle (711 of 2153)
PASS: lldb-api :: lang/objcxx/class-name-clash/TestNameClash.py (712 of 2153)
PASS: lldb-unit :: UnwindAssembly/x86/./UnwindAssemblyx86Tests/Testx86AssemblyInspectionEngine.TestPushECX (713 of 2153)
PASS: lldb-unit :: Utility/./UtilityTests/SerializationRountripTest.SerializeDeserializeObjectPointer (714 of 2153)
PASS: lldb-api :: lang/cpp/gmodules/TestWithModuleDebugging.py (715 of 2153)
PASS: lldb-shell :: Settings/TestEchoCommands.test (716 of 2153)
PASS: lldb-api :: functionalities/return-value/TestReturnValue.py (717 of 2153)
PASS: lldb-api :: commands/apropos/basic/TestApropos.py (718 of 2153)
PASS: lldb-shell :: SymbolFile/DWARF/debug_loc_and_loclists.s (719 of 2153)
PASS: lldb-api :: python_api/watchpoint/TestWatchpointIgnoreCount.py (720 of 2153)
PASS: lldb-api :: functionalities/unwind/sigtramp/TestSigtrampUnwind.py (721 of 2153)
PASS: lldb-shell :: SymbolFile/DWARF/clang-ast-from-dwarf-objc-property.m (722 of 2153)
PASS: lldb-api :: functionalities/thread/concurrent_events/TestConcurrentDelayedCrashWithBreakpointSignal.py (723 of 2153)
PASS: lldb-api :: functionalities/thread/concurrent_events/TestConcurrentManyBreakpoints.py (724 of 2153)
PASS: lldb-unit :: ObjectFile/PECOFF/./ObjectFilePECOFFTests/PECallFrameInfoTest.Frame_reg_eh (725 of 2153)
PASS: lldb-unit :: DataFormatter/./LLDBFormatterTests/TypeMatcherTests.CreatedBySameMatchStringExactNamePrefixes (726 of 2153)
PASS: lldb-api :: lang/cpp/char8_t/TestCxxChar8_t.py (727 of 2153)
PASS: lldb-unit :: Target/./TargetTests/ModuleCacheTest.GetAndPutStrangeHostname (728 of 2153)
PASS: lldb-unit :: SymbolFile/NativePDB/./SymbolFileNativePDBTests/PDBFPOProgramToDWARFExpressionTests.MultipleIndependentAssignments (729 of 2153)
PASS: lldb-shell :: SymbolFile/Breakpad/line-table.test (730 of 2153)
PASS: lldb-unit :: Utility/./UtilityTests/RangeDataVector.FindEntryThatContains (731 of 2153)
PASS: lldb-unit :: Expression/./ExpressionTests/DiagnosticManagerTest.GetStringPreserveOrder (732 of 2153)
PASS: lldb-unit :: Signals/./SignalsTests/UnixSignalsTest.VersionChange (733 of 2153)
PASS: lldb-unit :: UnwindAssembly/x86/./UnwindAssemblyx86Tests/Testx86AssemblyInspectionEngine.TestPopRBX (734 of 2153)
PASS: lldb-api :: commands/target/basic/TestTargetCommand.py (735 of 2153)
PASS: lldb-api :: commands/expression/two-files/TestObjCTypeQueryFromOtherCompileUnit.py (736 of 2153)
PASS: lldb-api :: macosx/version_zero/TestGetVersionZeroVersion.py (737 of 2153)
PASS: lldb-shell :: SymbolFile/DWARF/inline-function-address.ll (738 of 2153)
PASS: lldb-api :: functionalities/dead-strip/TestDeadStrip.py (739 of 2153)
PASS: lldb-unit :: Symbol/./SymbolTests/TestClangASTImporter.CanImportInvalidType (740 of 2153)
PASS: lldb-api :: tools/lldb-vscode/breakpoint/TestVSCode_setBreakpoints.py (741 of 2153)
PASS: lldb-api :: functionalities/thread/create_after_attach/TestCreateAfterAttach.py (742 of 2153)
PASS: lldb-unit :: Process/minidump/./LLDBMinidumpTests/MinidumpParserTest.InvalidMinidump (743 of 2153)
UNSUPPORTED: lldb-api :: functionalities/darwin_log/filter/regex/category/TestDarwinLogFilterRegexCategory.py (744 of 2153)
PASS: lldb-unit :: Utility/./UtilityTests/OptionsWithRawTest.MultiWordSuffix (745 of 2153)
PASS: lldb-api :: commands/frame/var/TestFrameVar.py (746 of 2153)
PASS: lldb-api :: commands/expression/call-function/TestCallStopAndContinue.py (747 of 2153)
PASS: lldb-api :: functionalities/data-formatter/data-formatter-stl/libcxx/bitset/TestDataFormatterLibcxxBitset.py (748 of 2153)
PASS: lldb-api :: lang/cpp/static_methods/TestCPPStaticMethods.py (749 of 2153)
UNSUPPORTED: lldb-api :: commands/trace/TestTraceSchema.py (750 of 2153)
PASS: lldb-unit :: DataFormatter/./LLDBFormatterTests/StringPrinterTests.SwiftUTF8 (751 of 2153)
PASS: lldb-shell :: SymbolFile/DWARF/anon_class_w_and_wo_export_symbols.ll (752 of 2153)
PASS: lldb-api :: lang/objc/rdar-11355592/TestRdar11355592.py (753 of 2153)
PASS: lldb-unit :: Utility/./UtilityTests/AnsiTerminal.Basic (754 of 2153)
PASS: lldb-unit :: UnwindAssembly/x86/./UnwindAssemblyx86Tests/Testx86AssemblyInspectionEngine.TestPopR14 (755 of 2153)
PASS: lldb-api :: functionalities/unwind/noreturn/module-end/TestNoReturnModuleEnd.py (756 of 2153)
PASS: lldb-api :: functionalities/data-formatter/data-formatter-stl/libcxx/unique_ptr/TestDataFormatterLibcxxUniquePtr.py (757 of 2153)
PASS: lldb-unit :: Utility/./UtilityTests/StreamTest.PutStringAsRawHex8 (758 of 2153)
PASS: lldb-unit :: Utility/./UtilityTests/SerializationRountripTest.SerializeDeserializeCStringArray (759 of 2153)
PASS: lldb-shell :: SymbolFile/DWARF/debug-types-dwo-cross-reference.cpp (760 of 2153)
PASS: lldb-api :: lang/cpp/class_types/TestClassTypes.py (761 of 2153)
PASS: lldb-unit :: Utility/./UtilityTests/UriParserTest.BracketedHostnameWithPortIPv4 (762 of 2153)
UNSUPPORTED: lldb-shell :: SymbolFile/DWARF/split-dwarf-expression-eval-bug.cpp (763 of 2153)
PASS: lldb-shell :: Process/TestEnvironment.test (764 of 2153)
PASS: lldb-unit :: Host/./HostTests/SocketTest.DomainGetConnectURI (765 of 2153)
PASS: lldb-api :: functionalities/thread/backtrace_limit/TestBacktraceLimit.py (766 of 2153)
PASS: lldb-api :: functionalities/pre_run_dylibs/TestPreRunDylibs.py (767 of 2153)
PASS: lldb-shell :: Quit/TestQuitExitCode-30.test (768 of 2153)
PASS: lldb-unit :: Core/./LLDBCoreTests/RichManglingContextTest.SwitchProvider (769 of 2153)
PASS: lldb-api :: python_api/sbenvironment/TestSBEnvironment.py (770 of 2153)
PASS: lldb-unit :: UnwindAssembly/x86/./UnwindAssemblyx86Tests/Testx86AssemblyInspectionEngine.TestPushR15 (771 of 2153)
PASS: lldb-shell :: Minidump/breakpad-symbols.test (772 of 2153)
PASS: lldb-api :: functionalities/thread/concurrent_events/TestConcurrentNWatchNBreak.py (773 of 2153)
PASS: lldb-shell :: SymbolFile/DWARF/module-ownership.mm (774 of 2153)
PASS: lldb-shell :: ObjectFile/PECOFF/dep-modules.yaml (775 of 2153)
UNSUPPORTED: lldb-api :: functionalities/data-formatter/data-formatter-stl/libstdcpp/vbool/TestDataFormatterStdVBool.py (776 of 2153)
PASS: lldb-api :: functionalities/data-formatter/data-formatter-objc/TestDataFormatterObjCKVO.py (777 of 2153)
PASS: lldb-api :: lang/objc/objc-checker/TestObjCCheckers.py (778 of 2153)
PASS: lldb-api :: functionalities/unwind/zeroth_frame/TestZerothFrame.py (779 of 2153)
PASS: lldb-unit :: SymbolFile/DWARF/./SymbolFileDWARFTests/SymbolFileDWARFTests.TestAbbrevMissingTerminator (780 of 2153)
PASS: lldb-shell :: Breakpoint/debug_rnglist_basic.test (781 of 2153)
PASS: lldb-unit :: Host/./HostTests/ConnectionFileDescriptorTest.TCPGetURIv6 (782 of 2153)
PASS: lldb-unit :: Utility/./UtilityTests/StringExtractorTest.GetHexBytesAvail_Partial (783 of 2153)
PASS: lldb-unit :: Expression/./ExpressionTests/CppModuleConfigurationTest.Linux (784 of 2153)
PASS: lldb-api :: functionalities/gdb_remote_client/TestNoWatchpointSupportInfo.py (785 of 2153)
PASS: lldb-unit :: Utility/./UtilityTests/StreamTeeTest.GetStreamAtIndexOutOfBoundsEmpty (786 of 2153)
PASS: lldb-unit :: Process/gdb-remote/./ProcessGdbRemoteTests/GDBRemoteCommunicationServerTest.SendErrorResponse_StringError (787 of 2153)
PASS: lldb-unit :: ScriptInterpreter/Python/./ScriptInterpreterPythonTests/PythonDataObjectsTest.TestPythonCallableInvoke (788 of 2153)
PASS: lldb-unit :: Utility/./UtilityTests/ArgsTest.TestOverwriteArgs (789 of 2153)
PASS: lldb-shell :: ObjectFile/wasm/embedded-debug-sections.yaml (790 of 2153)
PASS: lldb-shell :: SymbolFile/DWARF/debug-names-compressed.cpp (791 of 2153)
PASS: lldb-unit :: Host/./HostTests/SocketTest.TCPListen0ConnectAccept (792 of 2153)
PASS: lldb-api :: lang/objc/rdar-10967107/TestRdar10967107.py (793 of 2153)
PASS: lldb-api :: functionalities/var_path/TestVarPath.py (794 of 2153)
UNSUPPORTED: lldb-shell :: ScriptInterpreter/Lua/breakpoint_callback.test (795 of 2153)
PASS: lldb-api :: lang/cpp/rvalue-references/TestRvalueReferences.py (796 of 2153)
PASS: lldb-api :: commands/command/nested_alias/TestNestedAlias.py (797 of 2153)
PASS: lldb-unit :: Utility/./UtilityTests/StringLexerTest.AdvanceIf (798 of 2153)
PASS: lldb-unit :: Utility/./UtilityTests/AnsiTerminal.Empty (799 of 2153)
PASS: lldb-api :: lang/cpp/typeof/TestTypeOfDeclTypeExpr.py (800 of 2153)
PASS: lldb-api :: commands/expression/po_verbosity/TestPoVerbosity.py (801 of 2153)
PASS: lldb-shell :: Reproducer/TestVerify.test (802 of 2153)
PASS: lldb-shell :: ObjectFile/ELF/section-overlap.yaml (803 of 2153)
PASS: lldb-unit :: Process/minidump/./LLDBMinidumpTests/MinidumpParserTest.GetMiscInfo_no_stream (804 of 2153)
PASS: lldb-unit :: Utility/./UtilityTests/RecordReplayTest.InstrumentedFooSameThis (805 of 2153)
PASS: lldb-api :: commands/command/script/import/TestImport.py (806 of 2153)
PASS: lldb-unit :: Utility/./UtilityTests/StringExtractorTest.GetHexBytes_OddPair (807 of 2153)
PASS: lldb-unit :: UnwindAssembly/x86/./UnwindAssemblyx86Tests/Testx86AssemblyInspectionEngine.TestStackRealign8BitDisp_i386 (808 of 2153)
PASS: lldb-unit :: Utility/./UtilityTests/LogChannelTest.List (809 of 2153)
PASS: lldb-unit :: Utility/./UtilityTests/FileSpecTest.GuessPathStyle (810 of 2153)
PASS: lldb-api :: python_api/type/TestTypeList.py (811 of 2153)
PASS: lldb-api :: lang/c/inlines/TestRedefinitionsInInlines.py (812 of 2153)
PASS: lldb-unit :: Utility/./UtilityTests/LogChannelTest.Disable (813 of 2153)
PASS: lldb-unit :: Utility/./UtilityTests/Flags.Clear (814 of 2153)
PASS: lldb-unit :: Utility/./UtilityTests/RangeDataVector.FindEntryIndexesThatContain_Overlap (815 of 2153)
PASS: lldb-unit :: Utility/./UtilityTests/StringListTest.SetSize (816 of 2153)
PASS: lldb-unit :: Utility/./UtilityTests/SharedCluster.ClusterManager (817 of 2153)
PASS: lldb-unit :: Utility/./UtilityTests/StreamTeeTest.Assignment (818 of 2153)
PASS: lldb-unit :: UnwindAssembly/x86/./UnwindAssemblyx86Tests/Testx86AssemblyInspectionEngine.TestPushEDI (819 of 2153)
PASS: lldb-unit :: Utility/./UtilityTests/UUIDTest.SetFromStringRef (820 of 2153)
PASS: lldb-api :: python_api/sbdata/TestSBData.py (821 of 2153)
PASS: lldb-unit :: Utility/./UtilityTests/ScalarTest.ComparisonFloat (822 of 2153)
PASS: lldb-unit :: Target/./TargetTests/ModuleCacheTest.GetAndPutUuidExists (823 of 2153)
PASS: lldb-api :: commands/expression/namespace_local_var_same_name_cpp_and_c/TestNamespaceLocalVarSameNameCppAndC.py (824 of 2153)
PASS: lldb-api :: functionalities/archives/TestBSDArchives.py (825 of 2153)
PASS: lldb-unit :: Host/./HostTests/SocketTest.TCPListen0GetPort (826 of 2153)
UNSUPPORTED: lldb-shell :: Unwind/eh-frame-augment-noop.test (827 of 2153)
PASS: lldb-unit :: SymbolFile/NativePDB/./SymbolFileNativePDBTests/PDBFPOProgramToDWARFExpressionTests.InvalidOpBinary (828 of 2153)
PASS: lldb-api :: iohandler/completion/TestIOHandlerCompletion.py (829 of 2153)
PASS: lldb-unit :: Utility/./UtilityTests/SerializationRountripTest.SerializeDeserializePodReferences (830 of 2153)
PASS: lldb-api :: functionalities/data-formatter/data-formatter-objc/TestDataFormatterObjCNSError.py (831 of 2153)
PASS: lldb-api :: python_api/disassemble-raw-data/TestDisassembleRawData.py (832 of 2153)
PASS: lldb-api :: functionalities/unwind/noreturn/TestNoreturnUnwind.py (833 of 2153)
PASS: lldb-unit :: Utility/./UtilityTests/OptionsWithRawTest.SingleWhitespaceInput (834 of 2153)
PASS: lldb-unit :: ObjectFile/Breakpad/./ObjectFileBreakpadTests/InfoRecord.parse (835 of 2153)
PASS: lldb-unit :: Host/./HostTests/FileSystemTest.MakeAbsolute (836 of 2153)
PASS: lldb-api :: commands/expression/unwind_expression/TestUnwindExpression.py (837 of 2153)
PASS: lldb-unit :: Process/gdb-remote/./ProcessGdbRemoteTests/GDBRemoteCommunicationClientTest.WriteRegister (838 of 2153)
PASS: lldb-unit :: Editline/./EditlineTests/EditlineTestFixture.EditlineReceivesMultiLineText (839 of 2153)
UNSUPPORTED: lldb-api :: functionalities/darwin_log/filter/regex/message/TestDarwinLogFilterRegexMessage.py (840 of 2153)
PASS: lldb-api :: functionalities/breakpoint/hardware_breakpoints/require_hw_breakpoints/TestRequireHWBreakpoints.py (841 of 2153)
PASS: lldb-api :: lang/objc/foundation/TestSymbolTable.py (842 of 2153)
PASS: lldb-api :: commands/expression/scoped_enums/TestScopedEnumType.py (843 of 2153)
PASS: lldb-shell :: Breakpoint/jitbp_elf.test (844 of 2153)
PASS: lldb-shell :: Commands/command-stop-hook-output.test (845 of 2153)
PASS: lldb-api :: functionalities/thread/concurrent_events/TestConcurrentCrashWithWatchpoint.py (846 of 2153)
PASS: lldb-unit :: ObjectFile/MachO/./ObjectFileMachOTests/ObjectFileMachOTest.ModuleFromSharedCacheInfo (847 of 2153)
PASS: lldb-shell :: Reproducer/Modules/TestModuleCXX.test (848 of 2153)
PASS: lldb-shell :: Watchpoint/SetErrorCases.test (849 of 2153)
PASS: lldb-api :: sanity/TestModuleCacheSanity.py (850 of 2153)
PASS: lldb-unit :: Symbol/./SymbolTests/TestTypeSystemClang.TestGetEnumIntegerTypeUnexpectedType (851 of 2153)
PASS: lldb-shell :: Reproducer/TestHomeDir.test (852 of 2153)
PASS: lldb-api :: commands/log/basic/TestLogging.py (853 of 2153)
UNSUPPORTED: lldb-api :: functionalities/darwin_log/filter/regex/activity/TestDarwinLogFilterRegexActivity.py (854 of 2153)
PASS: lldb-unit :: Utility/./UtilityTests/RangeTest.ContainsAddr (855 of 2153)
PASS: lldb-unit :: Host/./HostTests/FileSystemTest.FileAndDirectoryComponents (856 of 2153)
PASS: lldb-api :: lang/cpp/bitfields/TestCppBitfields.py (857 of 2153)
PASS: lldb-api :: functionalities/data-formatter/data-formatter-stl/libcxx/atomic/TestLibCxxAtomic.py (858 of 2153)
PASS: lldb-api :: functionalities/breakpoint/objc/TestObjCBreakpoints.py (859 of 2153)
PASS: lldb-api :: commands/expression/import-std-module/deque-basic/TestDequeFromStdModule.py (860 of 2153)
PASS: lldb-unit :: UnwindAssembly/x86/./UnwindAssemblyx86Tests/Testx86AssemblyInspectionEngine.TestPushRBPWithREX (861 of 2153)
PASS: lldb-api :: functionalities/data-formatter/data-formatter-objc/TestDataFormatterObjCNSDate.py (862 of 2153)
PASS: lldb-unit :: Utility/./UtilityTests/StreamTest.ChangingByteOrder (863 of 2153)
PASS: lldb-unit :: Host/./HostTests/ConnectionFileDescriptorTest.TCPGetURIv4 (864 of 2153)
PASS: lldb-unit :: Utility/./UtilityTests/XcodeSDKTest.SDKSupportsSwift (865 of 2153)
PASS: lldb-shell :: ObjectFile/ELF/build-id-case.yaml (866 of 2153)
PASS: lldb-unit :: Utility/./UtilityTests/OptionsWithRawTest.EmptyArgsOnlySuffix (867 of 2153)
PASS: lldb-shell :: SymbolFile/DWARF/find-method.cpp (868 of 2153)
PASS: lldb-unit :: UnwindAssembly/x86/./UnwindAssemblyx86Tests/Testx86AssemblyInspectionEngine.TestStackRealign32BitDisp_x86_64 (869 of 2153)
PASS: lldb-api :: commands/command/invalid-args/TestInvalidArgsCommand.py (870 of 2153)
PASS: lldb-unit :: Utility/./UtilityTests/StringListTest.ShiftMove (871 of 2153)
PASS: lldb-unit :: UnwindAssembly/x86/./UnwindAssemblyx86Tests/Testx86AssemblyInspectionEngine.TestSpArithx86_64Augmented (872 of 2153)
PASS: lldb-api :: functionalities/breakpoint/breakpoint_command/TestRegexpBreakCommand.py (873 of 2153)
PASS: lldb-api :: lang/objc/objc-baseclass-sbtype/TestObjCBaseClassSBType.py (874 of 2153)
PASS: lldb-shell :: SymbolFile/DWARF/debug_ranges_and_rnglists.test (875 of 2153)
PASS: lldb-shell :: SymbolFile/Breakpad/stack-cfi-arm.yaml (876 of 2153)
UNSUPPORTED: lldb-shell :: Breakpoint/case-insensitive.test (877 of 2153)
PASS: lldb-unit :: Symbol/./SymbolTests/TestTypeSystemClang.TestBuiltinTypeForEncodingAndBitSize (878 of 2153)
PASS: lldb-api :: commands/statistics/basic/TestStats.py (879 of 2153)
PASS: lldb-unit :: Utility/./UtilityTests/StatusTest.ErrorConversion (880 of 2153)
PASS: lldb-api :: commands/disassemble/basic/TestDisassembleBreakpoint.py (881 of 2153)
PASS: lldb-shell :: SymbolFile/dissassemble-entry-point.s (882 of 2153)
PASS: lldb-unit :: Symbol/./SymbolTests/TestTypeSystemClang.TestGetBasicTypeFromName (883 of 2153)
PASS: lldb-shell :: Breakpoint/split-dwarf-5-addrbase.test (884 of 2153)
PASS: lldb-unit :: Utility/./UtilityTests/StringListTest.CopyListEmpty (885 of 2153)
PASS: lldb-unit :: Core/./LLDBCoreTests/MangledTest.ResultForBlockInvocation (886 of 2153)
PASS: lldb-shell :: SymbolFile/DWARF/compilercontext.ll (887 of 2153)
PASS: lldb-shell :: Unwind/thread-step-out-ret-addr-check.test (888 of 2153)
PASS: lldb-unit :: Utility/./UtilityTests/BinaryStreamTest.PutULEB128ThreeBytes (889 of 2153)
PASS: lldb-api :: python_api/lldbutil/iter/TestLLDBIterator.py (890 of 2153)
PASS: lldb-unit :: Utility/./UtilityTests/StringExtractorTest.InitMisc (891 of 2153)
PASS: lldb-unit :: Utility/./UtilityTests/ArchSpecTest.TestSetTriple (892 of 2153)
PASS: lldb-shell :: BuildScript/modes.test (893 of 2153)
PASS: lldb-unit :: Utility/./UtilityTests/StreamTeeTest.CopyConstructor (894 of 2153)
PASS: lldb-unit :: Utility/./UtilityTests/AnsiTerminal.KnownPrefix (895 of 2153)
UNSUPPORTED: lldb-shell :: Unwind/unwind-plan-dwarf-dump.test (896 of 2153)
PASS: lldb-api :: functionalities/tail_call_frames/ambiguous_tail_call_seq1/TestAmbiguousTailCallSeq1.py (897 of 2153)
PASS: lldb-shell :: SymbolFile/NativePDB/break-by-function.cpp (898 of 2153)
PASS: lldb-api :: functionalities/data-formatter/format-propagation/TestFormatPropagation.py (899 of 2153)
PASS: lldb-api :: linux/builtin_trap/TestBuiltinTrap.py (900 of 2153)
PASS: lldb-unit :: SymbolFile/NativePDB/./SymbolFileNativePDBTests/PDBFPOProgramToDWARFExpressionTests.InvalidAssignmentSingle (901 of 2153)
PASS: lldb-unit :: Utility/./UtilityTests/RangeTest.Union (902 of 2153)
PASS: lldb-unit :: Core/./LLDBCoreTests/SourceFileCache.FindSourceFileFound (903 of 2153)
PASS: lldb-shell :: SymbolFile/Breakpad/unwind-via-stack-cfi.test (904 of 2153)
PASS: lldb-api :: macosx/duplicate-archive-members/TestDuplicateMembers.py (905 of 2153)
PASS: lldb-api :: functionalities/tail_call_frames/thread_step_out_or_return/TestSteppingOutWithArtificialFrames.py (906 of 2153)
PASS: lldb-unit :: Symbol/./SymbolTests/DWARFCallFrameInfoTest.Basic_eh (907 of 2153)
PASS: lldb-shell :: ObjectFile/PECOFF/basic-info-arm64.yaml (908 of 2153)
PASS: lldb-shell :: SymbolFile/NativePDB/nested-types.cpp (909 of 2153)
PASS: lldb-unit :: Utility/./UtilityTests/Predicate.WaitForValueEqualTo (910 of 2153)
PASS: lldb-api :: functionalities/gdb_remote_client/TestRecognizeBreakpoint.py (911 of 2153)
PASS: lldb-unit :: Utility/./UtilityTests/VASprintfTest.BufferResize (912 of 2153)
PASS: lldb-shell :: SymbolFile/DWARF/debug-types-missing-signature.test (913 of 2153)
PASS: lldb-unit :: ObjectFile/ELF/./ObjectFileELFTests/ObjectFileELFTest.GetSymtab_NoSymEntryPointArmAddressClass (914 of 2153)
PASS: lldb-unit :: Host/./HostTests/SocketTest.TCPGetAddress (915 of 2153)
PASS: lldb-shell :: Reproducer/TestFileRepro.test (916 of 2153)
PASS: lldb-shell :: BuildScript/toolchain-clang.test (917 of 2153)
PASS: lldb-unit :: Utility/./UtilityTests/BinaryStreamTest.PutULEB128One (918 of 2153)
PASS: lldb-unit :: Symbol/./SymbolTests/TestClangASTImporter.MetadataPropagationAfterCopying (919 of 2153)
PASS: lldb-api :: commands/expression/dont_allow_jit/TestAllowJIT.py (920 of 2153)
PASS: lldb-shell :: SymbolFile/DWARF/DW_OP_piece-smaller-than-struct.s (921 of 2153)
PASS: lldb-api :: functionalities/data-formatter/data-formatter-stl/libstdcpp/unique_ptr/invalid/TestDataFormatterInvalidStdUniquePtr.py (922 of 2153)
PASS: lldb-api :: commands/expression/result_numbering/TestResultNumbering.py (923 of 2153)
PASS: lldb-unit :: Utility/./UtilityTests/StreamTest.PutPtr (924 of 2153)
PASS: lldb-unit :: UnwindAssembly/x86/./UnwindAssemblyx86Tests/Testx86AssemblyInspectionEngine.TestDisassemblyMidFunctionEpilogues (925 of 2153)
PASS: lldb-unit :: Utility/./UtilityTests/VMRange.ContainsRange (926 of 2153)
PASS: lldb-unit :: Utility/./UtilityTests/SerializationRountripTest.SerializeDeserializeCStringArrayNullptr (927 of 2153)
PASS: lldb-unit :: Utility/./UtilityTests/RangeTest.ContainsRange (928 of 2153)
PASS: lldb-api :: commands/frame/diagnose/dereference-this/TestDiagnoseDereferenceThis.py (929 of 2153)
PASS: lldb-api :: python_api/watchpoint/TestSetWatchpoint.py (930 of 2153)
PASS: lldb-shell :: ObjectFile/ELF/many-sections.s (931 of 2153)
PASS: lldb-unit :: Utility/./UtilityTests/RangeDataVector.FindEntryThatContains_Overlap (932 of 2153)
PASS: lldb-unit :: Utility/./UtilityTests/StreamTeeTest.Flush (933 of 2153)
PASS: lldb-shell :: SymbolFile/DWARF/win-i386-line-table.s (934 of 2153)
PASS: lldb-api :: commands/expression/import-std-module/conflicts/TestStdModuleWithConflicts.py (935 of 2153)
PASS: lldb-api :: functionalities/target_var/no_vars/TestTargetVarNoVars.py (936 of 2153)
PASS: lldb-api :: lang/cpp/namespace/TestNamespaceLookup.py (937 of 2153)
PASS: lldb-api :: lang/c/struct_types/TestStructTypes.py (938 of 2153)
PASS: lldb-shell :: Reproducer/TestPythonImport.test (939 of 2153)
PASS: lldb-api :: functionalities/limit-debug-info/TestLimitDebugInfo.py (940 of 2153)
PASS: lldb-shell :: ObjectFile/PECOFF/basic-info-arm.yaml (941 of 2153)
PASS: lldb-api :: python_api/file_handle/TestFileHandle.py (942 of 2153)
PASS: lldb-api :: commands/expression/deleting-implicit-copy-constructor/TestDeletingImplicitCopyConstructor.py (943 of 2153)
PASS: lldb-unit :: Symbol/./SymbolTests/TestClangASTImporter.ImportInvalidType (944 of 2153)
PASS: lldb-shell :: SymbolFile/DWARF/dwarf5-index-is-used.cpp (945 of 2153)
PASS: lldb-unit :: Utility/./UtilityTests/UriParserTest.LongPath (946 of 2153)
PASS: lldb-api :: macosx/add-dsym/TestAddDsymMidExecutionCommand.py (947 of 2153)
PASS: lldb-api :: lang/objc/objc-struct-argument/TestObjCStructArgument.py (948 of 2153)
PASS: lldb-shell :: Driver/TestNoUseColor.test (949 of 2153)
PASS: lldb-unit :: Utility/./UtilityTests/StreamTest.AddressPrefixAndSuffix (950 of 2153)
PASS: lldb-unit :: Process/minidump/./LLDBMinidumpTests/MinidumpParserTest.FindMemoryRange (951 of 2153)
PASS: lldb-shell :: Driver/TestError.test (952 of 2153)
UNSUPPORTED: lldb-shell :: ExecControl/StopHook/stop-hook-threads.test (953 of 2153)
PASS: lldb-unit :: Utility/./UtilityTests/StateTest.Formatv (954 of 2153)
PASS: lldb-unit :: Utility/./UtilityTests/ReproducerTest.SetReplay (955 of 2153)
PASS: lldb-unit :: Utility/./UtilityTests/ProcessInstanceInfo.Yaml (956 of 2153)
UNSUPPORTED: lldb-api :: functionalities/darwin_log/source/info/TestDarwinLogSourceInfo.py (957 of 2153)
PASS: lldb-unit :: Utility/./UtilityTests/UriParserTest.TypicalPortPathIPv6 (958 of 2153)
PASS: lldb-api :: functionalities/thread/step_until/TestStepUntil.py (959 of 2153)
PASS: lldb-api :: functionalities/data-formatter/data-formatter-stl/libcxx/forward_list/TestDataFormatterLibcxxForwardList.py (960 of 2153)
PASS: lldb-unit :: Utility/./UtilityTests/StreamTeeTest.DefaultConstructor (961 of 2153)
PASS: lldb-unit :: Utility/./UtilityTests/ArgsTest.TestInsertArg (962 of 2153)
PASS: lldb-api :: lang/objc/self/TestObjCSelf.py (963 of 2153)
PASS: lldb-shell :: ScriptInterpreter/Python/crashlog.test (964 of 2153)
PASS: lldb-api :: lang/cpp/frame-var-anon-unions/TestFrameVariableAnonymousUnions.py (965 of 2153)
PASS: lldb-api :: commands/frame/language/TestGuessLanguage.py (966 of 2153)
PASS: lldb-api :: commands/command/script/TestCommandScript.py (967 of 2153)
PASS: lldb-unit :: Process/gdb-remote/./ProcessGdbRemoteTests/GDBRemoteCommunicationClientTest.WriteRegisterNoSuffix (968 of 2153)
PASS: lldb-shell :: Driver/TestSingleQuote.test (969 of 2153)
UNSUPPORTED: lldb-api :: lang/objc/rdar-12408181/TestRdar12408181.py (970 of 2153)
PASS: lldb-api :: functionalities/breakpoint/breakpoint_callback_command_source/TestBreakpointCallbackCommandSource.py (971 of 2153)
PASS: lldb-unit :: UnwindAssembly/x86/./UnwindAssemblyx86Tests/Testx86AssemblyInspectionEngine.Testi386IgnoredRegisters (972 of 2153)
PASS: lldb-unit :: Utility/./UtilityTests/UriParserTest.BracketedHostname (973 of 2153)
PASS: lldb-api :: functionalities/breakpoint/serialize/TestBreakpointSerialization.py (974 of 2153)
PASS: lldb-api :: functionalities/gdb_remote_client/TestThreadSelectionBug.py (975 of 2153)
UNSUPPORTED: lldb-api :: functionalities/breakpoint/hardware_breakpoints/write_memory_with_hw_breakpoint/TestWriteMemoryWithHWBreakpoint.py (976 of 2153)
PASS: lldb-api :: lang/cpp/type_lookup/TestCppTypeLookup.py (977 of 2153)
PASS: lldb-unit :: Utility/./UtilityTests/StringListTest.PopBack (978 of 2153)
PASS: lldb-unit :: Target/./TargetTests/ExecutionContextTest.GetByteOrder (979 of 2153)
PASS: lldb-api :: functionalities/tail_call_frames/thread_step_out_message/TestArtificialFrameStepOutMessage.py (980 of 2153)
PASS: lldb-unit :: Language/Highlighting/./HighlighterTests/HighlighterTest.ClangCursorPosInOtherToken (981 of 2153)
PASS: lldb-unit :: Host/./HostTests/MainLoopTest.Signal (982 of 2153)
PASS: lldb-api :: functionalities/breakpoint/comp_dir_symlink/TestCompDirSymLink.py (983 of 2153)
PASS: lldb-api :: types/TestShortType.py (984 of 2153)
PASS: lldb-unit :: Utility/./UtilityTests/StringListTest.AppendList (985 of 2153)
PASS: lldb-api :: functionalities/tsan/thread_numbers/TestTsanThreadNumbers.py (986 of 2153)
PASS: lldb-shell :: SymbolFile/DWARF/dir-separator-no-comp-dir-relative-name.s (987 of 2153)
PASS: lldb-shell :: ObjectFile/ELF/netbsd-exec-8.99.30-amd64.yaml (988 of 2153)
PASS: lldb-api :: commands/target/stop-hook/disable/TestTargetStopHookDisable.py (989 of 2153)
PASS: lldb-unit :: Utility/./UtilityTests/StringListTest.Clear (990 of 2153)
PASS: lldb-unit :: Utility/./UtilityTests/ArchSpecTest.MergeFromMachOUnknown (991 of 2153)
PASS: lldb-api :: commands/command/script/import/rdar-12586188/TestRdar12586188.py (992 of 2153)
PASS: lldb-api :: python_api/watchpoint/TestWatchpointIter.py (993 of 2153)
PASS: lldb-unit :: Process/gdb-remote/./ProcessGdbRemoteTests/GDBRemoteCommunicationClientTest.SendGetDataPacket (994 of 2153)
PASS: lldb-unit :: Utility/./UtilityTests/UriParserTest.SchemeHostSeparator4 (995 of 2153)
PASS: lldb-unit :: Utility/./UtilityTests/BinaryStreamTest.PutULEB128SevenBytes (996 of 2153)
PASS: lldb-api :: functionalities/multiword-commands/TestMultiWordCommands.py (997 of 2153)
PASS: lldb-api :: tools/lldb-server/TestLldbGdbServer.py (998 of 2153)
PASS: lldb-unit :: Language/Highlighting/./HighlighterTests/HighlighterTest.ClangCursorPosAfterOtherToken (999 of 2153)
UNSUPPORTED: lldb-api :: linux/sepdebugsymlink/TestTargetSymbolsSepDebugSymlink.py (1000 of 2153)
PASS: lldb-shell :: SymbolFile/DWARF/DW_TAG_variable-DW_AT_const_value.s (1001 of 2153)
PASS: lldb-shell :: ScriptInterpreter/Python/eof.test (1002 of 2153)
PASS: lldb-shell :: SymbolFile/Breakpad/unwind-via-stack-win.test (1003 of 2153)
PASS: lldb-unit :: Utility/./UtilityTests/FileSpecTest.Equal (1004 of 2153)
PASS: lldb-unit :: Utility/./UtilityTests/UUIDTest.Validity (1005 of 2153)
PASS: lldb-api :: commands/expression/completion-crash-incomplete-record/TestCompletionCrashIncompleteRecord.py (1006 of 2153)
PASS: lldb-api :: lang/objc/variadic_methods/TestVariadicMethods.py (1007 of 2153)
PASS: lldb-unit :: Process/gdb-remote/./ProcessGdbRemoteTests/GDBRemoteClientBaseTest.SendContinueDelegateInterface (1008 of 2153)
PASS: lldb-api :: lang/objc/objc-runtime-ivars/TestRuntimeIvars.py (1009 of 2153)
PASS: lldb-unit :: Expression/./ExpressionTests/DiagnosticManagerTest.GetStringSeverityLabels (1010 of 2153)
PASS: lldb-unit :: SymbolFile/NativePDB/./SymbolFileNativePDBTests/PDBFPOProgramToDWARFExpressionTests.UnresolvedRegisterReference (1011 of 2153)
PASS: lldb-api :: tools/lldb-vscode/step/TestVSCode_step.py (1012 of 2153)
PASS: lldb-shell :: Settings/TestDisableColor.test (1013 of 2153)
PASS: lldb-shell :: SymbolFile/DWARF/DW_TAG_variable-invalid_location.s (1014 of 2153)
PASS: lldb-api :: commands/version/TestVersion.py (1015 of 2153)
PASS: lldb-unit :: SymbolFile/DWARF/./SymbolFileDWARFTests/SymbolFileDWARFTests.ParseArangesNonzeroSegmentSize (1016 of 2153)
PASS: lldb-unit :: Utility/./UtilityTests/ArchSpecTest.OperatorBool (1017 of 2153)
PASS: lldb-api :: commands/expression/import-std-module/forward_list/TestForwardListFromStdModule.py (1018 of 2153)
PASS: lldb-unit :: UnwindAssembly/x86/./UnwindAssemblyx86Tests/Testx86AssemblyInspectionEngine.TestPopESI (1019 of 2153)
PASS: lldb-api :: functionalities/load_unload/TestLoadUnload.py (1020 of 2153)
PASS: lldb-unit :: Utility/./UtilityTests/EnvironmentTest.EnvpConstruction (1021 of 2153)
PASS: lldb-unit :: Language/Highlighting/./HighlighterTests/HighlighterTest.ClangPreserveNewLine (1022 of 2153)
PASS: lldb-unit :: Utility/./UtilityTests/StreamTest.PutHex64ByteOrderBig (1023 of 2153)
PASS: lldb-shell :: SymbolFile/NativePDB/ast-methods.cpp (1024 of 2153)
PASS: lldb-api :: lang/cpp/dynamic-value/TestDynamicValue.py (1025 of 2153)
PASS: lldb-unit :: Symbol/./SymbolTests/TestTypeSystemClang.AddMethodToObjCObjectType (1026 of 2153)
PASS: lldb-api :: functionalities/breakpoint/move_nearest/TestMoveNearest.py (1027 of 2153)
PASS: lldb-api :: functionalities/data-formatter/data-formatter-stl/libcxx/initializerlist/TestInitializerList.py (1028 of 2153)
PASS: lldb-api :: functionalities/thread/concurrent_events/TestConcurrentSignalWatch.py (1029 of 2153)
PASS: lldb-api :: commands/expression/import-std-module/list/TestListFromStdModule.py (1030 of 2153)
PASS: lldb-shell :: Quit/TestQuitExitCodeNonInt.test (1031 of 2153)
PASS: lldb-api :: functionalities/thread/thread_exit/TestThreadExit.py (1032 of 2153)
UNSUPPORTED: lldb-api :: functionalities/thread/state/TestThreadStates.py (1033 of 2153)
PASS: lldb-unit :: Utility/./UtilityTests/GeneratorTest.GetOrCreate (1034 of 2153)
PASS: lldb-api :: functionalities/breakpoint/address_breakpoints/TestBadAddressBreakpoints.py (1035 of 2153)
PASS: lldb-api :: functionalities/gdb_remote_client/TestProcessConnect.py (1036 of 2153)
PASS: lldb-unit :: Process/./ProcessEventDataTests/ProcessEventDataTest.ShouldStop (1037 of 2153)
PASS: lldb-shell :: ObjectFile/ELF/PT_LOAD-overlap-PT_INTERP.yaml (1038 of 2153)
PASS: lldb-shell :: Breakpoint/case-sensitive.test (1039 of 2153)
PASS: lldb-unit :: Utility/./UtilityTests/BinaryStreamTest.PutSLEB128FourBytes (1040 of 2153)
UNSUPPORTED: lldb-api :: functionalities/data-formatter/data-formatter-stl/libstdcpp/string/TestDataFormatterStdString.py (1041 of 2153)
PASS: lldb-shell :: SymbolFile/DWARF/find-variable-dwo.cpp (1042 of 2153)
PASS: lldb-unit :: Utility/./UtilityTests/Flags.AllClear (1043 of 2153)
UNSUPPORTED: lldb-shell :: Register/x86-zmm-write.test (1044 of 2153)
PASS: lldb-api :: functionalities/abbreviation/TestCommonShortSpellings.py (1045 of 2153)
PASS: lldb-unit :: Language/Highlighting/./HighlighterTests/HighlighterTest.ClangCursorPos (1046 of 2153)
PASS: lldb-unit :: UnwindAssembly/x86/./UnwindAssemblyx86Tests/Testx86AssemblyInspectionEngine.TestLEAVE (1047 of 2153)
PASS: lldb-api :: python_api/debugger/TestDebuggerAPI.py (1048 of 2153)
PASS: lldb-api :: lang/cpp/class_static/TestStaticVariables.py (1049 of 2153)
UNSUPPORTED: lldb-api :: tools/lldb-vscode/completions/TestVSCode_completions.py (1050 of 2153)
PASS: lldb-api :: commands/disassemble/basic/TestFrameDisassemble.py (1051 of 2153)
PASS: lldb-unit :: Utility/./UtilityTests/ScalarTest.Division (1052 of 2153)
PASS: lldb-shell :: SymbolFile/DWARF/debug_ranges-missing-section.s (1053 of 2153)
PASS: lldb-shell :: Commands/command-target-modules-dump-sections.yaml (1054 of 2153)
PASS: lldb-api :: functionalities/gdb_remote_client/TestNestedRegDefinitions.py (1055 of 2153)
PASS: lldb-unit :: Process/gdb-remote/./ProcessGdbRemoteTests/GDBRemoteCommunicationClientTest.SendStartTracePacket (1056 of 2153)
PASS: lldb-api :: functionalities/tail_call_frames/sbapi_support/TestTailCallFrameSBAPI.py (1057 of 2153)
PASS: lldb-unit :: Utility/./UtilityTests/BinaryStreamTest.PutSLEB128NineBytes (1058 of 2153)
UNSUPPORTED: lldb-api :: functionalities/darwin_log/basic/TestDarwinLogBasic.py (1059 of 2153)
PASS: lldb-unit :: ScriptInterpreter/Python/./ScriptInterpreterPythonTests/PythonDataObjectsTest.TestPythonFile (1060 of 2153)
PASS: lldb-unit :: Process/gdb-remote/./ProcessGdbRemoteTests/GDBRemoteCommunicationServerTest.SendErrorResponse_UnimplementedError (1061 of 2153)
PASS: lldb-api :: lang/c/global_variables/TestGlobalVariables.py (1062 of 2153)
PASS: lldb-api :: lang/objc/foundation/TestObjectDescriptionAPI.py (1063 of 2153)
PASS: lldb-api :: functionalities/gdb_remote_client/TestTargetXMLArch.py (1064 of 2153)
PASS: lldb-shell :: SymbolFile/NativePDB/bitfields.cpp (1065 of 2153)
PASS: lldb-unit :: ScriptInterpreter/Python/./ScriptInterpreterPythonTests/PythonDataObjectsTest.TestDictionaryResolutionWithDot (1066 of 2153)
PASS: lldb-api :: commands/expression/import-std-module/weak_ptr/TestWeakPtrFromStdModule.py (1067 of 2153)
PASS: lldb-unit :: Utility/./UtilityTests/RangeTest.ContainsEndInclusive (1068 of 2153)
PASS: lldb-unit :: UnwindAssembly/x86/./UnwindAssemblyx86Tests/Testx86AssemblyInspectionEngine.Test32bitFramelessSmallStackFrame (1069 of 2153)
PASS: lldb-unit :: Utility/./UtilityTests/OptionsWithRawTest.WhitespaceSuffix (1070 of 2153)
PASS: lldb-api :: lang/objc/objc-struct-return/TestObjCStructReturn.py (1071 of 2153)
PASS: lldb-api :: commands/expression/weak_symbols/TestWeakSymbols.py (1072 of 2153)
PASS: lldb-api :: functionalities/gdb_remote_client/TestIOSSimulator.py (1073 of 2153)
PASS: lldb-api :: commands/process/attach-resume/TestAttachResume.py (1074 of 2153)
PASS: lldb-unit :: Utility/./UtilityTests/FileSpecTest.PrependPathComponent (1075 of 2153)
PASS: lldb-shell :: Driver/TestUseColor.test (1076 of 2153)
PASS: lldb-unit :: Language/Highlighting/./HighlighterTests/HighlighterTest.Keywords (1077 of 2153)
PASS: lldb-shell :: SymbolFile/DWARF/debug_ranges.s (1078 of 2153)
UNSUPPORTED: lldb-api :: commands/watchpoints/hello_watchlocation/TestWatchLocation.py (1079 of 2153)
PASS: lldb-unit :: Utility/./UtilityTests/BinaryStreamTest.PutSLEB128Zero (1080 of 2153)
UNSUPPORTED: lldb-api :: functionalities/data-formatter/data-formatter-stl/libstdcpp/list/TestDataFormatterStdList.py (1081 of 2153)
PASS: lldb-api :: functionalities/ubsan/user-expression/TestUbsanUserExpression.py (1082 of 2153)
PASS: lldb-shell :: Quit/TestQuitExitCode0.test (1083 of 2153)
PASS: lldb-api :: commands/expression/import-std-module/empty-module/TestEmptyStdModule.py (1084 of 2153)
PASS: lldb-api :: lang/c/local_types/TestUseClosestType.py (1085 of 2153)
PASS: lldb-api :: functionalities/data-formatter/data-formatter-ptr-to-array/TestPtrToArrayFormatting.py (1086 of 2153)
PASS: lldb-api :: commands/expression/multiline-completion/TestMultilineCompletion.py (1087 of 2153)
PASS: lldb-unit :: Process/gdb-remote/./ProcessGdbRemoteTests/GDBRemoteClientBaseTest.SendContinueDelegateStructuredDataReceipt (1088 of 2153)
PASS: lldb-api :: commands/expression/call-function/TestCallBuiltinFunction.py (1089 of 2153)
PASS: lldb-unit :: Thread/./ThreadTests/ThreadTest.GetPrivateStopInfo (1090 of 2153)
PASS: lldb-unit :: Utility/./UtilityTests/ScalarTest.GetBytes (1091 of 2153)
PASS: lldb-unit :: UnwindAssembly/x86/./UnwindAssemblyx86Tests/Testx86AssemblyInspectionEngine.TestCALLNextInsn (1092 of 2153)
PASS: lldb-api :: lang/c/offsetof/TestOffsetof.py (1093 of 2153)
PASS: lldb-unit :: Utility/./UtilityTests/OptionsWithRawTest.EmptySuffixSingleWhitespace (1094 of 2153)
PASS: lldb-unit :: Utility/./UtilityTests/RegularExpression.Invalid (1095 of 2153)
PASS: lldb-unit :: Utility/./UtilityTests/BinaryStreamTest.PutSLEB128MaxValue (1096 of 2153)
PASS: lldb-api :: functionalities/breakpoint/source_regexp/TestSourceRegexBreakpoints.py (1097 of 2153)
PASS: lldb-unit :: Utility/./UtilityTests/RangeDataVector.CustomSort (1098 of 2153)
PASS: lldb-shell :: ObjectFile/PECOFF/basic-info.yaml (1099 of 2153)
PASS: lldb-unit :: Utility/./UtilityTests/OptionsWithRawTest.ArgsButNoDelimiter (1100 of 2153)
PASS: lldb-api :: functionalities/data-formatter/data-formatter-stl/libcxx/multimap/TestDataFormatterLibccMultiMap.py (1101 of 2153)
PASS: lldb-unit :: Utility/./UtilityTests/StringListTest.JoinNonSpace (1102 of 2153)
UNSUPPORTED: lldb-api :: tools/intel-features/intel-pt/test/TestIntelPTSimpleBinary.py (1103 of 2153)
PASS: lldb-unit :: Utility/./UtilityTests/StringExtractorTest.GetHexU8_Extra (1104 of 2153)
PASS: lldb-unit :: Utility/./UtilityTests/SubsystemRAIITest.SubsystemWithErrorFailure (1105 of 2153)
PASS: lldb-api :: functionalities/data-formatter/data-formatter-caching/TestDataFormatterCaching.py (1106 of 2153)
PASS: lldb-unit :: Utility/./UtilityTests/VASprintfTest.EncodingError (1107 of 2153)
PASS: lldb-unit :: Utility/./UtilityTests/AnsiTerminal.Twice (1108 of 2153)
UNSUPPORTED: lldb-api :: functionalities/process_save_core/TestProcessSaveCore.py (1109 of 2153)
PASS: lldb-api :: functionalities/type_completion/TestTypeCompletion.py (1110 of 2153)
PASS: lldb-unit :: UnwindAssembly/x86/./UnwindAssemblyx86Tests/Testx86AssemblyInspectionEngine.TestSpillRegToStackViaMOVi386 (1111 of 2153)
PASS: lldb-api :: commands/frame/diagnose/dereference-function-return/TestDiagnoseDereferenceFunctionReturn.py (1112 of 2153)
PASS: lldb-unit :: Utility/./UtilityTests/StreamTest.PutRawBytesToBigEndian (1113 of 2153)
PASS: lldb-unit :: Process/gdb-remote/./ProcessGdbRemoteTests/GDBRemoteCommunicationClientTest.GetMemoryRegionInfoInvalidResponse (1114 of 2153)
PASS: lldb-unit :: Utility/./UtilityTests/FileSpecTest.OperatorBool (1115 of 2153)
PASS: lldb-unit :: Expression/./ExpressionTests/CppModuleConfigurationTest.AmbiguousLibCpp (1116 of 2153)
PASS: lldb-unit :: Host/./HostTests/FileSystemTest.Exists (1117 of 2153)
PASS: lldb-api :: functionalities/pointer_num_children/TestPointerNumChildren.py (1118 of 2153)
PASS: lldb-api :: functionalities/plugins/command_plugin/TestPluginCommands.py (1119 of 2153)
PASS: lldb-shell :: SymbolFile/DWARF/dwp.s (1120 of 2153)
PASS: lldb-api :: python_api/lldbutil/process/TestPrintStackTraces.py (1121 of 2153)
PASS: lldb-unit :: Utility/./UtilityTests/TimerTest.CategoryTimes (1122 of 2153)
UNSUPPORTED: lldb-shell :: SymbolFile/PDB/vbases.test (1123 of 2153)
PASS: lldb-unit :: Utility/./UtilityTests/AnsiTerminal.AtStart (1124 of 2153)
PASS: lldb-api :: commands/expression/argument_passing_restrictions/TestArgumentPassingRestrictions.py (1125 of 2153)
PASS: lldb-api :: functionalities/data-formatter/data-formatter-objc/TestDataFormatterObjCPlain.py (1126 of 2153)
PASS: lldb-unit :: Expression/./ExpressionTests/CppModuleConfigurationTest.MissingUsrInclude (1127 of 2153)
PASS: lldb-api :: lang/c/complex_int/TestComplexInt.py (1128 of 2153)
PASS: lldb-api :: functionalities/data-formatter/data-formatter-synth/TestDataFormatterSynth.py (1129 of 2153)
UNSUPPORTED: lldb-api :: commands/trace/TestTraceLoad.py (1130 of 2153)
PASS: lldb-unit :: Utility/./UtilityTests/DataExtractorTest.GetFloatUnaligned (1131 of 2153)
PASS: lldb-unit :: Utility/./UtilityTests/RangeVector.CombineConsecutiveRanges (1132 of 2153)
PASS: lldb-unit :: UnwindAssembly/x86/./UnwindAssemblyx86Tests/Testx86AssemblyInspectionEngine.TestPushEBP (1133 of 2153)
PASS: lldb-unit :: Symbol/./SymbolTests/TestTypeSystemClang.TestDisplayNameEmpty (1134 of 2153)
PASS: lldb-api :: functionalities/thread_plan/TestThreadPlanCommands.py (1135 of 2153)
PASS: lldb-api :: functionalities/breakpoint/breakpoint_conditions/TestBreakpointConditions.py (1136 of 2153)
PASS: lldb-api :: lang/cpp/nested-class-other-compilation-unit/TestNestedClassWithParentInAnotherCU.py (1137 of 2153)
UNSUPPORTED: lldb-api :: commands/expression/macros/TestMacros.py (1138 of 2153)
PASS: lldb-unit :: Utility/./UtilityTests/StreamTest.AddressSuffix (1139 of 2153)
PASS: lldb-api :: python_api/symbol-context/TestSymbolContext.py (1140 of 2153)
PASS: lldb-unit :: ScriptInterpreter/Python/./ScriptInterpreterPythonTests/PythonDataObjectsTest.TestExceptions (1141 of 2153)
PASS: lldb-api :: functionalities/memory/read/TestMemoryRead.py (1142 of 2153)
PASS: lldb-api :: functionalities/data-formatter/data-formatter-smart-array/TestDataFormatterSmartArray.py (1143 of 2153)
UNSUPPORTED: lldb-api :: functionalities/darwin_log/filter/regex/subsystem/TestDarwinLogFilterRegexSubsystem.py (1144 of 2153)
FAIL: lldb-api :: commands/target/stop-hooks/TestStopHookScripted.py (1145 of 2153)
******************** TEST 'lldb-api :: commands/target/stop-hooks/TestStopHookScripted.py' FAILED ********************
Script:
--
/usr/local/Frameworks/Python.framework/Versions/3.7/bin/python3.7 /Users/buildslave/jenkins/workspace/lldb-cmake/llvm-project/lldb/test/API/dotest.py -s /Users/buildslave/jenkins/workspace/lldb-cmake/lldb-build/lldb-test-traces -S nm -u CXXFLAGS -u CFLAGS --codesign-identity - --server /Users/buildslave/jenkins/workspace/lldb-cmake/lldb-build/./bin/debugserver --arch x86_64 --build-dir /Users/buildslave/jenkins/workspace/lldb-cmake/lldb-build/lldb-test-build.noindex -s=/Users/buildslave/jenkins/workspace/lldb-cmake/test/logs -t --env TERM=vt100 --env LLVM_LIBS_DIR=/Users/buildslave/jenkins/workspace/lldb-cmake/lldb-build/./lib --arch x86_64 --build-dir /Users/buildslave/jenkins/workspace/lldb-cmake/lldb-build/lldb-test-build.noindex --lldb-module-cache-dir /Users/buildslave/jenkins/workspace/lldb-cmake/lldb-build/lldb-test-build.noindex/module-cache-lldb/lldb-api --clang-module-cache-dir /Users/buildslave/jenkins/workspace/lldb-cmake/lldb-build/lldb-test-build.noindex/module-cache-clang/lldb-api --executable /Users/buildslave/jenkins/workspace/lldb-cmake/lldb-build/./bin/lldb --compiler /Users/buildslave/jenkins/workspace/lldb-cmake/lldb-build/./bin/clang --dsymutil /Users/buildslave/jenkins/workspace/lldb-cmake/lldb-build/./bin/dsymutil --filecheck /Users/buildslave/jenkins/workspace/lldb-cmake/lldb-build/./bin/FileCheck --yaml2obj /Users/buildslave/jenkins/workspace/lldb-cmake/lldb-build/./bin/yaml2obj --lldb-libs-dir /Users/buildslave/jenkins/workspace/lldb-cmake/lldb-build/./lib /Users/buildslave/jenkins/workspace/lldb-cmake/llvm-project/lldb/test/API/commands/target/stop-hooks -p TestStopHookScripted.py
--
Exit Code: 1

Hide Details

Command Output (stdout): -- lldb version 12.0.99 clang revision 915310bf14cbac58a81fd60e0fa9dc8d341108e2 llvm revision 915310bf14cbac58a81fd60e0fa9dc8d341108e2 libstdcxx tests will not be run because: Don't know how to build with libstdcxx on macosx Skipping following debug info categories: ['dwo'] Running command: target stop-hook add -P stop_hook.stop_handler -k increment -v 5 -k return_false -v 1 -n step_out_of_me I have stopped 1 times.

Hide Details

-- Command Output (stderr): --

Hide Details

Session logs for test failures/errors/unexpected successes will go into directory '/Users/buildslave/jenkins/workspace/lldb-cmake/test/logs' Change dir to: /Users/buildslave/jenkins/workspace/lldb-cmake/llvm-project/lldb/test/API/commands/target/stop-hooks runCmd: settings clear -all output:

Hide Details

runCmd: settings set symbols.enable-external-lookup false output:

Hide Details

runCmd: settings set target.inherit-tcc true output:

Hide Details

runCmd: settings set target.auto-apply-fixits false output:

Hide Details

runCmd: settings set plugin.process.gdb-remote.packet-timeout 60 output:

Hide Details

runCmd: settings set symbols.clang-modules-cache-path "/Users/buildslave/jenkins/workspace/lldb-cmake/lldb-build/lldb-test-build.noindex/module-cache-lldb/lldb-api" output:

Hide Details

runCmd: settings set use-color false output:

Hide Details

runCmd: setting set target.prefer-dynamic-value no-dynamic-values output:

Hide Details

FAIL: LLDB (/Users/buildslave/jenkins/workspace/lldb-cmake/lldb-build/bin/clang-x86_64) :: test_stop_hooks_scripted_return_false (TestStopHookScripted.TestStopHooks) <bound method SBProcess.Kill of <lldb.SBProcess; proxy of <Swig Object of type 'lldb::SBProcess *' at 0x10fc2a4e0> >>: success

Hide Details

Restore dir to: /Users/buildslave/jenkins/workspace/lldb-cmake/lldb-build/tools/lldb/test ====================================================================== FAIL: test_stop_hooks_scripted_return_false (TestStopHookScripted.TestStopHooks) Test that the returning False from a stop hook works ---------------------------------------------------------------------- Traceback (most recent call last): File "/Users/buildslave/jenkins/workspace/lldb-cmake/llvm-project/lldb/test/API/commands/target/stop-hooks/TestStopHookScripted.py", line 54, in test_stop_hooks_scripted_return_false self.do_test_auto_continue(True) File "/Users/buildslave/jenkins/workspace/lldb-cmake/llvm-project/lldb/test/API/commands/target/stop-hooks/TestStopHookScripted.py", line 91, in do_test_auto_continue self.assertEqual("main", func_name, "Didn't stop at the expected function.") AssertionError: 'main' != 'step_out_of_me' - main+ step_out_of_me : Didn't stop at the expected function. Config=x86_64-/Users/buildslave/jenkins/workspace/lldb-cmake/lldb-build/bin/clang ---------------------------------------------------------------------- Ran 1 test in 2.825s

Hide Details

RESULT: FAILED (0 passes, 1 failures, 0 errors, 0 skipped, 0 expected failures, 0 unexpected successes)

Hide Details

--

Hide Details

******************** PASS: lldb-unit :: Host/./HostTests/HostInfoTest.GetAugmentedArchSpec (1146 of 2153) PASS: lldb-shell :: Process/UnsupportedLanguage.test (1147 of 2153) PASS: lldb-api :: lang/objc/foundation/TestRuntimeTypes.py (1148 of 2153) PASS: lldb-shell :: SymbolFile/DWARF/DW_OP_piece-struct.s (1149 of 2153) PASS: lldb-unit :: Utility/./UtilityTests/StringExtractorTest.GetHexBytesAvail_FullString (1150 of 2153) PASS: lldb-api :: macosx/simulator/TestSimulatorPlatform.py (1151 of 2153) PASS: lldb-unit :: Core/./LLDBCoreTests/ModuleSpecTest.TestCOFFFile (1152 of 2153) PASS: lldb-api :: python_api/objc_type/TestObjCType.py (1153 of 2153) PASS: lldb-unit :: Process/minidump/./LLDBMinidumpTests/MinidumpParserTest.GetArchitectureWindows (1154 of 2153) PASS: lldb-unit :: Language/Highlighting/./HighlighterTests/HighlighterTest.ClangIdentifiers (1155 of 2153) PASS: lldb-unit :: Utility/./UtilityTests/LogTest.LLDB_LOG_nullptr (1156 of 2153) PASS: lldb-shell :: ObjectFile/ELF/basic-info.yaml (1157 of 2153) PASS: lldb-api :: lang/cpp/nsimport/TestCppNsImport.py (1158 of 2153) PASS: lldb-unit :: Utility/./UtilityTests/ScalarTest.Equality (1159 of 2153) PASS: lldb-unit :: Symbol/./SymbolTests/TestClangASTImporter.DeportDeclTagDecl (1160 of 2153) PASS: lldb-unit :: Utility/./UtilityTests/SerializationRountripTest.SerializeDeserializeCStringArrayNullptrElem (1161 of 2153) PASS: lldb-unit :: Process/minidump/./LLDBMinidumpTests/MinidumpParserTest.GetMemoryRegionInfoFromMemory64List (1162 of 2153) PASS: lldb-api :: functionalities/signal/handle-abrt/TestHandleAbort.py (1163 of 2153) PASS: lldb-unit :: Process/gdb-remote/./ProcessGdbRemoteTests/GDBRemoteCommunicationServerTest.SendErrorResponse_ErrorNumber (1164 of 2153) PASS: lldb-api :: iohandler/autosuggestion/TestAutosuggestion.py (1165 of 2153) UNSUPPORTED: lldb-api :: benchmarks/continue/TestBenchmarkContinue.py (1166 of 2153) PASS: lldb-api :: lang/c/local_variables/TestLocalVariables.py (1167 of 2153) PASS: lldb-api :: tools/lldb-vscode/stackTrace/TestVSCode_stackTrace.py (1168 of 2153) PASS: lldb-api :: macosx/find-dsym/bundle-with-dot-in-filename/TestBundleWithDotInFilename.py (1169 of 2153) PASS: lldb-api :: functionalities/data-formatter/compactvectors/TestCompactVectors.py (1170 of 2153) PASS: lldb-shell :: Reproducer/TestCrash.test (1171 of 2153) PASS: lldb-unit :: Utility/./UtilityTests/UUIDTest.StringConverion (1172 of 2153) PASS: lldb-unit :: Utility/./UtilityTests/RangeTest.Clear (1173 of 2153) PASS: lldb-unit :: Utility/./UtilityTests/TimerTest.CategoryTimes2 (1174 of 2153) PASS: lldb-shell :: SymbolFile/DWARF/debug-types-dwarf5.s (1175 of 2153) PASS: lldb-api :: functionalities/thread/thread_specific_break/TestThreadSpecificBreakpoint.py (1176 of 2153) UNSUPPORTED: lldb-shell :: ScriptInterpreter/Lua/lua-python.test (1177 of 2153) PASS: lldb-api :: functionalities/data-formatter/data-formatter-stl/libcxx/string/TestDataFormatterLibcxxString.py (1178 of 2153) PASS: lldb-api :: functionalities/gdb_remote_client/TestGDBRemoteDiskFileCompletion.py (1179 of 2153) PASS: lldb-unit :: Expression/./ExpressionTests/ClangExpressionDeclMapTest.TestPersistentDeclLookup (1180 of 2153) PASS: lldb-unit :: Interpreter/./InterpreterTests/CompletionTest.DirCompletionUsername (1181 of 2153) PASS: lldb-shell :: ScriptInterpreter/Python/python.test (1182 of 2153) PASS: lldb-shell :: ObjectFile/Breakpad/breakpad-identification.test (1183 of 2153) PASS: lldb-api :: lang/cpp/subst_template_type_param/TestSubstTemplateTypeParam.py (1184 of 2153) PASS: lldb-unit :: Utility/./UtilityTests/ArgsTest.Yaml (1185 of 2153) PASS: lldb-shell :: Settings/TestFrameFormatMangling.test (1186 of 2153) UNSUPPORTED: lldb-api :: functionalities/thread/break_after_join/TestBreakAfterJoin.py (1187 of 2153) PASS: lldb-unit :: Utility/./UtilityTests/Flags.AllSet (1188 of 2153) PASS: lldb-unit :: Language/Highlighting/./HighlighterTests/HighlighterTest.ClangScalarLiterals (1189 of 2153) PASS: lldb-shell :: SymbolFile/DWARF/find-function-regex.cpp (1190 of 2153) PASS: lldb-unit :: Signals/./SignalsTests/UnixSignalsTest.GetFilteredSignals (1191 of 2153) PASS: lldb-api :: sanity/TestSettingSkipping.py (1192 of 2153) PASS: lldb-unit :: Utility/./UtilityTests/StreamTeeTest.SetStreamAtIndexOutOfBounds (1193 of 2153) PASS: lldb-api :: lang/cpp/template/TestTemplateArgs.py (1194 of 2153) PASS: lldb-unit :: SymbolFile/DWARF/./SymbolFileDWARFTests/SymbolFileDWARFTests.TestAbbrevValidAttrNullForm (1195 of 2153) PASS: lldb-api :: tools/lldb-server/TestGdbRemoteKill.py (1196 of 2153) PASS: lldb-api :: functionalities/asan/TestReportData.py (1197 of 2153) PASS: lldb-shell :: SymbolFile/DWARF/clang-ast-from-dwarf-unamed-and-anon-structs.cpp (1198 of 2153) PASS: lldb-api :: functionalities/data-formatter/data-formatter-objc/TestDataFormatterObjNSException.py (1199 of 2153) XFAIL: lldb-shell :: SymbolFile/DWARF/find-type-in-function.cpp (1200 of 2153) PASS: lldb-unit :: Utility/./UtilityTests/CompletionRequest.DuplicateFilteringWithComments (1201 of 2153) PASS: lldb-shell :: SymbolFile/DWARF/debug-types-basic.test (1202 of 2153) PASS: lldb-unit :: Host/./HostTests/SocketAddressTest.Set (1203 of 2153) PASS: lldb-unit :: Utility/./UtilityTests/XcodeSDKTest.SDKSupportsModules (1204 of 2153) PASS: lldb-api :: functionalities/dynamic_value_child_count/TestDynamicValueChildCount.py (1205 of 2153) PASS: lldb-shell :: SymbolFile/DWARF/dwarf5_locations.s (1206 of 2153) UNSUPPORTED: lldb-shell :: SymbolFile/DWARF/debug-types-expressions.test (1207 of 2153) PASS: lldb-unit :: Utility/./UtilityTests/UriParserTest.MinimalPortPath (1208 of 2153) UNSUPPORTED: lldb-shell :: SymbolFile/DWARF/DW_TAG_GNU_call_site-DW_AT_low_pc.s (1209 of 2153) PASS: lldb-api :: functionalities/postmortem/elf-core/gcore/TestGCore.py (1210 of 2153) PASS: lldb-unit :: Utility/./UtilityTests/StreamTest.PutCharNull (1211 of 2153) UNSUPPORTED: lldb-api :: lang/cpp/function-template-parameter-pack/TestFunctionTemplateParameterPack.py (1212 of 2153) PASS: lldb-api :: functionalities/data-formatter/data-formatter-stl/libcxx/unordered/TestDataFormatterUnordered.py (1213 of 2153) PASS: lldb-shell :: Register/x86-64-ymm-read.test (1214 of 2153) PASS: lldb-unit :: Symbol/./SymbolTests/DWARFCallFrameInfoTest.Basic_dwarf4 (1215 of 2153) PASS: lldb-api :: commands/expression/persist_objc_pointeetype/TestPersistObjCPointeeType.py (1216 of 2153) UNSUPPORTED: lldb-api :: tools/lldb-server/TestGdbRemoteCompletion.py (1217 of 2153) PASS: lldb-api :: commands/expression/radar_8638051/Test8638051.py (1218 of 2153) PASS: lldb-api :: tools/lldb-vscode/launch/TestVSCode_launch.py (1219 of 2153) PASS: lldb-unit :: Language/Highlighting/./HighlighterTests/HighlighterTest.ClangPPDirectives (1220 of 2153) PASS: lldb-api :: commands/expression/context-object-objc/TestContextObjectObjc.py (1221 of 2153) PASS: lldb-unit :: ScriptInterpreter/Python/./ScriptInterpreterPythonTests/PythonDataObjectsTest.TestOwnedReferences (1222 of 2153) PASS: lldb-unit :: Language/Highlighting/./HighlighterTests/HighlighterTest.Colons (1223 of 2153) PASS: lldb-unit :: Utility/./UtilityTests/BroadcasterTest.EventTypeHasListeners (1224 of 2153) PASS: lldb-shell :: ObjectFile/Breakpad/uuid-matching-mac.test (1225 of 2153) PASS: lldb-shell :: Driver/TestFile.test (1226 of 2153) PASS: lldb-unit :: Utility/./UtilityTests/ArgsTest.TestSingleQuotedArgWithSpace (1227 of 2153) PASS: lldb-unit :: Host/./HostTests/MainLoopTest.UnmonitoredSignal (1228 of 2153) PASS: lldb-shell :: Commands/command-regex-delete.test (1229 of 2153) PASS: lldb-api :: commands/watchpoints/watchpoint_disable/TestWatchpointDisable.py (1230 of 2153) PASS: lldb-shell :: SymbolFile/DWARF/find-method-local-struct.cpp (1231 of 2153) PASS: lldb-api :: lang/objc/hidden-ivars/TestHiddenIvars.py (1232 of 2153) PASS: lldb-unit :: UnwindAssembly/x86/./UnwindAssemblyx86Tests/Testx86AssemblyInspectionEngine.TestPushR14 (1233 of 2153) PASS: lldb-api :: lang/cpp/dynamic-value-same-basename/TestDynamicValueSameBase.py (1234 of 2153) PASS: lldb-api :: functionalities/inferior-assert/TestInferiorAssert.py (1235 of 2153) PASS: lldb-unit :: Utility/./UtilityTests/BinaryStreamTest.PutSLEB128One (1236 of 2153) PASS: lldb-unit :: Process/minidump/./LLDBMinidumpTests/MinidumpParserTest.GetThreadsAndGetThreadContext (1237 of 2153) PASS: lldb-unit :: Language/Highlighting/./HighlighterTests/HighlighterTest.HighlighterSelectionType (1238 of 2153) UNSUPPORTED: lldb-api :: functionalities/darwin_log/filter/exact_match/category/TestDarwinLogFilterMatchCategory.py (1239 of 2153) PASS: lldb-shell :: SymbolFile/DWARF/dwarf5-atomic.s (1240 of 2153) PASS: lldb-unit :: Utility/./UtilityTests/PassiveReplayTest.InstrumentedFoo (1241 of 2153) PASS: lldb-unit :: Process/gdb-remote/./ProcessGdbRemoteTests/GDBRemoteCommunicationClientTest.GetMemoryRegionInfo (1242 of 2153) PASS: lldb-api :: commands/quit/TestQuit.py (1243 of 2153) PASS: lldb-api :: python_api/default-constructor/TestDefaultConstructorForAPIObjects.py (1244 of 2153) PASS: lldb-api :: commands/expression/diagnostics/TestExprDiagnostics.py (1245 of 2153) PASS: lldb-unit :: Utility/./UtilityTests/StreamTest.PutULEB128 (1246 of 2153) PASS: lldb-api :: types/TestLongTypes.py (1247 of 2153) UNSUPPORTED: lldb-shell :: SymbolFile/PDB/variables-locations.test (1248 of 2153) PASS: lldb-unit :: Utility/./UtilityTests/RangeTest.Equal (1249 of 2153) PASS: lldb-api :: lang/cpp/overloaded-functions/TestOverloadedFunctions.py (1250 of 2153) PASS: lldb-api :: functionalities/data-formatter/frameformat_smallstruct/TestFrameFormatSmallStruct.py (1251 of 2153) PASS: lldb-unit :: Utility/./UtilityTests/StringListTest.AppendListCStringArrayEmpty (1252 of 2153) PASS: lldb-api :: functionalities/gdb_remote_client/TestRegDefinitionInParts.py (1253 of 2153) PASS: lldb-unit :: Utility/./UtilityTests/RangeTest.DefaultConstructor (1254 of 2153) PASS: lldb-unit :: Language/CPlusPlus/./LanguageCPlusPlusTests/CPlusPlusLanguage.FindAlternateFunctionManglings (1255 of 2153) UNSUPPORTED: lldb-shell :: SymbolFile/PDB/pointers.test (1256 of 2153) PASS: lldb-unit :: SymbolFile/NativePDB/./SymbolFileNativePDBTests/PDBFPOProgramToDWARFExpressionTests.UnresolvedDependentCyclicRegisterAssignmentReference (1257 of 2153) PASS: lldb-api :: lang/objc/modules-hash-mismatch/TestClangModulesHashMismatch.py (1258 of 2153) PASS: lldb-api :: lang/objc/modules-update/TestClangModulesUpdate.py (1259 of 2153) PASS: lldb-api :: functionalities/postmortem/wow64_minidump/TestWow64MiniDump.py (1260 of 2153) PASS: lldb-unit :: Utility/./UtilityTests/RangeTest.NotEqualInvalid (1261 of 2153) PASS: lldb-unit :: UnwindAssembly/x86/./UnwindAssemblyx86Tests/Testx86AssemblyInspectionEngine.TestStackRealignMSVC_i386 (1262 of 2153) PASS: lldb-unit :: Host/./HostTests/SocketTest.UDPGetConnectURI (1263 of 2153) PASS: lldb-api :: functionalities/thread/concurrent_events/TestConcurrentSignalDelayWatch.py (1264 of 2153) PASS: lldb-api :: lang/cpp/this_class_type_mixing/TestThisClassTypeMixing.py (1265 of 2153) PASS: lldb-unit :: Utility/./UtilityTests/ArchSpecTest.TestParseMachCPUDashSubtypeTripleExtra (1266 of 2153) PASS: lldb-api :: functionalities/avoids-fd-leak/TestFdLeak.py (1267 of 2153) PASS: lldb-shell :: SymbolFile/DWARF/dir-separator-posix.s (1268 of 2153) PASS: lldb-api :: lang/cpp/bool/TestCPPBool.py (1269 of 2153) PASS: lldb-shell :: Driver/LocalLLDBInit.test (1270 of 2153) PASS: lldb-unit :: ScriptInterpreter/Python/./ScriptInterpreterPythonTests/PythonDataObjectsTest.TestPythonTupleValues (1271 of 2153) PASS: lldb-unit :: Utility/./UtilityTests/StreamTest.PutCharWhitespace (1272 of 2153) PASS: lldb-api :: functionalities/data-formatter/var-in-aggregate-misuse/TestVarInAggregateMisuse.py (1273 of 2153) PASS: lldb-api :: lang/objc/foundation/TestObjCMethodsString.py (1274 of 2153) PASS: lldb-api :: lang/cpp/inlines/TestInlines.py (1275 of 2153) PASS: lldb-api :: lang/cpp/diamond/TestDiamond.py (1276 of 2153) PASS: lldb-unit :: Utility/./UtilityTests/StringExtractorTest.DecodeHexU8_Underflow (1277 of 2153) UNSUPPORTED: lldb-shell :: ScriptInterpreter/Lua/independent_state.test (1278 of 2153) PASS: lldb-shell :: Heap/heap-cstr.test (1279 of 2153) PASS: lldb-api :: commands/process/launch/TestProcessLaunch.py (1280 of 2153) PASS: lldb-api :: api/multithreaded/TestMultithreaded.py (1281 of 2153) PASS: lldb-api :: functionalities/data-formatter/data-formatter-stl/libcxx/optional/TestDataFormatterLibcxxOptional.py (1282 of 2153) UNSUPPORTED: lldb-shell :: Reproducer/TestLuaImport.test (1283 of 2153) PASS: lldb-unit :: Utility/./UtilityTests/ConstStringTest.FromMidOfBufferStringRef (1284 of 2153) PASS: lldb-unit :: UnwindAssembly/x86/./UnwindAssemblyx86Tests/Testx86AssemblyInspectionEngine.TestDisassemblyJunkBytes (1285 of 2153) PASS: lldb-unit :: Utility/./UtilityTests/ConstStringTest.MangledCounterpart (1286 of 2153) PASS: lldb-api :: lang/c/stepping/TestStepAndBreakpoints.py (1287 of 2153) PASS: lldb-unit :: Utility/./UtilityTests/FileSpecTest.EqualDotsPosix (1288 of 2153) PASS: lldb-unit :: Utility/./UtilityTests/StreamTest.AddressNoSuffix (1289 of 2153) PASS: lldb-shell :: SymbolFile/DWARF/debug-types-address-ranges.s (1290 of 2153) PASS: lldb-unit :: Utility/./UtilityTests/StatusTest.Formatv (1291 of 2153) PASS: lldb-shell :: SymbolFile/Breakpad/symtab.test (1292 of 2153) PASS: lldb-api :: functionalities/gdb_remote_client/TestQemuAArch64TargetXml.py (1293 of 2153) PASS: lldb-api :: functionalities/data-formatter/boolreference/TestFormattersBoolRefPtr.py (1294 of 2153) PASS: lldb-unit :: Symbol/./SymbolTests/TestTypeSystemClang.TestGetBasicTypeFromEnum (1295 of 2153) PASS: lldb-api :: commands/target/stop-hooks/TestStopHooks.py (1296 of 2153) PASS: lldb-shell :: Driver/TestRepl.test (1297 of 2153) PASS: lldb-unit :: Expression/./ExpressionTests/DiagnosticManagerTest.PutString (1298 of 2153) PASS: lldb-unit :: SymbolFile/NativePDB/./SymbolFileNativePDBTests/PDBFPOProgramToDWARFExpressionTests.UnsupportedRASearch (1299 of 2153) PASS: lldb-unit :: Utility/./UtilityTests/RangeTest.ContainsAddrInvalid (1300 of 2153) PASS: lldb-unit :: Language/Highlighting/./HighlighterTests/HighlighterTest.ClangBraces (1301 of 2153) PASS: lldb-api :: commands/target/stop-hook/delete/TestTargetStopHookDelete.py (1302 of 2153) PASS: lldb-api :: commands/expression/call-throws/TestCallThatThrows.py (1303 of 2153) PASS: lldb-unit :: UnwindAssembly/x86/./UnwindAssemblyx86Tests/Testx86AssemblyInspectionEngine.TestPushEAX (1304 of 2153) PASS: lldb-api :: commands/expression/import-std-module/no-std-module/TestMissingStdModule.py (1305 of 2153) PASS: lldb-unit :: Utility/./UtilityTests/SubsystemRAIITest.SubsystemWithErrorSuccess (1306 of 2153) PASS: lldb-shell :: Commands/command-disassemble.s (1307 of 2153) PASS: lldb-unit :: Expression/./ExpressionTests/DiagnosticManagerTest.PutStringSeverities (1308 of 2153) PASS: lldb-unit :: Utility/./UtilityTests/StreamTest.ShiftOperatorChars (1309 of 2153) PASS: lldb-api :: commands/expression/import-std-module/pair/TestPairFromStdModule.py (1310 of 2153) PASS: lldb-api :: commands/watchpoints/hello_watchpoint/TestMyFirstWatchpoint.py (1311 of 2153) PASS: lldb-api :: lang/objc/objc_direct-methods/TestObjCDirectMethods.py (1312 of 2153) PASS: lldb-unit :: Utility/./UtilityTests/ListenerTest.GetEventWait (1313 of 2153) PASS: lldb-unit :: Symbol/./SymbolTests/TestTypeSystemClang.TestOwningModule (1314 of 2153) PASS: lldb-api :: functionalities/gdb_remote_client/TestNoGPacketSupported.py (1315 of 2153) PASS: lldb-shell :: Unwind/trap_frame_sym_ctx.test (1316 of 2153) PASS: lldb-shell :: Register/x86-64-read.test (1317 of 2153) PASS: lldb-unit :: Utility/./UtilityTests/BinaryStreamTest.PutULEB128MaxValue (1318 of 2153) PASS: lldb-api :: lang/cpp/extern_c/TestExternCSymbols.py (1319 of 2153) PASS: lldb-unit :: Expression/./ExpressionTests/ClangHostTest.ComputeClangResourceDirectory (1320 of 2153) PASS: lldb-api :: commands/target/create-no-such-arch/TestNoSuchArch.py (1321 of 2153) PASS: lldb-unit :: Utility/./UtilityTests/StringLexerTest.NextIfList (1322 of 2153) PASS: lldb-unit :: ScriptInterpreter/Python/./ScriptInterpreterPythonTests/PythonDataObjectsTest.TestPythonBytes (1323 of 2153) PASS: lldb-api :: functionalities/data-formatter/nsarraysynth/TestNSArraySynthetic.py (1324 of 2153) PASS: lldb-api :: lang/cpp/thread_local/TestThreadLocal.py (1325 of 2153) PASS: lldb-api :: lang/c/function_types/TestFunctionTypes.py (1326 of 2153) PASS: lldb-api :: lang/objc/conflicting-definition/TestConflictingDefinition.py (1327 of 2153) PASS: lldb-api :: functionalities/thread/crash_during_step/TestCrashDuringStep.py (1328 of 2153) PASS: lldb-api :: commands/process/attach/TestProcessAttach.py (1329 of 2153) PASS: lldb-unit :: DataFormatter/./LLDBFormatterTests/TypeMatcherTests.ExactName (1330 of 2153) PASS: lldb-api :: functionalities/postmortem/elf-core/thread_crash/TestLinuxCoreThreads.py (1331 of 2153) PASS: lldb-unit :: Language/Highlighting/./HighlighterTests/HighlighterTest.ClangUnterminatedString (1332 of 2153) PASS: lldb-api :: functionalities/inferior-crashing/TestInferiorCrashing.py (1333 of 2153) PASS: lldb-unit :: Utility/./UtilityTests/StringExtractorTest.GetNameColonValueNoColon (1334 of 2153) PASS: lldb-unit :: Utility/./UtilityTests/ConstStringTest.YAML (1335 of 2153) PASS: lldb-unit :: Process/gdb-remote/./ProcessGdbRemoteTests/GDBRemoteCommunicationClientTest.SendSignalsToIgnore (1336 of 2153) PASS: lldb-unit :: Utility/./UtilityTests/RegularExpression.Empty (1337 of 2153) PASS: lldb-api :: lang/objc/ptr_refs/TestPtrRefsObjC.py (1338 of 2153) PASS: lldb-api :: types/TestFloatTypesExpr.py (1339 of 2153) PASS: lldb-shell :: SymbolFile/DWARF/DW_AT_const_value.s (1340 of 2153) PASS: lldb-api :: functionalities/gdb_remote_client/TestGDBRemoteClient.py (1341 of 2153) PASS: lldb-api :: functionalities/postmortem/minidump-new/TestMiniDumpNew.py (1342 of 2153) PASS: lldb-unit :: Utility/./UtilityTests/LogTest.Unregister (1343 of 2153) PASS: lldb-api :: functionalities/tsan/thread_leak/TestTsanThreadLeak.py (1344 of 2153) PASS: lldb-unit :: Utility/./UtilityTests/VMRange.Comparison (1345 of 2153) PASS: lldb-unit :: Host/./HostTests/File.GetWaitableHandleFileno (1346 of 2153) PASS: lldb-unit :: Expression/./ExpressionTests/CppModuleConfigurationTest.Sysroot (1347 of 2153) PASS: lldb-shell :: Minidump/memory-region.yaml (1348 of 2153) PASS: lldb-api :: functionalities/process_crash_info/TestProcessCrashInfo.py (1349 of 2153) PASS: lldb-api :: lang/c/shared_lib/TestSharedLib.py (1350 of 2153) UNSUPPORTED: lldb-api :: benchmarks/turnaround/TestCompileRunToBreakpointTurnaround.py (1351 of 2153) PASS: lldb-unit :: Symbol/./SymbolTests/DWARFCallFrameInfoTest.Basic_dwarf3 (1352 of 2153) PASS: lldb-api :: functionalities/reproducers/attach/TestReproducerAttach.py (1353 of 2153) PASS: lldb-api :: lang/objc/direct-dispatch-step/TestObjCDirectDispatchStepping.py (1354 of 2153) PASS: lldb-unit :: Utility/./UtilityTests/Flags.AnySet (1355 of 2153) PASS: lldb-unit :: Host/./HostTests/SocketTest.DomainListenConnectAccept (1356 of 2153) PASS: lldb-unit :: Process/minidump/./LLDBMinidumpTests/MinidumpParserTest.MinidumpDuplicateModuleMappedFirst (1357 of 2153) PASS: lldb-api :: commands/expression/import-std-module/queue/TestQueueFromStdModule.py (1358 of 2153) PASS: lldb-api :: commands/expression/import-std-module/list-dbg-info-content/TestDbgInfoContentListFromStdModule.py (1359 of 2153) PASS: lldb-unit :: UnwindAssembly/x86/./UnwindAssemblyx86Tests/Testx86AssemblyInspectionEngine.TestPopEDI (1360 of 2153) PASS: lldb-unit :: UnwindAssembly/x86/./UnwindAssemblyx86Tests/Testx86AssemblyInspectionEngine.TestSimple64bitFrameFunction (1361 of 2153) PASS: lldb-api :: functionalities/data-formatter/nssetsynth/TestNSSetSynthetic.py (1362 of 2153) UNSUPPORTED: lldb-api :: functionalities/thread/concurrent_events/TestConcurrentManySignals.py (1363 of 2153) PASS: lldb-unit :: SymbolFile/NativePDB/./SymbolFileNativePDBTests/PDBFPOProgramToDWARFExpressionTests.UnresolvedCyclicRegisterAssignmentReference (1364 of 2153) PASS: lldb-api :: functionalities/testid/TestTestId.py (1365 of 2153) PASS: lldb-unit :: Utility/./UtilityTests/StringListTest.JoinSingle (1366 of 2153) PASS: lldb-api :: commands/expression/no-deadlock/TestExprDoesntBlock.py (1367 of 2153) PASS: lldb-unit :: Expression/./ExpressionTests/DiagnosticManagerTest.AppendMessageAttachToLastDiag (1368 of 2153) PASS: lldb-unit :: Breakpoint/./LLDBBreakpointTests/BreakpointIDTest.StringIsBreakpointName (1369 of 2153) PASS: lldb-api :: macosx/lc-note/kern-ver-str/TestKernVerStrLCNOTE.py (1370 of 2153) PASS: lldb-shell :: Commands/CommandScriptImmediateOutput/CommandScriptImmediateOutputConsole.test (1371 of 2153) UNSUPPORTED: lldb-shell :: SymbolFile/PDB/calling-conventions.test (1372 of 2153) PASS: lldb-api :: commands/frame/recognizer/TestFrameRecognizer.py (1373 of 2153) PASS: lldb-shell :: Reproducer/TestGDBRemoteRepro.test (1374 of 2153) PASS: lldb-unit :: Utility/./UtilityTests/StringListTest.LongestCommonPrefixNoPrefix (1375 of 2153) PASS: lldb-api :: lang/cpp/alignas_base_class/TestAlignAsBaseClass.py (1376 of 2153) PASS: lldb-api :: functionalities/thread/concurrent_events/TestConcurrentCrashWithSignal.py (1377 of 2153) PASS: lldb-unit :: Utility/./UtilityTests/XcodeSDKTest.GetCanonicalNameAndConstruct (1378 of 2153) PASS: lldb-unit :: Host/./HostTests/FileSystemTest.OpenErrno (1379 of 2153) PASS: lldb-shell :: Reproducer/TestSynchronous.test (1380 of 2153) PASS: lldb-unit :: Utility/./UtilityTests/EnvironmentTest.EnvpConversion (1381 of 2153) PASS: lldb-shell :: Commands/command-breakpoint-col.test (1382 of 2153) PASS: lldb-unit :: SymbolFile/DWARF/./SymbolFileDWARFTests/SymbolFileDWARFTests.TestAbbrevNullAttrValidForm (1383 of 2153) PASS: lldb-api :: tools/lldb-server/TestGdbRemoteExitCode.py (1384 of 2153) PASS: lldb-api :: commands/breakpoint/set/func-regex/TestBreakpointRegexError.py (1385 of 2153) PASS: lldb-api :: functionalities/tsan/global_location/TestTsanGlobalLocation.py (1386 of 2153) PASS: lldb-api :: commands/expression/vector_of_enums/TestVectorOfEnums.py (1387 of 2153) PASS: lldb-unit :: Utility/./UtilityTests/ScalarTest.Promotion (1388 of 2153) PASS: lldb-unit :: Utility/./UtilityTests/Flags.IsClear (1389 of 2153) PASS: lldb-api :: functionalities/load_using_paths/TestLoadUsingPaths.py (1390 of 2153) PASS: lldb-api :: types/TestDoubleTypesExpr.py (1391 of 2153) PASS: lldb-shell :: ObjectFile/Breakpad/sections.test (1392 of 2153) PASS: lldb-shell :: Quit/TestQuitExitCode30.test (1393 of 2153) UNSUPPORTED: lldb-shell :: SymbolFile/PDB/ast-restore.test (1394 of 2153) PASS: lldb-unit :: Process/gdb-remote/./ProcessGdbRemoteTests/GDBRemoteClientBaseTest.SendContinueAndWait (1395 of 2153) PASS: lldb-shell :: SymbolFile/DWARF/dwo-type-in-main-file.s (1396 of 2153) PASS: lldb-unit :: Utility/./UtilityTests/StringExtractorTest.GetU32BigEndian (1397 of 2153) PASS: lldb-api :: python_api/frame/TestFrames.py (1398 of 2153) PASS: lldb-unit :: Utility/./UtilityTests/DataExtractorTest.GetDouble (1399 of 2153) PASS: lldb-shell :: SymbolFile/DWARF/gnu-style-compression.cpp (1400 of 2153) PASS: lldb-api :: functionalities/signal/raise/TestRaise.py (1401 of 2153) PASS: lldb-unit :: ScriptInterpreter/Python/./ScriptInterpreterPythonTests/PythonDataObjectsTest.TestInstanceNameResolutionNoDot (1402 of 2153) PASS: lldb-unit :: Utility/./UtilityTests/StreamTest.AddressRangeEmptyRange (1403 of 2153) PASS: lldb-shell :: ObjectFile/ELF/PT_LOAD-overlap.yaml (1404 of 2153) PASS: lldb-api :: macosx/nslog/TestDarwinNSLogOutput.py (1405 of 2153) UNSUPPORTED: lldb-api :: tools/lldb-server/TestGdbRemote_vContThreads.py (1406 of 2153) PASS: lldb-unit :: Utility/./UtilityTests/StringListTest.AppendListCStringArray (1407 of 2153) PASS: lldb-api :: lang/objc/objc-builtin-types/TestObjCBuiltinTypes.py (1408 of 2153) PASS: lldb-api :: functionalities/data-formatter/data-formatter-stl/libcxx/tuple/TestDataFormatterLibcxxTuple.py (1409 of 2153) PASS: lldb-unit :: Utility/./UtilityTests/StreamTest.PutBytesAsRawHex8ToMixedEndian (1410 of 2153) PASS: lldb-unit :: Platform/./LLDBPlatformTests/PlatformDarwinTest.TestParseVersionBuildDir (1411 of 2153) UNSUPPORTED: lldb-shell :: Register/x86-64-ymm16-read.test (1412 of 2153) PASS: lldb-shell :: Unwind/eh-frame-dwarf-unwind.test (1413 of 2153) PASS: lldb-api :: tools/lldb-server/commandline/TestStubSetSID.py (1414 of 2153) PASS: lldb-unit :: ScriptInterpreter/Python/./ScriptInterpreterPythonTests/PythonDataObjectsTest.TestPythonTupleInitializerList2 (1415 of 2153) PASS: lldb-api :: types/TestDoubleTypes.py (1416 of 2153) PASS: lldb-unit :: Process/gdb-remote/./ProcessGdbRemoteTests/GDBRemoteCommunicationServerTest.SendErrorResponse_ErrorList (1417 of 2153) PASS: lldb-api :: functionalities/thread/concurrent_events/TestConcurrentWatchBreak.py (1418 of 2153) PASS: lldb-unit :: UnwindAssembly/x86/./UnwindAssemblyx86Tests/Testx86AssemblyInspectionEngine.TestSubESP (1419 of 2153) PASS: lldb-api :: functionalities/breakpoint/breakpoint_by_file_colon_line/TestBreakpointByFileColonLine.py (1420 of 2153) PASS: lldb-unit :: Symbol/./SymbolTests/TestTypeSystemClang.TestDisplayName (1421 of 2153) PASS: lldb-shell :: BuildScript/compiler-full-path.test (1422 of 2153) PASS: lldb-unit :: Symbol/./SymbolTests/TestClangASTImporter.RecordLayout (1423 of 2153) PASS: lldb-unit :: Target/./TargetTests/PathMappingListTest.RemapRoot (1424 of 2153) PASS: lldb-api :: commands/apropos/with-process/TestAproposWithProcess.py (1425 of 2153) PASS: lldb-unit :: Utility/./UtilityTests/DataExtractorTest.GetCStrAtNullOffset (1426 of 2153) UNSUPPORTED: lldb-shell :: SymbolFile/PDB/compilands.test (1427 of 2153) PASS: lldb-shell :: Reproducer/Functionalities/TestExpressionEvaluation.test (1428 of 2153) PASS: lldb-unit :: Utility/./UtilityTests/BinaryStreamTest.PutSLEB128FiveBytes (1429 of 2153) PASS: lldb-api :: macosx/universal/TestUniversal.py (1430 of 2153) PASS: lldb-unit :: Utility/./UtilityTests/UriParserTest.SchemeHostSeparator2 (1431 of 2153) PASS: lldb-shell :: Quit/TestQuitExitCodeHexA.test (1432 of 2153) PASS: lldb-unit :: Core/./LLDBCoreTests/ModuleSpecTest.TestELFFile (1433 of 2153) PASS: lldb-unit :: Utility/./UtilityTests/RegularExpression.CopyAssignment (1434 of 2153) PASS: lldb-unit :: Platform/./LLDBPlatformTests/PlatformDarwinTest.FindComponentInPath (1435 of 2153) PASS: lldb-api :: functionalities/breakpoint/scripted_bkpt/TestScriptedResolver.py (1436 of 2153) PASS: lldb-unit :: Utility/./UtilityTests/ArgsTest.TestQuotedTrailingBackslash (1437 of 2153) PASS: lldb-api :: lang/cpp/constructors/TestCppConstructors.py (1438 of 2153) PASS: lldb-api :: lang/objc/unicode-string/TestUnicodeString.py (1439 of 2153) PASS: lldb-api :: lang/objcxx/hide-runtime-values/TestObjCXXHideRuntimeValues.py (1440 of 2153) PASS: lldb-shell :: SymbolFile/DWARF/find-qualified-variable.cpp (1441 of 2153) PASS: lldb-api :: commands/expression/import-std-module/vector-of-vectors/TestVectorOfVectorsFromStdModule.py (1442 of 2153) PASS: lldb-api :: commands/session/save/TestSessionSave.py (1443 of 2153) PASS: lldb-unit :: UnwindAssembly/ARM64/./Arm64InstEmulationTests/TestArm64InstEmulation.TestCFARegisterTrackedAcrossJumps (1444 of 2153) PASS: lldb-shell :: ObjectFile/ELF/PT_LOAD-overlap-PT_TLS.yaml (1445 of 2153) PASS: lldb-api :: tools/lldb-server/TestGdbRemote_vCont.py (1446 of 2153) PASS: lldb-shell :: Register/x86-64-gp-read.test (1447 of 2153) PASS: lldb-unit :: Signals/./SignalsTests/UnixSignalsTest.Iteration (1448 of 2153) PASS: lldb-unit :: ScriptInterpreter/Python/./ScriptInterpreterPythonTests/PythonDataObjectsTest.TestPythonInteger (1449 of 2153) PASS: lldb-api :: commands/expression/import-std-module/weak_ptr-dbg-info-content/TestDbgInfoContentWeakPtrFromStdModule.py (1450 of 2153) PASS: lldb-api :: functionalities/data-formatter/cstring-utf8-summary/TestCstringUnicode.py (1451 of 2153) PASS: lldb-unit :: Utility/./UtilityTests/DataExtractorTest.GetMaxU64 (1452 of 2153) PASS: lldb-unit :: Interpreter/./InterpreterTests/OptionValueFileColonLine.setFromString (1453 of 2153) UNSUPPORTED: lldb-api :: benchmarks/startup/TestStartupDelays.py (1454 of 2153) PASS: lldb-api :: functionalities/inferior-crashing/TestInferiorCrashingStep.py (1455 of 2153) PASS: lldb-shell :: ObjectFile/PECOFF/invalid-export-table.yaml (1456 of 2153) PASS: lldb-unit :: Utility/./UtilityTests/UriParserTest.SchemeHostSeparator3 (1457 of 2153) PASS: lldb-api :: commands/expression/anonymous-struct/TestCallUserAnonTypedef.py (1458 of 2153) PASS: lldb-unit :: Utility/./UtilityTests/UriParserTest.MinimalPort (1459 of 2153) PASS: lldb-api :: functionalities/data-formatter/user-format-vs-summary/TestUserFormatVsSummary.py (1460 of 2153) PASS: lldb-unit :: Utility/./UtilityTests/StreamTest.ShiftOperatorStrings (1461 of 2153) PASS: lldb-api :: lang/objc/ivar-IMP/TestObjCiVarIMP.py (1462 of 2153) PASS: lldb-unit :: Utility/./UtilityTests/VMRange.IsValid (1463 of 2153) PASS: lldb-shell :: SymbolFile/Breakpad/symtab-macho.test (1464 of 2153) PASS: lldb-api :: tools/lldb-vscode/attach/TestVSCode_attach.py (1465 of 2153) PASS: lldb-api :: python_api/lldbutil/TestSwigVersion.py (1466 of 2153) PASS: lldb-api :: lang/cpp/member-and-local-vars-with-same-name/TestMembersAndLocalsWithSameName.py (1467 of 2153) PASS: lldb-shell :: Breakpoint/ppc64-localentry.test (1468 of 2153) PASS: lldb-unit :: Utility/./UtilityTests/ScalarTest.APIntConstructor (1469 of 2153) PASS: lldb-api :: commands/expression/test/TestExprs.py (1470 of 2153) PASS: lldb-unit :: Host/./HostTests/HostInfoTest.GetHostname (1471 of 2153) PASS: lldb-shell :: Settings/TestFrameFormatColor.test (1472 of 2153) PASS: lldb-shell :: Settings/TestDisassemblyFormat.test (1473 of 2153) PASS: lldb-unit :: Expression/./ExpressionTests/DiagnosticManagerTest.HasFixits (1474 of 2153) PASS: lldb-unit :: Utility/./UtilityTests/ArgsTest.ReplaceArgumentAtIndexEqual (1475 of 2153) PASS: lldb-unit :: Utility/./UtilityTests/StringListTest.GetMaxStringLengthIncreasingSize (1476 of 2153) PASS: lldb-api :: lang/cpp/unsigned_types/TestUnsignedTypes.py (1477 of 2153) PASS: lldb-unit :: Language/Highlighting/./HighlighterTests/HighlighterTest.ClangStringLiterals (1478 of 2153) PASS: lldb-api :: lang/cpp/namespace_conflicts/TestNamespaceConflicts.py (1479 of 2153) PASS: lldb-unit :: Utility/./UtilityTests/StringExtractorTest.DecodeHexU8_InvalidHex2 (1480 of 2153) UNSUPPORTED: lldb-api :: commands/watchpoints/multi_watchpoint_slots/TestWatchpointMultipleSlots.py (1481 of 2153) PASS: lldb-unit :: Utility/./UtilityTests/StreamTest.AddressSize (1482 of 2153) PASS: lldb-unit :: Utility/./UtilityTests/RangeTest.Constructor (1483 of 2153) PASS: lldb-api :: iohandler/resize/TestIOHandlerResizeNoEditline.py (1484 of 2153) PASS: lldb-api :: functionalities/wrong_commands/TestWrongCommands.py (1485 of 2153) PASS: lldb-api :: commands/expression/ir-interpreter-phi-nodes/TestIRInterpreterPHINodes.py (1486 of 2153) PASS: lldb-shell :: ObjectFile/ELF/PT_LOAD-empty.yaml (1487 of 2153) PASS: lldb-api :: functionalities/backticks/TestBackticksWithoutATarget.py (1488 of 2153) PASS: lldb-shell :: ObjectFile/ELF/avr-basic-info.yaml (1489 of 2153) PASS: lldb-unit :: Utility/./UtilityTests/AnsiTerminal.Unknown (1490 of 2153) PASS: lldb-unit :: Utility/./UtilityTests/RecordReplayTest.InstrumentedFoo (1491 of 2153) PASS: lldb-api :: lang/objc/foundation/TestObjCMethodsNSArray.py (1492 of 2153) PASS: lldb-api :: lang/cpp/limit-debug-info/TestWithLimitDebugInfo.py (1493 of 2153) PASS: lldb-unit :: Utility/./UtilityTests/StringListTest.CopyList (1494 of 2153) PASS: lldb-api :: lang/objc/foundation/TestObjCMethods2.py (1495 of 2153) UNSUPPORTED: lldb-api :: functionalities/breakpoint/breakpoint_in_delayslot/TestAvoidBreakpointInDelaySlot.py (1496 of 2153) PASS: lldb-api :: lang/objc/print-obj/TestPrintObj.py (1497 of 2153) PASS: lldb-api :: commands/target/stop-hook/enable/TestTargetStopHookEnable.py (1498 of 2153) PASS: lldb-unit :: Utility/./UtilityTests/StreamTest.PutHex32ByteOrderLittle (1499 of 2153) PASS: lldb-unit :: Symbol/./SymbolTests/TestTypeSystemClang.TestGetTypeClassDeclType (1500 of 2153) PASS: lldb-api :: python_api/interpreter/TestRunCommandInterpreterAPI.py (1501 of 2153) PASS: lldb-api :: functionalities/data-formatter/data-formatter-globals/TestDataFormatterGlobals.py (1502 of 2153) PASS: lldb-api :: functionalities/breakpoint/inlined_breakpoints/TestInlinedBreakpoints.py (1503 of 2153) UNSUPPORTED: lldb-api :: functionalities/thread/multi_break/TestMultipleBreakpoints.py (1504 of 2153) PASS: lldb-shell :: Driver/TestConvenienceVariables.test (1505 of 2153) PASS: lldb-unit :: Expression/./ExpressionTests/DiagnosticManagerTest.PutStringMultiple (1506 of 2153) PASS: lldb-unit :: Utility/./UtilityTests/ArchSpecTest.MergeFrom (1507 of 2153) UNSUPPORTED: lldb-api :: android/platform/TestDefaultCacheLineSize.py (1508 of 2153) PASS: lldb-unit :: Utility/./UtilityTests/LogChannelTest.Enable (1509 of 2153) UNSUPPORTED: lldb-api :: benchmarks/expression/TestRepeatedExprs.py (1510 of 2153) PASS: lldb-api :: functionalities/breakpoint/breakpoint_set_restart/TestBreakpointSetRestart.py (1511 of 2153) PASS: lldb-api :: commands/expression/timeout/TestCallWithTimeout.py (1512 of 2153) PASS: lldb-unit :: Utility/./UtilityTests/FileSpecTest.FileAndDirectoryComponents (1513 of 2153) PASS: lldb-api :: commands/expression/ir-interpreter/TestIRInterpreter.py (1514 of 2153) PASS: lldb-api :: functionalities/data-formatter/synthupdate/TestSyntheticFilterRecompute.py (1515 of 2153) PASS: lldb-unit :: Host/./HostTests/MainLoopTest.TerminatesImmediately (1516 of 2153) PASS: lldb-unit :: Utility/./UtilityTests/StringListTest.JoinMultiCharSeparator (1517 of 2153) PASS: lldb-shell :: Process/Optimization.test (1518 of 2153) PASS: lldb-api :: functionalities/data-formatter/vector-types/TestVectorTypesFormatting.py (1519 of 2153) PASS: lldb-api :: lang/objc/objc-static-method-stripped/TestObjCStaticMethodStripped.py (1520 of 2153) PASS: lldb-unit :: Process/gdb-remote/./ProcessGdbRemoteTests/GDBRemoteCommunicationClientTest.TestPacketSpeedJSON (1521 of 2153) PASS: lldb-unit :: Utility/./UtilityTests/CompletionRequest.ShiftArguments (1522 of 2153) PASS: lldb-api :: functionalities/thread/backtrace_all/TestBacktraceAll.py (1523 of 2153) PASS: lldb-unit :: Utility/./UtilityTests/VMRange.SetEndAddress (1524 of 2153) PASS: lldb-unit :: Utility/./UtilityTests/Flags.GetBitSize (1525 of 2153) PASS: lldb-unit :: Utility/./UtilityTests/RegularExpression.Match (1526 of 2153) PASS: lldb-shell :: ExecControl/StopHook/stop-hook.test (1527 of 2153) PASS: lldb-api :: python_api/frame/get-variables/TestGetVariables.py (1528 of 2153) PASS: lldb-unit :: Language/Highlighting/./HighlighterTests/HighlighterTest.ClangSquareBrackets (1529 of 2153) PASS: lldb-unit :: Expression/./ExpressionTests/DiagnosticManagerTest.GetStringNoDiags (1530 of 2153) PASS: lldb-unit :: Language/CPlusPlus/./LanguageCPlusPlusTests/CPlusPlusLanguage.ExtractContextAndIdentifier (1531 of 2153) PASS: lldb-api :: lang/c/bitfields/TestBitfields.py (1532 of 2153) PASS: lldb-api :: commands/command/script_alias/TestCommandScriptAlias.py (1533 of 2153) PASS: lldb-unit :: Process/minidump/./LLDBMinidumpTests/MinidumpParserTest.GetMemoryRegionInfo (1534 of 2153) PASS: lldb-shell :: Quit/TestQuitExitCodeTooManyArgs.test (1535 of 2153) PASS: lldb-unit :: ScriptInterpreter/Python/./ScriptInterpreterPythonTests/PythonDataObjectsTest.TestResetting (1536 of 2153) PASS: lldb-unit :: Process/gdb-remote/./ProcessGdbRemoteTests/GDBRemoteClientBaseTest.InterruptNoResponse (1537 of 2153) PASS: lldb-api :: functionalities/multidebugger_commands/TestMultipleDebuggersCommands.py (1538 of 2153) PASS: lldb-shell :: ObjectFile/ELF/gnu-debuglink.yaml (1539 of 2153) PASS: lldb-unit :: Utility/./UtilityTests/ArchSpecTest.TripleComponentsWereSpecified (1540 of 2153) PASS: lldb-unit :: ObjectFile/PECOFF/./ObjectFilePECOFFTests/PECallFrameInfoTest.Basic_eh (1541 of 2153) PASS: lldb-unit :: Utility/./UtilityTests/StreamTest.PutMaxHex64ByteOrderBig (1542 of 2153) PASS: lldb-unit :: SymbolFile/DWARF/./SymbolFileDWARFTests/SymbolFileDWARFTests.TestAbilitiesForDWARF (1543 of 2153) PASS: lldb-unit :: Utility/./UtilityTests/PassiveReplayTest.InstrumentedFooInvalid (1544 of 2153) PASS: lldb-unit :: Utility/./UtilityTests/LogChannelEnabledTest.LogVerboseThread (1545 of 2153) PASS: lldb-api :: commands/expression/ignore-artificial-constructors/TestIgnoreArtificialConstructors.py (1546 of 2153) PASS: lldb-api :: commands/expression/fixits/TestFixIts.py (1547 of 2153) PASS: lldb-api :: commands/expression/calculator_mode/TestCalculatorMode.py (1548 of 2153) PASS: lldb-shell :: SymbolFile/NativePDB/ast-types.cpp (1549 of 2153) PASS: lldb-shell :: SymbolFile/DWARF/debug_loc.s (1550 of 2153) PASS: lldb-unit :: Host/./HostTests/NativeProcessProtocolTest.ReadCStringFromMemory_MaxSize (1551 of 2153) PASS: lldb-unit :: UnwindAssembly/ARM64/./Arm64InstEmulationTests/TestArm64InstEmulation.TestRegisterSavedTwice (1552 of 2153) UNSUPPORTED: lldb-api :: functionalities/data-formatter/data-formatter-stl/libstdcpp/vector/TestDataFormatterStdVector.py (1553 of 2153) PASS: lldb-unit :: Instruction/./EmulatorTests/TestAArch64Emulator.TestOverflow (1554 of 2153) PASS: lldb-api :: commands/frame/diagnose/local-variable/TestLocalVariable.py (1555 of 2153) PASS: lldb-shell :: Recognizer/assert.test (1556 of 2153) PASS: lldb-api :: functionalities/gdb_remote_client/TestArmRegisterDefinition.py (1557 of 2153) UNSUPPORTED: lldb-shell :: SymbolFile/NativePDB/stack_unwinding01.cpp (1558 of 2153) PASS: lldb-unit :: Utility/./UtilityTests/StreamTeeTest.Write (1559 of 2153) UNSUPPORTED: lldb-shell :: Register/arm-gp-read.test (1560 of 2153) XFAIL: lldb-shell :: Register/x86-64-write.test (1561 of 2153) PASS: lldb-unit :: Utility/./UtilityTests/ScalarTest.ExtractBitfield (1562 of 2153) PASS: lldb-api :: functionalities/data-formatter/data-formatter-advanced/TestDataFormatterAdv.py (1563 of 2153) PASS: lldb-api :: lang/cpp/virtual-overload/TestVirtualOverload.py (1564 of 2153) PASS: lldb-api :: lang/cpp/multiple-inheritance/TestCppMultipleInheritance.py (1565 of 2153) PASS: lldb-api :: functionalities/data-formatter/stringprinter/TestStringPrinter.py (1566 of 2153) PASS: lldb-unit :: UnwindAssembly/x86/./UnwindAssemblyx86Tests/Testx86AssemblyInspectionEngine.TestPush0 (1567 of 2153) UNSUPPORTED: lldb-api :: functionalities/unwind/ehframe/TestEhFrameUnwind.py (1568 of 2153) PASS: lldb-api :: lang/objc/modules-inline-functions/TestModulesInlineFunctions.py (1569 of 2153) PASS: lldb-api :: functionalities/data-formatter/data-formatter-objc/TestDataFormatterObjCExpr.py (1570 of 2153) PASS: lldb-api :: python_api/sbstructureddata/TestStructuredDataAPI.py (1571 of 2153) PASS: lldb-api :: macosx/find-app-in-bundle/TestFindAppInBundle.py (1572 of 2153) PASS: lldb-unit :: Utility/./UtilityTests/BinaryStreamTest.PutULEB128OneByte (1573 of 2153) PASS: lldb-unit :: Thread/./ThreadTests/ThreadTest.SetStopInfo (1574 of 2153) PASS: lldb-unit :: Utility/./UtilityTests/SerializationRountripTest.SerializeDeserializeCStringNull (1575 of 2153) UNSUPPORTED: lldb-shell :: BuildScript/toolchain-msvc.test (1576 of 2153) PASS: lldb-unit :: Process/minidump/./LLDBMinidumpTests/MinidumpParserTest.MinidumpDuplicateModuleMappedSecond (1577 of 2153) PASS: lldb-api :: python_api/target/TestTargetAPI.py (1578 of 2153) PASS: lldb-unit :: Utility/./UtilityTests/StringListTest.Join (1579 of 2153) PASS: lldb-api :: lang/cpp/enum_types/TestCPP11EnumTypes.py (1580 of 2153) PASS: lldb-unit :: Utility/./UtilityTests/OptionsWithRawTest.QuotedSuffix (1581 of 2153) PASS: lldb-unit :: Expression/./ExpressionTests/CppModuleConfigurationTest.UnknownLibCppFile (1582 of 2153) PASS: lldb-shell :: Commands/command-script-import.test (1583 of 2153) PASS: lldb-shell :: ObjectFile/PECOFF/disassemble-thumb.yaml (1584 of 2153) PASS: lldb-unit :: Utility/./UtilityTests/DataExtractorTest.UncommonAddressSize (1585 of 2153) PASS: lldb-api :: functionalities/data-formatter/typedef_array/TestTypedefArray.py (1586 of 2153) PASS: lldb-api :: lang/objc/objc++/TestObjCXX.py (1587 of 2153) PASS: lldb-api :: lang/objc/objc-super/TestObjCSuper.py (1588 of 2153) PASS: lldb-unit :: Host/./HostTests/SocketTest.UDPConnect (1589 of 2153) PASS: lldb-unit :: Utility/./UtilityTests/XcodeSDKTest.ParseTest (1590 of 2153) PASS: lldb-api :: tools/lldb-server/TestGdbRemoteThreadsInStopReply.py (1591 of 2153) PASS: lldb-api :: commands/target/dump-symtab-demangle/TestDumpSymtabDemangle.py (1592 of 2153) PASS: lldb-api :: functionalities/data-formatter/data-formatter-stl/libcxx/multiset/TestDataFormatterLibcxxMultiSet.py (1593 of 2153) PASS: lldb-api :: functionalities/thread/concurrent_events/TestConcurrentManyCrash.py (1594 of 2153) PASS: lldb-unit :: Utility/./UtilityTests/SerializationRountripTest.SerializeDeserializePod (1595 of 2153) UNSUPPORTED: lldb-api :: linux/thread/create_during_instruction_step/TestCreateDuringInstructionStep.py (1596 of 2153) PASS: lldb-shell :: ScriptInterpreter/None/import_module.test (1597 of 2153) PASS: lldb-unit :: Core/./LLDBCoreTests/ModuleSpecTest.TestMachOFile (1598 of 2153) PASS: lldb-unit :: Utility/./UtilityTests/StringListTest.SplitIntoLines (1599 of 2153) PASS: lldb-unit :: Utility/./UtilityTests/DataExtractorTest.GetMaxS64 (1600 of 2153) PASS: lldb-api :: lang/cpp/incomplete-types/TestCppIncompleteTypes.py (1601 of 2153) PASS: lldb-api :: functionalities/gdb_remote_client/TestRestartBug.py (1602 of 2153) PASS: lldb-api :: lang/cpp/breakpoint-commands/TestCPPBreakpointCommands.py (1603 of 2153) PASS: lldb-shell :: SymbolFile/DWARF/DW_AT_const_value-bitfields.s (1604 of 2153) PASS: lldb-api :: lang/cpp/unicode-literals/TestUnicodeLiterals.py (1605 of 2153) PASS: lldb-shell :: Reproducer/TestWorkingDir.test (1606 of 2153) PASS: lldb-unit :: Expression/./ExpressionTests/CppModuleConfigurationTest.MissingLibCpp (1607 of 2153) UNSUPPORTED: lldb-api :: commands/register/register/intel_xtended_registers/mpx_bound_violation/TestBoundViolation.py (1608 of 2153) PASS: lldb-unit :: UnwindAssembly/PPC64/./PPC64InstEmulationTests/TestPPC64InstEmulation.TestMediumFunction (1609 of 2153) PASS: lldb-unit :: Utility/./UtilityTests/CompletionRequest.DuplicateFiltering (1610 of 2153) PASS: lldb-unit :: Utility/./UtilityTests/UriParserTest.TypicalPortPathIPv4 (1611 of 2153) PASS: lldb-api :: lang/c/find_struct_type/TestFindStructTypes.py (1612 of 2153) PASS: lldb-api :: python_api/sbtype_typeclass/TestSBTypeTypeClass.py (1613 of 2153) PASS: lldb-api :: functionalities/tail_call_frames/disambiguate_tail_call_seq/TestDisambiguateTailCallSeq.py (1614 of 2153) UNSUPPORTED: lldb-shell :: ScriptInterpreter/Lua/command_script_import.test (1615 of 2153) PASS: lldb-shell :: SymbolFile/NativePDB/break-by-line.cpp (1616 of 2153) PASS: lldb-unit :: Utility/./UtilityTests/ArgsTest.TestAppendArg (1617 of 2153) PASS: lldb-api :: functionalities/tsan/cpp_global_location/TestTsanCPPGlobalLocation.py (1618 of 2153) PASS: lldb-api :: lang/c/unions/TestUnionMembers.py (1619 of 2153) PASS: lldb-api :: lang/cpp/template-function/TestTemplateFunctions.py (1620 of 2153) PASS: lldb-unit :: UnwindAssembly/x86/./UnwindAssemblyx86Tests/Testx86AssemblyInspectionEngine.TestPushImm (1621 of 2153) PASS: lldb-shell :: Reproducer/TestRelativePath.test (1622 of 2153) PASS: lldb-unit :: Utility/./UtilityTests/CompletionRequest.TryCompleteCurrentArgMode (1623 of 2153) PASS: lldb-api :: commands/expression/persistent_types/TestNestedPersistentTypes.py (1624 of 2153) PASS: lldb-unit :: Utility/./UtilityTests/StreamTest.AddressEmptyPrefix (1625 of 2153) PASS: lldb-api :: functionalities/tail_call_frames/disambiguate_call_site/TestDisambiguateCallSite.py (1626 of 2153) UNSUPPORTED: lldb-api :: functionalities/thread/create_during_step/TestCreateDuringStep.py (1627 of 2153) PASS: lldb-unit :: ObjectFile/Breakpad/./ObjectFileBreakpadTests/ModuleRecord.parse (1628 of 2153) PASS: lldb-unit :: Utility/./UtilityTests/StringLexerTest.NextIf (1629 of 2153) UNSUPPORTED: lldb-api :: linux/mix-dwo-and-regular-objects/TestMixedDwarfBinary.py (1630 of 2153) PASS: lldb-unit :: Process/gdb-remote/./ProcessGdbRemoteTests/GDBRemoteClientBaseTest.SendPacketAndReceiveResponseWithOutputSupport (1631 of 2153) PASS: lldb-unit :: UnwindAssembly/ARM64/./Arm64InstEmulationTests/TestArm64InstEmulation.TestFramelessThreeEpilogueFunction (1632 of 2153) PASS: lldb-unit :: Process/gdb-remote/./ProcessGdbRemoteTests/GDBRemoteCommunicationClientTest.GetModulesInfoInvalidResponse (1633 of 2153) PASS: lldb-api :: lang/cpp/offsetof/TestOffsetofCpp.py (1634 of 2153) PASS: lldb-api :: lang/objc/objc-ivar-stripped/TestObjCIvarStripped.py (1635 of 2153) PASS: lldb-unit :: ObjectFile/Breakpad/./ObjectFileBreakpadTests/FileRecord.parse (1636 of 2153) UNSUPPORTED: lldb-shell :: SymbolFile/PDB/typedefs.test (1637 of 2153) PASS: lldb-api :: functionalities/breakpoint/breakpoint_command/TestBreakpointCommandsFromPython.py (1638 of 2153) PASS: lldb-unit :: UnwindAssembly/x86/./UnwindAssemblyx86Tests/Testx86AssemblyInspectionEngine.TestPushEDX (1639 of 2153) PASS: lldb-unit :: Utility/./UtilityTests/RangeTest.EqualInvalid (1640 of 2153) PASS: lldb-api :: commands/platform/file/close/TestPlatformFileClose.py (1641 of 2153) PASS: lldb-unit :: Process/gdb-remote/./ProcessGdbRemoteTests/GDBRemoteClientBaseTest.SendContinueAndAsyncPacket (1642 of 2153) PASS: lldb-api :: functionalities/thread/concurrent_events/TestConcurrentTwoWatchpointsOneDelayBreakpoint.py (1643 of 2153) UNSUPPORTED: lldb-api :: python_api/event/TestEvents.py (1644 of 2153) PASS: lldb-api :: functionalities/data-formatter/data-formatter-stl/libcxx/function/TestLibCxxFunction.py (1645 of 2153) PASS: lldb-unit :: Utility/./UtilityTests/FileSpecTest.RemoveLastPathComponent (1646 of 2153) PASS: lldb-unit :: SymbolFile/DWARF/./SymbolFileDWARFTests/SymbolFileDWARFTests.TestAbbrevInvalidNULLTag (1647 of 2153) PASS: lldb-unit :: Symbol/./SymbolTests/Type.GetTypeScopeAndBasename (1648 of 2153) PASS: lldb-api :: commands/expression/pr35310/TestExprsBug35310.py (1649 of 2153) XFAIL: lldb-shell :: Register/x86-mm-xmm-read.test (1650 of 2153) PASS: lldb-shell :: Reproducer/Functionalities/TestDataFormatter.test (1651 of 2153) PASS: lldb-unit :: UnwindAssembly/x86/./UnwindAssemblyx86Tests/Testx86AssemblyInspectionEngine.Test32bitFramelessBigStackFrame (1652 of 2153) PASS: lldb-unit :: UnwindAssembly/ARM64/./Arm64InstEmulationTests/TestArm64InstEmulation.TestMediumDarwinFunction (1653 of 2153) PASS: lldb-unit :: UnwindAssembly/x86/./UnwindAssemblyx86Tests/Testx86AssemblyInspectionEngine.TestSpillRegToStackViaMOVx86_64 (1654 of 2153) PASS: lldb-unit :: Host/./HostTests/SocketTest.TCPGetConnectURI (1655 of 2153) PASS: lldb-api :: commands/reproducer/invalid-args/TestInvalidArgsReproducer.py (1656 of 2153) PASS: lldb-api :: tools/lldb-vscode/breakpoint-events/TestVSCode_breakpointEvents.py (1657 of 2153) PASS: lldb-api :: commands/frame/diagnose/dereference-argument/TestDiagnoseDereferenceArgument.py (1658 of 2153) PASS: lldb-unit :: Host/./HostTests/HostInfoTest.GetXcodeSDK (1659 of 2153) PASS: lldb-api :: functionalities/thread/concurrent_events/TestConcurrentDelayWatchBreak.py (1660 of 2153) PASS: lldb-api :: python_api/frame/inlines/TestInlinedFrame.py (1661 of 2153) PASS: lldb-unit :: Language/Highlighting/./HighlighterTests/HighlighterTest.DefaultHighlighterWithCursor (1662 of 2153) PASS: lldb-api :: python_api/watchpoint/watchlocation/TestSetWatchlocation.py (1663 of 2153) PASS: lldb-api :: lang/c/shared_lib_stripped_symbols/TestSharedLibStrippedSymbols.py (1664 of 2153) PASS: lldb-unit :: ObjectFile/Breakpad/./ObjectFileBreakpadTests/StackCFIRecord.parse (1665 of 2153) PASS: lldb-unit :: SymbolFile/DWARF/./SymbolFileDWARFTests/SymbolFileDWARFTests.TestAbbrevOrder1Start1 (1666 of 2153) PASS: lldb-unit :: Utility/./UtilityTests/AnsiTerminal.WhiteSpace (1667 of 2153) PASS: lldb-api :: lang/objc/radar-9691614/TestObjCMethodReturningBOOL.py (1668 of 2153) PASS: lldb-api :: commands/target/modules/search-paths/insert/TestTargetModulesSearchpathsInsert.py (1669 of 2153) PASS: lldb-api :: commands/watchpoints/watchpoint_on_vectors/TestValueOfVectorVariable.py (1670 of 2153) PASS: lldb-shell :: SymbolFile/DWARF/dir-separator-no-comp-dir.s (1671 of 2153) PASS: lldb-unit :: Expression/./ExpressionTests/CppModuleConfigurationTest.IgnoreLibStdCpp (1672 of 2153) PASS: lldb-api :: lang/objc/foundation/TestConstStrings.py (1673 of 2153) PASS: lldb-unit :: Utility/./UtilityTests/StringExtractorTest.DecodeHexU8_Exact (1674 of 2153) UNSUPPORTED: lldb-shell :: Register/x86-ymm-read.test (1675 of 2153) PASS: lldb-unit :: Utility/./UtilityTests/DeserializerTest.HasData (1676 of 2153) PASS: lldb-api :: commands/expression/import-std-module/unique_ptr/TestUniquePtrFromStdModule.py (1677 of 2153) PASS: lldb-unit :: Host/./HostTests/File.GetStreamFromDescriptor (1678 of 2153) PASS: lldb-shell :: Settings/TestLineMarkerColor.test (1679 of 2153) PASS: lldb-api :: python_api/watchpoint/condition/TestWatchpointConditionAPI.py (1680 of 2153) PASS: lldb-api :: commands/expression/inline-namespace/TestInlineNamespace.py (1681 of 2153) PASS: lldb-unit :: Symbol/./SymbolTests/TestClangASTImporter.MetadataPropagation (1682 of 2153) PASS: lldb-shell :: SymbolFile/NativePDB/source-list.cpp (1683 of 2153) PASS: lldb-api :: functionalities/gdb_remote_client/TestGDBRemoteLoad.py (1684 of 2153) PASS: lldb-unit :: Utility/./UtilityTests/ProcessInstanceInfoMatch.Name (1685 of 2153) PASS: lldb-api :: commands/watchpoints/watchpoint_size/TestWatchpointSizes.py (1686 of 2153) PASS: lldb-unit :: Process/minidump/./LLDBMinidumpTests/RegisterContextMinidump.ConvertMinidumpContext_x86_64 (1687 of 2153) PASS: lldb-unit :: Utility/./UtilityTests/UUIDTest.RelationalOperators (1688 of 2153) UNSUPPORTED: lldb-api :: lang/cpp/static_members/TestCPPStaticMembers.py (1689 of 2153) PASS: lldb-api :: python_api/watchpoint/watchlocation/TestTargetWatchAddress.py (1690 of 2153) PASS: lldb-unit :: Symbol/./SymbolTests/TestTypeSystemClang.TestFunctionTemplateInRecordConstruction (1691 of 2153) PASS: lldb-unit :: Language/Highlighting/./HighlighterTests/HighlighterTest.DefaultHighlighterWithCursorOutOfBounds (1692 of 2153) PASS: lldb-unit :: ScriptInterpreter/Python/./ScriptInterpreterPythonTests/PythonDataObjectsTest.TestPythonString (1693 of 2153) PASS: lldb-api :: commands/expression/namespace_local_var_same_name_obj_c/TestNamespaceLocalVarSameNameObjC.py (1694 of 2153) PASS: lldb-shell :: ObjectFile/PECOFF/uuid.yaml (1695 of 2153) PASS: lldb-unit :: Utility/./UtilityTests/StringListTest.GetMaxStringLengthMixed (1696 of 2153) PASS: lldb-api :: commands/expression/test/TestExprs2.py (1697 of 2153) UNSUPPORTED: lldb-api :: functionalities/darwin_log/filter/exact_match/message/TestDarwinLogFilterMatchMessage.py (1698 of 2153) PASS: lldb-unit :: DataFormatter/./LLDBFormatterTests/FormatManagerTests.CompatibleLangs (1699 of 2153) PASS: lldb-unit :: UnwindAssembly/x86/./UnwindAssemblyx86Tests/Testx86AssemblyInspectionEngine.Test32BitOnlyInstruction (1700 of 2153) PASS: lldb-unit :: Utility/./UtilityTests/StringListTest.InsertStringAtIndexOutOfBounds (1701 of 2153) PASS: lldb-api :: functionalities/thread/concurrent_events/TestConcurrentCrashWithBreak.py (1702 of 2153) PASS: lldb-unit :: Utility/./UtilityTests/UriParserTest.MinimalPath (1703 of 2153) PASS: lldb-api :: commands/expression/completion/TestExprCompletion.py (1704 of 2153) PASS: lldb-unit :: Language/Highlighting/./HighlighterTests/HighlighterTest.ClangTrailingBackslashMissingNewLine (1705 of 2153) UNSUPPORTED: lldb-shell :: Register/x86-64-gp-write.test (1706 of 2153) PASS: lldb-api :: python_api/class_members/TestSBTypeClassMembers.py (1707 of 2153) PASS: lldb-unit :: Utility/./UtilityTests/DataExtractorTest.GetSLEB128_bit63 (1708 of 2153) PASS: lldb-unit :: Utility/./UtilityTests/XcodeSDKTest.FindXcodeContentsDirectoryInPath (1709 of 2153) PASS: lldb-unit :: Utility/./UtilityTests/StreamTest.PutCString (1710 of 2153) PASS: lldb-shell :: ObjectFile/MachO/lc_version_min.yaml (1711 of 2153) PASS: lldb-unit :: Core/./LLDBCoreTests/UniqueCStringMap.NoDefaultConstructor (1712 of 2153) PASS: lldb-api :: functionalities/thread/state_after_expression/TestStateAfterExpression.py (1713 of 2153) PASS: lldb-unit :: Host/./HostTests/NativeProcessProtocolTest.SetBreakpointFailVerify (1714 of 2153) PASS: lldb-unit :: Symbol/./SymbolTests/TestTypeSystemClang.TestRecordHasFields (1715 of 2153) UNSUPPORTED: lldb-shell :: ScriptInterpreter/Lua/persistent_state.test (1716 of 2153) PASS: lldb-api :: functionalities/data-formatter/setvaluefromcstring/TestSetValueFromCString.py (1717 of 2153) PASS: lldb-unit :: ScriptInterpreter/Python/./ScriptInterpreterPythonTests/PythonDataObjectsTest.TestRun (1718 of 2153) PASS: lldb-api :: lang/cpp/typedef/TestCppTypedef.py (1719 of 2153) UNSUPPORTED: lldb-shell :: BuildScript/toolchain-clang-cl.test (1720 of 2153) UNSUPPORTED: lldb-shell :: ScriptInterpreter/Lua/watchpoint_callback.test (1721 of 2153) PASS: lldb-api :: functionalities/breakpoint/breakpoint_ids/TestBreakpointIDs.py (1722 of 2153) PASS: lldb-unit :: Language/Highlighting/./HighlighterTests/HighlighterTest.ClangOperators (1723 of 2153) PASS: lldb-api :: python_api/value_var_update/TestValueVarUpdate.py (1724 of 2153) PASS: lldb-unit :: Utility/./UtilityTests/StringExtractorTest.GetHexBytes_Underflow (1725 of 2153) PASS: lldb-api :: macosx/load-kext/TestLoadKext.py (1726 of 2153) PASS: lldb-unit :: Utility/./UtilityTests/StringExtractorTest.GetHexBytesAvail_Underflow (1727 of 2153) PASS: lldb-api :: functionalities/tail_call_frames/ambiguous_tail_call_seq2/TestAmbiguousTailCallSeq2.py (1728 of 2153) PASS: lldb-api :: functionalities/object-file/TestImageListMultiArchitecture.py (1729 of 2153) PASS: lldb-unit :: ObjectFile/ELF/./ObjectFileELFTests/ObjectFileELFTest.SectionsResolveConsistently (1730 of 2153) PASS: lldb-unit :: Utility/./UtilityTests/LogChannelTest.EnableOptions (1731 of 2153) PASS: lldb-unit :: Utility/./UtilityTests/RangeDataVector.FindEntryIndexesThatContain (1732 of 2153) UNSUPPORTED: lldb-api :: tools/lldb-server/registers-target-xml-reading/TestGdbRemoteTargetXmlPacket.py (1733 of 2153) PASS: lldb-api :: python_api/formatters/TestFormattersSBAPI.py (1734 of 2153) PASS: lldb-unit :: Host/./HostTests/Host.GetEnvironment (1735 of 2153) PASS: lldb-api :: functionalities/gdb_remote_client/TestqOffsets.py (1736 of 2153) PASS: lldb-api :: macosx/function-starts/TestFunctionStarts.py (1737 of 2153) UNSUPPORTED: lldb-shell :: Register/x86-ymm-write.test (1738 of 2153) PASS: lldb-unit :: Symbol/./SymbolTests/TestTypeSystemClang.TestConvertAccessTypeToAccessSpecifier (1739 of 2153) PASS: lldb-api :: api/command-return-object/TestSBCommandReturnObject.py (1740 of 2153) PASS: lldb-api :: python_api/process/TestProcessAPI.py (1741 of 2153) PASS: lldb-api :: functionalities/breakpoint/cpp/TestCPPBreakpointLocations.py (1742 of 2153) PASS: lldb-api :: commands/register/register/register_command/TestRegisters.py (1743 of 2153) UNSUPPORTED: lldb-shell :: Unwind/eh-frame-small-fde.test (1744 of 2153) PASS: lldb-unit :: UnwindAssembly/x86/./UnwindAssemblyx86Tests/Testx86AssemblyInspectionEngine.TestPopRBPWithREX (1745 of 2153) PASS: lldb-api :: commands/frame/diagnose/bad-reference/TestBadReference.py (1746 of 2153) PASS: lldb-shell :: ObjectFile/ELF/aarch64-relocations.yaml (1747 of 2153) PASS: lldb-api :: commands/expression/top-level/TestTopLevelExprs.py (1748 of 2153) PASS: lldb-api :: terminal/TestSTTYBeforeAndAfter.py (1749 of 2153) UNSUPPORTED: lldb-shell :: SymbolFile/PDB/func-symbols.test (1750 of 2153) PASS: lldb-unit :: Core/./LLDBCoreTests/StreamCallbackTest.Callback (1751 of 2153) UNSUPPORTED: lldb-shell :: SymbolFile/PDB/enums-layout.test (1752 of 2153) PASS: lldb-unit :: Language/CLanguages/./LanguageCLanguagesTests/CLanguages.LookupCLanguagesByLanguageType (1753 of 2153) PASS: lldb-api :: functionalities/inferior-crashing/recursive-inferior/TestRecursiveInferiorStep.py (1754 of 2153) PASS: lldb-unit :: Utility/./UtilityTests/UserIDResolver.GetGroupName (1755 of 2153) PASS: lldb-api :: macosx/macCatalyst/TestMacCatalyst.py (1756 of 2153) PASS: lldb-unit :: Utility/./UtilityTests/StringExtractorTest.GetHexU8_Underflow (1757 of 2153) PASS: lldb-shell :: ObjectFile/Breakpad/discontiguous-sections.test (1758 of 2153) PASS: lldb-api :: lang/objc/objc-stepping/TestObjCStepping.py (1759 of 2153) UNSUPPORTED: lldb-shell :: SymbolFile/PDB/function-nested-block.test (1760 of 2153) PASS: lldb-shell :: SymbolFile/DWARF/debug-line-basic.s (1761 of 2153) PASS: lldb-api :: lang/objc/forward-decl/TestForwardDecl.py (1762 of 2153) PASS: lldb-api :: functionalities/ptr_refs/TestPtrRefs.py (1763 of 2153) PASS: lldb-shell :: Reproducer/TestDebugSymbols.test (1764 of 2153) PASS: lldb-shell :: Breakpoint/debug_rnglist_offset_pair.test (1765 of 2153) PASS: lldb-api :: functionalities/process_group/TestChangeProcessGroup.py (1766 of 2153) PASS: lldb-unit :: Host/./HostTests/FileSystemTest.GetByteSize (1767 of 2153) PASS: lldb-unit :: Utility/./UtilityTests/StringListTest.ForRange (1768 of 2153) PASS: lldb-unit :: Utility/./UtilityTests/ArchSpecTest.YAML (1769 of 2153) PASS: lldb-api :: commands/expression/dollar-in-variable/TestDollarInVariable.py (1770 of 2153) UNSUPPORTED: lldb-api :: functionalities/darwin_log/filter/regex/activity-chain/TestDarwinLogFilterRegexActivityChain.py (1771 of 2153) PASS: lldb-api :: functionalities/breakpoint/debugbreak/TestDebugBreak.py (1772 of 2153) PASS: lldb-unit :: Utility/./UtilityTests/StreamTest.PutBytesAsRawHex8ToBigEndian (1773 of 2153) PASS: lldb-shell :: ObjectFile/MachO/symtab.yaml (1774 of 2153) PASS: lldb-unit :: Symbol/./SymbolTests/LineEntryTest.GetSameLineContiguousAddressRangeNestedInline (1775 of 2153) PASS: lldb-unit :: Symbol/./SymbolTests/LineEntryTest.GetSameLineContiguousAddressRangeNoInlines (1776 of 2153) PASS: lldb-api :: commands/watchpoints/watchpoint_commands/condition/TestWatchpointConditionCmd.py (1777 of 2153) PASS: lldb-unit :: Utility/./UtilityTests/StreamTest.PutChar (1778 of 2153) UNSUPPORTED: lldb-shell :: Expr/TestIRMemoryMapWindows.test (1779 of 2153) PASS: lldb-api :: functionalities/postmortem/minidump-new/TestMiniDumpUUID.py (1780 of 2153) PASS: lldb-unit :: DataFormatter/./LLDBFormatterTests/TypeMatcherTests.GetMatchStringExactName (1781 of 2153) PASS: lldb-unit :: Utility/./UtilityTests/NameMatchesTest.Ignore (1782 of 2153) PASS: lldb-unit :: Utility/./UtilityTests/PassiveReplayTest.InstrumentedBarRef (1783 of 2153) PASS: lldb-api :: functionalities/thread/concurrent_events/TestConcurrentTwoBreakpointsOneSignal.py (1784 of 2153) PASS: lldb-unit :: DataFormatter/./LLDBFormatterTests/StringPrinterTests.CxxUTF8 (1785 of 2153) PASS: lldb-unit :: Utility/./UtilityTests/StreamTeeTest.GetStreamAtIndexOutOfBounds (1786 of 2153) PASS: lldb-api :: functionalities/data-formatter/varscript_formatting/TestDataFormatterVarScriptFormatting.py (1787 of 2153) PASS: lldb-unit :: Utility/./UtilityTests/DataExtractorTest.GetCStrAtEnd (1788 of 2153) PASS: lldb-unit :: Utility/./UtilityTests/StringExtractorTest.GetHexU8_Underflow_NoEof (1789 of 2153) PASS: lldb-unit :: Utility/./UtilityTests/LogTest.Register (1790 of 2153) PASS: lldb-unit :: Utility/./UtilityTests/RangeTest.ClearWithStarAddress (1791 of 2153) PASS: lldb-shell :: ObjectFile/ELF/minidebuginfo-corrupt-xz.yaml (1792 of 2153) PASS: lldb-unit :: UnwindAssembly/x86/./UnwindAssemblyx86Tests/Testx86AssemblyInspectionEngine.TestPopR12 (1793 of 2153) PASS: lldb-unit :: Utility/./UtilityTests/DataExtractorTest.GetMaxU64_unchecked (1794 of 2153) PASS: lldb-shell :: Minidump/memory-region-from-module.yaml (1795 of 2153) PASS: lldb-api :: functionalities/gdb_remote_client/TestWasm.py (1796 of 2153) PASS: lldb-unit :: Utility/./UtilityTests/BinaryStreamTest.PutSLEB128ThreeBytes (1797 of 2153) PASS: lldb-api :: lang/objc/bitfield_ivars/TestBitfieldIvars.py (1798 of 2153) PASS: lldb-api :: lang/objc/objc-class-method/TestObjCClassMethod.py (1799 of 2153) UNSUPPORTED: lldb-api :: tools/lldb-vscode/disconnect/TestVSCode_disconnect.py (1800 of 2153) PASS: lldb-unit :: ScriptInterpreter/Python/./ScriptInterpreterPythonTests/PythonDataObjectsTest.TestCallable (1801 of 2153) PASS: lldb-api :: lang/cpp/modules-import/TestCXXModulesImport.py (1802 of 2153) PASS: lldb-api :: functionalities/param_entry_vals/basic_entry_values/TestBasicEntryValues.py (1803 of 2153) PASS: lldb-api :: api/check_public_api_headers/TestPublicAPIHeaders.py (1804 of 2153) UNSUPPORTED: lldb-api :: benchmarks/stepping/TestSteppingSpeed.py (1805 of 2153) PASS: lldb-shell :: SymbolFile/NativePDB/globals-fundamental.cpp (1806 of 2153) PASS: lldb-unit :: Symbol/./SymbolTests/LineEntryTest.GetSameLineContiguousAddressRangeOneInline (1807 of 2153) PASS: lldb-shell :: Driver/TestCommands.test (1808 of 2153) PASS: lldb-api :: macosx/save_crashlog/TestSaveCrashlog.py (1809 of 2153) PASS: lldb-unit :: Core/./LLDBCoreTests/MangledTest.ResultForValidName (1810 of 2153) PASS: lldb-api :: functionalities/data-formatter/array_typedef/TestArrayTypedef.py (1811 of 2153) PASS: lldb-unit :: Utility/./UtilityTests/RegisterValueTest.GetSet8 (1812 of 2153) PASS: lldb-unit :: Utility/./UtilityTests/FileSpecTest.GetPath (1813 of 2153) PASS: lldb-api :: commands/expression/import-std-module/shared_ptr-dbg-info-content/TestSharedPtrDbgInfoContentFromStdModule.py (1814 of 2153) PASS: lldb-unit :: Utility/./UtilityTests/StringExtractorTest.GetHexBytesAvail_OddPair2 (1815 of 2153) PASS: lldb-unit :: Utility/./UtilityTests/VMRange.Clear (1816 of 2153) PASS: lldb-api :: functionalities/thread/concurrent_events/TestConcurrentTwoWatchpointsOneBreakpoint.py (1817 of 2153) PASS: lldb-unit :: Utility/./UtilityTests/StringLexerTest.Next (1818 of 2153) PASS: lldb-api :: commands/platform/basic/TestPlatformPython.py (1819 of 2153) PASS: lldb-unit :: Target/./TargetTests/ExecutionContextTest.GetByteOrderProcess (1820 of 2153) PASS: lldb-api :: lang/cpp/template-specialization-type/TestTemplateSpecializationType.py (1821 of 2153) PASS: lldb-shell :: SymbolFile/NativePDB/tag-types.cpp (1822 of 2153) PASS: lldb-shell :: ObjectFile/wasm/stripped-debug-sections.yaml (1823 of 2153) UNSUPPORTED: lldb-api :: commands/register/register/intel_xtended_registers/mpx_offset_intersection/TestMPXOffsetIntersection.py (1824 of 2153) PASS: lldb-unit :: Process/gdb-remote/./ProcessGdbRemoteTests/GDBRemoteCommunicationClientTest.SendStopTracePacket (1825 of 2153) PASS: lldb-unit :: Process/gdb-remote/./ProcessGdbRemoteTests/GDBRemoteCommunicationClientTest.GetModulesInfo_UUID20 (1826 of 2153) PASS: lldb-unit :: Utility/./UtilityTests/ArgsTest.ReplaceArgumentAtIndexLonger (1827 of 2153) PASS: lldb-unit :: Utility/./UtilityTests/DataExtractorTest.PeekData (1828 of 2153) PASS: lldb-unit :: ObjectFile/PECOFF/./ObjectFilePECOFFTests/PECallFrameInfoTest.Chained_eh (1829 of 2153) PASS: lldb-unit :: Utility/./UtilityTests/RangeTest.SetRangeBase (1830 of 2153) PASS: lldb-api :: lang/objc/real-definition/TestRealDefinition.py (1831 of 2153) PASS: lldb-unit :: Utility/./UtilityTests/OptionsWithRawTest.WhitespaceInput (1832 of 2153) PASS: lldb-unit :: Core/./LLDBCoreTests/RichManglingContextTest.IPDRealloc (1833 of 2153) PASS: lldb-api :: functionalities/thread/concurrent_events/TestConcurrentManyWatchpoints.py (1834 of 2153) PASS: lldb-unit :: Language/Highlighting/./HighlighterTests/HighlighterTest.ClangTrailingBackslashWithWhitespace (1835 of 2153) PASS: lldb-unit :: Utility/./UtilityTests/StringExtractorTest.GetHexU8_InvalidHex (1836 of 2153) UNSUPPORTED: lldb-api :: linux/add-symbols/TestTargetSymbolsAddCommand.py (1837 of 2153) PASS: lldb-api :: functionalities/thread/concurrent_events/TestConcurrentTwoBreakpointsOneDelaySignal.py (1838 of 2153) PASS: lldb-api :: functionalities/data-formatter/data-formatter-objc/TestDataFormatterObjCCF.py (1839 of 2153) PASS: lldb-api :: python_api/findvalue_duplist/TestSBFrameFindValue.py (1840 of 2153) PASS: lldb-api :: commands/expression/expr-in-syscall/TestExpressionInSyscall.py (1841 of 2153) PASS: lldb-unit :: Utility/./UtilityTests/StructuredDataTest.StringDump (1842 of 2153) PASS: lldb-api :: lang/objc/objc-ivar-protocols/TestIvarProtocols.py (1843 of 2153) PASS: lldb-api :: functionalities/fat_archives/TestFatArchives.py (1844 of 2153) PASS: lldb-api :: functionalities/data-formatter/data-formatter-objc/TestDataFormatterObjCNSContainer.py (1845 of 2153) PASS: lldb-api :: functionalities/thread/concurrent_events/TestConcurrentSignalWatchBreak.py (1846 of 2153) PASS: lldb-unit :: Utility/./UtilityTests/SerializationRountripTest.SerializeDeserializePodPointers (1847 of 2153) UNSUPPORTED: lldb-api :: commands/watchpoints/variable_out_of_scope/TestWatchedVarHitWhenInScope.py (1848 of 2153) PASS: lldb-api :: functionalities/lazy-loading/TestLazyLoading.py (1849 of 2153) PASS: lldb-unit :: Process/minidump/./LLDBMinidumpTests/MinidumpParserTest.GetThreadContext_x86_64 (1850 of 2153) PASS: lldb-api :: commands/expression/function_template_specialization_temp_args/TestFunctionTemplateSpecializationTempArgs.py (1851 of 2153) PASS: lldb-shell :: SymbolFile/Breakpad/line-table-missing-file.test (1852 of 2153) PASS: lldb-unit :: Utility/./UtilityTests/FileSpecTest.Yaml (1853 of 2153) PASS: lldb-unit :: Utility/./UtilityTests/StringExtractorTest.DecodeHexU8_Extra (1854 of 2153) PASS: lldb-unit :: Utility/./UtilityTests/ArgsTest.TestQuotedUnknownEscape (1855 of 2153) PASS: lldb-api :: functionalities/gdb_remote_client/TestWriteMemory.py (1856 of 2153) PASS: lldb-unit :: SymbolFile/DWARF/./SymbolFileDWARFTests/XcodeSDKModuleTests.TestModuleGetXcodeSDK (1857 of 2153) PASS: lldb-api :: lang/objc/orderedset/TestOrderedSet.py (1858 of 2153) PASS: lldb-api :: iohandler/resize/TestIOHandlerResize.py (1859 of 2153) PASS: lldb-unit :: Utility/./UtilityTests/GeneratorTest.YamlMultiProvider (1860 of 2153) PASS: lldb-unit :: SymbolFile/DWARF/./SymbolFileDWARFTests/SymbolFileDWARFTests.ParseAranges (1861 of 2153) UNSUPPORTED: lldb-shell :: Register/x86-64-zmm-write.test (1862 of 2153) PASS: lldb-unit :: UnwindAssembly/x86/./UnwindAssemblyx86Tests/Testx86AssemblyInspectionEngine.TestPushEBX (1863 of 2153) PASS: lldb-api :: python_api/value/TestValueAPI.py (1864 of 2153) PASS: lldb-api :: types/TestCharType.py (1865 of 2153) PASS: lldb-api :: lang/c/const_variables/TestConstVariables.py (1866 of 2153) PASS: lldb-api :: commands/expression/regression-access-function-template-in-record/TestRegressionAccessFunctionTemplateInRecord.py (1867 of 2153) PASS: lldb-unit :: Utility/./UtilityTests/StringListTest.JoinThree (1868 of 2153) PASS: lldb-unit :: Utility/./UtilityTests/StreamTeeTest.AppendStream (1869 of 2153) PASS: lldb-shell :: SymbolFile/symbol-binding.test (1870 of 2153) PASS: lldb-shell :: Minidump/no-process-id.yaml (1871 of 2153) PASS: lldb-api :: commands/expression/completion-in-lambda-and-unnamed-class/TestCompletionInLambdaAndUnnamedClass.py (1872 of 2153) PASS: lldb-api :: functionalities/gdb_remote_client/TestStopPCs.py (1873 of 2153) PASS: lldb-api :: macosx/order/TestOrderFile.py (1874 of 2153) PASS: lldb-api :: functionalities/dlopen_other_executable/TestDlopenOtherExecutable.py (1875 of 2153) PASS: lldb-api :: lang/cpp/operator-overload/TestOperatorOverload.py (1876 of 2153) PASS: lldb-unit :: UnwindAssembly/x86/./UnwindAssemblyx86Tests/Testx86AssemblyInspectionEngine.TestAddRSP (1877 of 2153) PASS: lldb-api :: functionalities/data-formatter/type_summary_list_script/TestTypeSummaryListScript.py (1878 of 2153) PASS: lldb-unit :: Symbol/./SymbolTests/TestTypeSystemClang.TestDeletingImplicitCopyCstrDueToMoveCStr (1879 of 2153) PASS: lldb-unit :: Utility/./UtilityTests/StringExtractorTest.GetHexBytesAvail_OddPair (1880 of 2153) PASS: lldb-unit :: Utility/./UtilityTests/StringLexerTest.Peek (1881 of 2153) PASS: lldb-api :: lang/objc/exceptions/TestObjCExceptions.py (1882 of 2153) PASS: lldb-unit :: UnwindAssembly/x86/./UnwindAssemblyx86Tests/Testx86AssemblyInspectionEngine.TestPopR15 (1883 of 2153) PASS: lldb-shell :: SymbolFile/NativePDB/function-types-builtins.cpp (1884 of 2153) PASS: lldb-unit :: ObjectFile/Breakpad/./ObjectFileBreakpadTests/Record.classify (1885 of 2153) PASS: lldb-unit :: Utility/./UtilityTests/DataExtractorTest.GetDoubleUnaligned (1886 of 2153) PASS: lldb-shell :: Reproducer/TestDSYM.test (1887 of 2153) PASS: lldb-unit :: Process/minidump/./LLDBMinidumpTests/MinidumpParserTest.GetLinuxProcStatus_no_stream (1888 of 2153) PASS: lldb-unit :: Utility/./UtilityTests/ProcessInfoTest.Constructor (1889 of 2153) PASS: lldb-api :: commands/expression/call-function/TestCallStdStringFunction.py (1890 of 2153) PASS: lldb-api :: lang/objcxx/cxx-bridged-po/TestObjCXXBridgedPO.py (1891 of 2153) PASS: lldb-shell :: SymbolFile/DWARF/DW_AT_data_bit_offset-DW_OP_stack_value.s (1892 of 2153) PASS: lldb-api :: functionalities/data-formatter/hexcaps/TestDataFormatterHexCaps.py (1893 of 2153) PASS: lldb-unit :: Utility/./UtilityTests/StringListTest.RemoveBlankLines (1894 of 2153) PASS: lldb-api :: functionalities/data-formatter/data-formatter-stl/libcxx/iterator/TestDataFormatterLibccIterator.py (1895 of 2153) PASS: lldb-unit :: Host/./HostTests/FileSystemTest.EnumerateDirectory (1896 of 2153) PASS: lldb-unit :: Process/gdb-remote/./ProcessGdbRemoteTests/GDBRemoteCommunicationServerTest.SendErrorResponse_Status (1897 of 2153) PASS: lldb-unit :: Utility/./UtilityTests/StreamTest.PutBytesAsRawHex8ToLittleEndian (1898 of 2153) PASS: lldb-api :: commands/expression/context-object/TestContextObject.py (1899 of 2153) PASS: lldb-api :: commands/platform/basic/TestPlatformCommand.py (1900 of 2153) XFAIL: lldb-shell :: Unwind/prefer-debug-over-eh-frame.test (1901 of 2153) PASS: lldb-api :: functionalities/breakpoint/breakpoint_ignore_count/TestBreakpointIgnoreCount.py (1902 of 2153) PASS: lldb-shell :: SymbolFile/DWARF/childless-compile-unit.s (1903 of 2153) PASS: lldb-api :: functionalities/signal/TestSendSignal.py (1904 of 2153) PASS: lldb-api :: commands/expression/unicode-in-variable/TestUnicodeInVariable.py (1905 of 2153) PASS: lldb-unit :: Utility/./UtilityTests/StreamTest.PutHex32ByteOrderBig (1906 of 2153) PASS: lldb-api :: commands/expression/import_base_class_when_class_has_derived_member/TestImportBaseClassWhenClassHasDerivedMember.py (1907 of 2153) PASS: lldb-unit :: ScriptInterpreter/Python/./ScriptInterpreterPythonTests/PythonDataObjectsTest.TestPythonCallableCheck (1908 of 2153) PASS: lldb-unit :: Utility/./UtilityTests/CompletionRequest.FakeLastArg (1909 of 2153) PASS: lldb-api :: functionalities/thread/concurrent_events/TestConcurrentDelaySignalWatch.py (1910 of 2153) PASS: lldb-unit :: Utility/./UtilityTests/StringExtractorTest.GetHexU8_Extra_NoEof (1911 of 2153) PASS: lldb-unit :: Process/minidump/./LLDBMinidumpTests/MinidumpParserTest.GetPid (1912 of 2153) PASS: lldb-api :: python_api/function_symbol/TestSymbolAPI.py (1913 of 2153) PASS: lldb-api :: functionalities/data-formatter/data-formatter-synthval/TestDataFormatterSynthVal.py (1914 of 2153) PASS: lldb-unit :: Utility/./UtilityTests/BinaryStreamTest.PutULEB128NineBytes (1915 of 2153) PASS: lldb-api :: functionalities/thread/concurrent_events/TestConcurrentBreakpointOneDelayBreakpointThreads.py (1916 of 2153) PASS: lldb-unit :: Utility/./UtilityTests/StringExtractorTest.GetHexBytesAvail (1917 of 2153) PASS: lldb-unit :: Utility/./UtilityTests/DataExtractorTest.GetCStr (1918 of 2153) PASS: lldb-unit :: Utility/./UtilityTests/ArgsTest.GetQuotedCommandString (1919 of 2153) PASS: lldb-unit :: Utility/./UtilityTests/ConstStringTest.CompareStringRef (1920 of 2153) PASS: lldb-api :: python_api/sbplatform/TestSBPlatform.py (1921 of 2153) PASS: lldb-api :: functionalities/inferior-changed/TestInferiorChanged.py (1922 of 2153) PASS: lldb-shell :: SymbolFile/DWARF/deterministic-build.cpp (1923 of 2153) PASS: lldb-unit :: Utility/./UtilityTests/ArgsTest.ReplaceArgumentAtIndexOutOfRange (1924 of 2153) PASS: lldb-unit :: Expression/./ExpressionTests/DiagnosticManagerTest.AddDiagnostic (1925 of 2153) PASS: lldb-unit :: Utility/./UtilityTests/LogChannelEnabledTest.LogThread (1926 of 2153) PASS: lldb-unit :: Expression/./ExpressionTests/DWARFExpression.DW_OP_stack_value (1927 of 2153) UNSUPPORTED: lldb-shell :: ObjectFile/ELF/minidebuginfo-no-lzma.yaml (1928 of 2153) PASS: lldb-unit :: Utility/./UtilityTests/StreamTest.AddressPrefix (1929 of 2153) PASS: lldb-unit :: Process/gdb-remote/./ProcessGdbRemoteTests/GDBRemoteCommunicationClientTest.GetQOffsets (1930 of 2153) PASS: lldb-unit :: ObjectFile/Breakpad/./ObjectFileBreakpadTests/LineRecord.parse (1931 of 2153) PASS: lldb-api :: functionalities/ubsan/basic/TestUbsanBasic.py (1932 of 2153) PASS: lldb-unit :: Process/gdb-remote/./ProcessGdbRemoteTests/GDBRemoteCommunicationClientTest.GetModulesInfo (1933 of 2153) PASS: lldb-shell :: Reproducer/TestProcessList.test (1934 of 2153) PASS: lldb-api :: commands/expression/cast_int_to_anonymous_enum/TestCastIntToAnonymousEnum.py (1935 of 2153) UNSUPPORTED: lldb-shell :: SymbolFile/PDB/type-quals.test (1936 of 2153) UNSUPPORTED: lldb-shell :: SymbolFile/PDB/expressions.test (1937 of 2153) UNSUPPORTED: lldb-shell :: SymbolFile/target-symbols-add-unwind.test (1938 of 2153) PASS: lldb-unit :: Language/Highlighting/./HighlighterTests/HighlighterTest.DefaultHighlighter (1939 of 2153) PASS: lldb-api :: lang/c/blocks/TestBlocks.py (1940 of 2153) PASS: lldb-unit :: Utility/./UtilityTests/BinaryStreamTest.PutSLEB128SevenBytes (1941 of 2153) PASS: lldb-unit :: Host/./HostTests/ProcessLaunchInfoTest.Constructor (1942 of 2153) PASS: lldb-api :: lang/objc/objc-dyn-sbtype/TestObjCDynamicSBType.py (1943 of 2153) PASS: lldb-unit :: Host/./HostTests/NativeProcessProtocolTest.ReadCStringFromMemory (1944 of 2153) PASS: lldb-api :: functionalities/data-formatter/data-formatter-proper-plurals/TestFormattersOneIsSingular.py (1945 of 2153) PASS: lldb-unit :: Utility/./UtilityTests/StringListTest.AppendStringStdString (1946 of 2153) PASS: lldb-unit :: Utility/./UtilityTests/OptionsWithRawTest.LeadingSpaceArgs (1947 of 2153) PASS: lldb-unit :: debugserver/./debugserverTests/RNBSocket.LoopBackConnectIPv4 (1948 of 2153) UNSUPPORTED: lldb-api :: tools/lldb-server/thread-name/TestGdbRemoteThreadName.py (1949 of 2153) PASS: lldb-shell :: Settings/TestStopCommandSourceOnError.test (1950 of 2153) PASS: lldb-unit :: Language/Highlighting/./HighlighterTests/HighlighterTest.ClangEmptyInput (1951 of 2153) PASS: lldb-api :: lang/cpp/function-qualifiers/TestCppFunctionQualifiers.py (1952 of 2153) PASS: lldb-api :: lang/cpp/stl/TestSTL.py (1953 of 2153) PASS: lldb-unit :: UnwindAssembly/PPC64/./PPC64InstEmulationTests/TestPPC64InstEmulation.TestSimpleFunction (1954 of 2153) PASS: lldb-api :: commands/target/create-deps/TestTargetCreateDeps.py (1955 of 2153) PASS: lldb-unit :: Utility/./UtilityTests/StringExtractorTest.GetU64BigEndian (1956 of 2153) PASS: lldb-api :: functionalities/memory-region/TestMemoryRegion.py (1957 of 2153) PASS: lldb-api :: commands/watchpoints/watchpoint_events/TestWatchpointEvents.py (1958 of 2153) PASS: lldb-api :: commands/frame/var-scope/TestFrameVariableScope.py (1959 of 2153) PASS: lldb-api :: functionalities/data-formatter/data-formatter-objc/cmtime/TestDataFormatterCMTime.py (1960 of 2153) PASS: lldb-api :: macosx/find-dsym/deep-bundle/TestDeepBundle.py (1961 of 2153) PASS: lldb-api :: terminal/TestEditline.py (1962 of 2153) PASS: lldb-api :: commands/expression/entry-bp/TestExprEntryBP.py (1963 of 2153) PASS: lldb-api :: tools/lldb-vscode/module/TestVSCode_module.py (1964 of 2153) PASS: lldb-unit :: SymbolFile/NativePDB/./SymbolFileNativePDBTests/PDBFPOProgramToDWARFExpressionTests.UnknownOp (1965 of 2153) PASS: lldb-shell :: SymbolFile/DWARF/dwp-separate-debug-file.cpp (1966 of 2153) PASS: lldb-api :: commands/gui/basic/TestGuiBasic.py (1967 of 2153) PASS: lldb-api :: lang/cpp/this/TestCPPThis.py (1968 of 2153) PASS: lldb-unit :: Process/gdb-remote/./ProcessGdbRemoteTests/GDBRemoteCommunicationClientTest.SendGetTraceConfigPacket (1969 of 2153) PASS: lldb-shell :: Minidump/Windows/arm-fp-unwind.test (1970 of 2153) PASS: lldb-api :: functionalities/jitloader_gdb/TestJITLoaderGDB.py (1971 of 2153) PASS: lldb-unit :: Language/Highlighting/./HighlighterTests/HighlighterTest.ClangCursorOutOfBounds (1972 of 2153) PASS: lldb-shell :: SymbolFile/DWARF/debug-types-signature-loop.s (1973 of 2153) PASS: lldb-unit :: Utility/./UtilityTests/StreamTest.PutHex16ByteOrderLittle (1974 of 2153) PASS: lldb-unit :: Expression/./ExpressionTests/DiagnosticManagerTest.GetStringMultiline (1975 of 2153) PASS: lldb-api :: lang/cpp/trivial_abi/TestTrivialABI.py (1976 of 2153) PASS: lldb-unit :: Utility/./UtilityTests/ArchSpecTest.Compatibility (1977 of 2153) PASS: lldb-shell :: SymbolFile/Breakpad/line-table-edgecases.test (1978 of 2153) PASS: lldb-shell :: Expr/TestMultilineExpr.test (1979 of 2153) PASS: lldb-shell :: Expr/TestIRMemoryMap.test (1980 of 2153) PASS: lldb-api :: lang/c/complex/TestComplexC99.py (1981 of 2153) PASS: lldb-api :: lang/c/anonymous/TestAnonymous.py (1982 of 2153) PASS: lldb-unit :: Utility/./UtilityTests/TimeoutTest.Construction (1983 of 2153) PASS: lldb-api :: lang/objc/objc-new-syntax/TestObjCNewSyntaxLiteral.py (1984 of 2153) UNSUPPORTED: lldb-api :: functionalities/data-formatter/data-formatter-stl/libstdcpp/map/TestDataFormatterStdMap.py (1985 of 2153) PASS: lldb-api :: lang/cpp/char1632_t/TestChar1632T.py (1986 of 2153) PASS: lldb-shell :: SymbolFile/NativePDB/locate-pdb.cpp (1987 of 2153) PASS: lldb-shell :: SymbolFile/DWARF/find-basic-namespace.cpp (1988 of 2153) PASS: lldb-unit :: UnwindAssembly/ARM64/./Arm64InstEmulationTests/TestArm64InstEmulation.TestRegisterDoubleSpills (1989 of 2153) PASS: lldb-shell :: Minidump/Windows/Sigsegv/sigsegv.test (1990 of 2153) PASS: lldb-api :: commands/expression/import-std-module/unique_ptr-dbg-info-content/TestUniquePtrDbgInfoContent.py (1991 of 2153) PASS: lldb-unit :: Utility/./UtilityTests/StringExtractorTest.GetHexBytes_FullString (1992 of 2153) PASS: lldb-api :: python_api/hello_world/TestHelloWorld.py (1993 of 2153) PASS: lldb-api :: functionalities/plugins/python_os_plugin/stepping_plugin_threads/TestOSPluginStepping.py (1994 of 2153) PASS: lldb-unit :: Process/minidump/./LLDBMinidumpTests/MinidumpParserTest.GetThreadContext_x86_32_wow64 (1995 of 2153) PASS: lldb-unit :: Utility/./UtilityTests/DataExtractorTest.GetBitfield (1996 of 2153) PASS: lldb-unit :: Utility/./UtilityTests/ScalarTest.SetValueFromData (1997 of 2153) PASS: lldb-api :: lang/objc/blocks/TestObjCIvarsInBlocks.py (1998 of 2153) PASS: lldb-shell :: SymbolFile/DWARF/apple-index-is-used.cpp (1999 of 2153) PASS: lldb-unit :: Utility/./UtilityTests/UserIDResolver.GetUserName (2000 of 2153) PASS: lldb-api :: functionalities/recursion/TestValueObjectRecursion.py (2001 of 2153) PASS: lldb-unit :: DataFormatter/./LLDBFormatterTests/TypeMatcherTests.GetMatchStringRegex (2002 of 2153) PASS: lldb-shell :: ObjectFile/ELF/section-types-edgecases.yaml (2003 of 2153) PASS: lldb-api :: functionalities/data-formatter/poarray/TestPrintObjectArray.py (2004 of 2153) PASS: lldb-api :: commands/expression/rdar42038760/TestScalarURem.py (2005 of 2153) PASS: lldb-unit :: tools/lldb-server/tests/./LLDBServerTests/TestBase.DebugserverEnv (2006 of 2153) PASS: lldb-api :: commands/frame/diagnose/virtual-method-call/TestDiagnoseDereferenceVirtualMethodCall.py (2007 of 2153) PASS: lldb-api :: commands/expression/import_builtin_fileid/TestImportBuiltinFileID.py (2008 of 2153) PASS: lldb-api :: arm/emulation/TestEmulations.py (2009 of 2153) PASS: lldb-unit :: Utility/./UtilityTests/UriParserTest.BracketedHostnameWithPortIPv6 (2010 of 2153) PASS: lldb-unit :: Process/minidump/./LLDBMinidumpTests/MinidumpParserTest.MinidumpModuleOrder (2011 of 2153) PASS: lldb-shell :: Breakpoint/debug_rnglist_rlestartend.test (2012 of 2153) PASS: lldb-shell :: Breakpoint/single-file-split-dwarf.test (2013 of 2153) UNSUPPORTED: lldb-shell :: Register/x86-64-ymm16-write.test (2014 of 2153) PASS: lldb-unit :: Interpreter/./InterpreterTests/OptionArgParserTest.toChar (2015 of 2153) PASS: lldb-shell :: SymbolFile/DWARF/find-basic-type.cpp (2016 of 2153) PASS: lldb-unit :: Utility/./UtilityTests/UriParserTest.PortOverflow (2017 of 2153) PASS: lldb-shell :: Breakpoint/debug_rnglistx_rlex.test (2018 of 2153) PASS: lldb-unit :: Utility/./UtilityTests/ProcessInstanceInfo.Dump (2019 of 2153) PASS: lldb-api :: functionalities/breakpoint/breakpoint_locations/TestBreakpointLocations.py (2020 of 2153) PASS: lldb-unit :: Core/./LLDBCoreTests/ModuleSpecTest.InvalidInMemoryBuffer (2021 of 2153) PASS: lldb-unit :: Utility/./UtilityTests/ScalarTest.TruncOrExtendTo (2022 of 2153) PASS: lldb-unit :: Expression/./ExpressionTests/DWARFExpression.DW_OP_unknown (2023 of 2153) PASS: lldb-api :: lang/cpp/llvm-style/TestLLVMStyle.py (2024 of 2153) PASS: lldb-unit :: Utility/./UtilityTests/StringExtractorTest.GetHexU8_Exact (2025 of 2153) PASS: lldb-unit :: Symbol/./SymbolTests/TestTypeSystemClang.TestGetTypeClassTypeOfExpr (2026 of 2153) PASS: lldb-unit :: Process/minidump/./LLDBMinidumpTests/MinidumpParserTest.FindMemoryRangeWithFullMemoryMinidump (2027 of 2153) PASS: lldb-unit :: ObjectFile/Breakpad/./ObjectFileBreakpadTests/PublicRecord.parse (2028 of 2153) PASS: lldb-api :: macosx/lc-note/firmware-corefile/TestFirmwareCorefiles.py (2029 of 2153) PASS: lldb-unit :: Utility/./UtilityTests/StringExtractorTest.GetHexU8_Underflow2 (2030 of 2153) PASS: lldb-api :: lang/cpp/scope/TestCppScope.py (2031 of 2153) PASS: lldb-api :: commands/process/attach/attach_denied/TestAttachDenied.py (2032 of 2153) PASS: lldb-api :: python_api/process/io/TestProcessIO.py (2033 of 2153) PASS: lldb-unit :: Utility/./UtilityTests/StreamTest.SetIndentLevel (2034 of 2153) PASS: lldb-api :: functionalities/thread/concurrent_events/TestConcurrentSignalNWatchNBreak.py (2035 of 2153) UNSUPPORTED: lldb-api :: benchmarks/expression/TestExpressionCmd.py (2036 of 2153) PASS: lldb-unit :: ObjectFile/Breakpad/./ObjectFileBreakpadTests/StackWinRecord.parse (2037 of 2153) UNSUPPORTED: lldb-shell :: Register/x86-gp-write.test (2038 of 2153) PASS: lldb-unit :: tools/lldb-server/tests/./LLDBServerTests/StandardStartupTest.TestStopReplyContainsThreadPcs (2039 of 2153) UNSUPPORTED: lldb-shell :: ScriptInterpreter/Lua/convenience_variables.test (2040 of 2153) PASS: lldb-unit :: Utility/./UtilityTests/UriParserTest.SchemeHostSeparator (2041 of 2153) PASS: lldb-unit :: Expression/./ExpressionTests/DiagnosticManagerTest.AppendMessageNoDiag (2042 of 2153) PASS: lldb-unit :: Utility/./UtilityTests/NameMatchesTest.RegularExpression (2043 of 2153) PASS: lldb-unit :: SymbolFile/NativePDB/./SymbolFileNativePDBTests/PDBFPOProgramToDWARFExpressionTests.MultipleDependentAssignments (2044 of 2153) PASS: lldb-api :: python_api/disassemble-raw-data/TestDisassemble_VST1_64.py (2045 of 2153) PASS: lldb-unit :: Utility/./UtilityTests/NameMatchesTest.Contains (2046 of 2153) PASS: lldb-api :: functionalities/rerun/TestRerun.py (2047 of 2153) PASS: lldb-unit :: DataFormatter/./LLDBFormatterTests/TypeMatcherTests.RegexName (2048 of 2153) PASS: lldb-unit :: UnwindAssembly/x86/./UnwindAssemblyx86Tests/Testx86AssemblyInspectionEngine.Test64bitFramelessSmallStackFrame (2049 of 2153) PASS: lldb-api :: lang/objc/modules-incomplete/TestIncompleteModules.py (2050 of 2153) PASS: lldb-unit :: Host/./HostTests/NativeProcessProtocolTest.SetBreakpoint (2051 of 2153) PASS: lldb-unit :: Utility/./UtilityTests/UriParserTest.Minimal (2052 of 2153) PASS: lldb-unit :: Symbol/./SymbolTests/TestTypeSystemClang.TemplateArguments (2053 of 2153) PASS: lldb-unit :: ScriptInterpreter/Python/./ScriptInterpreterPythonTests/PythonDataObjectsTest.TestScript (2054 of 2153) PASS: lldb-unit :: debugserver/./debugserverTests/RNBSocket.AnyListen (2055 of 2153) PASS: lldb-api :: types/TestIntegerType.py (2056 of 2153) PASS: lldb-unit :: UnwindAssembly/x86/./UnwindAssemblyx86Tests/Testx86AssemblyInspectionEngine.TestAddESP (2057 of 2153) PASS: lldb-api :: commands/expression/import-std-module/stack/TestStackFromStdModule.py (2058 of 2153) PASS: lldb-unit :: Expression/./ExpressionTests/DiagnosticManagerTest.FixedExpression (2059 of 2153) PASS: lldb-api :: python_api/value/change_values/TestChangeValueAPI.py (2060 of 2153) PASS: lldb-unit :: Utility/./UtilityTests/Flags.Reset (2061 of 2153) PASS: lldb-unit :: Symbol/./SymbolTests/TestClangASTImporter.DeportTypeTagDecl (2062 of 2153) PASS: lldb-unit :: ScriptInterpreter/Python/./ScriptInterpreterPythonTests/PythonDataObjectsTest.TestPythonStringToStructuredString (2063 of 2153) PASS: lldb-shell :: SymbolFile/Breakpad/unwind-via-stack-win-no-memory-info.yaml (2064 of 2153) PASS: lldb-shell :: Settings/TestFrameFormatNoColor.test (2065 of 2153) PASS: lldb-unit :: ObjectFile/ELF/./ObjectFileELFTests/ObjectFileELFTest.GetModuleSpecifications_EarlySectionHeaders (2066 of 2153) PASS: lldb-api :: functionalities/conditional_break/TestConditionalBreak.py (2067 of 2153) PASS: lldb-shell :: Host/TestCustomShell.test (2068 of 2153) PASS: lldb-api :: types/TestIntegerTypeExpr.py (2069 of 2153) PASS: lldb-unit :: Utility/./UtilityTests/StringExtractorTest.GetNameColonValueSuccess (2070 of 2153) PASS: lldb-unit :: Utility/./UtilityTests/FileSpecTest.EqualDotsWindows (2071 of 2153) UNSUPPORTED: lldb-shell :: ScriptInterpreter/Lua/nested_sessions.test (2072 of 2153) PASS: lldb-unit :: Utility/./UtilityTests/ArgsTest.TestUnknownEscape (2073 of 2153) PASS: lldb-unit :: Utility/./UtilityTests/FileSpecTest.AppendPathComponent (2074 of 2153) PASS: lldb-api :: lang/c/tls_globals/TestTlsGlobals.py (2075 of 2153) PASS: lldb-unit :: SymbolFile/DWARF/./SymbolFileDWARFTests/SymbolFileDWARFTests.TestAbbrevOrder1Start5 (2076 of 2153) PASS: lldb-shell :: Process/TestAbortExitCode.test (2077 of 2153) PASS: lldb-shell :: SymbolFile/DWARF/limit-debug-info.s (2078 of 2153) PASS: lldb-api :: functionalities/step-avoids-no-debug/TestStepNoDebug.py (2079 of 2153) PASS: lldb-unit :: Host/./HostTests/NativeProcessProtocolTest.ReadMemoryWithoutTrap (2080 of 2153) PASS: lldb-api :: functionalities/target-new-solib-notifications/TestModuleLoadedNotifys.py (2081 of 2153) PASS: lldb-api :: functionalities/thread/step_out/TestThreadStepOut.py (2082 of 2153) PASS: lldb-unit :: Utility/./UtilityTests/ArgsTest.EscapeLLDBCommandArgument (2083 of 2153) PASS: lldb-shell :: ObjectFile/ELF/section-permissions.yaml (2084 of 2153) PASS: lldb-api :: iohandler/unicode/TestUnicode.py (2085 of 2153) UNSUPPORTED: lldb-api :: lang/objc/objc-dynamic-value/TestObjCDynamicValue.py (2086 of 2153) PASS: lldb-api :: lang/c/forward/TestForwardDeclaration.py (2087 of 2153) PASS: lldb-api :: python_api/symbol-context/two-files/TestSymbolContextTwoFiles.py (2088 of 2153) PASS: lldb-unit :: Utility/./UtilityTests/StatusTest.ErrorConstructor (2089 of 2153) PASS: lldb-api :: functionalities/data-formatter/data-formatter-stl/libcxx/vector/TestDataFormatterLibcxxVector.py (2090 of 2153) PASS: lldb-unit :: Utility/./UtilityTests/VMRange.ContainsAddr (2091 of 2153) PASS: lldb-unit :: Process/gdb-remote/./ProcessGdbRemoteTests/GDBRemoteClientBaseTest.SendContinueAndAsyncSignal (2092 of 2153) PASS: lldb-shell :: ObjectFile/PECOFF/section-types.yaml (2093 of 2153) PASS: lldb-unit :: Utility/./UtilityTests/StringListTest.ShiftStdString (2094 of 2153) PASS: lldb-api :: lang/cpp/covariant-return-types/TestCovariantReturnTypes.py (2095 of 2153) PASS: lldb-api :: types/TestCharTypeExpr.py (2096 of 2153) PASS: lldb-unit :: Utility/./UtilityTests/DataExtractorTest.GetULEB128_bit63 (2097 of 2153) PASS: lldb-unit :: Disassembler/./DisassemblerTests/TestArm64Disassembly.TestArmv81Instruction (2098 of 2153) PASS: lldb-api :: commands/watchpoints/watchpoint_commands/command/TestWatchpointCommandPython.py (2099 of 2153) PASS: lldb-unit :: Utility/./UtilityTests/StringListTest.AppendStringCString (2100 of 2153) PASS: lldb-api :: functionalities/data-formatter/refpointer-recursion/TestDataFormatterRefPtrRecursion.py (2101 of 2153) PASS: lldb-unit :: ScriptInterpreter/Python/./ScriptInterpreterPythonTests/PythonDataObjectsTest.TestPythonDictionaryManipulation (2102 of 2153) PASS: lldb-api :: tools/lldb-server/TestAppleSimulatorOSType.py (2103 of 2153) PASS: lldb-api :: functionalities/data-formatter/data-formatter-stl/libcxx/vbool/TestDataFormatterLibcxxVBool.py (2104 of 2153) PASS: lldb-api :: functionalities/data-formatter/data-formatter-skip-summary/TestDataFormatterSkipSummary.py (2105 of 2153) PASS: lldb-api :: functionalities/thread/concurrent_events/TestConcurrentTwoWatchpointThreads.py (2106 of 2153) PASS: lldb-unit :: Utility/./UtilityTests/OptionsWithRawTest.EmptySuffix (2107 of 2153) PASS: lldb-unit :: SymbolFile/DWARF/./SymbolFileDWARFTests/DWARFASTParserClangTests.EnsureAllDIEsInDeclContextHaveBeenParsedParsesOnlyMatchingEntries (2108 of 2153) PASS: lldb-unit :: UnwindAssembly/x86/./UnwindAssemblyx86Tests/Testx86AssemblyInspectionEngine.TestSubRSP (2109 of 2153) PASS: lldb-unit :: Utility/./UtilityTests/FileSpecTest.EqualDotsPosixRoot (2110 of 2153) PASS: lldb-unit :: Utility/./UtilityTests/Flags.Test (2111 of 2153) UNSUPPORTED: lldb-api :: commands/expression/call-restarts/TestCallThatRestarts.py (2112 of 2153) UNSUPPORTED: lldb-api :: functionalities/data-formatter/data-formatter-stl/libstdcpp/tuple/TestDataFormatterStdTuple.py (2113 of 2153) PASS: lldb-unit :: Symbol/./SymbolTests/TestClangASTImporter.CopyDeclTagDecl (2114 of 2153) PASS: lldb-unit :: Utility/./UtilityTests/ArchSpecTest.TestParseMachCPUDashSubtypeTripleSimple (2115 of 2153) PASS: lldb-api :: python_api/exprpath_synthetic/TestExprPathSynthetic.py (2116 of 2153) PASS: lldb-unit :: Utility/./UtilityTests/StringExtractorTest.GetU32LittleEndian (2117 of 2153) PASS: lldb-api :: lang/cpp/call-function/TestCallCPPFunction.py (2118 of 2153) PASS: lldb-api :: commands/process/signal/TestProcessSignal.py (2119 of 2153) PASS: lldb-unit :: ScriptInterpreter/Python/./ScriptInterpreterPythonTests/PythonDataObjectsTest.TestPythonListValueEquality (2120 of 2153) PASS: lldb-api :: functionalities/thread/exit_during_step/TestExitDuringStep.py (2121 of 2153) UNSUPPORTED: lldb-api :: lang/cpp/printf/TestPrintf.py (2122 of 2153) PASS: lldb-shell :: SymbolFile/Breakpad/line-table-discontinuous-file-ids.test (2123 of 2153) PASS: lldb-shell :: SymbolFile/DWARF/DW_TAG_basic_type_DW_ATE_UTF_nonC.ll (2124 of 2153) PASS: lldb-api :: python_api/lldbutil/frame/TestFrameUtils.py (2125 of 2153) PASS: lldb-api :: commands/watchpoints/step_over_watchpoint/TestStepOverWatchpoint.py (2126 of 2153) PASS: lldb-unit :: Utility/./UtilityTests/VASprintfTest.NoBufferResize (2127 of 2153) PASS: lldb-shell :: Reproducer/TestDriverOptions.test (2128 of 2153) PASS: lldb-api :: functionalities/data-formatter/data-formatter-python-synth/TestDataFormatterPythonSynth.py (2129 of 2153) PASS: lldb-api :: commands/breakpoint/command/list/TestBreakpointCommandList.py (2130 of 2153) PASS: lldb-unit :: Utility/./UtilityTests/VMRange.Reset (2131 of 2153) PASS: lldb-unit :: Process/./ProcessEventDataTests/ProcessEventDataTest.DoOnRemoval (2132 of 2153) PASS: lldb-unit :: Utility/./UtilityTests/StringExtractorTest.GetU64LittleEndian (2133 of 2153) PASS: lldb-shell :: Reproducer/TestMultipleTargets.test (2134 of 2153) PASS: lldb-unit :: Symbol/./SymbolTests/PostfixExpression.ParseOneExpression (2135 of 2153) PASS: lldb-unit :: Expression/./ExpressionTests/DiagnosticManagerTest.AppendMessageSubsequentDiags (2136 of 2153) PASS: lldb-unit :: Expression/./ExpressionTests/DWARFExpression.DW_OP_pick (2137 of 2153) PASS: lldb-shell :: Driver/TestTarget.test (2138 of 2153) PASS: lldb-unit :: Utility/./UtilityTests/OptionsWithRawTest.SingleWordSuffix (2139 of 2153) PASS: lldb-shell :: SymbolFile/DWARF/debug_rnglists-dwo.s (2140 of 2153) XFAIL: lldb-shell :: Register/x86-mm-xmm-write.test (2141 of 2153) PASS: lldb-unit :: Host/./HostTests/NativeProcessProtocolTest.ReadCStringFromMemory_CrossPageBoundary (2142 of 2153) PASS: lldb-api :: functionalities/inline-stepping/TestInlineStepping.py (2143 of 2153) PASS: lldb-api :: functionalities/data-formatter/data-formatter-objc/nsstring/TestDataFormatterNSString.py (2144 of 2153) PASS: lldb-unit :: Utility/./UtilityTests/StringExtractorTest.DecodeHexU8_InvalidHex (2145 of 2153) PASS: lldb-unit :: Utility/./UtilityTests/CompletionRequest.TestCompletionOwnership (2146 of 2153) PASS: lldb-unit :: Utility/./UtilityTests/BinaryStreamTest.PutSLEB128OneByte (2147 of 2153) PASS: lldb-api :: lang/cpp/symbols/TestSymbols.py (2148 of 2153) PASS: lldb-shell :: ObjectFile/ELF/base-address.yaml (2149 of 2153) PASS: lldb-api :: functionalities/mtc/simple/TestMTCSimple.py (2150 of 2153) PASS: lldb-api :: lang/cpp/class_types/TestClassTypesDisassembly.py (2151 of 2153) PASS: lldb-shell :: SymbolFile/NativePDB/global-classes.cpp (2152 of 2153) PASS: lldb-api :: lang/objc/modules/TestObjCModules.py (2153 of 2153) Slowest Tests: -------------------------------------------------------------------------- 449.11s: lldb-api :: macosx/simulator/TestSimulatorPlatform.py 270.35s: lldb-api :: commands/expression/persist_objc_pointeetype/TestPersistObjCPointeeType.py 102.06s: lldb-api :: tools/lldb-server/TestLldbGdbServer.py 79.22s: lldb-api :: lang/objc/foundation/TestRuntimeTypes.py 78.62s: lldb-api :: functionalities/breakpoint/breakpoint_conditions/TestBreakpointConditions.py 66.87s: lldb-api :: lang/objc/foundation/TestObjCMethods.py 62.53s: lldb-api :: functionalities/data-formatter/data-formatter-objc/TestDataFormatterObjCPlain.py 60.98s: lldb-api :: lang/objc/hidden-ivars/TestHiddenIvars.py 59.64s: lldb-api :: lang/objc/objc-new-syntax/TestObjCNewSyntaxLiteral.py 59.47s: lldb-api :: lang/objc/exceptions/TestObjCExceptions.py 55.30s: lldb-api :: functionalities/load_unload/TestLoadUnload.py 52.18s: lldb-shell :: SymbolFile/NativePDB/locate-pdb.cpp 51.99s: lldb-api :: functionalities/completion/TestCompletion.py 50.46s: lldb-api :: lang/objc/foundation/TestFoundationDisassembly.py 49.42s: lldb-shell :: SymbolFile/NativePDB/ast-methods.cpp 47.47s: lldb-api :: api/multithreaded/TestMultithreaded.py 44.00s: lldb-api :: types/TestLongTypesExpr.py 42.90s: lldb-api :: lang/cpp/namespace/TestNamespaceLookup.py 42.75s: lldb-api :: functionalities/gdb_remote_client/TestIOSSimulator.py 40.28s: lldb-api :: functionalities/data-formatter/compactvectors/TestCompactVectors.py

Hide Details

Tests Times: -------------------------------------------------------------------------- [ Range ] :: [ Percentage ] :: [ Count ] -------------------------------------------------------------------------- [440s,460s) :: [ ] :: [ 1/2153] [420s,440s) :: [ ] :: [ 0/2153] [400s,420s) :: [ ] :: [ 0/2153] [380s,400s) :: [ ] :: [ 0/2153] [360s,380s) :: [ ] :: [ 0/2153] [340s,360s) :: [ ] :: [ 0/2153] [320s,340s) :: [ ] :: [ 0/2153] [300s,320s) :: [ ] :: [ 0/2153] [280s,300s) :: [ ] :: [ 0/2153] [260s,280s) :: [ ] :: [ 1/2153] [240s,260s) :: [ ] :: [ 0/2153] [220s,240s) :: [ ] :: [ 0/2153] [200s,220s) :: [ ] :: [ 0/2153] [180s,200s) :: [ ] :: [ 0/2153] [160s,180s) :: [ ] :: [ 0/2153] [140s,160s) :: [ ] :: [ 0/2153] [120s,140s) :: [ ] :: [ 0/2153] [100s,120s) :: [ ] :: [ 1/2153] [ 80s,100s) :: [ ] :: [ 2/2153] [ 60s, 80s) :: [ ] :: [ 5/2153] [ 40s, 60s) :: [ ] :: [ 10/2153] [ 20s, 40s) :: [ ] :: [ 43/2153] [ 0s, 20s) :: [************************************** ] :: [2090/2153] -------------------------------------------------------------------------- ******************** Failed Tests (1): lldb-api :: commands/target/stop-hooks/TestStopHookScripted.py

Hide Details

Hide Details

Testing Time: 1947.86s Unsupported : 153 Passed : 1993 Expectedly Failed: 6 Failed : 1 FAILED: tools/lldb/test/CMakeFiles/check-lldb-lit cd /Users/buildslave/jenkins/workspace/lldb-cmake/lldb-build/tools/lldb/test && /usr/local/Frameworks/Python.framework/Versions/3.7/bin/python3.7 /Users/buildslave/jenkins/workspace/lldb-cmake/lldb-build/./bin/llvm-lit -v --time-tests --shuffle --xunit-xml-output=/Users/buildslave/jenkins/workspace/lldb-cmake/test/results.xml -v -j 4 /Users/buildslave/jenkins/workspace/lldb-cmake/lldb-build/tools/lldb/test ninja: build stopped: subcommand failed. Command failed: Command '['/usr/bin/env', 'TERM=vt100', '/usr/local/bin/ninja', '-v', 'check-lldb']' returned non-zero exit status 1 Command: ['/usr/bin/env', 'TERM=vt100', '/usr/local/bin/ninja', '-v', 'check-lldb'] [Pipeline] } [Pipeline] // timeout [Pipeline] } [Pipeline] // stage [Pipeline] stage [Pipeline] { (Declarative: Post Actions) [Pipeline] scanForIssues [Clang (LLVM based)] Sleeping for 5 seconds due to JENKINS-32191... [Clang (LLVM based)] Parsing console log (workspace: '/Users/buildslave/jenkins/workspace/lldb-cmake') [Clang (LLVM based)] Successfully parsed console log [Clang (LLVM based)] -> found 8 issues (skipped 14 duplicates) [Clang (LLVM based)] Post processing issues on 'green-dragon-10' with source code encoding 'UTF-8' [Clang (LLVM based)] Creating SCM blamer to obtain author and commit information for affected files [Clang (LLVM based)] Creating SCM miner to obtain statistics for affected repository files [Clang (LLVM based)] Resolving file names for all issues in source directory '/Users/buildslave/jenkins/workspace/lldb-cmake' [Clang (LLVM based)] -> resolved paths in source directory (6 found, 0 not found) [Clang (LLVM based)] Resolving module names from module definitions (build.xml, pom.xml, or Manifest.mf files) [Clang (LLVM based)] -> resolved module names for 8 issues [Clang (LLVM based)] Resolving package names (or namespaces) by parsing the affected files [Clang (LLVM based)] -> resolved package names of 6 affected files [Clang (LLVM based)] No filter has been set, publishing all 8 issues [Clang (LLVM based)] Creating fingerprints for all affected code blocks to track issues over different builds [Clang (LLVM based)] -> created fingerprints for 8 issues (skipped 0 issues) [Clang (LLVM based)] Copying affected files to Jenkins' build folder '/Users/Shared/Jenkins/Home/jobs/lldb-cmake/builds/23977/files-with-issues' [Clang (LLVM based)] -> 4 copied, 2 not in workspace, 0 not-found, 0 with I/O error [Pipeline] junit Recording test results [Pipeline] } [Pipeline] // stage [Pipeline] } [Pipeline] // withEnv [Pipeline] } [Pipeline] // node [Pipeline] End of Pipeline ERROR: script returned exit code 1 Finished: FAILURE