FailedConsole Output

Skipping 8,108 KB.. Full Log
 of 2154)
UNSUPPORTED: lldb-shell :: Register/x86-ymm-read.test (654 of 2154)
PASS: lldb-unit :: Utility/./UtilityTests/SerializationRountripTest.SerializeDeserializePod (655 of 2154)
PASS: lldb-unit :: Utility/./UtilityTests/StreamTest.PutHex32ByteOrderBig (656 of 2154)
PASS: lldb-unit :: Language/Highlighting/./HighlighterTests/HighlighterTest.ClangCursorPosEndOfLine (657 of 2154)
PASS: lldb-unit :: DataFormatter/./LLDBFormatterTests/TypeMatcherTests.ExactName (658 of 2154)
PASS: lldb-api :: functionalities/data-formatter/data-formatter-stl/libcxx/forward_list/TestDataFormatterLibcxxForwardList.py (659 of 2154)
PASS: lldb-unit :: Utility/./UtilityTests/StringListTest.SplitIntoLinesEmpty (660 of 2154)
PASS: lldb-api :: functionalities/thread/exit_during_step/TestExitDuringStep.py (661 of 2154)
PASS: lldb-unit :: Utility/./UtilityTests/RecordReplayTest.InstrumentedFooSameThis (662 of 2154)
PASS: lldb-unit :: Process/gdb-remote/./ProcessGdbRemoteTests/GDBRemoteCommunicationServerTest.SendErrorResponse_UnimplementedError (663 of 2154)
PASS: lldb-shell :: SymbolFile/DWARF/apple-index-is-used.cpp (664 of 2154)
PASS: lldb-api :: functionalities/data-formatter/nsdictionarysynth/TestNSDictionarySynthetic.py (665 of 2154)
UNSUPPORTED: lldb-api :: functionalities/darwin_log/source/info/TestDarwinLogSourceInfo.py (666 of 2154)
UNSUPPORTED: lldb-api :: functionalities/darwin_log/filter/exact_match/category/TestDarwinLogFilterMatchCategory.py (667 of 2154)
PASS: lldb-shell :: Driver/LocalLLDBInit.test (668 of 2154)
PASS: lldb-shell :: Breakpoint/debug_rnglist_rlestartend.test (669 of 2154)
PASS: lldb-unit :: SymbolFile/NativePDB/./SymbolFileNativePDBTests/PDBFPOProgramToDWARFExpressionTests.InvalidAssignmentSingle (670 of 2154)
PASS: lldb-unit :: Utility/./UtilityTests/LogChannelEnabledTest.LogGetLogThread (671 of 2154)
PASS: lldb-unit :: Utility/./UtilityTests/RangeTest.Copy (672 of 2154)
PASS: lldb-unit :: Utility/./UtilityTests/AnsiTerminal.WhiteSpace (673 of 2154)
PASS: lldb-api :: functionalities/data-formatter/data-formatter-stl/libcxx/unordered/TestDataFormatterUnordered.py (674 of 2154)
PASS: lldb-unit :: Host/./HostTests/SocketTest.TCPListen0ConnectAccept (675 of 2154)
PASS: lldb-shell :: SymbolFile/DWARF/debug-line-basic.s (676 of 2154)
PASS: lldb-unit :: Utility/./UtilityTests/LogTest.LLDB_LOG_nullptr (677 of 2154)
PASS: lldb-api :: macosx/load-kext/TestLoadKext.py (678 of 2154)
PASS: lldb-api :: python_api/interpreter/TestCommandInterpreterAPI.py (679 of 2154)
PASS: lldb-shell :: SymbolFile/DWARF/win-i386-line-table.s (680 of 2154)
PASS: lldb-unit :: Process/minidump/./LLDBMinidumpTests/MinidumpParserTest.GetMemoryRegionInfo (681 of 2154)
PASS: lldb-api :: commands/expression/import-std-module/forward_list/TestForwardListFromStdModule.py (682 of 2154)
PASS: lldb-shell :: SymbolFile/DWARF/debug_ranges-missing-section.s (683 of 2154)
PASS: lldb-unit :: Language/Highlighting/./HighlighterTests/HighlighterTest.ClangOperators (684 of 2154)
PASS: lldb-unit :: Core/./LLDBCoreTests/ModuleSpecTest.TestCOFFFile (685 of 2154)
PASS: lldb-unit :: Utility/./UtilityTests/SubsystemRAIITest.NormalSubsystem (686 of 2154)
PASS: lldb-api :: commands/watchpoints/multiple_threads/TestWatchpointMultipleThreads.py (687 of 2154)
PASS: lldb-api :: functionalities/postmortem/elf-core/TestLinuxCore.py (688 of 2154)
PASS: lldb-api :: tools/lldb-vscode/module/TestVSCode_module.py (689 of 2154)
PASS: lldb-api :: functionalities/data-formatter/data-formatter-objc/cmtime/TestDataFormatterCMTime.py (690 of 2154)
PASS: lldb-api :: commands/expression/import-std-module/vector-bool/TestVectorBoolFromStdModule.py (691 of 2154)
PASS: lldb-unit :: ScriptInterpreter/Python/./ScriptInterpreterPythonTests/PythonDataObjectsTest.TestPythonTupleInitializerList2 (692 of 2154)
PASS: lldb-unit :: Process/gdb-remote/./ProcessGdbRemoteTests/GDBRemoteClientBaseTest.SendContinueAndWait (693 of 2154)
PASS: lldb-api :: commands/platform/basic/TestPlatformPython.py (694 of 2154)
PASS: lldb-api :: lang/objcxx/objcxx-ivar-vector/TestIvarVector.py (695 of 2154)
PASS: lldb-api :: lang/cpp/virtual-functions/TestCppVirtualFunctions.py (696 of 2154)
UNSUPPORTED: lldb-api :: functionalities/darwin_log/basic/TestDarwinLogBasic.py (697 of 2154)
PASS: lldb-unit :: SymbolFile/NativePDB/./SymbolFileNativePDBTests/PDBFPOProgramToDWARFExpressionTests.UnresolvedCyclicRegisterAssignmentReference (698 of 2154)
PASS: lldb-unit :: Utility/./UtilityTests/StringListTest.GetMaxStringLengthIncreasingSize (699 of 2154)
PASS: lldb-api :: commands/target/modules/search-paths/insert/TestTargetModulesSearchpathsInsert.py (700 of 2154)
PASS: lldb-unit :: Utility/./UtilityTests/StringListTest.SetSize (701 of 2154)
PASS: lldb-unit :: Host/./HostTests/NativeProcessProtocolTest.SetBreakpointFailWrite (702 of 2154)
PASS: lldb-shell :: Driver/TestPositionalArgs.test (703 of 2154)
PASS: lldb-api :: functionalities/thread/concurrent_events/TestConcurrentDelayedCrashWithBreakpointWatchpoint.py (704 of 2154)
PASS: lldb-unit :: Utility/./UtilityTests/OptionsWithRawTest.SingleWordSuffix (705 of 2154)
PASS: lldb-unit :: ScriptInterpreter/Python/./ScriptInterpreterPythonTests/PythonDataObjectsTest.TestPythonDictionaryValueEquality (706 of 2154)
PASS: lldb-unit :: UnwindAssembly/ARM64/./Arm64InstEmulationTests/TestArm64InstEmulation.TestRegisterDoubleSpills (707 of 2154)
PASS: lldb-unit :: Process/gdb-remote/./ProcessGdbRemoteTests/GDBRemoteCommunicationClientTest.SendStartTracePacket (708 of 2154)
PASS: lldb-unit :: Process/gdb-remote/./ProcessGdbRemoteTests/GDBRemoteClientBaseTest.InterruptNoResponse (709 of 2154)
PASS: lldb-shell :: Unwind/trap_frame_sym_ctx.test (710 of 2154)
UNSUPPORTED: lldb-api :: benchmarks/expression/TestExpressionCmd.py (711 of 2154)
PASS: lldb-unit :: Host/./HostTests/FileActionTest.Open (712 of 2154)
PASS: lldb-shell :: ObjectFile/ELF/PT_LOAD-overlap-PT_TLS.yaml (713 of 2154)
PASS: lldb-unit :: Utility/./UtilityTests/UUIDTest.RelationalOperators (714 of 2154)
PASS: lldb-api :: commands/expression/scoped_enums/TestScopedEnumType.py (715 of 2154)
PASS: lldb-shell :: SymbolFile/DWARF/anon_class_w_and_wo_export_symbols.ll (716 of 2154)
PASS: lldb-unit :: Utility/./UtilityTests/ScalarTest.SetValueFromCString (717 of 2154)
PASS: lldb-unit :: ObjectFile/ELF/./ObjectFileELFTests/ObjectFileELFTest.GetSymtab_NoSymEntryPointArmAddressClass (718 of 2154)
PASS: lldb-shell :: SymbolFile/NativePDB/disassembly.cpp (719 of 2154)
PASS: lldb-shell :: SymbolFile/DWARF/find-basic-type.cpp (720 of 2154)
PASS: lldb-unit :: Utility/./UtilityTests/StreamTest.PutMaxHex64ByteOrderBig (721 of 2154)
PASS: lldb-api :: functionalities/data-formatter/type_summary_list_script/TestTypeSummaryListScript.py (722 of 2154)
PASS: lldb-api :: functionalities/data-formatter/stringprinter/TestStringPrinter.py (723 of 2154)
PASS: lldb-api :: macosx/DBGSourcePathRemapping/TestDSYMSourcePathRemapping.py (724 of 2154)
PASS: lldb-api :: functionalities/gdb_remote_client/TestGDBRemoteDiskFileCompletion.py (725 of 2154)
PASS: lldb-unit :: ScriptInterpreter/Python/./ScriptInterpreterPythonTests/PythonDataObjectsTest.TestTypeNameResolutionNoDot (726 of 2154)
PASS: lldb-unit :: ScriptInterpreter/Python/./ScriptInterpreterPythonTests/PythonDataObjectsTest.TestRun (727 of 2154)
PASS: lldb-unit :: ScriptInterpreter/Python/./ScriptInterpreterPythonTests/PythonDataObjectsTest.TestOwnedReferences (728 of 2154)
PASS: lldb-api :: functionalities/data-formatter/builtin-formats/TestBuiltinFormats.py (729 of 2154)
PASS: lldb-api :: python_api/sbplatform/TestSBPlatform.py (730 of 2154)
PASS: lldb-unit :: UnwindAssembly/x86/./UnwindAssemblyx86Tests/Testx86AssemblyInspectionEngine.TestPush0 (731 of 2154)
PASS: lldb-unit :: DataFormatter/./LLDBFormatterTests/TypeMatcherTests.CreatedBySameMatchString (732 of 2154)
PASS: lldb-api :: lang/cpp/function-qualifiers/TestCppFunctionQualifiers.py (733 of 2154)
PASS: lldb-api :: functionalities/thread/concurrent_events/TestConcurrentTwoWatchpointsOneDelayBreakpoint.py (734 of 2154)
PASS: lldb-unit :: SymbolFile/NativePDB/./SymbolFileNativePDBTests/PDBFPOProgramToDWARFExpressionTests.DependencyChain (735 of 2154)
PASS: lldb-unit :: ObjectFile/PECOFF/./ObjectFilePECOFFTests/PECallFrameInfoTest.Basic_eh (736 of 2154)
PASS: lldb-unit :: Utility/./UtilityTests/FileSpecTest.Match (737 of 2154)
PASS: lldb-unit :: Process/minidump/./LLDBMinidumpTests/MinidumpParserTest.MinidumpDuplicateModuleSeparateCode (738 of 2154)
PASS: lldb-unit :: Utility/./UtilityTests/ArgsTest.ReplaceArgumentAtIndexOutOfRange (739 of 2154)
PASS: lldb-api :: lang/c/vla/TestVLA.py (740 of 2154)
PASS: lldb-api :: functionalities/thread/concurrent_events/TestConcurrentSignalDelayBreak.py (741 of 2154)
UNSUPPORTED: lldb-shell :: Watchpoint/netbsd-nouserdbregs.test (742 of 2154)
PASS: lldb-unit :: Utility/./UtilityTests/RangeTest.LessThan (743 of 2154)
PASS: lldb-unit :: tools/lldb-server/tests/./LLDBServerTests/StandardStartupTest.TestStopReplyContainsThreadPcs (744 of 2154)
UNSUPPORTED: lldb-shell :: ScriptInterpreter/Lua/watchpoint_callback.test (745 of 2154)
PASS: lldb-api :: lang/cpp/const_this/TestConstThis.py (746 of 2154)
PASS: lldb-api :: functionalities/data-formatter/synthupdate/TestSyntheticFilterRecompute.py (747 of 2154)
PASS: lldb-shell :: Reproducer/TestDSYM.test (748 of 2154)
PASS: lldb-api :: functionalities/tail_call_frames/disambiguate_call_site/TestDisambiguateCallSite.py (749 of 2154)
PASS: lldb-unit :: Utility/./UtilityTests/RangeTest.Equal (750 of 2154)
PASS: lldb-shell :: SymbolFile/DWARF/split-dwarf-multiple-cu.ll (751 of 2154)
PASS: lldb-unit :: Language/Highlighting/./HighlighterTests/HighlighterTest.ClangCursorPosBeforeOtherToken (752 of 2154)
PASS: lldb-unit :: Utility/./UtilityTests/LogChannelEnabledTest.log_options (753 of 2154)
PASS: lldb-api :: macosx/lc-note/firmware-corefile/TestFirmwareCorefiles.py (754 of 2154)
UNSUPPORTED: lldb-shell :: Breakpoint/case-insensitive.test (755 of 2154)
PASS: lldb-api :: lang/cpp/lambdas/TestLambdas.py (756 of 2154)
PASS: lldb-unit :: UnwindAssembly/x86/./UnwindAssemblyx86Tests/Testx86AssemblyInspectionEngine.TestPopRBPWithREX (757 of 2154)
PASS: lldb-shell :: Driver/TestCommands.test (758 of 2154)
PASS: lldb-unit :: Utility/./UtilityTests/ArchSpecTest.Compatibility (759 of 2154)
PASS: lldb-api :: python_api/disassemble-raw-data/TestDisassembleRawData.py (760 of 2154)
PASS: lldb-api :: functionalities/thread/concurrent_events/TestConcurrentTwoBreakpointsOneWatchpoint.py (761 of 2154)
PASS: lldb-unit :: ObjectFile/PECOFF/./ObjectFilePECOFFTests/PECallFrameInfoTest.Frame_reg_eh (762 of 2154)
PASS: lldb-unit :: Utility/./UtilityTests/ArgsTest.TestMultipleArgs (763 of 2154)
PASS: lldb-api :: commands/target/select/TestTargetSelect.py (764 of 2154)
PASS: lldb-shell :: Quit/TestQuitExitCode0.test (765 of 2154)
PASS: lldb-api :: functionalities/testid/TestTestId.py (766 of 2154)
UNSUPPORTED: lldb-api :: lang/c/typedef/Testtypedef.py (767 of 2154)
PASS: lldb-api :: functionalities/float-display/TestFloatDisplay.py (768 of 2154)
PASS: lldb-unit :: Utility/./UtilityTests/LogChannelTest.EnableOptions (769 of 2154)
PASS: lldb-unit :: Utility/./UtilityTests/TimerTest.CategoryTimesStats (770 of 2154)
PASS: lldb-unit :: Utility/./UtilityTests/VMRange.Reset (771 of 2154)
PASS: lldb-api :: functionalities/gdb_remote_client/TestRecognizeBreakpoint.py (772 of 2154)
PASS: lldb-unit :: Utility/./UtilityTests/OptionsWithRawTest.WhitespaceSuffix (773 of 2154)
PASS: lldb-api :: functionalities/breakpoint/address_breakpoints/TestBadAddressBreakpoints.py (774 of 2154)
PASS: lldb-api :: types/TestDoubleTypes.py (775 of 2154)
PASS: lldb-api :: functionalities/signal/handle-abrt/TestHandleAbort.py (776 of 2154)
PASS: lldb-api :: lang/objc/objc-super/TestObjCSuper.py (777 of 2154)
PASS: lldb-unit :: Language/Highlighting/./HighlighterTests/HighlighterTest.ClangPPDirectives (778 of 2154)
PASS: lldb-api :: tools/lldb-server/TestGdbRemoteExpeditedRegisters.py (779 of 2154)
PASS: lldb-unit :: Core/./LLDBCoreTests/MangledTest.NameIndexes_FindFunctionSymbols (780 of 2154)
PASS: lldb-unit :: Expression/./ExpressionTests/CppModuleConfigurationTest.IgnoreLibStdCpp (781 of 2154)
PASS: lldb-shell :: Expr/TestIRMemoryMap.test (782 of 2154)
PASS: lldb-api :: lang/cpp/elaborated-types/TestElaboratedTypes.py (783 of 2154)
PASS: lldb-api :: commands/target/stop-hook/delete/TestTargetStopHookDelete.py (784 of 2154)
PASS: lldb-api :: lang/objc/single-entry-dictionary/TestObjCSingleEntryDictionary.py (785 of 2154)
PASS: lldb-api :: functionalities/data-formatter/boolreference/TestFormattersBoolRefPtr.py (786 of 2154)
PASS: lldb-unit :: Language/Highlighting/./HighlighterTests/HighlighterTest.DefaultHighlighterWithCursorOutOfBounds (787 of 2154)
PASS: lldb-api :: commands/frame/diagnose/dereference-this/TestDiagnoseDereferenceThis.py (788 of 2154)
PASS: lldb-unit :: Process/gdb-remote/./ProcessGdbRemoteTests/GDBRemoteCommunicationClientTest.WriteRegister (789 of 2154)
PASS: lldb-shell :: Minidump/disassemble-no-module.yaml (790 of 2154)
PASS: lldb-unit :: Utility/./UtilityTests/StringLexerTest.GetUnlexed (791 of 2154)
PASS: lldb-unit :: Utility/./UtilityTests/StringLexerTest.AdvanceIf (792 of 2154)
PASS: lldb-unit :: ScriptInterpreter/Python/./ScriptInterpreterPythonTests/PythonDataObjectsTest.TestResetting (793 of 2154)
PASS: lldb-api :: functionalities/target_var/TestTargetVar.py (794 of 2154)
PASS: lldb-api :: commands/expression/dont_allow_jit/TestAllowJIT.py (795 of 2154)
PASS: lldb-api :: functionalities/breakpoint/breakpoint_ids/TestBreakpointIDs.py (796 of 2154)
PASS: lldb-api :: functionalities/type_lookup/TestTypeLookup.py (797 of 2154)
PASS: lldb-api :: types/TestCharType.py (798 of 2154)
PASS: lldb-api :: functionalities/data-formatter/data-formatter-stl/libcxx/tuple/TestDataFormatterLibcxxTuple.py (799 of 2154)
PASS: lldb-shell :: SymbolFile/DWARF/debug-types-missing-signature.test (800 of 2154)
PASS: lldb-api :: python_api/name_lookup/TestNameLookup.py (801 of 2154)
PASS: lldb-unit :: Utility/./UtilityTests/StringListTest.LongestCommonPrefixDuplicateElement (802 of 2154)
PASS: lldb-unit :: Utility/./UtilityTests/AnsiTerminal.Empty (803 of 2154)
PASS: lldb-api :: functionalities/thread/jump/TestThreadJump.py (804 of 2154)
PASS: lldb-unit :: Expression/./ExpressionTests/CppModuleConfigurationTest.Xcode (805 of 2154)
PASS: lldb-api :: tools/lldb-server/TestGdbRemoteRegisterState.py (806 of 2154)
PASS: lldb-unit :: Utility/./UtilityTests/ConstStringTest.YAML (807 of 2154)
PASS: lldb-unit :: UnwindAssembly/x86/./UnwindAssemblyx86Tests/Testx86AssemblyInspectionEngine.TestSimple64bitFrameFunction (808 of 2154)
PASS: lldb-shell :: Quit/TestQuitExitCode30.test (809 of 2154)
PASS: lldb-api :: commands/expression/expr-in-syscall/TestExpressionInSyscall.py (810 of 2154)
UNSUPPORTED: lldb-api :: commands/trace/TestTraceLoad.py (811 of 2154)
PASS: lldb-api :: functionalities/data-formatter/data-formatter-python-synth/TestDataFormatterPythonSynth.py (812 of 2154)
PASS: lldb-unit :: DataFormatter/./LLDBFormatterTests/TypeMatcherTests.GetMatchStringRegex (813 of 2154)
PASS: lldb-api :: lang/c/shared_lib_stripped_symbols/TestSharedLibStrippedSymbols.py (814 of 2154)
PASS: lldb-unit :: Utility/./UtilityTests/StringExtractorTest.GetHexU8_Extra_NoEof (815 of 2154)
UNSUPPORTED: lldb-shell :: ObjectFile/ELF/minidebuginfo-set-and-hit-breakpoint.test (816 of 2154)
PASS: lldb-api :: api/multithreaded/TestMultithreaded.py (817 of 2154)
PASS: lldb-unit :: Utility/./UtilityTests/VMRange.ContainsRange (818 of 2154)
PASS: lldb-unit :: Host/./HostTests/SocketAddressTest.Set (819 of 2154)
PASS: lldb-api :: functionalities/tail_call_frames/disambiguate_paths_to_common_sink/TestDisambiguatePathsToCommonSink.py (820 of 2154)
PASS: lldb-unit :: Utility/./UtilityTests/StringLexerTest.Peek (821 of 2154)
PASS: lldb-api :: functionalities/unwind/noreturn/TestNoreturnUnwind.py (822 of 2154)
PASS: lldb-shell :: SymbolFile/DWARF/gnu-style-compression.cpp (823 of 2154)
PASS: lldb-api :: python_api/sblaunchinfo/TestSBLaunchInfo.py (824 of 2154)
PASS: lldb-shell :: ObjectFile/ELF/build-id-case.yaml (825 of 2154)
PASS: lldb-unit :: Host/./HostTests/SocketTest.DomainGetConnectURI (826 of 2154)
PASS: lldb-api :: functionalities/breakpoint/breakpoint_hit_count/TestBreakpointHitCount.py (827 of 2154)
PASS: lldb-unit :: ScriptInterpreter/Python/./ScriptInterpreterPythonTests/PythonDataObjectsTest.TestInstanceNameResolutionNoDot (828 of 2154)
PASS: lldb-api :: commands/frame/select/TestFrameSelect.py (829 of 2154)
PASS: lldb-api :: lang/objc/modules-non-objc-target/TestObjCModulesNonObjCTarget.py (830 of 2154)
PASS: lldb-unit :: Utility/./UtilityTests/PassiveReplayTest.InstrumentedFoo (831 of 2154)
PASS: lldb-unit :: DataFormatter/./LLDBFormatterTests/TypeMatcherTests.RegexMatchPart (832 of 2154)
PASS: lldb-api :: commands/session/history/TestSessionHistory.py (833 of 2154)
PASS: lldb-unit :: Utility/./UtilityTests/FileSpecTest.EqualDotsPosixRoot (834 of 2154)
PASS: lldb-shell :: SymbolFile/DWARF/debug_rnglists-dwo.s (835 of 2154)
PASS: lldb-unit :: Utility/./UtilityTests/StreamTest.PutCharWhitespace (836 of 2154)
PASS: lldb-unit :: Utility/./UtilityTests/ArgsTest.DoubleQuotedItem (837 of 2154)
PASS: lldb-api :: commands/expression/vector_of_enums/TestVectorOfEnums.py (838 of 2154)
UNSUPPORTED: lldb-api :: functionalities/thread/break_after_join/TestBreakAfterJoin.py (839 of 2154)
PASS: lldb-shell :: SymbolFile/DWARF/find-basic-variable.cpp (840 of 2154)
PASS: lldb-unit :: Utility/./UtilityTests/StreamTest.PutHex16ByteOrderLittle (841 of 2154)
PASS: lldb-unit :: Editline/./EditlineTests/EditlineTestFixture.EditlineReceivesSingleLineText (842 of 2154)
PASS: lldb-unit :: Utility/./UtilityTests/SerializationRountripTest.SerializeDeserializeCStringArray (843 of 2154)
PASS: lldb-shell :: SymbolFile/DWARF/dwarf5-index-is-used.cpp (844 of 2154)
PASS: lldb-unit :: Process/minidump/./LLDBMinidumpTests/RegisterContextMinidump.ConvertMinidumpContext_x86_64 (845 of 2154)
PASS: lldb-unit :: Utility/./UtilityTests/StringExtractorTest.GetHexBytesAvail (846 of 2154)
PASS: lldb-unit :: Symbol/./SymbolTests/TestTypeSystemClang.TestGetEnumIntegerTypeBasicTypes (847 of 2154)
UNSUPPORTED: lldb-api :: functionalities/breakpoint/hardware_breakpoints/hardware_breakpoint_on_multiple_threads/TestHWBreakMultiThread.py (848 of 2154)
PASS: lldb-api :: functionalities/data-formatter/data-formatter-caching/TestDataFormatterCaching.py (849 of 2154)
PASS: lldb-api :: lang/cpp/breakpoint_in_member_func_w_non_primitive_params/TestBreakpointInMemberFuncWNonPrimitiveParams.py (850 of 2154)
PASS: lldb-shell :: Reproducer/TestDriverOptions.test (851 of 2154)
PASS: lldb-unit :: Utility/./UtilityTests/AnsiTerminal.Incomplete (852 of 2154)
PASS: lldb-unit :: Utility/./UtilityTests/StringListTest.GetSize (853 of 2154)
PASS: lldb-unit :: Utility/./UtilityTests/ListenerTest.GetEventImmediate (854 of 2154)
PASS: lldb-unit :: Utility/./UtilityTests/StreamTest.PutRawBytesToBigEndian (855 of 2154)
PASS: lldb-unit :: Process/gdb-remote/./ProcessGdbRemoteTests/GDBRemoteCommunicationClientTest.ReadRegister (856 of 2154)
PASS: lldb-unit :: Utility/./UtilityTests/TimeoutTest.Format (857 of 2154)
UNSUPPORTED: lldb-shell :: ScriptInterpreter/Lua/convenience_variables.test (858 of 2154)
PASS: lldb-api :: functionalities/data-formatter/format-propagation/TestFormatPropagation.py (859 of 2154)
PASS: lldb-api :: functionalities/breakpoint/inlined_breakpoints/TestInlinedBreakpoints.py (860 of 2154)
PASS: lldb-api :: functionalities/gdb_remote_client/TestIOSSimulator.py (861 of 2154)
PASS: lldb-unit :: Host/./HostTests/File.GetStreamFromDescriptor (862 of 2154)
PASS: lldb-unit :: ObjectFile/Breakpad/./ObjectFileBreakpadTests/StackWinRecord.parse (863 of 2154)
PASS: lldb-api :: commands/watchpoints/hello_watchpoint/TestMyFirstWatchpoint.py (864 of 2154)
PASS: lldb-shell :: SymbolFile/Breakpad/stack-cfi-parsing.test (865 of 2154)
PASS: lldb-api :: functionalities/thread/concurrent_events/TestConcurrentWatchBreakDelay.py (866 of 2154)
PASS: lldb-unit :: SymbolFile/NativePDB/./SymbolFileNativePDBTests/PDBFPOProgramToDWARFExpressionTests.MultipleDependentAssignments (867 of 2154)
PASS: lldb-api :: functionalities/tail_call_frames/thread_step_out_or_return/TestSteppingOutWithArtificialFrames.py (868 of 2154)
PASS: lldb-api :: functionalities/postmortem/elf-core/gcore/TestGCore.py (869 of 2154)
UNSUPPORTED: lldb-api :: benchmarks/expression/TestRepeatedExprs.py (870 of 2154)
PASS: lldb-unit :: Utility/./UtilityTests/FileSpecTest.EqualDotsWindows (871 of 2154)
PASS: lldb-api :: lang/cpp/class_types/TestClassTypes.py (872 of 2154)
UNSUPPORTED: lldb-shell :: SymbolFile/PDB/class-layout.test (873 of 2154)
PASS: lldb-unit :: Utility/./UtilityTests/ConstStringTest.NullAndEmptyStates (874 of 2154)
PASS: lldb-api :: python_api/module_section/TestModuleAndSection.py (875 of 2154)
PASS: lldb-unit :: Utility/./UtilityTests/UriParserTest.Minimal (876 of 2154)
PASS: lldb-unit :: Utility/./UtilityTests/FileSpecTest.GuessPathStyle (877 of 2154)
PASS: lldb-api :: python_api/value/empty_class/TestValueAPIEmptyClass.py (878 of 2154)
PASS: lldb-api :: lang/cpp/nested-class-other-compilation-unit/TestNestedClassWithParentInAnotherCU.py (879 of 2154)
PASS: lldb-api :: python_api/watchpoint/TestWatchpointIgnoreCount.py (880 of 2154)
PASS: lldb-unit :: Utility/./UtilityTests/StringExtractorTest.GetHexU8_InvalidHex_NoEof (881 of 2154)
PASS: lldb-api :: functionalities/data-formatter/data-formatter-stl/libcxx/bitset/TestDataFormatterLibcxxBitset.py (882 of 2154)
PASS: lldb-api :: functionalities/breakpoint/serialize/TestBreakpointSerialization.py (883 of 2154)
PASS: lldb-unit :: Utility/./UtilityTests/UriParserTest.LongPath (884 of 2154)
UNSUPPORTED: lldb-api :: functionalities/unwind/standard/TestStandardUnwind.py (885 of 2154)
PASS: lldb-unit :: Expression/./ExpressionTests/DWARFExpression.DW_OP_pick (886 of 2154)
PASS: lldb-api :: lang/cpp/covariant-return-types/TestCovariantReturnTypes.py (887 of 2154)
PASS: lldb-unit :: Host/./HostTests/SocketTest.TCPGetConnectURI (888 of 2154)
PASS: lldb-api :: lang/cpp/llvm-style/TestLLVMStyle.py (889 of 2154)
PASS: lldb-api :: functionalities/tsan/thread_numbers/TestTsanThreadNumbers.py (890 of 2154)
PASS: lldb-shell :: ObjectFile/ELF/section-types-edgecases.yaml (891 of 2154)
PASS: lldb-shell :: ScriptInterpreter/Python/crashlog.test (892 of 2154)
PASS: lldb-api :: functionalities/pre_run_dylibs/TestPreRunDylibs.py (893 of 2154)
PASS: lldb-api :: lang/c/anonymous/TestAnonymous.py (894 of 2154)
PASS: lldb-shell :: SymbolFile/DWARF/DW_AT_loclists_base.s (895 of 2154)
PASS: lldb-api :: lang/objc/rdar-10967107/TestRdar10967107.py (896 of 2154)
PASS: lldb-api :: functionalities/thread/concurrent_events/TestConcurrentBreakpointsDelayedBreakpointOneWatchpoint.py (897 of 2154)
PASS: lldb-shell :: SymbolFile/DWARF/debug-names-compressed.cpp (898 of 2154)
PASS: lldb-unit :: UnwindAssembly/x86/./UnwindAssemblyx86Tests/Testx86AssemblyInspectionEngine.TestPushEDI (899 of 2154)
PASS: lldb-api :: functionalities/reproducers/attach/TestReproducerAttach.py (900 of 2154)
PASS: lldb-api :: python_api/findvalue_duplist/TestSBFrameFindValue.py (901 of 2154)
XFAIL: lldb-shell :: Register/x86-64-ymm-write.test (902 of 2154)
UNSUPPORTED: lldb-shell :: SymbolFile/NativePDB/typedefs.cpp (903 of 2154)
PASS: lldb-unit :: ScriptInterpreter/Python/./ScriptInterpreterPythonTests/PythonDataObjectsTest.TestPythonListManipulation (904 of 2154)
PASS: lldb-unit :: Expression/./ExpressionTests/DiagnosticManagerTest.HasFixits (905 of 2154)
PASS: lldb-unit :: Utility/./UtilityTests/VASprintfTest.EncodingError (906 of 2154)
PASS: lldb-unit :: Utility/./UtilityTests/StreamTest.QuotedCString (907 of 2154)
PASS: lldb-unit :: Utility/./UtilityTests/GeneratorTest.GetOrCreate (908 of 2154)
PASS: lldb-unit :: Symbol/./SymbolTests/TestTypeSystemClang.TestRecordHasFields (909 of 2154)
PASS: lldb-unit :: Expression/./ExpressionTests/CppModuleConfigurationTest.MissingLibCpp (910 of 2154)
PASS: lldb-api :: functionalities/thread/concurrent_events/TestConcurrentTwoWatchpointThreads.py (911 of 2154)
UNSUPPORTED: lldb-api :: functionalities/data-formatter/data-formatter-stl/libstdcpp/tuple/TestDataFormatterStdTuple.py (912 of 2154)
PASS: lldb-api :: macosx/find-dsym/bundle-with-dot-in-filename/TestBundleWithDotInFilename.py (913 of 2154)
PASS: lldb-unit :: Utility/./UtilityTests/StringListTest.GetMaxStringLengthMixed (914 of 2154)
PASS: lldb-shell :: ObjectFile/wasm/stripped-debug-sections.yaml (915 of 2154)
PASS: lldb-shell :: Settings/TestFrameFormatNoColor.test (916 of 2154)
PASS: lldb-api :: tools/lldb-server/TestGdbRemoteHostInfo.py (917 of 2154)
PASS: lldb-shell :: ObjectFile/Breakpad/sections.test (918 of 2154)
PASS: lldb-unit :: Disassembler/./DisassemblerTests/TestArm64Disassembly.TestArmv81Instruction (919 of 2154)
PASS: lldb-unit :: Process/gdb-remote/./ProcessGdbRemoteTests/GDBRemoteClientBaseTest.SendContinueAndAsyncPacket (920 of 2154)
PASS: lldb-unit :: Expression/./ExpressionTests/CppModuleConfigurationTest.AmbiguousLibCpp (921 of 2154)
PASS: lldb-api :: functionalities/gdb_remote_client/TestRegDefinitionInParts.py (922 of 2154)
PASS: lldb-api :: commands/expression/radar_8638051/Test8638051.py (923 of 2154)
PASS: lldb-unit :: Utility/./UtilityTests/StringListTest.JoinSingle (924 of 2154)
PASS: lldb-unit :: UnwindAssembly/x86/./UnwindAssemblyx86Tests/Testx86AssemblyInspectionEngine.TestStackRealignMSVC_i386 (925 of 2154)
PASS: lldb-unit :: Utility/./UtilityTests/RangeTest.EqualInvalid (926 of 2154)
PASS: lldb-shell :: ObjectFile/PECOFF/section-types.yaml (927 of 2154)
PASS: lldb-api :: tools/lldb-server/TestLldbGdbServer.py (928 of 2154)
PASS: lldb-api :: functionalities/deleted-executable/TestDeletedExecutable.py (929 of 2154)
PASS: lldb-api :: functionalities/breakpoint/breakpoint_ignore_count/TestBreakpointIgnoreCount.py (930 of 2154)
PASS: lldb-unit :: Interpreter/./InterpreterTests/OptionValueFileColonLine.setFromString (931 of 2154)
PASS: lldb-api :: tools/lldb-server/register-reading/TestGdbRemoteGPacket.py (932 of 2154)
PASS: lldb-unit :: Platform/./LLDBPlatformTests/PlatformAppleSimulatorTest.TestSimHasSimEnvionament (933 of 2154)
PASS: lldb-unit :: Utility/./UtilityTests/StreamTeeTest.SetStreamAtIndexOverwrite (934 of 2154)
PASS: lldb-api :: commands/expression/unwind_expression/TestUnwindExpression.py (935 of 2154)
PASS: lldb-unit :: Language/CPlusPlus/./LanguageCPlusPlusTests/CPlusPlusLanguage.CPlusPlusNameParser (936 of 2154)
PASS: lldb-api :: commands/statistics/basic/TestStats.py (937 of 2154)
PASS: lldb-api :: lang/c/modules/TestCModules.py (938 of 2154)
PASS: lldb-api :: functionalities/data-formatter/data-formatter-ptr-to-array/TestPtrToArrayFormatting.py (939 of 2154)
PASS: lldb-shell :: SymbolFile/Breakpad/symtab.test (940 of 2154)
PASS: lldb-shell :: SymbolFile/DWARF/split-dwarf-inlining.cpp (941 of 2154)
PASS: lldb-shell :: SymbolFile/Breakpad/line-table.test (942 of 2154)
PASS: lldb-api :: functionalities/breakpoint/breakpoint_callback_command_source/TestBreakpointCallbackCommandSource.py (943 of 2154)
PASS: lldb-api :: lang/cpp/member-and-local-vars-with-same-name/TestMembersAndLocalsWithSameName.py (944 of 2154)
PASS: lldb-api :: python_api/lldbutil/iter/TestRegistersIterator.py (945 of 2154)
PASS: lldb-shell :: Heap/heap-cstr.test (946 of 2154)
PASS: lldb-api :: lang/c/function_types/TestFunctionTypes.py (947 of 2154)
PASS: lldb-api :: commands/expression/top-level/TestTopLevelExprs.py (948 of 2154)
PASS: lldb-api :: functionalities/breakpoint/consecutive_breakpoints/TestConsecutiveBreakpoints.py (949 of 2154)
PASS: lldb-shell :: Breakpoint/ppc64-localentry.test (950 of 2154)
PASS: lldb-unit :: Process/gdb-remote/./ProcessGdbRemoteTests/GDBRemoteClientBaseTest.SendPacketAndReceiveResponseWithOutputSupport (951 of 2154)
UNSUPPORTED: lldb-shell :: SymbolFile/PDB/enums-layout.test (952 of 2154)
PASS: lldb-api :: commands/expression/import-std-module/stack/TestStackFromStdModule.py (953 of 2154)
PASS: lldb-unit :: Core/./LLDBCoreTests/ModuleSpecTest.InvalidInMemoryBuffer (954 of 2154)
PASS: lldb-shell :: Commands/command-disassemble-process.yaml (955 of 2154)
PASS: lldb-unit :: Utility/./UtilityTests/SharedCluster.ClusterManager (956 of 2154)
PASS: lldb-shell :: ScriptInterpreter/Python/eof.test (957 of 2154)
PASS: lldb-unit :: Utility/./UtilityTests/StringListTest.PopBack (958 of 2154)
UNSUPPORTED: lldb-api :: commands/expression/completion-crash-invalid-iterator/TestInvalidIteratorCompletionCrash.py (959 of 2154)
PASS: lldb-api :: macosx/order/TestOrderFile.py (960 of 2154)
PASS: lldb-unit :: Utility/./UtilityTests/NameMatchesTest.Ignore (961 of 2154)
PASS: lldb-unit :: Process/minidump/./LLDBMinidumpTests/MinidumpParserTest.GetThreadContext_x86_32_wow64 (962 of 2154)
PASS: lldb-api :: commands/target/stop-hooks/TestStopHooks.py (963 of 2154)
PASS: lldb-unit :: Process/gdb-remote/./ProcessGdbRemoteTests/GDBRemoteCommunicationClientTest.GetMemoryRegionInfoInvalidResponse (964 of 2154)
PASS: lldb-unit :: Utility/./UtilityTests/Predicate.WaitForValueEqualTo (965 of 2154)
UNSUPPORTED: lldb-api :: functionalities/tty/TestTerminal.py (966 of 2154)
PASS: lldb-unit :: Utility/./UtilityTests/Predicate.WaitForValueNotEqualTo (967 of 2154)
PASS: lldb-unit :: ScriptInterpreter/Python/./ScriptInterpreterPythonTests/PythonDataObjectsTest.TestPythonStringToStr (968 of 2154)
PASS: lldb-unit :: Utility/./UtilityTests/StreamTest.Indent (969 of 2154)
PASS: lldb-shell :: SymbolFile/NativePDB/ast-methods.cpp (970 of 2154)
PASS: lldb-api :: macosx/universal/TestUniversal.py (971 of 2154)
PASS: lldb-unit :: UnwindAssembly/x86/./UnwindAssemblyx86Tests/Testx86AssemblyInspectionEngine.TestPushEDX (972 of 2154)
PASS: lldb-shell :: SymbolFile/NativePDB/function-types-calling-conv.cpp (973 of 2154)
PASS: lldb-unit :: Interpreter/./InterpreterTests/OptionArgParserTest.toScriptLanguage (974 of 2154)
PASS: lldb-api :: commands/expression/completion-crash-incomplete-record/TestCompletionCrashIncompleteRecord.py (975 of 2154)
PASS: lldb-api :: commands/quit/TestQuit.py (976 of 2154)
PASS: lldb-unit :: Symbol/./SymbolTests/TestTypeSystemClang.TestGetEnumIntegerTypeInvalid (977 of 2154)
PASS: lldb-unit :: Utility/./UtilityTests/ScalarTest.GetBytes (978 of 2154)
PASS: lldb-shell :: Recognizer/assert.test (979 of 2154)
PASS: lldb-unit :: ScriptInterpreter/Python/./ScriptInterpreterPythonTests/PythonDataObjectsTest.TestPythonFile (980 of 2154)
PASS: lldb-unit :: Utility/./UtilityTests/StringExtractorTest.GetNameColonValueSuccess (981 of 2154)
PASS: lldb-api :: commands/frame/diagnose/array/TestArray.py (982 of 2154)
PASS: lldb-unit :: Utility/./UtilityTests/OptionsWithRawTest.LeadingSpaceArgs (983 of 2154)
PASS: lldb-unit :: Utility/./UtilityTests/StringListTest.RemoveBlankLines (984 of 2154)
PASS: lldb-unit :: Utility/./UtilityTests/AnsiTerminal.Unknown (985 of 2154)
PASS: lldb-api :: functionalities/thread/concurrent_events/TestConcurrentTwoBreakpointsOneDelaySignal.py (986 of 2154)
PASS: lldb-unit :: SymbolFile/DWARF/./SymbolFileDWARFTests/SymbolFileDWARFTests.TestAbbrevOutOfOrder (987 of 2154)
PASS: lldb-unit :: Utility/./UtilityTests/UriParserTest.BracketedHostnameWithPortIPv6 (988 of 2154)
PASS: lldb-shell :: SymbolFile/DWARF/debug-types-basic.test (989 of 2154)
PASS: lldb-unit :: Utility/./UtilityTests/ArchSpecTest.OperatorBool (990 of 2154)
PASS: lldb-unit :: Utility/./UtilityTests/StreamTest.ShiftOperatorPtr (991 of 2154)
PASS: lldb-api :: lang/cpp/auto/TestCPPAuto.py (992 of 2154)
PASS: lldb-unit :: Utility/./UtilityTests/RangeTest.ClearWithStarAddress (993 of 2154)
PASS: lldb-unit :: Thread/./ThreadTests/ThreadTest.SetStopInfo (994 of 2154)
PASS: lldb-unit :: Utility/./UtilityTests/ConstStringTest.format_provider (995 of 2154)
PASS: lldb-api :: commands/expression/import-std-module/list/TestListFromStdModule.py (996 of 2154)
PASS: lldb-api :: functionalities/data-formatter/user-format-vs-summary/TestUserFormatVsSummary.py (997 of 2154)
PASS: lldb-api :: functionalities/tail_call_frames/cross_object/TestCrossObjectTailCalls.py (998 of 2154)
PASS: lldb-api :: lang/cpp/frame-var-anon-unions/TestFrameVariableAnonymousUnions.py (999 of 2154)
PASS: lldb-api :: lang/objc/foundation/TestObjCMethods.py (1000 of 2154)
UNSUPPORTED: lldb-api :: linux/mix-dwo-and-regular-objects/TestMixedDwarfBinary.py (1001 of 2154)
PASS: lldb-unit :: Target/./TargetTests/PathMappingListTest.RelativeTests (1002 of 2154)
PASS: lldb-unit :: Utility/./UtilityTests/FileSpecTest.GetPath (1003 of 2154)
PASS: lldb-unit :: Process/minidump/./LLDBMinidumpTests/MinidumpParserTest.InvalidMinidump (1004 of 2154)
UNSUPPORTED: lldb-shell :: ScriptInterpreter/Lua/independent_state.test (1005 of 2154)
PASS: lldb-shell :: Minidump/memory-region-from-module.yaml (1006 of 2154)
UNSUPPORTED: lldb-api :: functionalities/data-formatter/data-formatter-stl/libstdcpp/unique_ptr/TestDataFormatterStdUniquePtr.py (1007 of 2154)
PASS: lldb-api :: functionalities/data-formatter/data-formatter-stl/libcxx/vbool/TestDataFormatterLibcxxVBool.py (1008 of 2154)
PASS: lldb-unit :: Utility/./UtilityTests/RangeTest.Constructor (1009 of 2154)
PASS: lldb-shell :: Reproducer/Functionalities/TestImageList.test (1010 of 2154)
PASS: lldb-unit :: Utility/./UtilityTests/StringExtractorTest.GetU32BigEndian (1011 of 2154)
PASS: lldb-unit :: UnwindAssembly/PPC64/./PPC64InstEmulationTests/TestPPC64InstEmulation.TestMediumFunction (1012 of 2154)
PASS: lldb-unit :: Utility/./UtilityTests/RangeDataVector.FindEntryIndexesThatContain (1013 of 2154)
PASS: lldb-api :: functionalities/gdb_remote_client/TestGDBRemoteLoad.py (1014 of 2154)
PASS: lldb-shell :: SymbolFile/DWARF/module-ownership.mm (1015 of 2154)
PASS: lldb-unit :: Symbol/./SymbolTests/DWARFCallFrameInfoTest.Basic_dwarf4 (1016 of 2154)
PASS: lldb-api :: commands/expression/regression-access-function-template-in-record/TestRegressionAccessFunctionTemplateInRecord.py (1017 of 2154)
PASS: lldb-unit :: Utility/./UtilityTests/VMRange.Ordering (1018 of 2154)
PASS: lldb-unit :: Utility/./UtilityTests/BinaryStreamTest.PutULEB128MaxValue (1019 of 2154)
PASS: lldb-api :: commands/settings/TestSettings.py (1020 of 2154)
PASS: lldb-shell :: SymbolFile/DWARF/find-method-local-struct.cpp (1021 of 2154)
PASS: lldb-api :: functionalities/data-formatter/data-formatter-objc/TestDataFormatterObjCNSContainer.py (1022 of 2154)
PASS: lldb-api :: macosx/thread-names/TestInterruptThreadNames.py (1023 of 2154)
PASS: lldb-unit :: Utility/./UtilityTests/StringExtractorTest.GetHexU8_Underflow2_NoEof (1024 of 2154)
PASS: lldb-shell :: Settings/TestSettingsWrite.test (1025 of 2154)
PASS: lldb-unit :: Utility/./UtilityTests/LogChannelTest.Enable (1026 of 2154)
PASS: lldb-unit :: Utility/./UtilityTests/XcodeSDKTest.SDKSupportsModules (1027 of 2154)
PASS: lldb-shell :: Expr/TestMultilineExpr.test (1028 of 2154)
PASS: lldb-shell :: Reproducer/TestFileRepro.test (1029 of 2154)
PASS: lldb-unit :: UnwindAssembly/x86/./UnwindAssemblyx86Tests/Testx86AssemblyInspectionEngine.Test32bitFramelessSmallStackFrame (1030 of 2154)
PASS: lldb-unit :: UnwindAssembly/x86/./UnwindAssemblyx86Tests/Testx86AssemblyInspectionEngine.TestSubESP (1031 of 2154)
PASS: lldb-api :: functionalities/limit-debug-info/TestLimitDebugInfo.py (1032 of 2154)
PASS: lldb-api :: macosx/nslog/TestDarwinNSLogOutput.py (1033 of 2154)
PASS: lldb-api :: lang/cpp/stl/TestSTL.py (1034 of 2154)
PASS: lldb-unit :: ObjectFile/ELF/./ObjectFileELFTests/ObjectFileELFTest.GetSymtab_NoSymEntryPointArmThumbAddressClass (1035 of 2154)
UNSUPPORTED: lldb-shell :: ExecControl/StopHook/stop-hook-threads.test (1036 of 2154)
PASS: lldb-api :: lang/c/shared_lib/TestSharedLib.py (1037 of 2154)
PASS: lldb-api :: macosx/save_crashlog/TestSaveCrashlog.py (1038 of 2154)
PASS: lldb-shell :: ScriptInterpreter/Python/python.test (1039 of 2154)
PASS: lldb-api :: iohandler/unicode/TestUnicode.py (1040 of 2154)
PASS: lldb-unit :: Process/gdb-remote/./ProcessGdbRemoteTests/GDBRemoteCommunicationClientTest.GetModulesInfo (1041 of 2154)
PASS: lldb-unit :: Utility/./UtilityTests/DataExtractorTest.GetDoubleUnaligned (1042 of 2154)
PASS: lldb-unit :: Symbol/./SymbolTests/TestClangASTImporter.DeportDeclTagDecl (1043 of 2154)
PASS: lldb-unit :: Utility/./UtilityTests/ArgsTest.StringListConstructor (1044 of 2154)
PASS: lldb-unit :: UnwindAssembly/x86/./UnwindAssemblyx86Tests/Testx86AssemblyInspectionEngine.TestPushR15 (1045 of 2154)
PASS: lldb-api :: functionalities/data-formatter/data-formatter-smart-array/TestDataFormatterSmartArray.py (1046 of 2154)
PASS: lldb-shell :: ObjectFile/ELF/aarch64-relocations.yaml (1047 of 2154)
PASS: lldb-unit :: Utility/./UtilityTests/Flags.IsClear (1048 of 2154)
PASS: lldb-unit :: Process/minidump/./LLDBMinidumpTests/MinidumpParserTest.GetPidWow64 (1049 of 2154)
UNSUPPORTED: lldb-api :: functionalities/data-formatter/data-formatter-stl/libstdcpp/iterator/TestDataFormatterStdIterator.py (1050 of 2154)
PASS: lldb-unit :: Process/minidump/./LLDBMinidumpTests/MinidumpParserTest.GetArchitecture (1051 of 2154)
PASS: lldb-unit :: Symbol/./SymbolTests/TestTypeSystemClang.TestOwningModule (1052 of 2154)
PASS: lldb-unit :: Utility/./UtilityTests/RangeVector.CombineConsecutiveRanges (1053 of 2154)
PASS: lldb-unit :: Utility/./UtilityTests/StringListTest.JoinThree (1054 of 2154)
PASS: lldb-unit :: Utility/./UtilityTests/StringExtractorTest.DecodeHexU8_Underflow (1055 of 2154)
PASS: lldb-unit :: Utility/./UtilityTests/RangeTest.Clear (1056 of 2154)
PASS: lldb-api :: commands/expression/diagnostics/TestExprDiagnostics.py (1057 of 2154)
UNSUPPORTED: lldb-shell :: BuildScript/toolchain-msvc.test (1058 of 2154)
PASS: lldb-unit :: Utility/./UtilityTests/ConstStringTest.CompareConstString (1059 of 2154)
PASS: lldb-api :: functionalities/breakpoint/auto_continue/TestBreakpointAutoContinue.py (1060 of 2154)
PASS: lldb-unit :: Utility/./UtilityTests/BinaryStreamTest.PutSLEB128SevenBytes (1061 of 2154)
PASS: lldb-unit :: Utility/./UtilityTests/TimerTest.CategoryTimes (1062 of 2154)
PASS: lldb-unit :: Interpreter/./InterpreterTests/CompletionTest.DirCompletionAbsolute (1063 of 2154)
PASS: lldb-unit :: Symbol/./SymbolTests/TestTypeSystemClang.TestGetEnumIntegerTypeUnexpectedType (1064 of 2154)
PASS: lldb-api :: functionalities/thread/exit_during_expression/TestExitDuringExpression.py (1065 of 2154)
PASS: lldb-unit :: Utility/./UtilityTests/LogChannelTest.List (1066 of 2154)
PASS: lldb-api :: commands/breakpoint/set/func-regex/TestBreakpointRegexError.py (1067 of 2154)
XFAIL: lldb-shell :: Register/x86-mm-xmm-read.test (1068 of 2154)
UNSUPPORTED: lldb-api :: linux/add-symbols/TestTargetSymbolsAddCommand.py (1069 of 2154)
PASS: lldb-unit :: SymbolFile/NativePDB/./SymbolFileNativePDBTests/PDBFPOProgramToDWARFExpressionTests.InvalidOpUnary (1070 of 2154)
PASS: lldb-api :: functionalities/data-formatter/vector-types/TestVectorTypesFormatting.py (1071 of 2154)
PASS: lldb-shell :: Minidump/fb-dump.test (1072 of 2154)
PASS: lldb-shell :: ObjectFile/MachO/lc_version_min.yaml (1073 of 2154)
PASS: lldb-api :: python_api/exprpath_synthetic/TestExprPathSynthetic.py (1074 of 2154)
PASS: lldb-api :: functionalities/unwind/zeroth_frame/TestZerothFrame.py (1075 of 2154)
PASS: lldb-unit :: SymbolFile/NativePDB/./SymbolFileNativePDBTests/PDBFPOProgramToDWARFExpressionTests.UnsupportedRASearch (1076 of 2154)
PASS: lldb-unit :: ScriptInterpreter/Python/./ScriptInterpreterPythonTests/PythonDataObjectsTest.TestPythonCallableCheck (1077 of 2154)
UNSUPPORTED: lldb-api :: lang/cpp/function-template-parameter-pack/TestFunctionTemplateParameterPack.py (1078 of 2154)
PASS: lldb-unit :: Utility/./UtilityTests/RangeTest.ContainsRange (1079 of 2154)
PASS: lldb-unit :: Utility/./UtilityTests/StringExtractorTest.GetHexBytes_OddPair2 (1080 of 2154)
PASS: lldb-shell :: ObjectFile/ELF/many-sections.s (1081 of 2154)
PASS: lldb-unit :: Symbol/./SymbolTests/TestTypeSystemClang.TestConvertAccessTypeToAccessSpecifier (1082 of 2154)
PASS: lldb-shell :: ObjectFile/ELF/PT_LOAD-empty.yaml (1083 of 2154)
PASS: lldb-unit :: Interpreter/./InterpreterTests/CompletionTest.FileCompletionAbsolute (1084 of 2154)
PASS: lldb-shell :: Driver/TestSingleQuote.test (1085 of 2154)
PASS: lldb-unit :: Core/./LLDBCoreTests/RichManglingContextTest.SwitchProvider (1086 of 2154)
PASS: lldb-unit :: UnwindAssembly/x86/./UnwindAssemblyx86Tests/Testx86AssemblyInspectionEngine.TestPopR14 (1087 of 2154)
PASS: lldb-api :: tools/lldb-vscode/breakpoint-events/TestVSCode_breakpointEvents.py (1088 of 2154)
PASS: lldb-api :: lang/objc/direct-dispatch-step/TestObjCDirectDispatchStepping.py (1089 of 2154)
PASS: lldb-unit :: Process/gdb-remote/./ProcessGdbRemoteTests/GDBRemoteCommunicationServerTest.SendErrorResponse_ErrorNumber (1090 of 2154)
PASS: lldb-api :: lang/objc/orderedset/TestOrderedSet.py (1091 of 2154)
PASS: lldb-unit :: Utility/./UtilityTests/BinaryStreamTest.PutULEB128TwoBytes (1092 of 2154)
PASS: lldb-api :: functionalities/data-formatter/data-formatter-synth/TestDataFormatterSynth.py (1093 of 2154)
PASS: lldb-api :: commands/expression/call-throws/TestCallThatThrows.py (1094 of 2154)
PASS: lldb-api :: lang/cpp/alignas_base_class/TestAlignAsBaseClass.py (1095 of 2154)
PASS: lldb-api :: commands/expression/import-std-module/weak_ptr/TestWeakPtrFromStdModule.py (1096 of 2154)
PASS: lldb-api :: functionalities/avoids-fd-leak/TestFdLeak.py (1097 of 2154)
PASS: lldb-unit :: ScriptInterpreter/Python/./ScriptInterpreterPythonTests/PythonDataObjectsTest.TestModuleNameResolutionNoDot (1098 of 2154)
PASS: lldb-unit :: Symbol/./SymbolTests/TestClangASTImporter.CompleteFwdDeclWithOtherOrigin (1099 of 2154)
PASS: lldb-shell :: SymbolFile/DWARF/dwarf5-debug_line.s (1100 of 2154)
PASS: lldb-shell :: SymbolFile/Breakpad/unwind-via-raSearch.test (1101 of 2154)
PASS: lldb-unit :: Utility/./UtilityTests/StringListTest.AppendListCStringArrayEmpty (1102 of 2154)
UNSUPPORTED: lldb-shell :: SymbolFile/PDB/type-quals.test (1103 of 2154)
PASS: lldb-unit :: Utility/./UtilityTests/StreamTest.PutMaxHex64ByteOrderLittle (1104 of 2154)
PASS: lldb-shell :: SymbolFile/symbol-binding.test (1105 of 2154)
PASS: lldb-api :: functionalities/data-formatter/data-formatter-objc/TestDataFormatterObjCNSError.py (1106 of 2154)
PASS: lldb-unit :: Symbol/./SymbolTests/TestClangASTImporter.CopyDeclTagDecl (1107 of 2154)
PASS: lldb-api :: functionalities/inferior-crashing/TestInferiorCrashingStep.py (1108 of 2154)
PASS: lldb-unit :: Symbol/./SymbolTests/Type.CompilerContextPattern (1109 of 2154)
PASS: lldb-unit :: ScriptInterpreter/Python/./ScriptInterpreterPythonTests/PythonDataObjectsTest.TestPythonListToStructuredList (1110 of 2154)
PASS: lldb-api :: lang/objc/objc-new-syntax/TestObjCNewSyntaxLiteral.py (1111 of 2154)
PASS: lldb-api :: python_api/process/TestProcessAPI.py (1112 of 2154)
PASS: lldb-api :: sanity/TestModuleCacheSanity.py (1113 of 2154)
PASS: lldb-unit :: Utility/./UtilityTests/GeneratorTest.YamlMultiProvider (1114 of 2154)
PASS: lldb-api :: functionalities/data-formatter/data-formatter-stl/libcxx/map/TestDataFormatterLibccMap.py (1115 of 2154)
PASS: lldb-api :: functionalities/jitloader_gdb/TestJITLoaderGDB.py (1116 of 2154)
PASS: lldb-unit :: Utility/./UtilityTests/StringListTest.ShiftStdString (1117 of 2154)
PASS: lldb-shell :: BuildScript/modes.test (1118 of 2154)
PASS: lldb-shell :: Breakpoint/debug_rnglist_offset_pair.test (1119 of 2154)
PASS: lldb-api :: commands/gui/viewlarge/TestGuiViewLarge.py (1120 of 2154)
PASS: lldb-unit :: Utility/./UtilityTests/ScalarTest.CastOperations (1121 of 2154)
UNSUPPORTED: lldb-api :: commands/register/register/aarch64_sve_registers/rw_access_static_config/TestSVERegisters.py (1122 of 2154)
PASS: lldb-unit :: Utility/./UtilityTests/ArgsTest.TestUnknownEscape (1123 of 2154)
PASS: lldb-api :: driver/batch_mode/TestBatchMode.py (1124 of 2154)
PASS: lldb-unit :: Utility/./UtilityTests/DataExtractorTest.GetCStrEmpty (1125 of 2154)
PASS: lldb-api :: lang/objcxx/cxx-bridged-po/TestObjCXXBridgedPO.py (1126 of 2154)
PASS: lldb-unit :: Language/Highlighting/./HighlighterTests/HighlighterTest.Colons (1127 of 2154)
PASS: lldb-unit :: ScriptInterpreter/Python/./ScriptInterpreterPythonTests/PythonDataObjectsTest.TestObjectAttributes (1128 of 2154)
UNSUPPORTED: lldb-shell :: SymbolFile/PDB/calling-conventions.test (1129 of 2154)
PASS: lldb-api :: functionalities/gdb_remote_client/TestTargetXMLArch.py (1130 of 2154)
PASS: lldb-api :: tools/lldb-vscode/variables/TestVSCode_variables.py (1131 of 2154)
PASS: lldb-unit :: Process/gdb-remote/./ProcessGdbRemoteTests/GDBRemoteClientBaseTest.SendContinueDelegateStructuredDataReceipt (1132 of 2154)
PASS: lldb-api :: types/TestShortType.py (1133 of 2154)
PASS: lldb-api :: commands/expression/persistent_ptr_update/TestPersistentPtrUpdate.py (1134 of 2154)
PASS: lldb-unit :: Process/minidump/./LLDBMinidumpTests/MinidumpParserTest.GetPid (1135 of 2154)
PASS: lldb-shell :: Commands/command-regex-unalias.test (1136 of 2154)
PASS: lldb-shell :: Reproducer/TestPythonImport.test (1137 of 2154)
PASS: lldb-unit :: Language/Highlighting/./HighlighterTests/HighlighterTest.Keywords (1138 of 2154)
PASS: lldb-shell :: ObjectFile/ELF/section-permissions.yaml (1139 of 2154)
PASS: lldb-unit :: Utility/./UtilityTests/FileSpecTest.PrependPathComponent (1140 of 2154)
PASS: lldb-api :: commands/expression/anonymous-struct/TestCallUserAnonTypedef.py (1141 of 2154)
PASS: lldb-shell :: SymbolFile/DWARF/find-function-regex.cpp (1142 of 2154)
PASS: lldb-unit :: Utility/./UtilityTests/StreamTest.AddressPrefix (1143 of 2154)
PASS: lldb-unit :: Utility/./UtilityTests/StringListTest.CopyListSingle (1144 of 2154)
PASS: lldb-api :: lang/cpp/operator-overload/TestOperatorOverload.py (1145 of 2154)
PASS: lldb-unit :: Utility/./UtilityTests/AnsiTerminal.Twice (1146 of 2154)
PASS: lldb-api :: commands/target/basic/TestTargetCommand.py (1147 of 2154)
PASS: lldb-api :: functionalities/completion/TestCompletion.py (1148 of 2154)
PASS: lldb-unit :: Utility/./UtilityTests/ArgsTest.GetQuotedCommandString (1149 of 2154)
UNSUPPORTED: lldb-api :: functionalities/darwin_log/filter/regex/activity/TestDarwinLogFilterRegexActivity.py (1150 of 2154)
PASS: lldb-unit :: Process/gdb-remote/./ProcessGdbRemoteTests/GDBRemoteCommunicationClientTest.SendStopTracePacket (1151 of 2154)
PASS: lldb-unit :: Disassembler/./DisassemblerTests/TestArmv7Disassembly.TestCortexFPDisass (1152 of 2154)
PASS: lldb-unit :: Process/minidump/./LLDBMinidumpTests/MinidumpParserTest.GetLinuxProcStatus (1153 of 2154)
PASS: lldb-api :: functionalities/thread/concurrent_events/TestConcurrentBreakpointDelayBreakpointOneSignal.py (1154 of 2154)
PASS: lldb-api :: functionalities/data-formatter/data-formatter-stl/libcxx/deque/TestDataFormatterLibcxxDeque.py (1155 of 2154)
PASS: lldb-api :: functionalities/tsan/global_location/TestTsanGlobalLocation.py (1156 of 2154)
PASS: lldb-api :: lang/cpp/function_refs/TestFunctionRefs.py (1157 of 2154)
PASS: lldb-api :: commands/apropos/with-process/TestAproposWithProcess.py (1158 of 2154)
PASS: lldb-shell :: Reproducer/TestDebugSymbols.test (1159 of 2154)
PASS: lldb-unit :: Utility/./UtilityTests/XcodeSDKTest.GetSDKTypeForTriple (1160 of 2154)
PASS: lldb-unit :: ScriptInterpreter/Python/./ScriptInterpreterPythonTests/PythonDataObjectsTest.TestPythonTupleValues (1161 of 2154)
PASS: lldb-api :: lang/cpp/bool/TestCPPBool.py (1162 of 2154)
PASS: lldb-api :: functionalities/data-formatter/data-formatter-named-summaries/TestDataFormatterNamedSummaries.py (1163 of 2154)
PASS: lldb-unit :: UnwindAssembly/x86/./UnwindAssemblyx86Tests/Testx86AssemblyInspectionEngine.TestDisassemblyMidFunctionEpilogues (1164 of 2154)
PASS: lldb-api :: functionalities/thread/concurrent_events/TestConcurrentCrashWithSignal.py (1165 of 2154)
PASS: lldb-unit :: Utility/./UtilityTests/SubsystemRAIITest.SubsystemWithErrorFailure (1166 of 2154)
PASS: lldb-unit :: Host/./HostTests/Host.GetEnvironment (1167 of 2154)
PASS: lldb-api :: lang/c/array_types/TestArrayTypes.py (1168 of 2154)
PASS: lldb-api :: lang/cpp/nsimport/TestCppNsImport.py (1169 of 2154)
PASS: lldb-unit :: Utility/./UtilityTests/StringListTest.ShiftMove (1170 of 2154)
PASS: lldb-unit :: Process/minidump/./LLDBMinidumpTests/MinidumpParserTest.GetFilteredModuleList (1171 of 2154)
PASS: lldb-unit :: Utility/./UtilityTests/StreamTest.PutSLEB128 (1172 of 2154)
PASS: lldb-unit :: UnwindAssembly/x86/./UnwindAssemblyx86Tests/Testx86AssemblyInspectionEngine.TestMovRSPtoRBP (1173 of 2154)
PASS: lldb-api :: python_api/lldbutil/iter/TestLLDBIterator.py (1174 of 2154)
PASS: lldb-unit :: Utility/./UtilityTests/ArgsTest.TestOverwriteArgs (1175 of 2154)
PASS: lldb-shell :: ObjectFile/ELF/avr-basic-info.yaml (1176 of 2154)
UNSUPPORTED: lldb-shell :: Reproducer/TestLuaImport.test (1177 of 2154)
PASS: lldb-shell :: Driver/TestFile.test (1178 of 2154)
PASS: lldb-unit :: DataFormatter/./LLDBFormatterTests/FormatManagerTests.CompatibleLangs (1179 of 2154)
UNSUPPORTED: lldb-api :: functionalities/data-formatter/data-formatter-stl/libstdcpp/string/TestDataFormatterStdString.py (1180 of 2154)
PASS: lldb-unit :: Utility/./UtilityTests/BinaryStreamTest.PutULEB128One (1181 of 2154)
PASS: lldb-api :: lang/cpp/incomplete-types/TestCppIncompleteTypes.py (1182 of 2154)
PASS: lldb-api :: lang/cpp/constructors/TestCppConstructors.py (1183 of 2154)
PASS: lldb-unit :: Language/Highlighting/./HighlighterTests/HighlighterTest.ClangCursorPosAfterOtherToken (1184 of 2154)
PASS: lldb-shell :: BuildScript/toolchain-clang.test (1185 of 2154)
PASS: lldb-api :: functionalities/inferior-crashing/recursive-inferior/TestRecursiveInferiorStep.py (1186 of 2154)
PASS: lldb-unit :: Core/./LLDBCoreTests/MangledTest.ResultForValidName (1187 of 2154)
PASS: lldb-api :: commands/frame/diagnose/complicated-expression/TestComplicatedExpression.py (1188 of 2154)
PASS: lldb-unit :: Utility/./UtilityTests/VMRange.Comparison (1189 of 2154)
PASS: lldb-api :: functionalities/postmortem/wow64_minidump/TestWow64MiniDump.py (1190 of 2154)
PASS: lldb-shell :: Commands/CommandScriptImmediateOutput/CommandScriptImmediateOutputFile.test (1191 of 2154)
PASS: lldb-unit :: Utility/./UtilityTests/ArchSpecTest.TestSetTriple (1192 of 2154)
PASS: lldb-api :: lang/cpp/dynamic-value-same-basename/TestDynamicValueSameBase.py (1193 of 2154)
UNSUPPORTED: lldb-api :: tools/lldb-vscode/disconnect/TestVSCode_disconnect.py (1194 of 2154)
PASS: lldb-unit :: ObjectFile/Breakpad/./ObjectFileBreakpadTests/PublicRecord.parse (1195 of 2154)
PASS: lldb-unit :: UnwindAssembly/x86/./UnwindAssemblyx86Tests/Testx86AssemblyInspectionEngine.TestPushRBP (1196 of 2154)
PASS: lldb-unit :: Utility/./UtilityTests/Flags.AnySet (1197 of 2154)
PASS: lldb-api :: macosx/find-dsym/deep-bundle/TestDeepBundle.py (1198 of 2154)
PASS: lldb-api :: functionalities/data-formatter/data-formatter-stl/libcxx/list/TestDataFormatterLibcxxList.py (1199 of 2154)
PASS: lldb-unit :: UnwindAssembly/x86/./UnwindAssemblyx86Tests/Testx86AssemblyInspectionEngine.TestPushR12 (1200 of 2154)
PASS: lldb-api :: functionalities/inline-stepping/TestInlineStepping.py (1201 of 2154)
PASS: lldb-unit :: Utility/./UtilityTests/ScalarTest.ComparisonFloat (1202 of 2154)
PASS: lldb-unit :: Process/minidump/./LLDBMinidumpTests/RegisterContextMinidump.ConvertMinidumpContext_x86_32 (1203 of 2154)
PASS: lldb-unit :: Target/./TargetTests/StackFrameRecognizerTest.NullModuleRegex (1204 of 2154)
PASS: lldb-api :: functionalities/set-data/TestSetData.py (1205 of 2154)
PASS: lldb-api :: api/multiple-targets/TestMultipleTargets.py (1206 of 2154)
PASS: lldb-api :: functionalities/data-formatter/data-formatter-stl/libcxx/function/TestLibCxxFunction.py (1207 of 2154)
PASS: lldb-unit :: Process/gdb-remote/./ProcessGdbRemoteTests/GDBRemoteCommunicationClientTest.SyncThreadState (1208 of 2154)
PASS: lldb-unit :: Utility/./UtilityTests/StreamTest.PutHex64ByteOrderLittle (1209 of 2154)
PASS: lldb-unit :: Utility/./UtilityTests/ConstStringTest.MangledCounterpart (1210 of 2154)
PASS: lldb-api :: commands/expression/issue_11588/Test11588.py (1211 of 2154)
PASS: lldb-api :: lang/cpp/accelerator-table/TestCPPAccelerator.py (1212 of 2154)
PASS: lldb-unit :: Utility/./UtilityTests/DataExtractorTest.GetMaxU64 (1213 of 2154)
PASS: lldb-unit :: Process/gdb-remote/./ProcessGdbRemoteTests/GDBRemoteClientBaseTest.SendContinueAndInterrupt (1214 of 2154)
PASS: lldb-unit :: Host/./HostTests/MainLoopTest.DetectsEOF (1215 of 2154)
PASS: lldb-api :: lang/objc/blocks/TestObjCIvarsInBlocks.py (1216 of 2154)
PASS: lldb-api :: tools/lldb-server/TestGdbRemoteThreadsInStopReply.py (1217 of 2154)
UNSUPPORTED: lldb-shell :: Register/x86-zmm-write.test (1218 of 2154)
PASS: lldb-shell :: SymbolFile/DWARF/dir-separator-no-comp-dir.s (1219 of 2154)
PASS: lldb-api :: commands/frame/var/TestFrameVar.py (1220 of 2154)
PASS: lldb-shell :: Reproducer/Functionalities/TestExpressionEvaluation.test (1221 of 2154)
PASS: lldb-api :: commands/expression/import-std-module/queue/TestQueueFromStdModule.py (1222 of 2154)
PASS: lldb-unit :: Utility/./UtilityTests/OptionsWithRawTest.QuotedSuffix (1223 of 2154)
PASS: lldb-api :: python_api/sbenvironment/TestSBEnvironment.py (1224 of 2154)
PASS: lldb-unit :: Utility/./UtilityTests/StringExtractorTest.GetHexBytesAvail_OddPair2 (1225 of 2154)
PASS: lldb-api :: api/log/TestAPILog.py (1226 of 2154)
PASS: lldb-unit :: Symbol/./SymbolTests/TestTypeSystemClang.TestFunctionTemplateInRecordConstruction (1227 of 2154)
PASS: lldb-api :: commands/thread/select/TestThreadSelect.py (1228 of 2154)
PASS: lldb-api :: python_api/symbol-context/TestSymbolContext.py (1229 of 2154)
PASS: lldb-shell :: SymbolFile/NativePDB/ast-functions.cpp (1230 of 2154)
PASS: lldb-api :: functionalities/data-formatter/data-formatter-objc/TestDataFormatterObjCExpr.py (1231 of 2154)
PASS: lldb-unit :: Utility/./UtilityTests/RangeDataVector.FindEntryIndexesThatContain_Overlap (1232 of 2154)
PASS: lldb-api :: functionalities/history/TestHistoryRecall.py (1233 of 2154)
PASS: lldb-api :: commands/command/script/TestCommandScript.py (1234 of 2154)
PASS: lldb-unit :: Symbol/./SymbolTests/TestClangASTImporter.MetadataPropagationAfterCopying (1235 of 2154)
PASS: lldb-api :: commands/reproducer/invalid-args/TestInvalidArgsReproducer.py (1236 of 2154)
PASS: lldb-api :: functionalities/data-formatter/data-formatter-objc/TestDataFormatterObjCNSURL.py (1237 of 2154)
PASS: lldb-api :: functionalities/thread/concurrent_events/TestConcurrentNWatchNBreak.py (1238 of 2154)
PASS: lldb-unit :: Process/gdb-remote/./ProcessGdbRemoteTests/GDBRemoteClientBaseTest.SendContinueAndLateInterrupt (1239 of 2154)
PASS: lldb-unit :: Utility/./UtilityTests/StringExtractorTest.GetHexBytes_Partial (1240 of 2154)
PASS: lldb-api :: commands/frame/diagnose/dereference-function-return/TestDiagnoseDereferenceFunctionReturn.py (1241 of 2154)
PASS: lldb-unit :: Utility/./UtilityTests/StatusTest.ErrorConversion (1242 of 2154)
PASS: lldb-api :: functionalities/data-formatter/data-formatter-synthval/TestDataFormatterSynthVal.py (1243 of 2154)
PASS: lldb-api :: functionalities/recursion/TestValueObjectRecursion.py (1244 of 2154)
PASS: lldb-unit :: Utility/./UtilityTests/LogTest.Register (1245 of 2154)
PASS: lldb-unit :: Utility/./UtilityTests/FileSpecTest.CopyByAppendingPathComponent (1246 of 2154)
UNSUPPORTED: lldb-api :: functionalities/darwin_log/filter/regex/subsystem/TestDarwinLogFilterRegexSubsystem.py (1247 of 2154)
PASS: lldb-api :: commands/expression/pr35310/TestExprsBug35310.py (1248 of 2154)
PASS: lldb-unit :: Utility/./UtilityTests/StringExtractorTest.GetHexU8_Exact (1249 of 2154)
PASS: lldb-api :: functionalities/tail_call_frames/inlining_and_tail_calls/TestInliningAndTailCalls.py (1250 of 2154)
PASS: lldb-unit :: Utility/./UtilityTests/StringLexerTest.HasAtLeast (1251 of 2154)
PASS: lldb-api :: lang/cpp/namespace_conflicts/TestNamespaceConflicts.py (1252 of 2154)
PASS: lldb-shell :: ObjectFile/ELF/minidebuginfo-corrupt-xz.yaml (1253 of 2154)
PASS: lldb-unit :: Symbol/./SymbolTests/TestTypeSystemClang.TestUnifyAccessSpecifiers (1254 of 2154)
PASS: lldb-unit :: Host/./HostTests/HostInfoTest.GetAugmentedArchSpec (1255 of 2154)
PASS: lldb-api :: functionalities/data-formatter/language_category_updates/TestDataFormatterLanguageCategoryUpdates.py (1256 of 2154)
PASS: lldb-api :: functionalities/gdb_remote_client/TestJLink6Armv7RegisterDefinition.py (1257 of 2154)
PASS: lldb-unit :: Symbol/./SymbolTests/TestTypeSystemClang.TestGetTypeClassNested (1258 of 2154)
PASS: lldb-api :: functionalities/breakpoint/breakpoint_names/TestBreakpointNames.py (1259 of 2154)
PASS: lldb-api :: functionalities/breakpoint/breakpoint_by_file_colon_line/TestBreakpointByFileColonLine.py (1260 of 2154)
PASS: lldb-unit :: Utility/./UtilityTests/StreamTest.PutNHex8 (1261 of 2154)
PASS: lldb-unit :: ObjectFile/Breakpad/./ObjectFileBreakpadTests/ModuleRecord.parse (1262 of 2154)
PASS: lldb-api :: types/TestFloatTypes.py (1263 of 2154)
PASS: lldb-shell :: SymbolFile/DWARF/clang-ast-from-dwarf-objc-property.m (1264 of 2154)
PASS: lldb-shell :: SymbolFile/Breakpad/line-table-edgecases.test (1265 of 2154)
PASS: lldb-unit :: Utility/./UtilityTests/StreamTest.AddressRangeSize (1266 of 2154)
PASS: lldb-unit :: ObjectFile/Breakpad/./ObjectFileBreakpadTests/LineRecord.parse (1267 of 2154)
PASS: lldb-api :: functionalities/thread_plan/TestThreadPlanCommands.py (1268 of 2154)
PASS: lldb-unit :: Utility/./UtilityTests/UriParserTest.BracketedHostnameWithColon (1269 of 2154)
PASS: lldb-unit :: Utility/./UtilityTests/StreamTest.ShiftOperatorChars (1270 of 2154)
PASS: lldb-unit :: Symbol/./SymbolTests/TestClangASTImporter.RecordLayout (1271 of 2154)
PASS: lldb-api :: commands/frame/diagnose/dereference-argument/TestDiagnoseDereferenceArgument.py (1272 of 2154)
PASS: lldb-api :: functionalities/memory-region/TestMemoryRegion.py (1273 of 2154)
PASS: lldb-api :: functionalities/gdb_remote_client/TestWasm.py (1274 of 2154)
PASS: lldb-unit :: ScriptInterpreter/Python/./ScriptInterpreterPythonTests/PythonDataObjectsTest.TestPythonByteArray (1275 of 2154)
UNSUPPORTED: lldb-shell :: ScriptInterpreter/Lua/lua.test (1276 of 2154)
PASS: lldb-unit :: Utility/./UtilityTests/ReproducerTest.SetReplay (1277 of 2154)
PASS: lldb-unit :: Utility/./UtilityTests/RangeTest.NotEqualInvalid (1278 of 2154)
UNSUPPORTED: lldb-shell :: ScriptInterpreter/Lua/breakpoint_callback.test (1279 of 2154)
PASS: lldb-api :: commands/watchpoints/watchpoint_events/TestWatchpointEvents.py (1280 of 2154)
PASS: lldb-unit :: Expression/./ExpressionTests/ClangExpressionDeclMapTest.TestUnknownIdentifierLookup (1281 of 2154)
PASS: lldb-api :: functionalities/gdb_remote_client/TestWriteMemory.py (1282 of 2154)
PASS: lldb-unit :: Utility/./UtilityTests/UriParserTest.BracketedHostname (1283 of 2154)
PASS: lldb-unit :: DataFormatter/./LLDBFormatterTests/TypeMatcherTests.CreatedBySameMatchStringExactNamePrefixes (1284 of 2154)
PASS: lldb-api :: lang/cpp/dynamic-value/TestCppValueCast.py (1285 of 2154)
PASS: lldb-unit :: Signals/./SignalsTests/UnixSignalsTest.GetFilteredSignals (1286 of 2154)
PASS: lldb-api :: commands/expression/inline-namespace/TestInlineNamespace.py (1287 of 2154)
PASS: lldb-api :: functionalities/thread/concurrent_events/TestConcurrentCrashWithWatchpointBreakpointSignal.py (1288 of 2154)
UNSUPPORTED: lldb-api :: functionalities/darwin_log/source/debug/TestDarwinLogSourceDebug.py (1289 of 2154)
PASS: lldb-api :: lang/objc/foundation/TestObjectDescriptionAPI.py (1290 of 2154)
PASS: lldb-api :: lang/objc/conflicting-definition/TestConflictingDefinition.py (1291 of 2154)
PASS: lldb-unit :: Utility/./UtilityTests/StreamTeeTest.SetStreamAtIndexOutOfBounds (1292 of 2154)
PASS: lldb-unit :: Utility/./UtilityTests/RangeTest.SizeTypes (1293 of 2154)
PASS: lldb-unit :: Utility/./UtilityTests/StreamTeeTest.Assignment (1294 of 2154)
UNSUPPORTED: lldb-shell :: SymbolFile/NativePDB/ast-functions-msvc.cpp (1295 of 2154)
PASS: lldb-unit :: UnwindAssembly/x86/./UnwindAssemblyx86Tests/Testx86AssemblyInspectionEngine.TestPushRBX (1296 of 2154)
PASS: lldb-unit :: Utility/./UtilityTests/ScalarTest.Getters (1297 of 2154)
PASS: lldb-unit :: Process/minidump/./LLDBMinidumpTests/MinidumpParserTest.MinidumpModuleOrder (1298 of 2154)
PASS: lldb-unit :: Utility/./UtilityTests/BroadcasterTest.EventTypeHasListeners (1299 of 2154)
PASS: lldb-unit :: Process/gdb-remote/./ProcessGdbRemoteTests/GDBRemoteCommunicationClientTest.SendGetMetaDataPacket (1300 of 2154)
PASS: lldb-api :: lang/cpp/exceptions/TestCPPExceptionBreakpoints.py (1301 of 2154)
PASS: lldb-api :: functionalities/breakpoint/hardware_breakpoints/require_hw_breakpoints/TestRequireHWBreakpoints.py (1302 of 2154)
PASS: lldb-unit :: Utility/./UtilityTests/UUIDTest.Validity (1303 of 2154)
UNSUPPORTED: lldb-api :: functionalities/data-formatter/data-formatter-stl/libstdcpp/map/TestDataFormatterStdMap.py (1304 of 2154)
PASS: lldb-api :: commands/expression/class_template_specialization_empty_pack/TestClassTemplateSpecializationParametersHandling.py (1305 of 2154)
PASS: lldb-unit :: Utility/./UtilityTests/StringListTest.DefaultConstructor (1306 of 2154)
PASS: lldb-unit :: Symbol/./SymbolTests/TestTypeSystemClang.TestDisplayName (1307 of 2154)
PASS: lldb-shell :: ObjectFile/PECOFF/sections-names.yaml (1308 of 2154)
PASS: lldb-api :: lang/cpp/overloaded-functions/TestOverloadedFunctions.py (1309 of 2154)
PASS: lldb-api :: tools/lldb-vscode/runInTerminal/TestVSCode_runInTerminal.py (1310 of 2154)
PASS: lldb-unit :: Expression/./ExpressionTests/DiagnosticManagerTest.GetStringSeverityLabels (1311 of 2154)
UNSUPPORTED: lldb-api :: benchmarks/stepping/TestSteppingSpeed.py (1312 of 2154)
PASS: lldb-shell :: Quit/TestQuitExitCodeTooManyArgs.test (1313 of 2154)
PASS: lldb-unit :: Utility/./UtilityTests/RangeTest.DefaultConstructor (1314 of 2154)
PASS: lldb-unit :: Utility/./UtilityTests/SerializationRountripTest.SerializeDeserializeCStringArrayNullptr (1315 of 2154)
PASS: lldb-api :: commands/help/TestHelp.py (1316 of 2154)
PASS: lldb-api :: lang/objc/objc-ivar-protocols/TestIvarProtocols.py (1317 of 2154)
PASS: lldb-unit :: Utility/./UtilityTests/ArchSpecTest.MergeFrom (1318 of 2154)
PASS: lldb-api :: lang/cpp/namespace_definitions/TestNamespaceDefinitions.py (1319 of 2154)
PASS: lldb-api :: functionalities/data-formatter/pyobjsynthprovider/TestPyObjSynthProvider.py (1320 of 2154)
PASS: lldb-api :: tools/lldb-server/TestGdbRemoteExitCode.py (1321 of 2154)
PASS: lldb-unit :: Utility/./UtilityTests/ScalarTest.SetValueFromData (1322 of 2154)
PASS: lldb-unit :: Utility/./UtilityTests/StringListTest.AppendStringStdString (1323 of 2154)
PASS: lldb-api :: tools/lldb-server/TestAppleSimulatorOSType.py (1324 of 2154)
PASS: lldb-api :: commands/expression/call-function/TestCallStopAndContinue.py (1325 of 2154)
PASS: lldb-api :: functionalities/load_using_paths/TestLoadUsingPaths.py (1326 of 2154)
PASS: lldb-api :: functionalities/dead-strip/TestDeadStrip.py (1327 of 2154)
PASS: lldb-unit :: Core/./LLDBCoreTests/ModuleSpecTest.TestELFFile (1328 of 2154)
PASS: lldb-api :: commands/expression/entry-bp/TestExprEntryBP.py (1329 of 2154)
PASS: lldb-shell :: Driver/TestRepl.test (1330 of 2154)
PASS: lldb-api :: lang/objc/objc-checker/TestObjCCheckers.py (1331 of 2154)
PASS: lldb-api :: functionalities/inferior-assert/TestInferiorAssert.py (1332 of 2154)
PASS: lldb-api :: lang/cpp/bitfields/TestCppBitfields.py (1333 of 2154)
PASS: lldb-unit :: Utility/./UtilityTests/StringExtractorTest.DecodeHexU8_Underflow2 (1334 of 2154)
PASS: lldb-unit :: DataFormatter/./LLDBFormatterTests/StringPrinterTests.CxxASCII (1335 of 2154)
PASS: lldb-api :: commands/expression/namespace_local_var_same_name_cpp_and_c/TestNamespaceLocalVarSameNameCppAndC.py (1336 of 2154)
PASS: lldb-shell :: ObjectFile/PECOFF/disassemble-thumb.yaml (1337 of 2154)
PASS: lldb-unit :: Utility/./UtilityTests/OptionsWithRawTest.EmptySuffixSingleWhitespace (1338 of 2154)
PASS: lldb-api :: functionalities/thread/concurrent_events/TestConcurrentWatchpointWithDelayWatchpointThreads.py (1339 of 2154)
PASS: lldb-shell :: Breakpoint/debug_rnglist_basic.test (1340 of 2154)
PASS: lldb-shell :: Driver/TestHelp.test (1341 of 2154)
PASS: lldb-api :: lang/cpp/template-specialization-type/TestTemplateSpecializationType.py (1342 of 2154)
PASS: lldb-api :: functionalities/thread/thread_specific_break/TestThreadSpecificBreakpoint.py (1343 of 2154)
PASS: lldb-unit :: UnwindAssembly/x86/./UnwindAssemblyx86Tests/Testx86AssemblyInspectionEngine.TestPopEBP (1344 of 2154)
PASS: lldb-shell :: Reproducer/Functionalities/TestStepping.test (1345 of 2154)
PASS: lldb-api :: functionalities/signal/raise/TestRaise.py (1346 of 2154)
PASS: lldb-api :: types/TestIntegerType.py (1347 of 2154)
PASS: lldb-api :: commands/add-dsym/uuid/TestAddDsymCommand.py (1348 of 2154)
PASS: lldb-api :: commands/expression/unicode-in-variable/TestUnicodeInVariable.py (1349 of 2154)
PASS: lldb-api :: python_api/lldbutil/TestSwigVersion.py (1350 of 2154)
PASS: lldb-api :: commands/process/launch-with-shellexpand/TestLaunchWithShellExpand.py (1351 of 2154)
UNSUPPORTED: lldb-api :: functionalities/longjmp/TestLongjmp.py (1352 of 2154)
PASS: lldb-unit :: Utility/./UtilityTests/FileSpecTest.AppendPathComponent (1353 of 2154)
PASS: lldb-unit :: Process/minidump/./LLDBMinidumpTests/MinidumpParserTest.GetThreadContext_x86_64 (1354 of 2154)
PASS: lldb-unit :: Utility/./UtilityTests/StringListTest.JoinMultiCharSeparator (1355 of 2154)
PASS: lldb-unit :: Utility/./UtilityTests/StringListTest.InsertStringAtIndexEnd (1356 of 2154)
PASS: lldb-api :: functionalities/data-formatter/data-formatter-stl/libcxx/variant/TestDataFormatterLibcxxVariant.py (1357 of 2154)
PASS: lldb-unit :: Utility/./UtilityTests/ArgsTest.EscapeLLDBCommandArgument (1358 of 2154)
PASS: lldb-unit :: Utility/./UtilityTests/ScalarTest.Scalar_512 (1359 of 2154)
PASS: lldb-api :: functionalities/data-formatter/data-formatter-stl/libcxx/multiset/TestDataFormatterLibcxxMultiSet.py (1360 of 2154)
PASS: lldb-shell :: SymbolFile/DWARF/debug-types-dwarf5.s (1361 of 2154)
PASS: lldb-unit :: Utility/./UtilityTests/BinaryStreamTest.PutSLEB128OneByte (1362 of 2154)
PASS: lldb-unit :: Process/minidump/./LLDBMinidumpTests/MinidumpParserTest.FindMemoryRange (1363 of 2154)
PASS: lldb-unit :: Expression/./ExpressionTests/CppModuleConfigurationTest.UnrelatedLibrary (1364 of 2154)
PASS: lldb-api :: commands/target/create-deps/TestTargetCreateDeps.py (1365 of 2154)
PASS: lldb-api :: commands/expression/completion/TestExprCompletion.py (1366 of 2154)
PASS: lldb-unit :: Utility/./UtilityTests/RecordReplayTest.InstrumentedBarRef (1367 of 2154)
UNSUPPORTED: lldb-api :: tools/lldb-server/TestGdbRemoteAuxvSupport.py (1368 of 2154)
PASS: lldb-api :: functionalities/tsan/thread_leak/TestTsanThreadLeak.py (1369 of 2154)
PASS: lldb-shell :: SymbolFile/NativePDB/nested-types.cpp (1370 of 2154)
PASS: lldb-unit :: Utility/./UtilityTests/StringExtractorTest.GetHexBytesAvail_FullString (1371 of 2154)
PASS: lldb-unit :: Utility/./UtilityTests/StreamTest.ShiftOperatorStrings (1372 of 2154)
PASS: lldb-api :: python_api/process/read-mem-cstring/TestReadMemCString.py (1373 of 2154)
PASS: lldb-api :: functionalities/postmortem/minidump-new/TestMiniDumpNew.py (1374 of 2154)
PASS: lldb-unit :: Utility/./UtilityTests/DataExtractorTest.GetMaxU64_unchecked (1375 of 2154)
PASS: lldb-api :: commands/settings/use_source_cache/TestUseSourceCache.py (1376 of 2154)
PASS: lldb-shell :: SymbolFile/NativePDB/globals-bss.cpp (1377 of 2154)
PASS: lldb-api :: lang/c/local_variables/TestLocalVariables.py (1378 of 2154)
PASS: lldb-unit :: Utility/./UtilityTests/GeneratorTest.Get (1379 of 2154)
PASS: lldb-api :: commands/command/script_alias/TestCommandScriptAlias.py (1380 of 2154)
PASS: lldb-unit :: Core/./LLDBCoreTests/SourceFileCache.FindSourceFileFound (1381 of 2154)
PASS: lldb-api :: lang/objc/variadic_methods/TestVariadicMethods.py (1382 of 2154)
UNSUPPORTED: lldb-shell :: SymbolFile/DWARF/debug-types-expressions.test (1383 of 2154)
UNSUPPORTED: lldb-shell :: SymbolFile/target-symbols-add-unwind.test (1384 of 2154)
PASS: lldb-unit :: Host/./HostTests/File.GetWaitableHandleFileno (1385 of 2154)
PASS: lldb-api :: functionalities/data-formatter/dump_dynamic/TestDumpDynamic.py (1386 of 2154)
PASS: lldb-unit :: debugserver/./debugserverTests/JSON.Parse (1387 of 2154)
PASS: lldb-api :: functionalities/data-formatter/data-formatter-objc/TestDataFormatterObjCCF.py (1388 of 2154)
PASS: lldb-api :: lang/cpp/extern_c/TestExternCSymbols.py (1389 of 2154)
PASS: lldb-shell :: Quit/TestQuitExitCodeHexA.test (1390 of 2154)
UNSUPPORTED: lldb-api :: commands/watchpoints/variable_out_of_scope/TestWatchedVarHitWhenInScope.py (1391 of 2154)
PASS: lldb-unit :: Utility/./UtilityTests/NameMatchesTest.RegularExpression (1392 of 2154)
PASS: lldb-api :: functionalities/multiword-commands/TestMultiWordCommands.py (1393 of 2154)
PASS: lldb-unit :: Process/gdb-remote/./ProcessGdbRemoteTests/GDBRemoteCommunicationServerTest.SendErrorResponse_Status (1394 of 2154)
PASS: lldb-unit :: UnwindAssembly/ARM64/./Arm64InstEmulationTests/TestArm64InstEmulation.TestFramelessThreeEpilogueFunction (1395 of 2154)
PASS: lldb-unit :: Symbol/./SymbolTests/PostfixExpression.ParseFPOProgram (1396 of 2154)
PASS: lldb-shell :: ObjectFile/PECOFF/export-dllfunc.yaml (1397 of 2154)
PASS: lldb-unit :: Language/Highlighting/./HighlighterTests/HighlighterTest.ClangIdentifiers (1398 of 2154)
PASS: lldb-unit :: Target/./TargetTests/ExecutionContextTest.GetByteOrderProcess (1399 of 2154)
PASS: lldb-unit :: Utility/./UtilityTests/ArgsTest.BareSingleQuote (1400 of 2154)
PASS: lldb-api :: python_api/process/io/TestProcessIO.py (1401 of 2154)
PASS: lldb-unit :: Host/./HostTests/SocketTest.TCPGetAddress (1402 of 2154)
PASS: lldb-unit :: UnwindAssembly/ARM64/./Arm64InstEmulationTests/TestArm64InstEmulation.TestSimpleDarwinFunction (1403 of 2154)
PASS: lldb-api :: lang/objc/modules-auto-import/TestModulesAutoImport.py (1404 of 2154)
PASS: lldb-api :: functionalities/memory/read/TestMemoryRead.py (1405 of 2154)
PASS: lldb-api :: types/TestLongTypesExpr.py (1406 of 2154)
UNSUPPORTED: lldb-api :: android/platform/TestDefaultCacheLineSize.py (1407 of 2154)
UNSUPPORTED: lldb-shell :: Register/x86-64-gp-write.test (1408 of 2154)
PASS: lldb-shell :: Minidump/Windows/Sigsegv/sigsegv.test (1409 of 2154)
PASS: lldb-unit :: Platform/./LLDBPlatformTests/PlatformAppleSimulatorTest.TestHostPlatformToSim (1410 of 2154)
UNSUPPORTED: lldb-api :: commands/watchpoints/multi_watchpoint_slots/TestWatchpointMultipleSlots.py (1411 of 2154)
PASS: lldb-api :: commands/expression/import-std-module/deque-basic/TestDequeFromStdModule.py (1412 of 2154)
PASS: lldb-api :: commands/watchpoints/watchpoint_count/TestWatchpointCount.py (1413 of 2154)
PASS: lldb-unit :: Process/minidump/./LLDBMinidumpTests/MinidumpParserTest.GetMemory (1414 of 2154)
PASS: lldb-shell :: Settings/TestDisableColor.test (1415 of 2154)
PASS: lldb-api :: lang/cpp/template-function/TestTemplateFunctions.py (1416 of 2154)
PASS: lldb-api :: api/listeners/TestListener.py (1417 of 2154)
PASS: lldb-shell :: ObjectFile/PECOFF/sections.yaml (1418 of 2154)
UNSUPPORTED: lldb-api :: functionalities/data-formatter/data-formatter-stl/libstdcpp/list/TestDataFormatterStdList.py (1419 of 2154)
PASS: lldb-unit :: Host/./HostTests/NativeProcessProtocolTest.SetBreakpointFailVerify (1420 of 2154)
PASS: lldb-unit :: Utility/./UtilityTests/EnvironmentTest.EnvpConstruction (1421 of 2154)
UNSUPPORTED: lldb-api :: benchmarks/turnaround/TestCompileRunToBreakpointTurnaround.py (1422 of 2154)
PASS: lldb-unit :: Utility/./UtilityTests/RangeTest.DoesAdjoinOrIntersect (1423 of 2154)
PASS: lldb-api :: commands/frame/diagnose/local-variable/TestLocalVariable.py (1424 of 2154)
PASS: lldb-shell :: SymbolFile/DWARF/debug-types-signature-loop.s (1425 of 2154)
PASS: lldb-api :: tools/lldb-server/inferior-crash/TestGdbRemoteSegFault.py (1426 of 2154)
PASS: lldb-shell :: ObjectFile/MachO/lc_build_version.yaml (1427 of 2154)
PASS: lldb-api :: api/check_public_api_headers/TestPublicAPIHeaders.py (1428 of 2154)
PASS: lldb-unit :: Utility/./UtilityTests/ScalarTest.Comparison (1429 of 2154)
PASS: lldb-api :: commands/expression/import_base_class_when_class_has_derived_member/TestImportBaseClassWhenClassHasDerivedMember.py (1430 of 2154)
UNSUPPORTED: lldb-api :: commands/register/register/intel_xtended_registers/mpx_offset_intersection/TestMPXOffsetIntersection.py (1431 of 2154)
PASS: lldb-shell :: SymbolFile/Breakpad/unwind-via-stack-win-no-memory-info.yaml (1432 of 2154)
PASS: lldb-api :: functionalities/thread/concurrent_events/TestConcurrentTwoBreakpointThreads.py (1433 of 2154)
PASS: lldb-unit :: UnwindAssembly/x86/./UnwindAssemblyx86Tests/Testx86AssemblyInspectionEngine.TestSubRSP (1434 of 2154)
PASS: lldb-unit :: Utility/./UtilityTests/RegularExpression.CopyAssignment (1435 of 2154)
PASS: lldb-unit :: Process/gdb-remote/./ProcessGdbRemoteTests/GDBRemoteCommunicationServerTest.SendErrorResponse_StringError (1436 of 2154)
PASS: lldb-unit :: Utility/./UtilityTests/ArgsTest.Yaml (1437 of 2154)
PASS: lldb-unit :: Utility/./UtilityTests/PassiveReplayTest.InstrumentedBarRef (1438 of 2154)
PASS: lldb-api :: lang/objc/objc-optimized/TestObjcOptimized.py (1439 of 2154)
PASS: lldb-shell :: ObjectFile/Breakpad/uuid-matching-mac.test (1440 of 2154)
PASS: lldb-api :: functionalities/thread/concurrent_events/TestConcurrentManyWatchpoints.py (1441 of 2154)
PASS: lldb-unit :: Utility/./UtilityTests/StreamTest.PutHex64ByteOrderBig (1442 of 2154)
PASS: lldb-shell :: SymbolFile/DWARF/find-qualified-variable.cpp (1443 of 2154)
PASS: lldb-unit :: Utility/./UtilityTests/ArchSpecTest.YAML (1444 of 2154)
PASS: lldb-unit :: Symbol/./SymbolTests/TestClangASTImporter.DeportTypeTagDecl (1445 of 2154)
PASS: lldb-unit :: Utility/./UtilityTests/StreamTeeTest.Write (1446 of 2154)
PASS: lldb-unit :: Interpreter/./InterpreterTests/CompletionTest.DirCompletionUsername (1447 of 2154)
PASS: lldb-unit :: Utility/./UtilityTests/RangeDataVector.CustomSort (1448 of 2154)
PASS: lldb-unit :: Utility/./UtilityTests/TimerTest.CategoryTimes2 (1449 of 2154)
PASS: lldb-api :: python_api/disassemble-raw-data/TestDisassemble_VST1_64.py (1450 of 2154)
PASS: lldb-api :: commands/expression/import-std-module/vector-of-vectors/TestVectorOfVectorsFromStdModule.py (1451 of 2154)
PASS: lldb-api :: commands/breakpoint/command/list/TestBreakpointCommandList.py (1452 of 2154)
PASS: lldb-unit :: Utility/./UtilityTests/DataExtractorTest.GetDouble (1453 of 2154)
PASS: lldb-api :: lang/cpp/multiple-inheritance/TestCppMultipleInheritance.py (1454 of 2154)
PASS: lldb-api :: lang/objc/objc-new-syntax/TestObjCNewSyntaxArray.py (1455 of 2154)
PASS: lldb-unit :: Utility/./UtilityTests/StringExtractorTest.GetHexBytesAvail_Underflow (1456 of 2154)
PASS: lldb-api :: lang/c/record_decl_in_expr/TestRecordDeclInExpr.py (1457 of 2154)
PASS: lldb-unit :: Utility/./UtilityTests/AnsiTerminal.Basic (1458 of 2154)
PASS: lldb-api :: functionalities/gdb_remote_client/TestRestartBug.py (1459 of 2154)
UNSUPPORTED: lldb-api :: functionalities/darwin_log/format/TestDarwinLogMessageFormat.py (1460 of 2154)
PASS: lldb-api :: lang/cpp/thread_local/TestThreadLocal.py (1461 of 2154)
PASS: lldb-unit :: Utility/./UtilityTests/BinaryStreamTest.PutULEB128SevenBytes (1462 of 2154)
PASS: lldb-unit :: Utility/./UtilityTests/StringExtractorTest.GetHexU8_InvalidHex (1463 of 2154)
PASS: lldb-unit :: Language/Highlighting/./HighlighterTests/HighlighterTest.ClangPreserveNewLine (1464 of 2154)
PASS: lldb-shell :: ScriptInterpreter/Python/sb_address_exception.test (1465 of 2154)
PASS: lldb-unit :: Utility/./UtilityTests/FileSpecTest.FileAndDirectoryComponents (1466 of 2154)
PASS: lldb-api :: functionalities/data-formatter/data-formatter-objc/TestDataFormatterObjCPlain.py (1467 of 2154)
PASS: lldb-api :: lang/cpp/namespace/TestNamespace.py (1468 of 2154)
PASS: lldb-unit :: Utility/./UtilityTests/StreamTeeTest.Constructor2Streams (1469 of 2154)
PASS: lldb-api :: macosx/version_zero/TestGetVersionZeroVersion.py (1470 of 2154)
PASS: lldb-api :: functionalities/breakpoint/breakpoint_by_line_and_column/TestBreakpointByLineAndColumn.py (1471 of 2154)
PASS: lldb-api :: lang/objc/modules-cache/TestClangModulesCache.py (1472 of 2154)
PASS: lldb-api :: commands/expression/call-function/TestCallBuiltinFunction.py (1473 of 2154)
PASS: lldb-shell :: ObjectFile/PECOFF/basic-info-arm64.yaml (1474 of 2154)
PASS: lldb-api :: tools/lldb-server/inferior-crash/TestGdbRemoteAbort.py (1475 of 2154)
PASS: lldb-api :: functionalities/process_group/TestChangeProcessGroup.py (1476 of 2154)
PASS: lldb-api :: terminal/TestEditline.py (1477 of 2154)
PASS: lldb-unit :: Utility/./UtilityTests/StringExtractorTest.GetHexBytes_OddPair (1478 of 2154)
PASS: lldb-api :: functionalities/thread/concurrent_events/TestConcurrentSignalNWatchNBreak.py (1479 of 2154)
PASS: lldb-unit :: Utility/./UtilityTests/StreamTest.AddressSuffix (1480 of 2154)
PASS: lldb-unit :: Utility/./UtilityTests/StringExtractorTest.GetU32LittleEndian (1481 of 2154)
PASS: lldb-api :: macosx/queues/TestQueues.py (1482 of 2154)
PASS: lldb-unit :: Expression/./ExpressionTests/ClangHostTest.ComputeClangResourceDirectory (1483 of 2154)
PASS: lldb-api :: lang/objc/objc-property/TestObjCProperty.py (1484 of 2154)
PASS: lldb-unit :: Process/minidump/./LLDBMinidumpTests/MinidumpParserTest.MinidumpDuplicateModuleMappedFirst (1485 of 2154)
PASS: lldb-api :: lang/cpp/char1632_t/TestChar1632T.py (1486 of 2154)
PASS: lldb-api :: commands/watchpoints/watchpoint_disable/TestWatchpointDisable.py (1487 of 2154)
PASS: lldb-api :: commands/process/attach/TestProcessAttach.py (1488 of 2154)
PASS: lldb-api :: lang/objc/modules-incomplete/TestIncompleteModules.py (1489 of 2154)
UNSUPPORTED: lldb-shell :: Expr/TestIRMemoryMapWindows.test (1490 of 2154)
PASS: lldb-api :: functionalities/thread/concurrent_events/TestConcurrentWatchpointDelayWatchpointOneBreakpoint.py (1491 of 2154)
PASS: lldb-unit :: Utility/./UtilityTests/StringExtractorTest.GetNameColonValueContainsColon (1492 of 2154)
PASS: lldb-unit :: Symbol/./SymbolTests/TestTypeSystemClang.TestGetBasicTypeFromName (1493 of 2154)
PASS: lldb-api :: lang/c/global_variables/TestGlobalVariables.py (1494 of 2154)
PASS: lldb-shell :: SymbolFile/DWARF/DW_AT_location-DW_AT_const_value.s (1495 of 2154)
UNSUPPORTED: lldb-api :: commands/target/auto-install-main-executable/TestAutoInstallMainExecutable.py (1496 of 2154)
PASS: lldb-unit :: Utility/./UtilityTests/ConstStringTest.CompareStringRef (1497 of 2154)
PASS: lldb-api :: lang/cpp/gmodules/TestWithModuleDebugging.py (1498 of 2154)
PASS: lldb-api :: python_api/frame/inlines/TestInlinedFrame.py (1499 of 2154)
PASS: lldb-unit :: ScriptInterpreter/Python/./ScriptInterpreterPythonTests/PythonDataObjectsTest.TestPythonIntegerToStr (1500 of 2154)
PASS: lldb-api :: functionalities/conditional_break/TestConditionalBreak.py (1501 of 2154)
PASS: lldb-api :: functionalities/data-formatter/compactvectors/TestCompactVectors.py (1502 of 2154)
PASS: lldb-api :: lang/objc/radar-9691614/TestObjCMethodReturningBOOL.py (1503 of 2154)
PASS: lldb-unit :: Utility/./UtilityTests/PassiveReplayTest.InstrumentedBar (1504 of 2154)
PASS: lldb-api :: lang/cpp/global_operators/TestCppGlobalOperators.py (1505 of 2154)
PASS: lldb-api :: lang/cpp/std-function-step-into-callable/TestStdFunctionStepIntoCallable.py (1506 of 2154)
PASS: lldb-api :: commands/command/source/TestCommandSource.py (1507 of 2154)
PASS: lldb-shell :: ObjectFile/ELF/compressed-sections.yaml (1508 of 2154)
PASS: lldb-api :: functionalities/show_location/TestShowLocationDwarf5.py (1509 of 2154)
PASS: lldb-shell :: ObjectFile/ELF/gnu-debuglink.yaml (1510 of 2154)
PASS: lldb-api :: lang/objc/objc-class-method/TestObjCClassMethod.py (1511 of 2154)
PASS: lldb-api :: lang/cpp/inlines/TestInlines.py (1512 of 2154)
PASS: lldb-unit :: Utility/./UtilityTests/StreamTest.AddressNoSuffix (1513 of 2154)
PASS: lldb-unit :: DataFormatter/./LLDBFormatterTests/TypeMatcherTests.RegexName (1514 of 2154)
PASS: lldb-unit :: Utility/./UtilityTests/StateTest.Formatv (1515 of 2154)
UNSUPPORTED: lldb-shell :: SymbolFile/PDB/function-level-linking.test (1516 of 2154)
PASS: lldb-unit :: Utility/./UtilityTests/ArchSpecTest.TestParseMachCPUDashSubtypeTripleSimple (1517 of 2154)
PASS: lldb-shell :: Driver/TestUseColor.test (1518 of 2154)
PASS: lldb-api :: commands/platform/basic/TestPlatformCommand.py (1519 of 2154)
PASS: lldb-unit :: Process/minidump/./LLDBMinidumpTests/MinidumpParserTest.GetPidWindows (1520 of 2154)
PASS: lldb-unit :: UnwindAssembly/x86/./UnwindAssemblyx86Tests/Testx86AssemblyInspectionEngine.TestPushESI (1521 of 2154)
PASS: lldb-unit :: Utility/./UtilityTests/VMRange.SetEndAddress (1522 of 2154)
PASS: lldb-api :: macosx/duplicate-archive-members/TestDuplicateMembers.py (1523 of 2154)
PASS: lldb-api :: python_api/value_var_update/TestValueVarUpdate.py (1524 of 2154)
PASS: lldb-api :: commands/command/delete/TestCommandDelete.py (1525 of 2154)
UNSUPPORTED: lldb-api :: functionalities/darwin_log/filter/regex/message/TestDarwinLogFilterRegexMessage.py (1526 of 2154)
PASS: lldb-unit :: SymbolFile/DWARF/./SymbolFileDWARFTests/SymbolFileDWARFTests.TestAbbrevOrder1Start5 (1527 of 2154)
PASS: lldb-shell :: VSCode/TestOptions.test (1528 of 2154)
PASS: lldb-api :: lang/objc/foundation/TestObjCMethods2.py (1529 of 2154)
PASS: lldb-api :: functionalities/load_unload/TestLoadUnload.py (1530 of 2154)
PASS: lldb-unit :: API/./APITests/SBCommandInterpreterTest.MultiWordCommand (1531 of 2154)
PASS: lldb-unit :: Utility/./UtilityTests/StringListTest.LongestCommonPrefix (1532 of 2154)
PASS: lldb-api :: functionalities/tail_call_frames/ambiguous_tail_call_seq2/TestAmbiguousTailCallSeq2.py (1533 of 2154)
PASS: lldb-unit :: Expression/./ExpressionTests/DiagnosticManagerTest.GetStringMultipleDiags (1534 of 2154)
PASS: lldb-unit :: Symbol/./SymbolTests/TestTypeSystemClang.TestFunctionTemplateConstruction (1535 of 2154)
PASS: lldb-unit :: Language/Highlighting/./HighlighterTests/HighlighterTest.ClangStringLiterals (1536 of 2154)
PASS: lldb-unit :: Symbol/./SymbolTests/LineEntryTest.GetSameLineContiguousAddressRangeNestedInline (1537 of 2154)
PASS: lldb-api :: commands/platform/file/close/TestPlatformFileClose.py (1538 of 2154)
PASS: lldb-api :: commands/expression/options/TestExprOptions.py (1539 of 2154)
PASS: lldb-unit :: SymbolFile/NativePDB/./SymbolFileNativePDBTests/PDBFPOProgramToDWARFExpressionTests.UnknownOp (1540 of 2154)
PASS: lldb-api :: functionalities/object-file/TestImageListMultiArchitecture.py (1541 of 2154)
PASS: lldb-shell :: SymbolFile/Breakpad/symtab-macho.test (1542 of 2154)
PASS: lldb-unit :: SymbolFile/DWARF/./SymbolFileDWARFTests/SymbolFileDWARFTests.TestAbbrevInvalidNULLTag (1543 of 2154)
PASS: lldb-unit :: Process/minidump/./LLDBMinidumpTests/MinidumpParserTest.GetExceptionStream (1544 of 2154)
PASS: lldb-unit :: Utility/./UtilityTests/OptionsWithRawTest.ArgsButNoLeadingDash (1545 of 2154)
PASS: lldb-shell :: Process/Optimization.test (1546 of 2154)
PASS: lldb-unit :: Target/./TargetTests/ExecutionContextTest.GetByteOrder (1547 of 2154)
PASS: lldb-api :: lang/cpp/class_static/TestStaticVariables.py (1548 of 2154)
PASS: lldb-shell :: SymbolFile/DWARF/array-sizes.s (1549 of 2154)
PASS: lldb-api :: commands/expression/function_template_specialization_temp_args/TestFunctionTemplateSpecializationTempArgs.py (1550 of 2154)
PASS: lldb-api :: commands/watchpoints/watchpoint_commands/command/TestWatchpointCommandPython.py (1551 of 2154)
PASS: lldb-api :: functionalities/breakpoint/breakpoint_language/TestBreakpointLanguage.py (1552 of 2154)
PASS: lldb-unit :: Utility/./UtilityTests/Flags.Test (1553 of 2154)
UNSUPPORTED: lldb-api :: functionalities/thread/concurrent_events/TestConcurrentManySignals.py (1554 of 2154)
PASS: lldb-api :: lang/c/stepping/TestStepAndBreakpoints.py (1555 of 2154)
PASS: lldb-api :: commands/expression/ir-interpreter-phi-nodes/TestIRInterpreterPHINodes.py (1556 of 2154)
PASS: lldb-api :: commands/gui/basicdebug/TestGuiBasicDebug.py (1557 of 2154)
PASS: lldb-unit :: Utility/./UtilityTests/StringListTest.Assignment (1558 of 2154)
PASS: lldb-api :: macosx/add-dsym/TestAddDsymMidExecutionCommand.py (1559 of 2154)
PASS: lldb-unit :: Symbol/./SymbolTests/SymbolsTest.TerminateLocateExecutableSymbolFileForUnknownExecutableAndUnknownSymbolFile (1560 of 2154)
PASS: lldb-api :: lang/c/inlines/TestRedefinitionsInInlines.py (1561 of 2154)
PASS: lldb-unit :: Expression/./ExpressionTests/CppModuleConfigurationTest.Linux (1562 of 2154)
PASS: lldb-api :: python_api/function_symbol/TestDisasmAPI.py (1563 of 2154)
PASS: lldb-unit :: Utility/./UtilityTests/StreamTest.PutPtr (1564 of 2154)
PASS: lldb-api :: functionalities/breakpoint/source_regexp/TestSourceRegexBreakpoints.py (1565 of 2154)
PASS: lldb-shell :: SymbolFile/NativePDB/s_constant.cpp (1566 of 2154)
PASS: lldb-shell :: SymbolFile/DWARF/dir-separator-windows.s (1567 of 2154)
UNSUPPORTED: lldb-api :: arm/breakpoint-it/TestBreakpointIt.py (1568 of 2154)
PASS: lldb-api :: lang/objc/objc-stepping/TestObjCStepping.py (1569 of 2154)
PASS: lldb-api :: functionalities/data-formatter/synthcapping/TestSyntheticCapping.py (1570 of 2154)
PASS: lldb-unit :: Utility/./UtilityTests/ArgsTest.TestArgv (1571 of 2154)
PASS: lldb-unit :: Utility/./UtilityTests/RangeTest.ContainsAddr (1572 of 2154)
PASS: lldb-shell :: Unwind/eh-frame-dwarf-unwind.test (1573 of 2154)
PASS: lldb-api :: functionalities/tail_call_frames/sbapi_support/TestTailCallFrameSBAPI.py (1574 of 2154)
PASS: lldb-api :: functionalities/tsan/multiple/TestTsanMultiple.py (1575 of 2154)
PASS: lldb-unit :: UnwindAssembly/x86/./UnwindAssemblyx86Tests/Testx86AssemblyInspectionEngine.TestPopRBP (1576 of 2154)
PASS: lldb-api :: functionalities/target_var/no_vars/TestTargetVarNoVars.py (1577 of 2154)
PASS: lldb-unit :: Process/minidump/./LLDBMinidumpTests/MinidumpParserTest.GetLinuxProcStatus_no_stream (1578 of 2154)
PASS: lldb-shell :: SymbolFile/DWARF/clang-ast-from-dwarf-unamed-and-anon-structs.cpp (1579 of 2154)
PASS: lldb-api :: lang/c/unions/TestUnionMembers.py (1580 of 2154)
PASS: lldb-unit :: UnwindAssembly/x86/./UnwindAssemblyx86Tests/Testx86AssemblyInspectionEngine.Test64bitFramelessBigStackFrame (1581 of 2154)
PASS: lldb-api :: macosx/find-app-in-bundle/TestFindAppInBundle.py (1582 of 2154)
PASS: lldb-shell :: Settings/TestSettingsSet.test (1583 of 2154)
PASS: lldb-api :: commands/platform/file/read/TestPlatformFileRead.py (1584 of 2154)
PASS: lldb-unit :: UnwindAssembly/x86/./UnwindAssemblyx86Tests/Testx86AssemblyInspectionEngine.Testi386IgnoredRegisters (1585 of 2154)
UNSUPPORTED: lldb-shell :: Register/arm-gp-read.test (1586 of 2154)
PASS: lldb-unit :: Utility/./UtilityTests/RangeTest.Slide (1587 of 2154)
PASS: lldb-unit :: Process/minidump/./LLDBMinidumpTests/MinidumpParserTest.GetMiscInfoWindows (1588 of 2154)
PASS: lldb-api :: commands/expression/two-files/TestObjCTypeQueryFromOtherCompileUnit.py (1589 of 2154)
PASS: lldb-api :: commands/gui/basic/TestGuiBasic.py (1590 of 2154)
PASS: lldb-api :: commands/frame/var-scope/TestFrameVariableScope.py (1591 of 2154)
PASS: lldb-api :: functionalities/thread/concurrent_events/TestConcurrentSignalDelayWatch.py (1592 of 2154)
PASS: lldb-unit :: Core/./LLDBCoreTests/CommunicationTest.SynchronizeWhileClosing (1593 of 2154)
PASS: lldb-unit :: Utility/./UtilityTests/UriParserTest.TypicalPortPathIPv4 (1594 of 2154)
PASS: lldb-api :: lang/cpp/dynamic-value/TestDynamicValue.py (1595 of 2154)
PASS: lldb-unit :: Symbol/./SymbolTests/LineEntryTest.GetSameLineContiguousAddressRangeOneInline (1596 of 2154)
PASS: lldb-unit :: Utility/./UtilityTests/ArchSpecTest.TripleComponentsWereSpecified (1597 of 2154)
PASS: lldb-unit :: UnwindAssembly/x86/./UnwindAssemblyx86Tests/Testx86AssemblyInspectionEngine.TestPopEBX (1598 of 2154)
PASS: lldb-api :: commands/expression/persistent_types/TestPersistentTypes.py (1599 of 2154)
PASS: lldb-unit :: Expression/./ExpressionTests/DiagnosticManagerTest.AppendMessageAttachToLastDiag (1600 of 2154)
PASS: lldb-api :: lang/objc/objc_direct-methods/TestObjCDirectMethods.py (1601 of 2154)
PASS: lldb-unit :: Utility/./UtilityTests/RangeTest.SetRangeBase (1602 of 2154)
PASS: lldb-api :: functionalities/gdb_remote_client/TestPlatformClient.py (1603 of 2154)
PASS: lldb-unit :: ScriptInterpreter/Python/./ScriptInterpreterPythonTests/PythonDataObjectsTest.TestExtractingUInt64ThroughStructuredData (1604 of 2154)
UNSUPPORTED: lldb-shell :: Register/aarch64-fp-read.test (1605 of 2154)
PASS: lldb-unit :: Utility/./UtilityTests/StringListTest.ForRange (1606 of 2154)
PASS: lldb-unit :: Utility/./UtilityTests/StringExtractorTest.DecodeHexU8_InvalidHex (1607 of 2154)
PASS: lldb-unit :: Utility/./UtilityTests/ArgsTest.ReplaceArgumentAtIndexFarOutOfRange (1608 of 2154)
PASS: lldb-shell :: Breakpoint/debug_rnglistx_rlex.test (1609 of 2154)
PASS: lldb-shell :: SymbolFile/DWARF/DW_AT_declaration-with-children.s (1610 of 2154)
PASS: lldb-unit :: Utility/./UtilityTests/FileSpecTest.RemoveLastPathComponent (1611 of 2154)
PASS: lldb-unit :: Utility/./UtilityTests/ArgsTest.TestSingleArg (1612 of 2154)
PASS: lldb-shell :: SymbolFile/NativePDB/globals-fundamental.cpp (1613 of 2154)
PASS: lldb-api :: functionalities/thread/exit_during_break/TestExitDuringBreak.py (1614 of 2154)
PASS: lldb-unit :: Utility/./UtilityTests/StringExtractorTest.GetHexBytes_FullString (1615 of 2154)
PASS: lldb-unit :: Language/CPlusPlus/./LanguageCPlusPlusTests/CPlusPlusLanguage.ExtractContextAndIdentifier (1616 of 2154)
PASS: lldb-unit :: Utility/./UtilityTests/ArgsTest.ReplaceArgumentAtIndexShort (1617 of 2154)
PASS: lldb-api :: functionalities/data-formatter/summary-string-onfail/Test-rdar-9974002.py (1618 of 2154)
PASS: lldb-unit :: Utility/./UtilityTests/StringListTest.Clear (1619 of 2154)
PASS: lldb-unit :: Utility/./UtilityTests/XcodeSDKTest.FindXcodeContentsDirectoryInPath (1620 of 2154)
PASS: lldb-unit :: UnwindAssembly/x86/./UnwindAssemblyx86Tests/Testx86AssemblyInspectionEngine.TestStackRealign32BitDisp_x86_64 (1621 of 2154)
PASS: lldb-api :: tools/lldb-server/TestGdbRemote_vCont.py (1622 of 2154)
PASS: lldb-shell :: Breakpoint/case-sensitive.test (1623 of 2154)
PASS: lldb-unit :: Utility/./UtilityTests/ProcessInstanceInfoMatch.Name (1624 of 2154)
UNSUPPORTED: lldb-api :: python_api/event/TestEvents.py (1625 of 2154)
PASS: lldb-unit :: Utility/./UtilityTests/SerializationRountripTest.SerializeDeserializeObjectPointer (1626 of 2154)
PASS: lldb-api :: lang/cpp/trivial_abi/TestTrivialABI.py (1627 of 2154)
PASS: lldb-api :: functionalities/value_md5_crash/TestValueMD5Crash.py (1628 of 2154)
PASS: lldb-shell :: Commands/command-source.test (1629 of 2154)
PASS: lldb-api :: lang/cpp/signed_types/TestSignedTypes.py (1630 of 2154)
UNSUPPORTED: lldb-api :: tools/lldb-server/registers-target-xml-reading/TestGdbRemoteTargetXmlPacket.py (1631 of 2154)
PASS: lldb-api :: lang/c/unicode/TestUnicodeSymbols.py (1632 of 2154)
PASS: lldb-api :: lang/objc/modules-inline-functions/TestModulesInlineFunctions.py (1633 of 2154)
PASS: lldb-unit :: Language/Highlighting/./HighlighterTests/HighlighterTest.ClangScalarLiterals (1634 of 2154)
PASS: lldb-unit :: Utility/./UtilityTests/StreamTest.PutCharNull (1635 of 2154)
PASS: lldb-api :: lang/cpp/char8_t/TestCxxChar8_t.py (1636 of 2154)
UNSUPPORTED: lldb-shell :: Register/arm-fp-read.test (1637 of 2154)
PASS: lldb-api :: commands/expression/context-object-objc/TestContextObjectObjc.py (1638 of 2154)
PASS: lldb-api :: lang/objc/objc-baseclass-sbtype/TestObjCBaseClassSBType.py (1639 of 2154)
PASS: lldb-unit :: UnwindAssembly/x86/./UnwindAssemblyx86Tests/Testx86AssemblyInspectionEngine.TestPopR13 (1640 of 2154)
PASS: lldb-unit :: Host/./HostTests/MainLoopTest.ReadObject (1641 of 2154)
PASS: lldb-unit :: Utility/./UtilityTests/StringListTest.InsertStringAtIndexStart (1642 of 2154)
PASS: lldb-shell :: SymbolFile/NativePDB/break-by-line.cpp (1643 of 2154)
PASS: lldb-unit :: SymbolFile/DWARF/./SymbolFileDWARFTests/DWARFASTParserClangTests.EnsureAllDIEsInDeclContextHaveBeenParsedParsesOnlyMatchingEntries (1644 of 2154)
PASS: lldb-shell :: Reproducer/TestVersionCheck.test (1645 of 2154)
PASS: lldb-api :: macosx/indirect_symbol/TestIndirectSymbols.py (1646 of 2154)
PASS: lldb-shell :: SymbolFile/DWARF/find-method.cpp (1647 of 2154)
PASS: lldb-unit :: Instruction/./EmulatorTests/TestAArch64Emulator.TestOverflow (1648 of 2154)
PASS: lldb-api :: macosx/safe-to-func-call/TestSafeFuncCalls.py (1649 of 2154)
PASS: lldb-unit :: Utility/./UtilityTests/ProcessInstanceInfo.Dump (1650 of 2154)
PASS: lldb-shell :: Commands/command-breakpoint-col.test (1651 of 2154)
PASS: lldb-shell :: ExecControl/StopHook/stop-hook.test (1652 of 2154)
UNSUPPORTED: lldb-shell :: SymbolFile/PDB/variables-locations.test (1653 of 2154)
UNSUPPORTED: lldb-shell :: SymbolFile/PDB/expressions.test (1654 of 2154)
PASS: lldb-unit :: UnwindAssembly/x86/./UnwindAssemblyx86Tests/Testx86AssemblyInspectionEngine.TestPushImm (1655 of 2154)
PASS: lldb-shell :: SymbolFile/DWARF/debug-types-address-ranges.s (1656 of 2154)
PASS: lldb-unit :: SymbolFile/NativePDB/./SymbolFileNativePDBTests/PDBFPOProgramToDWARFExpressionTests.InvalidAssignmentMultiple (1657 of 2154)
PASS: lldb-unit :: Utility/./UtilityTests/AnsiTerminal.AtStart (1658 of 2154)
PASS: lldb-api :: commands/expression/import-std-module/conflicts/TestStdModuleWithConflicts.py (1659 of 2154)
UNSUPPORTED: lldb-shell :: SymbolFile/PDB/typedefs.test (1660 of 2154)
PASS: lldb-api :: commands/expression/import-std-module/forward_list-dbg-info-content/TestDbgInfoContentForwardListFromStdModule.py (1661 of 2154)
PASS: lldb-unit :: DataFormatter/./LLDBFormatterTests/StringPrinterTests.CxxUTF8 (1662 of 2154)
PASS: lldb-api :: functionalities/breakpoint/address_breakpoints/TestAddressBreakpoints.py (1663 of 2154)
PASS: lldb-api :: functionalities/gdb_remote_client/TestNestedRegDefinitions.py (1664 of 2154)
PASS: lldb-unit :: Utility/./UtilityTests/LogChannelTest.Disable (1665 of 2154)
PASS: lldb-unit :: ObjectFile/MachO/./ObjectFileMachOTests/ObjectFileMachOTest.ModuleFromSharedCacheInfo (1666 of 2154)
PASS: lldb-api :: lang/objc/objc-runtime-ivars/TestRuntimeIvars.py (1667 of 2154)
PASS: lldb-api :: tools/lldb-vscode/step/TestVSCode_step.py (1668 of 2154)
PASS: lldb-api :: functionalities/data-formatter/data-formatter-advanced/TestDataFormatterAdv.py (1669 of 2154)
PASS: lldb-api :: lang/objc/foundation/TestSymbolTable.py (1670 of 2154)
PASS: lldb-shell :: ObjectFile/PECOFF/basic-info.yaml (1671 of 2154)
PASS: lldb-api :: sample_test/TestSampleTest.py (1672 of 2154)
PASS: lldb-unit :: ScriptInterpreter/Python/./ScriptInterpreterPythonTests/PythonDataObjectsTest.TestExceptions (1673 of 2154)
PASS: lldb-unit :: Utility/./UtilityTests/OptionsWithRawTest.UnterminatedQuote (1674 of 2154)
PASS: lldb-unit :: Utility/./UtilityTests/StreamTest.AddressPrefixAndSuffix (1675 of 2154)
PASS: lldb-unit :: Symbol/./SymbolTests/DWARFCallFrameInfoTest.Basic_eh (1676 of 2154)
PASS: lldb-unit :: Utility/./UtilityTests/OptionsWithRawTest.SingleWhitespaceInput (1677 of 2154)
PASS: lldb-unit :: Utility/./UtilityTests/ScalarTest.LongLongAssigmentOperator (1678 of 2154)
PASS: lldb-unit :: Utility/./UtilityTests/StreamTest.PutCString (1679 of 2154)
PASS: lldb-unit :: Utility/./UtilityTests/StringExtractorTest.GetU64BigEndian (1680 of 2154)
PASS: lldb-unit :: Host/./HostTests/FileSystemTest.EmptyTest (1681 of 2154)
UNSUPPORTED: lldb-api :: lang/objc/objc-dynamic-value/TestObjCDynamicValue.py (1682 of 2154)
PASS: lldb-unit :: Symbol/./SymbolTests/PostfixExpression.ParseOneExpression (1683 of 2154)
PASS: lldb-api :: python_api/objc_type/TestObjCType.py (1684 of 2154)
PASS: lldb-api :: commands/expression/formatters/TestFormatters.py (1685 of 2154)
PASS: lldb-api :: python_api/watchpoint/TestWatchpointIter.py (1686 of 2154)
PASS: lldb-unit :: Utility/./UtilityTests/StreamTest.PutRawBytesToLittleEndian (1687 of 2154)
PASS: lldb-api :: lang/c/blocks/TestBlocks.py (1688 of 2154)
PASS: lldb-api :: commands/frame/diagnose/bad-reference/TestBadReference.py (1689 of 2154)
PASS: lldb-api :: functionalities/thread/backtrace_all/TestBacktraceAll.py (1690 of 2154)
PASS: lldb-shell :: SymbolFile/dissassemble-entry-point.s (1691 of 2154)
PASS: lldb-unit :: ObjectFile/Breakpad/./ObjectFileBreakpadTests/InfoRecord.parse (1692 of 2154)
PASS: lldb-api :: python_api/target/TestTargetAPI.py (1693 of 2154)
PASS: lldb-api :: commands/expression/call-function/TestCallStdStringFunction.py (1694 of 2154)
PASS: lldb-unit :: Target/./TargetTests/ModuleCacheTest.GetAndPutStrangeHostname (1695 of 2154)
UNSUPPORTED: lldb-shell :: Register/x86-gp-write.test (1696 of 2154)
PASS: lldb-api :: types/TestShortTypeExpr.py (1697 of 2154)
PASS: lldb-unit :: Utility/./UtilityTests/StreamTest.SetIndentLevel (1698 of 2154)
PASS: lldb-shell :: SymbolFile/DWARF/find-basic-function.cpp (1699 of 2154)
PASS: lldb-api :: functionalities/data-formatter/parray/TestPrintArray.py (1700 of 2154)
PASS: lldb-unit :: Language/Highlighting/./HighlighterTests/HighlighterTest.ClangCursorPos (1701 of 2154)
UNSUPPORTED: lldb-shell :: Register/x86-64-ymm16-read.test (1702 of 2154)
PASS: lldb-api :: functionalities/thread/state_after_expression/TestStateAfterExpression.py (1703 of 2154)
PASS: lldb-unit :: Utility/./UtilityTests/UserIDResolver.GetGroupName (1704 of 2154)
PASS: lldb-shell :: Register/x86-64-gp-read.test (1705 of 2154)
PASS: lldb-api :: functionalities/breakpoint/dummy_target_breakpoints/TestBreakpointsWithNoTargets.py (1706 of 2154)
PASS: lldb-unit :: Utility/./UtilityTests/StringListTest.InsertStringAtIndexStdString (1707 of 2154)
PASS: lldb-unit :: UnwindAssembly/x86/./UnwindAssemblyx86Tests/Testx86AssemblyInspectionEngine.TestPopEDI (1708 of 2154)
PASS: lldb-unit :: Utility/./UtilityTests/OptionsWithRawTest.ArgsButNoDelimiter (1709 of 2154)
PASS: lldb-api :: functionalities/pointer_num_children/TestPointerNumChildren.py (1710 of 2154)
PASS: lldb-unit :: Utility/./UtilityTests/GeneratorTest.Create (1711 of 2154)
PASS: lldb-api :: functionalities/thread/concurrent_events/TestConcurrentManyCrash.py (1712 of 2154)
PASS: lldb-unit :: Utility/./UtilityTests/StringExtractorTest.InitEmpty (1713 of 2154)
PASS: lldb-unit :: Symbol/./SymbolTests/TestTypeSystemClang.TestGetTypeClassTypeOfExpr (1714 of 2154)
PASS: lldb-unit :: Utility/./UtilityTests/RangeTest.DoesIntersect (1715 of 2154)
PASS: lldb-shell :: ObjectFile/Breakpad/sections-trailing-func.test (1716 of 2154)
PASS: lldb-unit :: Language/CLanguages/./LanguageCLanguagesTests/CLanguages.LookupCLanguagesByLanguageType (1717 of 2154)
PASS: lldb-unit :: Language/Highlighting/./HighlighterTests/HighlighterTest.ClangTrailingBackslashMissingNewLine (1718 of 2154)
PASS: lldb-api :: terminal/TestSTTYBeforeAndAfter.py (1719 of 2154)
PASS: lldb-api :: tools/lldb-vscode/launch/TestVSCode_launch.py (1720 of 2154)
PASS: lldb-unit :: Expression/./ExpressionTests/DWARFExpression.DW_OP_piece (1721 of 2154)
PASS: lldb-unit :: Language/Highlighting/./HighlighterTests/HighlighterTest.ClangCursorOutOfBounds (1722 of 2154)
PASS: lldb-unit :: Utility/./UtilityTests/BinaryStreamTest.PutULEB128OneByte (1723 of 2154)
PASS: lldb-shell :: SymbolFile/DWARF/debug_rnglists.s (1724 of 2154)
UNSUPPORTED: lldb-api :: functionalities/process_save_core/TestProcessSaveCore.py (1725 of 2154)
PASS: lldb-shell :: ObjectFile/Breakpad/breakpad-identification.test (1726 of 2154)
FAIL: lldb-api :: commands/target/stop-hooks/TestStopHookScripted.py (1727 of 2154)
******************** TEST 'lldb-api :: commands/target/stop-hooks/TestStopHookScripted.py' FAILED ********************
Script:
--
/usr/local/Frameworks/Python.framework/Versions/3.7/bin/python3.7 /Users/buildslave/jenkins/workspace/lldb-cmake/llvm-project/lldb/test/API/dotest.py -s /Users/buildslave/jenkins/workspace/lldb-cmake/lldb-build/lldb-test-traces -S nm -u CXXFLAGS -u CFLAGS --codesign-identity - --server /Users/buildslave/jenkins/workspace/lldb-cmake/lldb-build/./bin/debugserver --arch x86_64 --build-dir /Users/buildslave/jenkins/workspace/lldb-cmake/lldb-build/lldb-test-build.noindex -s=/Users/buildslave/jenkins/workspace/lldb-cmake/test/logs -t --env TERM=vt100 --env LLVM_LIBS_DIR=/Users/buildslave/jenkins/workspace/lldb-cmake/lldb-build/./lib --arch x86_64 --build-dir /Users/buildslave/jenkins/workspace/lldb-cmake/lldb-build/lldb-test-build.noindex --lldb-module-cache-dir /Users/buildslave/jenkins/workspace/lldb-cmake/lldb-build/lldb-test-build.noindex/module-cache-lldb/lldb-api --clang-module-cache-dir /Users/buildslave/jenkins/workspace/lldb-cmake/lldb-build/lldb-test-build.noindex/module-cache-clang/lldb-api --executable /Users/buildslave/jenkins/workspace/lldb-cmake/lldb-build/./bin/lldb --compiler /Users/buildslave/jenkins/workspace/lldb-cmake/lldb-build/./bin/clang --dsymutil /Users/buildslave/jenkins/workspace/lldb-cmake/lldb-build/./bin/dsymutil --filecheck /Users/buildslave/jenkins/workspace/lldb-cmake/lldb-build/./bin/FileCheck --yaml2obj /Users/buildslave/jenkins/workspace/lldb-cmake/lldb-build/./bin/yaml2obj --lldb-libs-dir /Users/buildslave/jenkins/workspace/lldb-cmake/lldb-build/./lib /Users/buildslave/jenkins/workspace/lldb-cmake/llvm-project/lldb/test/API/commands/target/stop-hooks -p TestStopHookScripted.py
--
Exit Code: 1

Hide Details

Command Output (stdout): -- lldb version 12.0.99 clang revision fdfe324da195ebd9b9c691f006b0d6ccc64365e1 llvm revision fdfe324da195ebd9b9c691f006b0d6ccc64365e1 libstdcxx tests will not be run because: Don't know how to build with libstdcxx on macosx Skipping following debug info categories: ['dwo'] Running command: target stop-hook add -P stop_hook.stop_handler -k increment -v 5 -k return_false -v 1 -n step_out_of_me I have stopped 1 times.

Hide Details

-- Command Output (stderr): --

Hide Details

Session logs for test failures/errors/unexpected successes will go into directory '/Users/buildslave/jenkins/workspace/lldb-cmake/test/logs' Change dir to: /Users/buildslave/jenkins/workspace/lldb-cmake/llvm-project/lldb/test/API/commands/target/stop-hooks runCmd: settings clear -all output:

Hide Details

runCmd: settings set symbols.enable-external-lookup false output:

Hide Details

runCmd: settings set target.inherit-tcc true output:

Hide Details

runCmd: settings set target.auto-apply-fixits false output:

Hide Details

runCmd: settings set plugin.process.gdb-remote.packet-timeout 60 output:

Hide Details

runCmd: settings set symbols.clang-modules-cache-path "/Users/buildslave/jenkins/workspace/lldb-cmake/lldb-build/lldb-test-build.noindex/module-cache-lldb/lldb-api" output:

Hide Details

runCmd: settings set use-color false output:

Hide Details

runCmd: setting set target.prefer-dynamic-value no-dynamic-values output:

Hide Details

FAIL: LLDB (/Users/buildslave/jenkins/workspace/lldb-cmake/lldb-build/bin/clang-x86_64) :: test_stop_hooks_scripted_return_false (TestStopHookScripted.TestStopHooks) <bound method SBProcess.Kill of <lldb.SBProcess; proxy of <Swig Object of type 'lldb::SBProcess *' at 0x1079bc4e0> >>: success

Hide Details

Restore dir to: /Users/buildslave/jenkins/workspace/lldb-cmake/lldb-build/tools/lldb/test ====================================================================== FAIL: test_stop_hooks_scripted_return_false (TestStopHookScripted.TestStopHooks) Test that the returning False from a stop hook works ---------------------------------------------------------------------- Traceback (most recent call last): File "/Users/buildslave/jenkins/workspace/lldb-cmake/llvm-project/lldb/test/API/commands/target/stop-hooks/TestStopHookScripted.py", line 54, in test_stop_hooks_scripted_return_false self.do_test_auto_continue(True) File "/Users/buildslave/jenkins/workspace/lldb-cmake/llvm-project/lldb/test/API/commands/target/stop-hooks/TestStopHookScripted.py", line 91, in do_test_auto_continue self.assertEqual("main", func_name, "Didn't stop at the expected function.") AssertionError: 'main' != 'step_out_of_me' - main+ step_out_of_me : Didn't stop at the expected function. Config=x86_64-/Users/buildslave/jenkins/workspace/lldb-cmake/lldb-build/bin/clang ---------------------------------------------------------------------- Ran 1 test in 1.268s

Hide Details

RESULT: FAILED (0 passes, 1 failures, 0 errors, 0 skipped, 0 expected failures, 0 unexpected successes)

Hide Details

--

Hide Details

******************** PASS: lldb-unit :: Expression/./ExpressionTests/CppModuleConfigurationTest.UnknownLibCppFile (1728 of 2154) PASS: lldb-unit :: ScriptInterpreter/Python/./ScriptInterpreterPythonTests/PythonDataObjectsTest.TestPythonTupleToStructuredList (1729 of 2154) UNSUPPORTED: lldb-shell :: SymbolFile/PDB/udt-layout.test (1730 of 2154) PASS: lldb-api :: commands/expression/import-std-module/weak_ptr-dbg-info-content/TestDbgInfoContentWeakPtrFromStdModule.py (1731 of 2154) UNSUPPORTED: lldb-shell :: Process/Windows/exception_access_violation.cpp (1732 of 2154) PASS: lldb-unit :: Host/./HostTests/ConnectionFileDescriptorTest.TCPGetURIv6 (1733 of 2154) PASS: lldb-unit :: Utility/./UtilityTests/LogChannelEnabledTest.LLDB_LOG_ERROR (1734 of 2154) UNSUPPORTED: lldb-shell :: Register/x86-64-zmm-write.test (1735 of 2154) PASS: lldb-api :: commands/expression/import-std-module/shared_ptr/TestSharedPtrFromStdModule.py (1736 of 2154) PASS: lldb-shell :: Reproducer/TestProcessList.test (1737 of 2154) PASS: lldb-api :: commands/expression/rdar44436068/Test128BitsInteger.py (1738 of 2154) UNSUPPORTED: lldb-api :: benchmarks/libcxxmap/TestBenchmarkLibcxxMap.py (1739 of 2154) PASS: lldb-unit :: Process/minidump/./LLDBMinidumpTests/MinidumpParserTest.GetMemoryRegionInfoLinuxMaps (1740 of 2154) PASS: lldb-unit :: Utility/./UtilityTests/ScalarTest.Promotion (1741 of 2154) PASS: lldb-shell :: ObjectFile/MachO/symtab.yaml (1742 of 2154) PASS: lldb-unit :: Utility/./UtilityTests/StringExtractorTest.DecodeHexU8_Exact (1743 of 2154) PASS: lldb-api :: lang/cpp/chained-calls/TestCppChainedCalls.py (1744 of 2154) PASS: lldb-api :: functionalities/asan/TestMemoryHistory.py (1745 of 2154) UNSUPPORTED: lldb-shell :: Register/x86-64-ymm16-write.test (1746 of 2154) PASS: lldb-api :: functionalities/archives/TestBSDArchives.py (1747 of 2154) PASS: lldb-unit :: Core/./LLDBCoreTests/SourceFileCache.FindSourceFileNotFound (1748 of 2154) PASS: lldb-api :: lang/objc/foundation/TestConstStrings.py (1749 of 2154) PASS: lldb-unit :: Utility/./UtilityTests/CompletionRequest.Constructor (1750 of 2154) UNSUPPORTED: lldb-shell :: ScriptInterpreter/Lua/io.test (1751 of 2154) PASS: lldb-api :: commands/process/attach-resume/TestAttachResume.py (1752 of 2154) PASS: lldb-api :: functionalities/rerun/TestRerun.py (1753 of 2154) PASS: lldb-api :: python_api/signals/TestSignalsAPI.py (1754 of 2154) PASS: lldb-unit :: Symbol/./SymbolTests/TestTypeSystemClang.TestGetBasicTypeFromEnum (1755 of 2154) PASS: lldb-shell :: Quit/TestQuitExitCodeNonInt.test (1756 of 2154) PASS: lldb-unit :: Utility/./UtilityTests/TildeExpressionResolver.ResolveFullPath (1757 of 2154) PASS: lldb-shell :: SymbolFile/Breakpad/line-table-missing-file.test (1758 of 2154) PASS: lldb-unit :: Utility/./UtilityTests/ArgsTest.TestQuotedTrailingBackslash (1759 of 2154) PASS: lldb-shell :: Commands/command-stop-hook-output.test (1760 of 2154) UNSUPPORTED: lldb-shell :: Register/aarch64-gp-read.test (1761 of 2154) UNSUPPORTED: lldb-api :: functionalities/unwind/ehframe/TestEhFrameUnwind.py (1762 of 2154) PASS: lldb-api :: commands/expression/argument_passing_restrictions/TestArgumentPassingRestrictions.py (1763 of 2154) PASS: lldb-unit :: Process/./ProcessEventDataTests/ProcessEventDataTest.ShouldStop (1764 of 2154) PASS: lldb-api :: functionalities/plugins/python_os_plugin/stepping_plugin_threads/TestOSPluginStepping.py (1765 of 2154) PASS: lldb-api :: python_api/frame/get-variables/TestGetVariables.py (1766 of 2154) PASS: lldb-unit :: Process/minidump/./LLDBMinidumpTests/RegisterContextMinidump.CheckRegisterContextMinidump_ARM (1767 of 2154) PASS: lldb-unit :: Process/gdb-remote/./ProcessGdbRemoteTests/GDBRemoteCommunicationClientTest.SaveRestoreRegistersNoSuffix (1768 of 2154) PASS: lldb-api :: commands/expression/import-std-module/forward_decl_from_module/TestForwardDeclFromStdModule.py (1769 of 2154) PASS: lldb-shell :: SymbolFile/DWARF/limit-debug-info.s (1770 of 2154) PASS: lldb-unit :: Utility/./UtilityTests/StringListTest.JoinEmpty (1771 of 2154) PASS: lldb-unit :: Utility/./UtilityTests/IndexToObjectTest.ObjectForIndex (1772 of 2154) PASS: lldb-unit :: Language/CPlusPlus/./LanguageCPlusPlusTests/CPlusPlusLanguage.FindAlternateFunctionManglings (1773 of 2154) UNSUPPORTED: lldb-shell :: SymbolFile/PDB/ast-restore.test (1774 of 2154) PASS: lldb-api :: functionalities/data-formatter/type_summary_list_arg/TestTypeSummaryListArg.py (1775 of 2154) UNSUPPORTED: lldb-shell :: ScriptInterpreter/Lua/quit.test (1776 of 2154) PASS: lldb-unit :: Symbol/./SymbolTests/TestTypeSystemClang.TestIsClangType (1777 of 2154) PASS: lldb-api :: functionalities/source-map/TestTargetSourceMap.py (1778 of 2154) UNSUPPORTED: lldb-api :: tools/lldb-server/libraries-svr4/TestGdbRemoteLibrariesSvr4Support.py (1779 of 2154) PASS: lldb-api :: sample_test/TestSampleInlineTest.py (1780 of 2154) PASS: lldb-shell :: Register/x86-64-ymm-read.test (1781 of 2154) PASS: lldb-shell :: Register/x86-64-read.test (1782 of 2154) PASS: lldb-shell :: SymbolFile/DWARF/DW_TAG_basic_type_DW_ATE_UTF_nonC.ll (1783 of 2154) PASS: lldb-unit :: Host/./HostTests/HostInfoTest.GetXcodeSDK (1784 of 2154) UNSUPPORTED: lldb-shell :: SymbolFile/PDB/pointers.test (1785 of 2154) PASS: lldb-api :: tools/lldb-vscode/console/TestVSCode_console.py (1786 of 2154) PASS: lldb-api :: python_api/value/change_values/TestChangeValueAPI.py (1787 of 2154) PASS: lldb-shell :: Reproducer/TestReuseDirectory.test (1788 of 2154) PASS: lldb-unit :: Utility/./UtilityTests/StreamTeeTest.GetStreamAtIndexOutOfBounds (1789 of 2154) PASS: lldb-unit :: SymbolFile/DWARF/./SymbolFileDWARFTests/SymbolFileDWARFTests.TestAbbrevOrder1Start1 (1790 of 2154) PASS: lldb-shell :: Commands/command-backtrace.test (1791 of 2154) PASS: lldb-unit :: Expression/./ExpressionTests/DiagnosticManagerTest.AddDiagnostic (1792 of 2154) PASS: lldb-unit :: Process/gdb-remote/./ProcessGdbRemoteTests/GDBRemoteCommunicationClientTest.SendGetTraceConfigPacket (1793 of 2154) PASS: lldb-api :: lang/cpp/typedef/TestCppTypedef.py (1794 of 2154) PASS: lldb-api :: functionalities/multidebugger_commands/TestMultipleDebuggersCommands.py (1795 of 2154) PASS: lldb-api :: python_api/sbvalue_persist/TestSBValuePersist.py (1796 of 2154) PASS: lldb-unit :: Language/Highlighting/./HighlighterTests/HighlighterTest.ClangCursorPosInOtherToken (1797 of 2154) PASS: lldb-unit :: UnwindAssembly/x86/./UnwindAssemblyx86Tests/Testx86AssemblyInspectionEngine.TestSpArithx86_64Augmented (1798 of 2154) PASS: lldb-unit :: Host/./HostTests/MainLoopTest.UnmonitoredSignal (1799 of 2154) PASS: lldb-unit :: Utility/./UtilityTests/ScalarTest.APIntConstructor (1800 of 2154) PASS: lldb-shell :: ObjectFile/ELF/netbsd-core-amd64.test (1801 of 2154) PASS: lldb-api :: python_api/sbdata/TestSBData.py (1802 of 2154) PASS: lldb-unit :: Utility/./UtilityTests/RegularExpression.Invalid (1803 of 2154) PASS: lldb-shell :: ScriptInterpreter/Python/scripted_breakpoint.test (1804 of 2154) PASS: lldb-api :: commands/platform/process/list/TestProcessList.py (1805 of 2154) PASS: lldb-api :: commands/expression/ir-interpreter/TestIRInterpreter.py (1806 of 2154) UNSUPPORTED: lldb-shell :: Unwind/eh-frame-augment-noop.test (1807 of 2154) PASS: lldb-unit :: Utility/./UtilityTests/BinaryStreamTest.PutULEB128SixBytes (1808 of 2154) PASS: lldb-unit :: Utility/./UtilityTests/VASprintfTest.BufferResize (1809 of 2154) PASS: lldb-unit :: Utility/./UtilityTests/NameMatchesTest.EndsWith (1810 of 2154) PASS: lldb-shell :: SymbolFile/DWARF/debug_line-tombstone.s (1811 of 2154) PASS: lldb-api :: functionalities/data-formatter/cstring-utf8-summary/TestCstringUnicode.py (1812 of 2154) PASS: lldb-unit :: Utility/./UtilityTests/RegisterValueTest.GetSet8 (1813 of 2154) PASS: lldb-unit :: Utility/./UtilityTests/ScalarTest.TruncOrExtendTo (1814 of 2154) PASS: lldb-api :: functionalities/data-formatter/data-formatter-stl/libcxx/string/TestDataFormatterLibcxxString.py (1815 of 2154) PASS: lldb-unit :: Utility/./UtilityTests/NameMatchesTest.StartsWith (1816 of 2154) PASS: lldb-api :: python_api/section/TestSectionAPI.py (1817 of 2154) UNSUPPORTED: lldb-api :: commands/watchpoints/hello_watchlocation/TestWatchLocation.py (1818 of 2154) PASS: lldb-api :: functionalities/data-formatter/poarray/TestPrintObjectArray.py (1819 of 2154) PASS: lldb-api :: lang/cpp/unsigned_types/TestUnsignedTypes.py (1820 of 2154) PASS: lldb-shell :: Breakpoint/dummy-target.test (1821 of 2154) PASS: lldb-api :: functionalities/dynamic_value_child_count/TestDynamicValueChildCount.py (1822 of 2154) PASS: lldb-api :: lang/objc/foundation/TestRuntimeTypes.py (1823 of 2154) PASS: lldb-unit :: Utility/./UtilityTests/StringExtractorTest.GetNameColonValueNoSemicolon (1824 of 2154) PASS: lldb-api :: lang/cpp/scope/TestCppScope.py (1825 of 2154) PASS: lldb-shell :: Settings/TestStopCommandSourceOnError.test (1826 of 2154) PASS: lldb-unit :: Host/./HostTests/FileSystemTest.Resolve (1827 of 2154) PASS: lldb-unit :: Expression/./ExpressionTests/DWARFExpression.DW_OP_convert (1828 of 2154) PASS: lldb-api :: types/TestIntegerTypeExpr.py (1829 of 2154) PASS: lldb-unit :: Utility/./UtilityTests/UUIDTest.StringConverion (1830 of 2154) PASS: lldb-api :: functionalities/data-formatter/data-formatter-stl/libcxx/list/loop/TestDataFormatterLibcxxListLoop.py (1831 of 2154) UNSUPPORTED: lldb-api :: functionalities/data-formatter/data-formatter-stl/libstdcpp/vector/TestDataFormatterStdVector.py (1832 of 2154) PASS: lldb-api :: lang/cpp/type_lookup/TestCppTypeLookup.py (1833 of 2154) PASS: lldb-unit :: Utility/./UtilityTests/DataExtractorTest.GetFloatUnaligned (1834 of 2154) PASS: lldb-shell :: SymbolFile/DWARF/debug-types-dwo-cross-reference.cpp (1835 of 2154) PASS: lldb-api :: lang/objc/bitfield_ivars/TestBitfieldIvars.py (1836 of 2154) UNSUPPORTED: lldb-shell :: Unwind/eh-frame-small-fde.test (1837 of 2154) PASS: lldb-unit :: Utility/./UtilityTests/RegularExpression.Valid (1838 of 2154) PASS: lldb-api :: commands/expression/persist_objc_pointeetype/TestPersistObjCPointeeType.py (1839 of 2154) PASS: lldb-api :: commands/process/launch/TestProcessLaunch.py (1840 of 2154) PASS: lldb-unit :: Utility/./UtilityTests/UriParserTest.SchemeHostSeparator4 (1841 of 2154) PASS: lldb-shell :: SymbolFile/DWARF/debug_ranges_and_rnglists.test (1842 of 2154) PASS: lldb-unit :: Language/Highlighting/./HighlighterTests/HighlighterTest.ClangTrailingBackslashWithWhitespace (1843 of 2154) PASS: lldb-api :: commands/expression/cast_int_to_anonymous_enum/TestCastIntToAnonymousEnum.py (1844 of 2154) PASS: lldb-unit :: Utility/./UtilityTests/StringListTest.InsertStringAtIndexMove (1845 of 2154) PASS: lldb-shell :: Process/TestEnvironment.test (1846 of 2154) PASS: lldb-api :: commands/expression/import-std-module/unique_ptr-dbg-info-content/TestUniquePtrDbgInfoContent.py (1847 of 2154) PASS: lldb-api :: commands/expression/weak_symbols/TestWeakSymbols.py (1848 of 2154) PASS: lldb-unit :: Utility/./UtilityTests/PassiveReplayTest.InstrumentedBarPtr (1849 of 2154) PASS: lldb-api :: functionalities/tsan/basic/TestTsanBasic.py (1850 of 2154) UNSUPPORTED: lldb-api :: tools/intel-features/intel-pt/test/TestIntelPTSimpleBinary.py (1851 of 2154) PASS: lldb-api :: functionalities/breakpoint/cpp/TestCPPBreakpointLocations.py (1852 of 2154) PASS: lldb-unit :: Utility/./UtilityTests/StringExtractorTest.InitMisc (1853 of 2154) PASS: lldb-unit :: Signals/./SignalsTests/UnixSignalsTest.VersionChange (1854 of 2154) PASS: lldb-api :: python_api/sbtype_typeclass/TestSBTypeTypeClass.py (1855 of 2154) PASS: lldb-api :: commands/expression/import-std-module/vector/TestVectorFromStdModule.py (1856 of 2154) PASS: lldb-shell :: ScriptInterpreter/None/import_module.test (1857 of 2154) PASS: lldb-shell :: ObjectFile/ELF/PT_LOAD-overlap.yaml (1858 of 2154) PASS: lldb-shell :: Settings/TestEchoCommands.test (1859 of 2154) XFAIL: lldb-shell :: SymbolFile/DWARF/find-type-in-function.cpp (1860 of 2154) PASS: lldb-shell :: Commands/command-target-modules-dump-sections.yaml (1861 of 2154) PASS: lldb-api :: python_api/watchpoint/watchlocation/TestSetWatchlocation.py (1862 of 2154) PASS: lldb-unit :: Symbol/./SymbolTests/TestTypeSystemClang.TestDeletingImplicitCopyCstrDueToMoveCStr (1863 of 2154) PASS: lldb-shell :: Settings/TestFrameFormatMangling.test (1864 of 2154) PASS: lldb-api :: api/command-return-object/TestSBCommandReturnObject.py (1865 of 2154) PASS: lldb-api :: functionalities/abbreviation/TestAbbreviations.py (1866 of 2154) PASS: lldb-unit :: Utility/./UtilityTests/Flags.AllClear (1867 of 2154) PASS: lldb-unit :: Expression/./ExpressionTests/DiagnosticManagerTest.GetStringMultiline (1868 of 2154) PASS: lldb-unit :: Utility/./UtilityTests/FileSpecTest.OperatorBool (1869 of 2154) PASS: lldb-api :: lang/c/forward/TestForwardDeclaration.py (1870 of 2154) PASS: lldb-shell :: SymbolFile/DWARF/inline-function-address-shared.test (1871 of 2154) PASS: lldb-unit :: Symbol/./SymbolTests/TestTypeSystemClang.TestNotDeletingUserCopyCstrDueToMoveCStr (1872 of 2154) PASS: lldb-shell :: SymbolFile/DWARF/dwarf5_locations.s (1873 of 2154) UNSUPPORTED: lldb-api :: functionalities/darwin_log/filter/exact_match/activity-chain/TestDarwinLogFilterMatchActivityChain.py (1874 of 2154) PASS: lldb-api :: functionalities/dlopen_other_executable/TestDlopenOtherExecutable.py (1875 of 2154) PASS: lldb-shell :: SymbolFile/Breakpad/line-table-discontinuous-file-ids.test (1876 of 2154) PASS: lldb-unit :: Utility/./UtilityTests/DataExtractorTest.GetSLEB128_bit63 (1877 of 2154) PASS: lldb-shell :: SymbolFile/NativePDB/source-list.cpp (1878 of 2154) PASS: lldb-unit :: ScriptInterpreter/Python/./ScriptInterpreterPythonTests/PythonDataObjectsTest.TestPythonInteger (1879 of 2154) UNSUPPORTED: lldb-shell :: Unwind/unwind-plan-dwarf-dump.test (1880 of 2154) PASS: lldb-api :: types/TestDoubleTypesExpr.py (1881 of 2154) PASS: lldb-unit :: Utility/./UtilityTests/VMRange.Clear (1882 of 2154) PASS: lldb-api :: commands/gui/invalid-args/TestInvalidArgsGui.py (1883 of 2154) PASS: lldb-shell :: SymbolFile/DWARF/DW_AT_low_pc-addrx.s (1884 of 2154) PASS: lldb-api :: functionalities/breakpoint/breakpoint_conditions/TestBreakpointConditions.py (1885 of 2154) PASS: lldb-unit :: Utility/./UtilityTests/Flags.AllSet (1886 of 2154) UNSUPPORTED: lldb-shell :: SymbolFile/DWARF/split-dwarf-expression-eval-bug.cpp (1887 of 2154) PASS: lldb-unit :: Expression/./ExpressionTests/DiagnosticManagerTest.GetStringPreserveOrder (1888 of 2154) UNSUPPORTED: lldb-api :: lang/cpp/static_members/TestCPPStaticMembers.py (1889 of 2154) PASS: lldb-api :: lang/cpp/virtual-overload/TestVirtualOverload.py (1890 of 2154) PASS: lldb-api :: functionalities/tail_call_frames/ambiguous_tail_call_seq1/TestAmbiguousTailCallSeq1.py (1891 of 2154) PASS: lldb-unit :: Host/./HostTests/SocketTest.DomainListenConnectAccept (1892 of 2154) PASS: lldb-unit :: Utility/./UtilityTests/RegularExpression.Empty (1893 of 2154) UNSUPPORTED: lldb-shell :: Register/x86-gp-read.test (1894 of 2154) UNSUPPORTED: lldb-api :: benchmarks/libcxxlist/TestBenchmarkLibcxxList.py (1895 of 2154) PASS: lldb-shell :: Commands/command-script-import.test (1896 of 2154) PASS: lldb-api :: lang/cpp/template/TestTemplateArgs.py (1897 of 2154) PASS: lldb-shell :: SymbolFile/DWARF/debug_loclists-dwo.s (1898 of 2154) PASS: lldb-unit :: Utility/./UtilityTests/StreamTest.AddressSize (1899 of 2154) PASS: lldb-unit :: Utility/./UtilityTests/DeserializerTest.HasData (1900 of 2154) PASS: lldb-api :: lang/cpp/rvalue-references/TestRvalueReferences.py (1901 of 2154) PASS: lldb-unit :: UnwindAssembly/x86/./UnwindAssemblyx86Tests/Testx86AssemblyInspectionEngine.TestPopR12 (1902 of 2154) PASS: lldb-unit :: SymbolFile/DWARF/./SymbolFileDWARFTests/XcodeSDKModuleTests.TestModuleGetXcodeSDK (1903 of 2154) PASS: lldb-api :: functionalities/breakpoint/comp_dir_symlink/TestCompDirSymLink.py (1904 of 2154) PASS: lldb-unit :: Utility/./UtilityTests/FileSpecTest.EqualSeparator (1905 of 2154) PASS: lldb-unit :: Utility/./UtilityTests/CompletionRequest.ShiftArguments (1906 of 2154) PASS: lldb-unit :: Utility/./UtilityTests/CompletionRequest.TryCompleteCurrentArgGood (1907 of 2154) PASS: lldb-api :: functionalities/data-formatter/data-formatter-objc/TestDataFormatterObjCKVO.py (1908 of 2154) PASS: lldb-unit :: Target/./TargetTests/MemoryRegionInfoTest.Formatv (1909 of 2154) PASS: lldb-api :: macosx/thread_suspend/TestInternalThreadSuspension.py (1910 of 2154) PASS: lldb-api :: functionalities/thread/num_threads/TestNumThreads.py (1911 of 2154) PASS: lldb-api :: commands/expression/timeout/TestCallWithTimeout.py (1912 of 2154) PASS: lldb-shell :: Breakpoint/split-dwarf5-debug-stroffsets.test (1913 of 2154) PASS: lldb-unit :: UnwindAssembly/x86/./UnwindAssemblyx86Tests/Testx86AssemblyInspectionEngine.Test32bitFramelessBigStackFrame (1914 of 2154) PASS: lldb-unit :: Host/./HostTests/SocketTest.TCPListen0GetPort (1915 of 2154) PASS: lldb-api :: functionalities/data-formatter/varscript_formatting/TestDataFormatterVarScriptFormatting.py (1916 of 2154) PASS: lldb-shell :: SymbolFile/NativePDB/ast-types.cpp (1917 of 2154) PASS: lldb-shell :: ObjectFile/PECOFF/invalid-export-table.yaml (1918 of 2154) PASS: lldb-unit :: Host/./HostTests/SocketTest.UDPGetConnectURI (1919 of 2154) PASS: lldb-unit :: Utility/./UtilityTests/StringExtractorTest.GetHexBytesAvail_OddPair (1920 of 2154) PASS: lldb-unit :: ScriptInterpreter/Python/./ScriptInterpreterPythonTests/PythonDataObjectsTest.TestPythonIntegerToStructuredInteger (1921 of 2154) PASS: lldb-api :: tools/lldb-server/TestGdbRemoteSingleStep.py (1922 of 2154) PASS: lldb-unit :: Utility/./UtilityTests/FileSpecTest.Yaml (1923 of 2154) PASS: lldb-api :: commands/expression/fixits/TestFixIts.py (1924 of 2154) PASS: lldb-api :: commands/expression/calculator_mode/TestCalculatorMode.py (1925 of 2154) PASS: lldb-api :: functionalities/ubsan/basic/TestUbsanBasic.py (1926 of 2154) PASS: lldb-unit :: Utility/./UtilityTests/XcodeSDKTest.GetCanonicalNameAndConstruct (1927 of 2154) PASS: lldb-shell :: Settings/TestLineMarkerColor.test (1928 of 2154) PASS: lldb-unit :: ObjectFile/ELF/./ObjectFileELFTests/ObjectFileELFTest.SectionsResolveConsistently (1929 of 2154) UNSUPPORTED: lldb-api :: functionalities/thread/state/TestThreadStates.py (1930 of 2154) PASS: lldb-unit :: Expression/./ExpressionTests/ClangExpressionDeclMapTest.TestPersistentDeclLookup (1931 of 2154) PASS: lldb-api :: tools/lldb-vscode/breakpoint/TestVSCode_setExceptionBreakpoints.py (1932 of 2154) PASS: lldb-api :: functionalities/data-formatter/data-formatter-objc/nsindexpath/TestDataFormatterNSIndexPath.py (1933 of 2154) PASS: lldb-unit :: Utility/./UtilityTests/Flags.AnyClear (1934 of 2154) PASS: lldb-unit :: Language/Highlighting/./HighlighterTests/HighlighterTest.ClangBraces (1935 of 2154) PASS: lldb-shell :: Minidump/breakpad-symbols.test (1936 of 2154) PASS: lldb-api :: commands/frame/diagnose/virtual-method-call/TestDiagnoseDereferenceVirtualMethodCall.py (1937 of 2154) PASS: lldb-api :: python_api/type/TestTypeList.py (1938 of 2154) UNSUPPORTED: lldb-shell :: Register/x86-64-xmm16-write.test (1939 of 2154) PASS: lldb-api :: commands/watchpoints/watchpoint_size/TestWatchpointSizes.py (1940 of 2154) PASS: lldb-api :: functionalities/thread/concurrent_events/TestConcurrentBreakpointOneDelayBreakpointThreads.py (1941 of 2154) PASS: lldb-api :: lang/objc/hidden-ivars/TestHiddenIvars.py (1942 of 2154) PASS: lldb-unit :: Utility/./UtilityTests/VMRange.ContainsAddr (1943 of 2154) PASS: lldb-api :: api/multiple-debuggers/TestMultipleDebuggers.py (1944 of 2154) PASS: lldb-api :: functionalities/thread/create_after_attach/TestCreateAfterAttach.py (1945 of 2154) PASS: lldb-api :: lang/cpp/namespace/TestNamespaceLookup.py (1946 of 2154) PASS: lldb-api :: types/TestLongTypes.py (1947 of 2154) PASS: lldb-unit :: Host/./HostTests/FileSystemTest.OpenErrno (1948 of 2154) PASS: lldb-api :: commands/expression/completion-in-lambda-and-unnamed-class/TestCompletionInLambdaAndUnnamedClass.py (1949 of 2154) PASS: lldb-unit :: Host/./HostTests/NativeProcessProtocolTest.SetBreakpoint (1950 of 2154) PASS: lldb-api :: functionalities/breakpoint/move_nearest/TestMoveNearest.py (1951 of 2154) PASS: lldb-unit :: Utility/./UtilityTests/Flags.Reset (1952 of 2154) PASS: lldb-api :: functionalities/data-formatter/frameformat_smallstruct/TestFrameFormatSmallStruct.py (1953 of 2154) PASS: lldb-api :: lang/objc/objc-static-method-stripped/TestObjCStaticMethodStripped.py (1954 of 2154) PASS: lldb-unit :: Utility/./UtilityTests/ListenerTest.GetEventWait (1955 of 2154) PASS: lldb-unit :: Utility/./UtilityTests/StreamTest.PutRawBytesToMixedEndian (1956 of 2154) PASS: lldb-unit :: ScriptInterpreter/Python/./ScriptInterpreterPythonTests/PythonDataObjectsTest.TestPythonString (1957 of 2154) PASS: lldb-unit :: Utility/./UtilityTests/StructuredDataTest.StringDump (1958 of 2154) PASS: lldb-unit :: Expression/./ExpressionTests/CppModuleConfigurationTest.LinuxLocalLibCpp (1959 of 2154) PASS: lldb-unit :: Utility/./UtilityTests/DataExtractorTest.GetCStrUnterminated (1960 of 2154) PASS: lldb-shell :: Minidump/Windows/arm-fp-unwind.test (1961 of 2154) PASS: lldb-unit :: Symbol/./SymbolTests/TestClangASTImporter.CopyTypeTagDecl (1962 of 2154) PASS: lldb-unit :: UnwindAssembly/x86/./UnwindAssemblyx86Tests/Testx86AssemblyInspectionEngine.Test32BitOnlyInstruction (1963 of 2154) PASS: lldb-unit :: UnwindAssembly/x86/./UnwindAssemblyx86Tests/Testx86AssemblyInspectionEngine.TestSimplei386ugmented (1964 of 2154) PASS: lldb-unit :: Core/./LLDBCoreTests/RichManglingContextTest.IPDRealloc (1965 of 2154) PASS: lldb-api :: functionalities/gdb_remote_client/TestQemuAArch64TargetXml.py (1966 of 2154) PASS: lldb-unit :: Utility/./UtilityTests/StringListTest.CopyList (1967 of 2154) PASS: lldb-api :: source-manager/TestSourceManager.py (1968 of 2154) PASS: lldb-unit :: Editline/./EditlineTests/EditlineTestFixture.EditlineReceivesMultiLineText (1969 of 2154) PASS: lldb-shell :: Host/TestCustomShell.test (1970 of 2154) PASS: lldb-api :: functionalities/breakpoint/cpp_exception/TestCPPExceptionBreakpoint.py (1971 of 2154) PASS: lldb-api :: commands/expression/result_numbering/TestResultNumbering.py (1972 of 2154) PASS: lldb-unit :: Utility/./UtilityTests/StringExtractorTest.GetHexU8_Underflow (1973 of 2154) PASS: lldb-api :: lang/cpp/typeof/TestTypeOfDeclTypeExpr.py (1974 of 2154) PASS: lldb-api :: functionalities/thread/ignore_suspended/TestIgnoreSuspendedThread.py (1975 of 2154) PASS: lldb-unit :: ScriptInterpreter/Python/./ScriptInterpreterPythonTests/PythonDataObjectsTest.TestPythonDictionaryToStructuredDictionary (1976 of 2154) PASS: lldb-unit :: ScriptInterpreter/Python/./ScriptInterpreterPythonTests/PythonDataObjectsTest.TestGlobalNameResolutionWithDot (1977 of 2154) PASS: lldb-shell :: SymbolFile/Breakpad/stack-cfi-arm.yaml (1978 of 2154) PASS: lldb-api :: python_api/class_members/TestSBTypeClassMembers.py (1979 of 2154) PASS: lldb-unit :: UnwindAssembly/x86/./UnwindAssemblyx86Tests/Testx86AssemblyInspectionEngine.TestPushEBX (1980 of 2154) UNSUPPORTED: lldb-api :: functionalities/breakpoint/hardware_breakpoints/write_memory_with_hw_breakpoint/TestWriteMemoryWithHWBreakpoint.py (1981 of 2154) PASS: lldb-api :: lang/objcxx/class-name-clash/TestNameClash.py (1982 of 2154) PASS: lldb-api :: commands/command/nested_alias/TestNestedAlias.py (1983 of 2154) PASS: lldb-shell :: SymbolFile/NativePDB/global-classes.cpp (1984 of 2154) PASS: lldb-unit :: Utility/./UtilityTests/UriParserTest.BadPort (1985 of 2154) PASS: lldb-api :: functionalities/postmortem/minidump-new/TestMiniDumpUUID.py (1986 of 2154) PASS: lldb-api :: functionalities/breakpoint/objc/TestObjCBreakpoints.py (1987 of 2154) PASS: lldb-api :: functionalities/breakpoint/step_over_breakpoint/TestStepOverBreakpoint.py (1988 of 2154) PASS: lldb-unit :: Symbol/./SymbolTests/PostfixExpression.ToDWARF (1989 of 2154) PASS: lldb-unit :: Utility/./UtilityTests/DataExtractorTest.GetMaxS64 (1990 of 2154) PASS: lldb-api :: functionalities/postmortem/netbsd-core/TestNetBSDCore.py (1991 of 2154) PASS: lldb-api :: tools/lldb-server/TestGdbRemoteKill.py (1992 of 2154) PASS: lldb-api :: functionalities/breakpoint/breakpoint_command/TestBreakpointCommandsFromPython.py (1993 of 2154) PASS: lldb-api :: functionalities/thread/concurrent_events/TestConcurrentSignalWatchBreak.py (1994 of 2154) PASS: lldb-api :: tools/lldb-server/commandline/TestStubReverseConnect.py (1995 of 2154) PASS: lldb-api :: lang/objc/objc-builtin-types/TestObjCBuiltinTypes.py (1996 of 2154) PASS: lldb-unit :: Target/./TargetTests/PathMappingListTest.AbsoluteTests (1997 of 2154) PASS: lldb-unit :: Utility/./UtilityTests/BinaryStreamTest.PutSLEB128TwoBytes (1998 of 2154) PASS: lldb-api :: commands/frame/diagnose/inheritance/TestDiagnoseInheritance.py (1999 of 2154) PASS: lldb-unit :: Utility/./UtilityTests/StringExtractorTest.GetNameColonValueNoColon (2000 of 2154) PASS: lldb-shell :: SymbolFile/DWARF/dwp-separate-debug-file.cpp (2001 of 2154) PASS: lldb-unit :: Process/./ProcessEventDataTests/ProcessEventDataTest.DoOnRemoval (2002 of 2154) PASS: lldb-shell :: SymbolFile/DWARF/DW_TAG_variable-invalid_location.s (2003 of 2154) PASS: lldb-api :: functionalities/tail_call_frames/disambiguate_tail_call_seq/TestDisambiguateTailCallSeq.py (2004 of 2154) PASS: lldb-unit :: Utility/./UtilityTests/StreamTest.ChangingByteOrder (2005 of 2154) PASS: lldb-unit :: SymbolFile/NativePDB/./SymbolFileNativePDBTests/PDBFPOProgramToDWARFExpressionTests.MissingTargetRegister (2006 of 2154) PASS: lldb-shell :: SymbolFile/DWARF/DW_OP_piece-struct.s (2007 of 2154) PASS: lldb-shell :: ObjectFile/ELF/short-build-id.yaml (2008 of 2154) PASS: lldb-shell :: ObjectFile/MachO/lc_build_version_notools.yaml (2009 of 2154) PASS: lldb-unit :: Utility/./UtilityTests/OptionsWithRawTest.MultiWordSuffix (2010 of 2154) PASS: lldb-unit :: Utility/./UtilityTests/RangeDataVector.FindEntryThatContains (2011 of 2154) PASS: lldb-unit :: Host/./HostTests/SocketTest.DecodeHostAndPort (2012 of 2154) PASS: lldb-api :: python_api/breakpoint/TestBreakpointAPI.py (2013 of 2154) UNSUPPORTED: lldb-shell :: SymbolFile/PDB/vbases.test (2014 of 2154) PASS: lldb-unit :: Utility/./UtilityTests/UriParserTest.BracketedHostnameWithPortIPv4 (2015 of 2154) PASS: lldb-shell :: SymbolFile/DWARF/dir-separator-no-comp-dir-relative-name.s (2016 of 2154) PASS: lldb-unit :: debugserver/./debugserverTests/RNBSocket.AnyListen (2017 of 2154) PASS: lldb-unit :: Target/./TargetTests/ExecutionContextTest.GetByteOrderTarget (2018 of 2154) PASS: lldb-api :: commands/process/attach/attach_denied/TestAttachDenied.py (2019 of 2154) PASS: lldb-unit :: Utility/./UtilityTests/AnsiTerminal.AtEnd (2020 of 2154) PASS: lldb-unit :: Utility/./UtilityTests/StringLexerTest.Next (2021 of 2154) PASS: lldb-unit :: Symbol/./SymbolTests/TestClangASTImporter.ImportInvalidType (2022 of 2154) PASS: lldb-shell :: BuildScript/compiler-full-path.test (2023 of 2154) PASS: lldb-api :: iohandler/completion/TestIOHandlerCompletion.py (2024 of 2154) PASS: lldb-api :: commands/watchpoints/multiple_hits/TestMultipleHits.py (2025 of 2154) PASS: lldb-unit :: Utility/./UtilityTests/ScalarTest.Division (2026 of 2154) PASS: lldb-unit :: Utility/./UtilityTests/StringListTest.Join (2027 of 2154) PASS: lldb-api :: commands/log/basic/TestLogging.py (2028 of 2154) PASS: lldb-api :: functionalities/thread/concurrent_events/TestConcurrentSignalBreak.py (2029 of 2154) PASS: lldb-api :: python_api/watchpoint/TestSetWatchpoint.py (2030 of 2154) PASS: lldb-unit :: Utility/./UtilityTests/BinaryStreamTest.PutSLEB128SixBytes (2031 of 2154) PASS: lldb-api :: commands/expression/import-std-module/list-dbg-info-content/TestDbgInfoContentListFromStdModule.py (2032 of 2154) PASS: lldb-shell :: Unwind/thread-step-out-ret-addr-check.test (2033 of 2154) PASS: lldb-api :: commands/settings/quoting/TestQuoting.py (2034 of 2154) PASS: lldb-unit :: Utility/./UtilityTests/StringListTest.JoinNonSpace (2035 of 2154) PASS: lldb-api :: functionalities/data-formatter/array_typedef/TestArrayTypedef.py (2036 of 2154) PASS: lldb-unit :: Expression/./ExpressionTests/DiagnosticManagerTest.FixedExpression (2037 of 2154) PASS: lldb-unit :: Symbol/./SymbolTests/TestClangASTImporter.MetadataPropagationIndirectImport (2038 of 2154) PASS: lldb-unit :: Utility/./UtilityTests/EventTest.DumpEventDataBytes (2039 of 2154) PASS: lldb-unit :: Utility/./UtilityTests/StatusTest.ErrorCodeConstructor (2040 of 2154) PASS: lldb-api :: commands/expression/persistent_types/TestNestedPersistentTypes.py (2041 of 2154) UNSUPPORTED: lldb-api :: macosx/macCatalystAppMacOSFramework/TestMacCatalystAppWithMacOSFramework.py (2042 of 2154) PASS: lldb-unit :: Utility/./UtilityTests/RecordReplayTest.InstrumentedBar (2043 of 2154) PASS: lldb-shell :: Reproducer/TestCrash.test (2044 of 2154) PASS: lldb-shell :: Minidump/Windows/find-module.test (2045 of 2154) PASS: lldb-api :: functionalities/step_scripted/TestStepScripted.py (2046 of 2154) PASS: lldb-unit :: Expression/./ExpressionTests/DiagnosticManagerTest.AppendMessageNoDiag (2047 of 2154) PASS: lldb-unit :: Target/./TargetTests/ModuleCacheTest.GetAndPut (2048 of 2154) PASS: lldb-unit :: Utility/./UtilityTests/TimerTest.CategoryTimesNested (2049 of 2154) PASS: lldb-unit :: Utility/./UtilityTests/StringExtractorTest.DecodeHexU8_Extra (2050 of 2154) PASS: lldb-unit :: Target/./TargetTests/ModuleCacheTest.GetAndPutUuidExists (2051 of 2154) PASS: lldb-unit :: Utility/./UtilityTests/UriParserTest.PortOverflow (2052 of 2154) PASS: lldb-unit :: Thread/./ThreadTests/ThreadTest.GetPrivateStopInfo (2053 of 2154) PASS: lldb-unit :: UnwindAssembly/ARM64/./Arm64InstEmulationTests/TestArm64InstEmulation.TestMediumDarwinFunction (2054 of 2154) PASS: lldb-unit :: UnwindAssembly/x86/./UnwindAssemblyx86Tests/Testx86AssemblyInspectionEngine.TestReturnDetect (2055 of 2154) UNSUPPORTED: lldb-api :: benchmarks/startup/TestStartupDelays.py (2056 of 2154) UNSUPPORTED: lldb-shell :: Register/x86-ymm-write.test (2057 of 2154) PASS: lldb-api :: lang/cpp/gmodules-templates/TestGModules.py (2058 of 2154) PASS: lldb-api :: lang/objc/exceptions/TestObjCExceptions.py (2059 of 2154) PASS: lldb-unit :: Symbol/./SymbolTests/TestClangASTImporter.MetadataPropagation (2060 of 2154) PASS: lldb-api :: lang/cpp/offsetof/TestOffsetofCpp.py (2061 of 2154) PASS: lldb-api :: functionalities/data-formatter/data-formatter-objc/TestDataFormatterObjCNSBundle.py (2062 of 2154) PASS: lldb-unit :: ScriptInterpreter/Python/./ScriptInterpreterPythonTests/PythonDataObjectsTest.TestDictionaryResolutionWithDot (2063 of 2154) PASS: lldb-unit :: ScriptInterpreter/Python/./ScriptInterpreterPythonTests/PythonDataObjectsTest.TestBorrowedReferences (2064 of 2154) PASS: lldb-shell :: SymbolFile/NativePDB/function-types-classes.cpp (2065 of 2154) PASS: lldb-shell :: BuildScript/script-args.test (2066 of 2154) PASS: lldb-api :: python_api/get-value-32bit-int/TestGetValue32BitInt.py (2067 of 2154) PASS: lldb-api :: lang/c/local_types/TestUseClosestType.py (2068 of 2154) PASS: lldb-unit :: Symbol/./SymbolTests/TestTypeSystemClang.TestBuiltinTypeForEncodingAndBitSize (2069 of 2154) PASS: lldb-api :: functionalities/data-formatter/hexcaps/TestDataFormatterHexCaps.py (2070 of 2154) PASS: lldb-unit :: Utility/./UtilityTests/CompletionRequest.TryCompleteCurrentArgMode (2071 of 2154) PASS: lldb-api :: lang/cpp/stl/TestStdCXXDisassembly.py (2072 of 2154) UNSUPPORTED: lldb-api :: tools/lldb-server/TestGdbRemoteCompletion.py (2073 of 2154) PASS: lldb-unit :: UnwindAssembly/x86/./UnwindAssemblyx86Tests/Testx86AssemblyInspectionEngine.TestSimplex86_64Augmented (2074 of 2154) PASS: lldb-api :: lang/objc/modules-update/TestClangModulesUpdate.py (2075 of 2154) PASS: lldb-shell :: Reproducer/TestGDBRemoteRepro.test (2076 of 2154) PASS: lldb-unit :: Target/./TargetTests/RemoteAwarePlatformTest.TestResolveExecutabelOnClientByPlatform (2077 of 2154) PASS: lldb-shell :: Reproducer/TestDiscard.test (2078 of 2154) PASS: lldb-unit :: Utility/./UtilityTests/ProcessInstanceInfo.Yaml (2079 of 2154) PASS: lldb-api :: tools/lldb-vscode/breakpoint/TestVSCode_setFunctionBreakpoints.py (2080 of 2154) PASS: lldb-api :: functionalities/data-formatter/data-formatter-globals/TestDataFormatterGlobals.py (2081 of 2154) PASS: lldb-unit :: Utility/./UtilityTests/FileSpecTest.FormatFileSpec (2082 of 2154) PASS: lldb-api :: functionalities/data-formatter/data-formatter-stl/libcxx/unique_ptr/TestDataFormatterLibcxxUniquePtr.py (2083 of 2154) PASS: lldb-shell :: ObjectFile/ELF/section-addresses.yaml (2084 of 2154) PASS: lldb-api :: functionalities/data-formatter/data-formatter-objc/nsstring/TestDataFormatterNSString.py (2085 of 2154) PASS: lldb-api :: python_api/lldbutil/process/TestPrintStackTraces.py (2086 of 2154) PASS: lldb-api :: lang/objc/modules-app-update/TestClangModulesAppUpdate.py (2087 of 2154) PASS: lldb-shell :: ObjectFile/MachO/subsections.yaml (2088 of 2154) PASS: lldb-unit :: Utility/./UtilityTests/StreamTest.PutBytesAsRawHex8ToLittleEndian (2089 of 2154) PASS: lldb-api :: commands/expression/rdar42038760/TestScalarURem.py (2090 of 2154) PASS: lldb-api :: lang/objc/forward-decl/TestForwardDecl.py (2091 of 2154) PASS: lldb-api :: commands/expression/char/TestExprsChar.py (2092 of 2154) PASS: lldb-api :: lang/c/offsetof/TestOffsetof.py (2093 of 2154) PASS: lldb-unit :: Utility/./UtilityTests/BinaryStreamTest.PutULEB128NineBytes (2094 of 2154) PASS: lldb-shell :: Commands/command-thread-select.test (2095 of 2154) PASS: lldb-shell :: Settings/TestDisassemblyFormat.test (2096 of 2154) PASS: lldb-unit :: Utility/./UtilityTests/DataExtractorTest.GetCStrAtEnd (2097 of 2154) PASS: lldb-api :: lang/cpp/unicode-literals/TestUnicodeLiterals.py (2098 of 2154) PASS: lldb-unit :: Utility/./UtilityTests/LogChannelEnabledTest.LogVerboseThread (2099 of 2154) PASS: lldb-shell :: SymbolFile/NativePDB/function-types-builtins.cpp (2100 of 2154) PASS: lldb-api :: lang/objc/foundation/TestFoundationDisassembly.py (2101 of 2154) PASS: lldb-unit :: Utility/./UtilityTests/BinaryStreamTest.PutSLEB128NineBytes (2102 of 2154) PASS: lldb-api :: functionalities/process_crash_info/TestProcessCrashInfo.py (2103 of 2154) PASS: lldb-unit :: Utility/./UtilityTests/UriParserTest.SchemeHostSeparator2 (2104 of 2154) PASS: lldb-api :: commands/version/TestVersion.py (2105 of 2154) UNSUPPORTED: lldb-api :: lang/objc/rdar-12408181/TestRdar12408181.py (2106 of 2154) PASS: lldb-unit :: Utility/./UtilityTests/StringListTest.GetMaxStringLengthEqualSize (2107 of 2154) PASS: lldb-shell :: Settings/TestFrameFormatColor.test (2108 of 2154) PASS: lldb-unit :: Utility/./UtilityTests/XcodeSDKTest.MergeTest (2109 of 2154) PASS: lldb-shell :: Settings/TestModuleCacheSanity.test (2110 of 2154) PASS: lldb-unit :: Host/./HostTests/FileSystemTest.FileAndDirectoryComponents (2111 of 2154) PASS: lldb-unit :: UnwindAssembly/x86/./UnwindAssemblyx86Tests/Testx86AssemblyInspectionEngine.TestPushExtended (2112 of 2154) UNSUPPORTED: lldb-api :: functionalities/darwin_log/filter/exact_match/activity/TestDarwinLogFilterMatchActivity.py (2113 of 2154) PASS: lldb-unit :: ObjectFile/Breakpad/./ObjectFileBreakpadTests/FileRecord.parse (2114 of 2154) UNSUPPORTED: lldb-api :: functionalities/data-formatter/data-formatter-stl/libstdcpp/vbool/TestDataFormatterStdVBool.py (2115 of 2154) PASS: lldb-unit :: Utility/./UtilityTests/StreamTeeTest.DefaultConstructor (2116 of 2154) PASS: lldb-unit :: Expression/./ExpressionTests/DiagnosticManagerTest.PutStringMultiple (2117 of 2154) PASS: lldb-unit :: Utility/./UtilityTests/StringListTest.LongestCommonPrefixSingleElement (2118 of 2154) PASS: lldb-api :: functionalities/tail_call_frames/thread_step_out_message/TestArtificialFrameStepOutMessage.py (2119 of 2154) PASS: lldb-api :: iohandler/autosuggestion/TestAutosuggestion.py (2120 of 2154) PASS: lldb-api :: commands/expression/save_jit_objects/TestSaveJITObjects.py (2121 of 2154) PASS: lldb-unit :: Utility/./UtilityTests/UriParserTest.BracketedHostnamePort (2122 of 2154) PASS: lldb-unit :: Expression/./ExpressionTests/CppModuleConfigurationTest.LibCppV2 (2123 of 2154) PASS: lldb-api :: functionalities/gdb_remote_client/TestProcessConnect.py (2124 of 2154) PASS: lldb-unit :: ScriptInterpreter/Python/./ScriptInterpreterPythonTests/PythonDataObjectsTest.TestGlobalNameResolutionNoDot (2125 of 2154) PASS: lldb-unit :: Expression/./ExpressionTests/CppModuleConfigurationTest.MissingUsrInclude (2126 of 2154) PASS: lldb-shell :: SymbolFile/NativePDB/tag-types.cpp (2127 of 2154) PASS: lldb-unit :: Utility/./UtilityTests/StringExtractorTest.GetHexBytes (2128 of 2154) PASS: lldb-shell :: SymbolFile/DWARF/find-variable-file.cpp (2129 of 2154) PASS: lldb-api :: functionalities/data-formatter/data-formatter-script/TestDataFormatterScript.py (2130 of 2154) PASS: lldb-unit :: Utility/./UtilityTests/DataExtractorTest.GetCStr (2131 of 2154) PASS: lldb-shell :: SymbolFile/DWARF/deterministic-build.cpp (2132 of 2154) PASS: lldb-unit :: Utility/./UtilityTests/DataExtractorTest.GetFloat (2133 of 2154) PASS: lldb-unit :: UnwindAssembly/x86/./UnwindAssemblyx86Tests/Testx86AssemblyInspectionEngine.TestPushEAX (2134 of 2154) PASS: lldb-api :: functionalities/data-formatter/data-formatter-synthtype/TestDataFormatterSynthType.py (2135 of 2154) PASS: lldb-unit :: Utility/./UtilityTests/StringListTest.LongestCommonPrefixNoPrefix (2136 of 2154) PASS: lldb-shell :: SymbolFile/DWARF/DW_TAG_variable-DW_AT_const_value.s (2137 of 2154) PASS: lldb-unit :: Process/gdb-remote/./ProcessGdbRemoteTests/GDBRemoteClientBaseTest.SendContinueAndAsyncSignal (2138 of 2154) UNSUPPORTED: lldb-shell :: SymbolFile/PDB/compilands.test (2139 of 2154) PASS: lldb-unit :: Utility/./UtilityTests/DataExtractorTest.UncommonAddressSize (2140 of 2154) PASS: lldb-unit :: Utility/./UtilityTests/FileSpecTest.Equal (2141 of 2154) PASS: lldb-api :: commands/target/stop-hook/enable/TestTargetStopHookEnable.py (2142 of 2154) PASS: lldb-api :: lang/objc/print-obj/TestPrintObj.py (2143 of 2154) PASS: lldb-api :: functionalities/data-formatter/ostypeformatting/TestFormattersOsType.py (2144 of 2154) PASS: lldb-api :: commands/expression/context-object/TestContextObject.py (2145 of 2154) PASS: lldb-unit :: SymbolFile/NativePDB/./SymbolFileNativePDBTests/PDBFPOProgramToDWARFExpressionTests.UnresolvedDependentCyclicRegisterAssignmentReference (2146 of 2154) PASS: lldb-unit :: Utility/./UtilityTests/StringExtractorTest.GetHexU8_Extra (2147 of 2154) PASS: lldb-api :: commands/target/stop-hook/disable/TestTargetStopHookDisable.py (2148 of 2154) PASS: lldb-unit :: Utility/./UtilityTests/EnvironmentTest.EnvpConversion (2149 of 2154) PASS: lldb-unit :: Utility/./UtilityTests/BinaryStreamTest.PutSLEB128FiveBytes (2150 of 2154) PASS: lldb-api :: lang/objc/real-definition/TestRealDefinition.py (2151 of 2154) PASS: lldb-api :: commands/disassemble/basic/TestDisassembleBreakpoint.py (2152 of 2154) PASS: lldb-api :: commands/expression/invalid-args/TestInvalidArgsExpression.py (2153 of 2154) PASS: lldb-api :: commands/expression/po_verbosity/TestPoVerbosity.py (2154 of 2154) Slowest Tests: -------------------------------------------------------------------------- 287.55s: lldb-api :: macosx/simulator/TestSimulatorPlatform.py 186.77s: lldb-api :: functionalities/postmortem/mach-core/TestMachCore.py 103.55s: lldb-api :: tools/lldb-server/TestLldbGdbServer.py 55.07s: lldb-api :: lang/objc/hidden-ivars/TestHiddenIvars.py 51.91s: lldb-api :: lang/objc/foundation/TestObjCMethods.py 51.62s: lldb-api :: lang/objc/exceptions/TestObjCExceptions.py 50.89s: lldb-api :: lang/objc/foundation/TestFoundationDisassembly.py 50.21s: lldb-api :: functionalities/gdb_remote_client/TestNoGPacketSupported.py 49.58s: lldb-api :: lang/objc/objc-new-syntax/TestObjCNewSyntaxDictionary.py 48.16s: lldb-shell :: SymbolFile/Breakpad/unwind-via-stack-win.test 47.07s: lldb-api :: api/multithreaded/TestMultithreaded.py 45.49s: lldb-api :: types/TestLongTypesExpr.py 42.17s: lldb-api :: lang/cpp/namespace/TestNamespaceLookup.py 39.15s: lldb-api :: lang/objc/objc-new-syntax/TestObjCNewSyntaxLiteral.py 38.99s: lldb-api :: functionalities/plugins/command_plugin/TestPluginCommands.py 38.09s: lldb-api :: functionalities/completion/TestCompletion.py 37.10s: lldb-api :: functionalities/inferior-crashing/TestInferiorCrashing.py 36.99s: lldb-api :: functionalities/inferior-crashing/recursive-inferior/TestRecursiveInferior.py 36.45s: lldb-api :: functionalities/thread/step_until/TestStepUntil.py 36.01s: lldb-api :: python_api/target/TestTargetAPI.py

Hide Details

Tests Times: -------------------------------------------------------------------------- [ Range ] :: [ Percentage ] :: [ Count ] -------------------------------------------------------------------------- [280s,300s) :: [ ] :: [ 1/2154] [260s,280s) :: [ ] :: [ 0/2154] [240s,260s) :: [ ] :: [ 0/2154] [220s,240s) :: [ ] :: [ 0/2154] [200s,220s) :: [ ] :: [ 0/2154] [180s,200s) :: [ ] :: [ 1/2154] [160s,180s) :: [ ] :: [ 0/2154] [140s,160s) :: [ ] :: [ 0/2154] [120s,140s) :: [ ] :: [ 0/2154] [100s,120s) :: [ ] :: [ 1/2154] [ 80s,100s) :: [ ] :: [ 0/2154] [ 60s, 80s) :: [ ] :: [ 0/2154] [ 40s, 60s) :: [ ] :: [ 12/2154] [ 20s, 40s) :: [ ] :: [ 36/2154] [ 0s, 20s) :: [*************************************** ] :: [2103/2154] -------------------------------------------------------------------------- ******************** Failed Tests (1): lldb-api :: commands/target/stop-hooks/TestStopHookScripted.py

Hide Details

Hide Details

Testing Time: 1664.29s Unsupported : 153 Passed : 1994 Expectedly Failed: 6 Failed : 1 FAILED: tools/lldb/test/CMakeFiles/check-lldb-lit cd /Users/buildslave/jenkins/workspace/lldb-cmake/lldb-build/tools/lldb/test && /usr/local/Frameworks/Python.framework/Versions/3.7/bin/python3.7 /Users/buildslave/jenkins/workspace/lldb-cmake/lldb-build/./bin/llvm-lit -v --time-tests --shuffle --xunit-xml-output=/Users/buildslave/jenkins/workspace/lldb-cmake/test/results.xml -v -j 4 /Users/buildslave/jenkins/workspace/lldb-cmake/lldb-build/tools/lldb/test ninja: build stopped: subcommand failed. Command failed: Command '['/usr/bin/env', 'TERM=vt100', '/usr/local/bin/ninja', '-v', 'check-lldb']' returned non-zero exit status 1 Command: ['/usr/bin/env', 'TERM=vt100', '/usr/local/bin/ninja', '-v', 'check-lldb'] [Pipeline] } [Pipeline] // timeout [Pipeline] } [Pipeline] // stage [Pipeline] stage [Pipeline] { (Declarative: Post Actions) [Pipeline] scanForIssues [Clang (LLVM based)] Sleeping for 5 seconds due to JENKINS-32191... [Clang (LLVM based)] Parsing console log (workspace: '/Users/buildslave/jenkins/workspace/lldb-cmake') [Clang (LLVM based)] Successfully parsed console log [Clang (LLVM based)] -> found 7 issues (skipped 6 duplicates) [Clang (LLVM based)] Post processing issues on 'green-dragon-10' with source code encoding 'UTF-8' [Clang (LLVM based)] Creating SCM blamer to obtain author and commit information for affected files [Clang (LLVM based)] Creating SCM miner to obtain statistics for affected repository files [Clang (LLVM based)] Resolving file names for all issues in source directory '/Users/buildslave/jenkins/workspace/lldb-cmake' [Clang (LLVM based)] -> resolved paths in source directory (5 found, 0 not found) [Clang (LLVM based)] Resolving module names from module definitions (build.xml, pom.xml, or Manifest.mf files) [Clang (LLVM based)] -> resolved module names for 7 issues [Clang (LLVM based)] Resolving package names (or namespaces) by parsing the affected files [Clang (LLVM based)] -> resolved package names of 5 affected files [Clang (LLVM based)] No filter has been set, publishing all 7 issues [Clang (LLVM based)] Creating fingerprints for all affected code blocks to track issues over different builds [Clang (LLVM based)] -> created fingerprints for 7 issues (skipped 0 issues) [Clang (LLVM based)] Copying affected files to Jenkins' build folder '/Users/Shared/Jenkins/Home/jobs/lldb-cmake/builds/23998/files-with-issues' [Clang (LLVM based)] -> 3 copied, 2 not in workspace, 0 not-found, 0 with I/O error [Pipeline] junit Recording test results [Pipeline] } [Pipeline] // stage [Pipeline] } [Pipeline] // withEnv [Pipeline] } [Pipeline] // node [Pipeline] End of Pipeline ERROR: script returned exit code 1 Finished: FAILURE