Started 1 hr 15 min ago
Took 1 hr 7 min

Failed Build clang-d363574-g1621c004da7-t13669-b13669.tar.gz (Aug 14, 2020 9:31:44 PM)

Issues

Found 3 issues:
Ninja target: 20030626-2.c.o
[10852/11531] /Users/buildslave/jenkins/workspace/test-suite-verify-machineinstrs-aarch64-O3/test-suite-build/tools/timeit --summary SingleSource/Regression/C/gcc-c-torture/execute/CMakeFiles/GCC-C-execute-loop-2g.dir/loop-2g.c.o.time /Users/buildslave/jenkins/workspace/test-suite-verify-machineinstrs-aarch64-O3/compiler/bin/clang -DNDEBUG  -B /Applications/Xcode.app/Contents/Developer/Toolchains/XcodeDefault.xctoolchain/usr/bin    -Wno-unused-command-line-argument -mllvm -verify-machineinstrs -O3 -arch arm64 -isysroot /Applications/Xcode.app/Contents/Developer/Platforms/iPhoneOS.platform/Developer/SDKs/iPhoneOS13.5.sdk   -w -Werror=date-time -w -MD -MT SingleSource/Regression/C/gcc-c-torture/execute/CMakeFiles/GCC-C-execute-loop-2g.dir/loop-2g.c.o -MF SingleSource/Regression/C/gcc-c-torture/execute/CMakeFiles/GCC-C-execute-loop-2g.dir/loop-2g.c.o.d -o SingleSource/Regression/C/gcc-c-torture/execute/CMakeFiles/GCC-C-execute-loop-2g.dir/loop-2g.c.o   -c /Users/buildslave/jenkins/workspace/test-suite-verify-machineinstrs-aarch64-O3/test-suite/SingleSource/Regression/C/gcc-c-torture/execute/loop-2g.c
[10853/11531] : && /Users/buildslave/jenkins/workspace/test-suite-verify-machineinstrs-aarch64-O3/test-suite-build/tools/timeit --summary SingleSource/Regression/C/gcc-c-torture/execute/GCC-C-execute-900409-1.link.time /Users/buildslave/jenkins/workspace/test-suite-verify-machineinstrs-aarch64-O3/compiler/bin/clang -B /Applications/Xcode.app/Contents/Developer/Toolchains/XcodeDefault.xctoolchain/usr/bin    -Wno-unused-command-line-argument -mllvm -verify-machineinstrs -O3 -arch arm64 -isysroot /Applications/Xcode.app/Contents/Developer/Platforms/iPhoneOS.platform/Developer/SDKs/iPhoneOS13.5.sdk -Wl,-search_paths_first -Wl,-headerpad_max_install_names -B /Applications/Xcode.app/Contents/Developer/Toolchains/XcodeDefault.xctoolchain/usr/bin SingleSource/Regression/C/gcc-c-torture/execute/CMakeFiles/GCC-C-execute-900409-1.dir/900409-1.c.o  -o SingleSource/Regression/C/gcc-c-torture/execute/GCC-C-execute-900409-1   && :
[10854/11531] : && /Users/buildslave/jenkins/workspace/test-suite-verify-machineinstrs-aarch64-O3/test-suite-build/tools/timeit --summary SingleSource/Regression/C/gcc-c-torture/execute/GCC-C-execute-20001228-1.link.time /Users/buildslave/jenkins/workspace/test-suite-verify-machineinstrs-aarch64-O3/compiler/bin/clang -B /Applications/Xcode.app/Contents/Developer/Toolchains/XcodeDefault.xctoolchain/usr/bin    -Wno-unused-command-line-argument -mllvm -verify-machineinstrs -O3 -arch arm64 -isysroot /Applications/Xcode.app/Contents/Developer/Platforms/iPhoneOS.platform/Developer/SDKs/iPhoneOS13.5.sdk -Wl,-search_paths_first -Wl,-headerpad_max_install_names -B /Applications/Xcode.app/Contents/Developer/Toolchains/XcodeDefault.xctoolchain/usr/bin SingleSource/Regression/C/gcc-c-torture/execute/CMakeFiles/GCC-C-execute-20001228-1.dir/20001228-1.c.o  -o SingleSource/Regression/C/gcc-c-torture/execute/GCC-C-execute-20001228-1   && :
[10855/11531] : && /Users/buildslave/jenkins/workspace/test-suite-verify-machineinstrs-aarch64-O3/test-suite-build/tools/timeit --summary SingleSource/Regression/C/gcc-c-torture/execute/GCC-C-execute-loop-2g.link.time /Users/buildslave/jenkins/workspace/test-suite-verify-machineinstrs-aarch64-O3/compiler/bin/clang -B /Applications/Xcode.app/Contents/Developer/Toolchains/XcodeDefault.xctoolchain/usr/bin    -Wno-unused-command-line-argument -mllvm -verify-machineinstrs -O3 -arch arm64 -isysroot /Applications/Xcode.app/Contents/Developer/Platforms/iPhoneOS.platform/Developer/SDKs/iPhoneOS13.5.sdk -Wl,-search_paths_first -Wl,-headerpad_max_install_names -B /Applications/Xcode.app/Contents/Developer/Toolchains/XcodeDefault.xctoolchain/usr/bin SingleSource/Regression/C/gcc-c-torture/execute/CMakeFiles/GCC-C-execute-loop-2g.dir/loop-2g.c.o  -o SingleSource/Regression/C/gcc-c-torture/execute/GCC-C-execute-loop-2g   && :
[10856/11531] /Users/buildslave/jenkins/workspace/test-suite-verify-machineinstrs-aarch64-O3/test-suite-build/tools/timeit --summary SingleSource/Regression/C/gcc-c-torture/execute/CMakeFiles/GCC-C-execute-20030626-2.dir/20030626-2.c.o.time /Users/buildslave/jenkins/workspace/test-suite-verify-machineinstrs-aarch64-O3/compiler/bin/clang -DNDEBUG  -B /Applications/Xcode.app/Contents/Developer/Toolchains/XcodeDefault.xctoolchain/usr/bin    -Wno-unused-command-line-argument -mllvm -verify-machineinstrs -O3 -arch arm64 -isysroot /Applications/Xcode.app/Contents/Developer/Platforms/iPhoneOS.platform/Developer/SDKs/iPhoneOS13.5.sdk   -w -Werror=date-time -w -MD -MT SingleSource/Regression/C/gcc-c-torture/execute/CMakeFiles/GCC-C-execute-20030626-2.dir/20030626-2.c.o -MF SingleSource/Regression/C/gcc-c-torture/execute/CMakeFiles/GCC-C-execute-20030626-2.dir/20030626-2.c.o.d -o SingleSource/Regression/C/gcc-c-torture/execute/CMakeFiles/GCC-C-execute-20030626-2.dir/20030626-2.c.o   -c /Users/buildslave/jenkins/workspace/test-suite-verify-machineinstrs-aarch64-O3/test-suite/SingleSource/Regression/C/gcc-c-torture/execute/20030626-2.c
FAILED: SingleSource/Regression/C/gcc-c-torture/execute/CMakeFiles/GCC-C-execute-20030626-2.dir/20030626-2.c.o 
/Users/buildslave/jenkins/workspace/test-suite-verify-machineinstrs-aarch64-O3/test-suite-build/tools/timeit --summary SingleSource/Regression/C/gcc-c-torture/execute/CMakeFiles/GCC-C-execute-20030626-2.dir/20030626-2.c.o.time /Users/buildslave/jenkins/workspace/test-suite-verify-machineinstrs-aarch64-O3/compiler/bin/clang -DNDEBUG  -B /Applications/Xcode.app/Contents/Developer/Toolchains/XcodeDefault.xctoolchain/usr/bin    -Wno-unused-command-line-argument -mllvm -verify-machineinstrs -O3 -arch arm64 -isysroot /Applications/Xcode.app/Contents/Developer/Platforms/iPhoneOS.platform/Developer/SDKs/iPhoneOS13.5.sdk   -w -Werror=date-time -w -MD -MT SingleSource/Regression/C/gcc-c-torture/execute/CMakeFiles/GCC-C-execute-20030626-2.dir/20030626-2.c.o -MF SingleSource/Regression/C/gcc-c-torture/execute/CMakeFiles/GCC-C-execute-20030626-2.dir/20030626-2.c.o.d -o SingleSource/Regression/C/gcc-c-torture/execute/CMakeFiles/GCC-C-execute-20030626-2.dir/20030626-2.c.o   -c /Users/buildslave/jenkins/workspace/test-suite-verify-machineinstrs-aarch64-O3/test-suite/SingleSource/Regression/C/gcc-c-torture/execute/20030626-2.c
Assertion failed: (New->getType() == getType() && "replaceAllUses of value with new value of different type!"), function doRAUW, file /Users/buildslave/jenkins/workspace/clang-stage1-RA/llvm-project/llvm/lib/IR/Value.cpp, line 473.
assertion: New->getType() == getType() && "replaceAllUses of value with new value of different type!"
[10854/11531] : && /Users/buildslave/jenkins/workspace/test-suite-verify-machineinstrs-aarch64-O3/test-suite-build/tools/timeit --summary SingleSource/Regression/C/gcc-c-torture/execute/GCC-C-execute-20001228-1.link.time /Users/buildslave/jenkins/workspace/test-suite-verify-machineinstrs-aarch64-O3/compiler/bin/clang -B /Applications/Xcode.app/Contents/Developer/Toolchains/XcodeDefault.xctoolchain/usr/bin    -Wno-unused-command-line-argument -mllvm -verify-machineinstrs -O3 -arch arm64 -isysroot /Applications/Xcode.app/Contents/Developer/Platforms/iPhoneOS.platform/Developer/SDKs/iPhoneOS13.5.sdk -Wl,-search_paths_first -Wl,-headerpad_max_install_names -B /Applications/Xcode.app/Contents/Developer/Toolchains/XcodeDefault.xctoolchain/usr/bin SingleSource/Regression/C/gcc-c-torture/execute/CMakeFiles/GCC-C-execute-20001228-1.dir/20001228-1.c.o  -o SingleSource/Regression/C/gcc-c-torture/execute/GCC-C-execute-20001228-1   && :
[10855/11531] : && /Users/buildslave/jenkins/workspace/test-suite-verify-machineinstrs-aarch64-O3/test-suite-build/tools/timeit --summary SingleSource/Regression/C/gcc-c-torture/execute/GCC-C-execute-loop-2g.link.time /Users/buildslave/jenkins/workspace/test-suite-verify-machineinstrs-aarch64-O3/compiler/bin/clang -B /Applications/Xcode.app/Contents/Developer/Toolchains/XcodeDefault.xctoolchain/usr/bin    -Wno-unused-command-line-argument -mllvm -verify-machineinstrs -O3 -arch arm64 -isysroot /Applications/Xcode.app/Contents/Developer/Platforms/iPhoneOS.platform/Developer/SDKs/iPhoneOS13.5.sdk -Wl,-search_paths_first -Wl,-headerpad_max_install_names -B /Applications/Xcode.app/Contents/Developer/Toolchains/XcodeDefault.xctoolchain/usr/bin SingleSource/Regression/C/gcc-c-torture/execute/CMakeFiles/GCC-C-execute-loop-2g.dir/loop-2g.c.o  -o SingleSource/Regression/C/gcc-c-torture/execute/GCC-C-execute-loop-2g   && :
[10856/11531] /Users/buildslave/jenkins/workspace/test-suite-verify-machineinstrs-aarch64-O3/test-suite-build/tools/timeit --summary SingleSource/Regression/C/gcc-c-torture/execute/CMakeFiles/GCC-C-execute-20030626-2.dir/20030626-2.c.o.time /Users/buildslave/jenkins/workspace/test-suite-verify-machineinstrs-aarch64-O3/compiler/bin/clang -DNDEBUG  -B /Applications/Xcode.app/Contents/Developer/Toolchains/XcodeDefault.xctoolchain/usr/bin    -Wno-unused-command-line-argument -mllvm -verify-machineinstrs -O3 -arch arm64 -isysroot /Applications/Xcode.app/Contents/Developer/Platforms/iPhoneOS.platform/Developer/SDKs/iPhoneOS13.5.sdk   -w -Werror=date-time -w -MD -MT SingleSource/Regression/C/gcc-c-torture/execute/CMakeFiles/GCC-C-execute-20030626-2.dir/20030626-2.c.o -MF SingleSource/Regression/C/gcc-c-torture/execute/CMakeFiles/GCC-C-execute-20030626-2.dir/20030626-2.c.o.d -o SingleSource/Regression/C/gcc-c-torture/execute/CMakeFiles/GCC-C-execute-20030626-2.dir/20030626-2.c.o   -c /Users/buildslave/jenkins/workspace/test-suite-verify-machineinstrs-aarch64-O3/test-suite/SingleSource/Regression/C/gcc-c-torture/execute/20030626-2.c
FAILED: SingleSource/Regression/C/gcc-c-torture/execute/CMakeFiles/GCC-C-execute-20030626-2.dir/20030626-2.c.o 
/Users/buildslave/jenkins/workspace/test-suite-verify-machineinstrs-aarch64-O3/test-suite-build/tools/timeit --summary SingleSource/Regression/C/gcc-c-torture/execute/CMakeFiles/GCC-C-execute-20030626-2.dir/20030626-2.c.o.time /Users/buildslave/jenkins/workspace/test-suite-verify-machineinstrs-aarch64-O3/compiler/bin/clang -DNDEBUG  -B /Applications/Xcode.app/Contents/Developer/Toolchains/XcodeDefault.xctoolchain/usr/bin    -Wno-unused-command-line-argument -mllvm -verify-machineinstrs -O3 -arch arm64 -isysroot /Applications/Xcode.app/Contents/Developer/Platforms/iPhoneOS.platform/Developer/SDKs/iPhoneOS13.5.sdk   -w -Werror=date-time -w -MD -MT SingleSource/Regression/C/gcc-c-torture/execute/CMakeFiles/GCC-C-execute-20030626-2.dir/20030626-2.c.o -MF SingleSource/Regression/C/gcc-c-torture/execute/CMakeFiles/GCC-C-execute-20030626-2.dir/20030626-2.c.o.d -o SingleSource/Regression/C/gcc-c-torture/execute/CMakeFiles/GCC-C-execute-20030626-2.dir/20030626-2.c.o   -c /Users/buildslave/jenkins/workspace/test-suite-verify-machineinstrs-aarch64-O3/test-suite/SingleSource/Regression/C/gcc-c-torture/execute/20030626-2.c
Assertion failed: (New->getType() == getType() && "replaceAllUses of value with new value of different type!"), function doRAUW, file /Users/buildslave/jenkins/workspace/clang-stage1-RA/llvm-project/llvm/lib/IR/Value.cpp, line 473.
PLEASE submit a bug report to https://bugs.llvm.org/ and include the crash backtrace, preprocessed source, and associated run script.
Stack dump:
Error: clang frontend command failed due to signal (use -v to see invocation)
33 clang                    0x0000000105ae7e8d clang::driver::Compilation::ExecuteJobs(clang::driver::JobList const&, llvm::SmallVectorImpl<std::__1::pair<int, clang::driver::Command const*> >&) const + 125
34 clang                    0x0000000105afc47c clang::driver::Driver::ExecuteCompilation(clang::driver::Compilation&, llvm::SmallVectorImpl<std::__1::pair<int, clang::driver::Command const*> >&) + 204
35 clang                    0x000000010362cc75 main + 10389
36 libdyld.dylib            0x00007fff6eb25cc9 start + 1
37 libdyld.dylib            0x0000000000000018 start + 18446603338658980688
clang-12: error: clang frontend command failed due to signal (use -v to see invocation)
clang version 12.0.0 (https://github.com/llvm/llvm-project.git 1621c004da7b6a917be53b3569218da91b9f54b0)
Target: aarch64-apple-darwin19.5.0

Build Log

Changes
  1. Remove inline gc arguments from statepoints (details)
  2. [Statepoint] Remove code related to inline operand bundles (details)
  3. [Tests] Be consistent w/definition of statepoint-example (details)

Started by upstream project relay-test-suite-verify-machineinstrs build number 8660
originally caused by:

This run spent:

  • 35 min waiting;
  • 1 hr 7 min build duration;
  • 1 hr 7 min total from scheduled to completion.
Revision: 9200ad6bba3db32c6b52a2e43888797e1c141376
  • refs/remotes/origin/master
Revision: 1621c004da7b6a917be53b3569218da91b9f54b0
  • detached
Revision: 61eaf8a9eccf4edbef18f55593d1095254ed3ff5
  • refs/remotes/origin/master
Revision: 350389291e2a1e1dec566596c97919b5569c2f33
  • refs/remotes/origin/master

Identified problems

Assertion failure

This build failed because of an assertion failure. Below is a list of all errors in the build log:
Indication 1

Ninja target failed

Below is a link to the first failed ninja target.
Indication 2

Compile Error

This build failed because of a compile error. Below is a list of all errors in the build log:
Indication 3