Started 23 days ago
Took 36 min

Failed Build clang-d360332-gde7bf722c23-t12691-b12691.tar.gz (Jul 15, 2020 2:26:26 AM)

Issues

Found 3 issues:
Ninja target: matrix-types-spec.cpp.o
[4940/7672] /Users/buildslave/jenkins/workspace/test-suite-verify-machineinstrs-x86_64-O3/test-suite-build/tools/timeit --summary SingleSource/UnitTests/Vector/CMakeFiles/Vector-sumarray.dir/sumarray.c.o.time /Users/buildslave/jenkins/workspace/test-suite-verify-machineinstrs-x86_64-O3/compiler/bin/clang -DNDEBUG  -B /Applications/Xcode.app/Contents/Developer/Toolchains/XcodeDefault.xctoolchain/usr/bin    -Wno-unused-command-line-argument -mllvm -verify-machineinstrs -O3 -arch x86_64 -isysroot /Applications/Xcode.app/Contents/Developer/Platforms/MacOSX.platform/Developer/SDKs/MacOSX10.15.sdk   -w -Werror=date-time -MD -MT SingleSource/UnitTests/Vector/CMakeFiles/Vector-sumarray.dir/sumarray.c.o -MF SingleSource/UnitTests/Vector/CMakeFiles/Vector-sumarray.dir/sumarray.c.o.d -o SingleSource/UnitTests/Vector/CMakeFiles/Vector-sumarray.dir/sumarray.c.o   -c /Users/buildslave/jenkins/workspace/test-suite-verify-machineinstrs-x86_64-O3/test-suite/SingleSource/UnitTests/Vector/sumarray.c
[4941/7672] /Users/buildslave/jenkins/workspace/test-suite-verify-machineinstrs-x86_64-O3/test-suite-build/tools/timeit --summary SingleSource/UnitTests/Vector/CMakeFiles/Vector-build2.dir/build2.c.o.time /Users/buildslave/jenkins/workspace/test-suite-verify-machineinstrs-x86_64-O3/compiler/bin/clang -DNDEBUG  -B /Applications/Xcode.app/Contents/Developer/Toolchains/XcodeDefault.xctoolchain/usr/bin    -Wno-unused-command-line-argument -mllvm -verify-machineinstrs -O3 -arch x86_64 -isysroot /Applications/Xcode.app/Contents/Developer/Platforms/MacOSX.platform/Developer/SDKs/MacOSX10.15.sdk   -w -Werror=date-time -MD -MT SingleSource/UnitTests/Vector/CMakeFiles/Vector-build2.dir/build2.c.o -MF SingleSource/UnitTests/Vector/CMakeFiles/Vector-build2.dir/build2.c.o.d -o SingleSource/UnitTests/Vector/CMakeFiles/Vector-build2.dir/build2.c.o   -c /Users/buildslave/jenkins/workspace/test-suite-verify-machineinstrs-x86_64-O3/test-suite/SingleSource/UnitTests/Vector/build2.c
[4942/7672] : && /Users/buildslave/jenkins/workspace/test-suite-verify-machineinstrs-x86_64-O3/test-suite-build/tools/timeit --summary SingleSource/UnitTests/Vector/Vector-sumarray.link.time /Users/buildslave/jenkins/workspace/test-suite-verify-machineinstrs-x86_64-O3/compiler/bin/clang -B /Applications/Xcode.app/Contents/Developer/Toolchains/XcodeDefault.xctoolchain/usr/bin    -Wno-unused-command-line-argument -mllvm -verify-machineinstrs -O3 -arch x86_64 -isysroot /Applications/Xcode.app/Contents/Developer/Platforms/MacOSX.platform/Developer/SDKs/MacOSX10.15.sdk -Wl,-search_paths_first -Wl,-headerpad_max_install_names -B /Applications/Xcode.app/Contents/Developer/Toolchains/XcodeDefault.xctoolchain/usr/bin SingleSource/UnitTests/Vector/CMakeFiles/Vector-sumarray.dir/sumarray.c.o  -o SingleSource/UnitTests/Vector/Vector-sumarray  -Wl,-no_pie && cd /Users/buildslave/jenkins/workspace/test-suite-verify-machineinstrs-x86_64-O3/test-suite-build/SingleSource/UnitTests/Vector && /usr/local/Cellar/cmake/3.17.2/bin/cmake -E create_symlink /Users/buildslave/jenkins/workspace/test-suite-verify-machineinstrs-x86_64-O3/test-suite/SingleSource/UnitTests/Vector/sumarray.reference_output /Users/buildslave/jenkins/workspace/test-suite-verify-machineinstrs-x86_64-O3/test-suite-build/SingleSource/UnitTests/Vector/sumarray.reference_output
[4943/7672] : && /Users/buildslave/jenkins/workspace/test-suite-verify-machineinstrs-x86_64-O3/test-suite-build/tools/timeit --summary SingleSource/UnitTests/Vector/Vector-build2.link.time /Users/buildslave/jenkins/workspace/test-suite-verify-machineinstrs-x86_64-O3/compiler/bin/clang -B /Applications/Xcode.app/Contents/Developer/Toolchains/XcodeDefault.xctoolchain/usr/bin    -Wno-unused-command-line-argument -mllvm -verify-machineinstrs -O3 -arch x86_64 -isysroot /Applications/Xcode.app/Contents/Developer/Platforms/MacOSX.platform/Developer/SDKs/MacOSX10.15.sdk -Wl,-search_paths_first -Wl,-headerpad_max_install_names -B /Applications/Xcode.app/Contents/Developer/Toolchains/XcodeDefault.xctoolchain/usr/bin SingleSource/UnitTests/Vector/CMakeFiles/Vector-build2.dir/build2.c.o  -o SingleSource/UnitTests/Vector/Vector-build2  -Wl,-no_pie && cd /Users/buildslave/jenkins/workspace/test-suite-verify-machineinstrs-x86_64-O3/test-suite-build/SingleSource/UnitTests/Vector && /usr/local/Cellar/cmake/3.17.2/bin/cmake -E create_symlink /Users/buildslave/jenkins/workspace/test-suite-verify-machineinstrs-x86_64-O3/test-suite/SingleSource/UnitTests/Vector/build2.reference_output /Users/buildslave/jenkins/workspace/test-suite-verify-machineinstrs-x86_64-O3/test-suite-build/SingleSource/UnitTests/Vector/build2.reference_output
[4944/7672] /Users/buildslave/jenkins/workspace/test-suite-verify-machineinstrs-x86_64-O3/test-suite-build/tools/timeit --summary SingleSource/UnitTests/CMakeFiles/matrix-types-spec.dir/matrix-types-spec.cpp.o.time /Users/buildslave/jenkins/workspace/test-suite-verify-machineinstrs-x86_64-O3/compiler/bin/clang++  -DNDEBUG  -B /Applications/Xcode.app/Contents/Developer/Toolchains/XcodeDefault.xctoolchain/usr/bin    -Wno-unused-command-line-argument -mllvm -verify-machineinstrs -O3 -arch x86_64 -isysroot /Applications/Xcode.app/Contents/Developer/Platforms/MacOSX.platform/Developer/SDKs/MacOSX10.15.sdk   -w -Werror=date-time -fenable-matrix -MD -MT SingleSource/UnitTests/CMakeFiles/matrix-types-spec.dir/matrix-types-spec.cpp.o -MF SingleSource/UnitTests/CMakeFiles/matrix-types-spec.dir/matrix-types-spec.cpp.o.d -o SingleSource/UnitTests/CMakeFiles/matrix-types-spec.dir/matrix-types-spec.cpp.o -c /Users/buildslave/jenkins/workspace/test-suite-verify-machineinstrs-x86_64-O3/test-suite/SingleSource/UnitTests/matrix-types-spec.cpp
FAILED: SingleSource/UnitTests/CMakeFiles/matrix-types-spec.dir/matrix-types-spec.cpp.o 
/Users/buildslave/jenkins/workspace/test-suite-verify-machineinstrs-x86_64-O3/test-suite-build/tools/timeit --summary SingleSource/UnitTests/CMakeFiles/matrix-types-spec.dir/matrix-types-spec.cpp.o.time /Users/buildslave/jenkins/workspace/test-suite-verify-machineinstrs-x86_64-O3/compiler/bin/clang++  -DNDEBUG  -B /Applications/Xcode.app/Contents/Developer/Toolchains/XcodeDefault.xctoolchain/usr/bin    -Wno-unused-command-line-argument -mllvm -verify-machineinstrs -O3 -arch x86_64 -isysroot /Applications/Xcode.app/Contents/Developer/Platforms/MacOSX.platform/Developer/SDKs/MacOSX10.15.sdk   -w -Werror=date-time -fenable-matrix -MD -MT SingleSource/UnitTests/CMakeFiles/matrix-types-spec.dir/matrix-types-spec.cpp.o -MF SingleSource/UnitTests/CMakeFiles/matrix-types-spec.dir/matrix-types-spec.cpp.o.d -o SingleSource/UnitTests/CMakeFiles/matrix-types-spec.dir/matrix-types-spec.cpp.o -c /Users/buildslave/jenkins/workspace/test-suite-verify-machineinstrs-x86_64-O3/test-suite/SingleSource/UnitTests/matrix-types-spec.cpp
Intrinsic name not mangled correctly for type arguments! Should be: llvm.matrix.column.major.load.v9f64
Fatal Error: error in backend: Broken function found, compilation aborted!
Intrinsic name not mangled correctly for type arguments! Should be: llvm.matrix.column.major.load.v9f64
<9 x double> (double*, i64, i1, i32, i32)* @llvm.matrix.column.major.load.v9f64.p0f64
Intrinsic name not mangled correctly for type arguments! Should be: llvm.matrix.column.major.store.v9f64
void (<9 x double>, double*, i64, i1, i32, i32)* @llvm.matrix.column.major.store.v9f64.p0f64
in function _Z13transposeSpecIdLj3ELj3EEvPT_S1_
fatal error: error in backend: Broken function found, compilation aborted!
PLEASE submit a bug report to https://bugs.llvm.org/ and include the crash backtrace, preprocessed source, and associated run script.
Stack dump:
Error: clang frontend command failed with exit code 70 (use -v to see invocation)
25 clang++       0x0000000109c5d4cd clang::driver::Compilation::ExecuteJobs(clang::driver::JobList const&, llvm::SmallVectorImpl<std::__1::pair<int, clang::driver::Command const*> >&) const + 125
26 clang++       0x0000000109c7198c clang::driver::Driver::ExecuteCompilation(clang::driver::Compilation&, llvm::SmallVectorImpl<std::__1::pair<int, clang::driver::Command const*> >&) + 204
27 clang++       0x0000000107802245 main + 10389
28 libdyld.dylib 0x00007fff696f7cc9 start + 1
29 libdyld.dylib 0x0000000000000018 start + 18446603338747249488
clang-11: error: clang frontend command failed with exit code 70 (use -v to see invocation)
clang version 11.0.0 (https://github.com/llvm/llvm-project.git de7bf722c23a1ab006bd306165c094669071577f)
Target: x86_64-apple-darwin19.5.0

Build Log

Changes
  1. Make linalg::ReshapeOp implement ViewLikeOpInterface (details)
  2. [MLIR][SPIRVToLLVM] SPIRV function fix and nits (details)
  3. [NFC] Add tests for boolean comparisons (details)
  4. [DAGCombiner] Rebuild (setcc x, y, ==) from (xor (xor x, y), 1) (details)
  5. [RISCV] Add error checking for extensions missing separating underscores (details)

Started by upstream project relay-test-suite-verify-machineinstrs build number 8349
originally caused by:

This run spent:

  • 13 min waiting;
  • 36 min build duration;
  • 36 min total from scheduled to completion.
Revision: a5b58cdd800d0d45b1bdd1f7fe058db6acbfd918
  • refs/remotes/origin/master
Revision: de7bf722c23a1ab006bd306165c094669071577f
  • detached
Revision: 4c57b004f148dffc6db199890d91fc3e6e578972
  • refs/remotes/origin/master
Revision: 60cfbf7833b8039b938ce679bed89c738b519e1d
  • refs/remotes/origin/master

Identified problems

Ninja target failed

Below is a link to the first failed ninja target.
Indication 1

Compile Error

This build failed because of a compile error. Below is a list of all errors in the build log:
Indication 2