FailedConsole Output

Skipping 1,734 KB.. Full Log
an/llvm-project/llvm/lib/Target/MSP430 -I /Users/buildslave/jenkins/workspace/clang-stage2-cmake-RgTSan/llvm-project/llvm/include -I /Users/buildslave/jenkins/workspace/clang-stage2-cmake-RgTSan/llvm-project/llvm/lib/Target /Users/buildslave/jenkins/workspace/clang-stage2-cmake-RgTSan/llvm-project/llvm/lib/Target/MSP430/MSP430.td --write-if-changed -o lib/Target/MSP430/MSP430GenInstrInfo.inc -d lib/Target/MSP430/MSP430GenInstrInfo.inc.d
[1430/2138] cd /Users/buildslave/jenkins/workspace/clang-stage2-cmake-RgTSan/clang-build && /Users/buildslave/jenkins/workspace/clang-stage2-cmake-RgTSan/clang-build/bin/llvm-tblgen -gen-instr-info -I /Users/buildslave/jenkins/workspace/clang-stage2-cmake-RgTSan/llvm-project/llvm/lib/Target/Mips -I /Users/buildslave/jenkins/workspace/clang-stage2-cmake-RgTSan/llvm-project/llvm/include -I /Users/buildslave/jenkins/workspace/clang-stage2-cmake-RgTSan/llvm-project/llvm/lib/Target /Users/buildslave/jenkins/workspace/clang-stage2-cmake-RgTSan/llvm-project/llvm/lib/Target/Mips/Mips.td --write-if-changed -o lib/Target/Mips/MipsGenInstrInfo.inc -d lib/Target/Mips/MipsGenInstrInfo.inc.d
[1431/2138] cd /Users/buildslave/jenkins/workspace/clang-stage2-cmake-RgTSan/clang-build && /Users/buildslave/jenkins/workspace/clang-stage2-cmake-RgTSan/clang-build/bin/llvm-tblgen -gen-asm-writer -I /Users/buildslave/jenkins/workspace/clang-stage2-cmake-RgTSan/llvm-project/llvm/lib/Target/PowerPC -I /Users/buildslave/jenkins/workspace/clang-stage2-cmake-RgTSan/llvm-project/llvm/include -I /Users/buildslave/jenkins/workspace/clang-stage2-cmake-RgTSan/llvm-project/llvm/lib/Target /Users/buildslave/jenkins/workspace/clang-stage2-cmake-RgTSan/llvm-project/llvm/lib/Target/PowerPC/PPC.td --write-if-changed -o lib/Target/PowerPC/PPCGenAsmWriter.inc -d lib/Target/PowerPC/PPCGenAsmWriter.inc.d
[1432/2138] /Users/buildslave/jenkins/workspace/clang-stage2-cmake-RgTSan/host-compiler/bin/clang++  -DBUILD_EXAMPLES -DGTEST_HAS_RTTI=0 -D__STDC_CONSTANT_MACROS -D__STDC_FORMAT_MACROS -D__STDC_LIMIT_MACROS -Ilib/Target/MSP430 -I/Users/buildslave/jenkins/workspace/clang-stage2-cmake-RgTSan/llvm-project/llvm/lib/Target/MSP430 -I/usr/include/libxml2 -Iinclude -I/Users/buildslave/jenkins/workspace/clang-stage2-cmake-RgTSan/llvm-project/llvm/include -fPIC -fvisibility-inlines-hidden -Werror=date-time -Werror=unguarded-availability-new -Wall -Wextra -Wno-unused-parameter -Wwrite-strings -Wcast-qual -Wmissing-field-initializers -pedantic -Wno-long-long -Wimplicit-fallthrough -Wcovered-switch-default -Wno-noexcept-type -Wnon-virtual-dtor -Wdelete-non-virtual-dtor -Wstring-conversion -fno-omit-frame-pointer -fsanitize=thread -fdiagnostics-color -flto=thin -O2 -g -DNDEBUG    -fno-exceptions -fno-rtti -std=c++14 -MD -MT lib/Target/MSP430/CMakeFiles/LLVMMSP430CodeGen.dir/MSP430BranchSelector.cpp.o -MF lib/Target/MSP430/CMakeFiles/LLVMMSP430CodeGen.dir/MSP430BranchSelector.cpp.o.d -o lib/Target/MSP430/CMakeFiles/LLVMMSP430CodeGen.dir/MSP430BranchSelector.cpp.o -c /Users/buildslave/jenkins/workspace/clang-stage2-cmake-RgTSan/llvm-project/llvm/lib/Target/MSP430/MSP430BranchSelector.cpp
[1433/2138] /Users/buildslave/jenkins/workspace/clang-stage2-cmake-RgTSan/host-compiler/bin/clang++  -DBUILD_EXAMPLES -DGTEST_HAS_RTTI=0 -D__STDC_CONSTANT_MACROS -D__STDC_FORMAT_MACROS -D__STDC_LIMIT_MACROS -Ilib/Target/Mips -I/Users/buildslave/jenkins/workspace/clang-stage2-cmake-RgTSan/llvm-project/llvm/lib/Target/Mips -I/usr/include/libxml2 -Iinclude -I/Users/buildslave/jenkins/workspace/clang-stage2-cmake-RgTSan/llvm-project/llvm/include -fPIC -fvisibility-inlines-hidden -Werror=date-time -Werror=unguarded-availability-new -Wall -Wextra -Wno-unused-parameter -Wwrite-strings -Wcast-qual -Wmissing-field-initializers -pedantic -Wno-long-long -Wimplicit-fallthrough -Wcovered-switch-default -Wno-noexcept-type -Wnon-virtual-dtor -Wdelete-non-virtual-dtor -Wstring-conversion -fno-omit-frame-pointer -fsanitize=thread -fdiagnostics-color -flto=thin -O2 -g -DNDEBUG    -fno-exceptions -fno-rtti -std=c++14 -MD -MT lib/Target/Mips/CMakeFiles/LLVMMipsCodeGen.dir/Mips16HardFloatInfo.cpp.o -MF lib/Target/Mips/CMakeFiles/LLVMMipsCodeGen.dir/Mips16HardFloatInfo.cpp.o.d -o lib/Target/Mips/CMakeFiles/LLVMMipsCodeGen.dir/Mips16HardFloatInfo.cpp.o -c /Users/buildslave/jenkins/workspace/clang-stage2-cmake-RgTSan/llvm-project/llvm/lib/Target/Mips/Mips16HardFloatInfo.cpp
[1434/2138] cd /Users/buildslave/jenkins/workspace/clang-stage2-cmake-RgTSan/clang-build && /Users/buildslave/jenkins/workspace/clang-stage2-cmake-RgTSan/clang-build/bin/llvm-tblgen -gen-asm-writer -I /Users/buildslave/jenkins/workspace/clang-stage2-cmake-RgTSan/llvm-project/llvm/lib/Target/NVPTX -I /Users/buildslave/jenkins/workspace/clang-stage2-cmake-RgTSan/llvm-project/llvm/include -I /Users/buildslave/jenkins/workspace/clang-stage2-cmake-RgTSan/llvm-project/llvm/lib/Target /Users/buildslave/jenkins/workspace/clang-stage2-cmake-RgTSan/llvm-project/llvm/lib/Target/NVPTX/NVPTX.td --write-if-changed -o lib/Target/NVPTX/NVPTXGenAsmWriter.inc -d lib/Target/NVPTX/NVPTXGenAsmWriter.inc.d
[1435/2138] cd /Users/buildslave/jenkins/workspace/clang-stage2-cmake-RgTSan/clang-build && /Users/buildslave/jenkins/workspace/clang-stage2-cmake-RgTSan/clang-build/bin/llvm-tblgen -gen-register-info -I /Users/buildslave/jenkins/workspace/clang-stage2-cmake-RgTSan/llvm-project/llvm/lib/Target/NVPTX -I /Users/buildslave/jenkins/workspace/clang-stage2-cmake-RgTSan/llvm-project/llvm/include -I /Users/buildslave/jenkins/workspace/clang-stage2-cmake-RgTSan/llvm-project/llvm/lib/Target /Users/buildslave/jenkins/workspace/clang-stage2-cmake-RgTSan/llvm-project/llvm/lib/Target/NVPTX/NVPTX.td --write-if-changed -o lib/Target/NVPTX/NVPTXGenRegisterInfo.inc -d lib/Target/NVPTX/NVPTXGenRegisterInfo.inc.d
[1436/2138] cd /Users/buildslave/jenkins/workspace/clang-stage2-cmake-RgTSan/clang-build && /Users/buildslave/jenkins/workspace/clang-stage2-cmake-RgTSan/clang-build/bin/llvm-tblgen -gen-subtarget -I /Users/buildslave/jenkins/workspace/clang-stage2-cmake-RgTSan/llvm-project/llvm/lib/Target/NVPTX -I /Users/buildslave/jenkins/workspace/clang-stage2-cmake-RgTSan/llvm-project/llvm/include -I /Users/buildslave/jenkins/workspace/clang-stage2-cmake-RgTSan/llvm-project/llvm/lib/Target /Users/buildslave/jenkins/workspace/clang-stage2-cmake-RgTSan/llvm-project/llvm/lib/Target/NVPTX/NVPTX.td --write-if-changed -o lib/Target/NVPTX/NVPTXGenSubtargetInfo.inc -d lib/Target/NVPTX/NVPTXGenSubtargetInfo.inc.d
[1437/2138] /Users/buildslave/jenkins/workspace/clang-stage2-cmake-RgTSan/host-compiler/bin/clang++  -DBUILD_EXAMPLES -DGTEST_HAS_RTTI=0 -D__STDC_CONSTANT_MACROS -D__STDC_FORMAT_MACROS -D__STDC_LIMIT_MACROS -Ilib/Target/Mips -I/Users/buildslave/jenkins/workspace/clang-stage2-cmake-RgTSan/llvm-project/llvm/lib/Target/Mips -I/usr/include/libxml2 -Iinclude -I/Users/buildslave/jenkins/workspace/clang-stage2-cmake-RgTSan/llvm-project/llvm/include -fPIC -fvisibility-inlines-hidden -Werror=date-time -Werror=unguarded-availability-new -Wall -Wextra -Wno-unused-parameter -Wwrite-strings -Wcast-qual -Wmissing-field-initializers -pedantic -Wno-long-long -Wimplicit-fallthrough -Wcovered-switch-default -Wno-noexcept-type -Wnon-virtual-dtor -Wdelete-non-virtual-dtor -Wstring-conversion -fno-omit-frame-pointer -fsanitize=thread -fdiagnostics-color -flto=thin -O2 -g -DNDEBUG    -fno-exceptions -fno-rtti -std=c++14 -MD -MT lib/Target/Mips/CMakeFiles/LLVMMipsCodeGen.dir/Mips16FrameLowering.cpp.o -MF lib/Target/Mips/CMakeFiles/LLVMMipsCodeGen.dir/Mips16FrameLowering.cpp.o.d -o lib/Target/Mips/CMakeFiles/LLVMMipsCodeGen.dir/Mips16FrameLowering.cpp.o -c /Users/buildslave/jenkins/workspace/clang-stage2-cmake-RgTSan/llvm-project/llvm/lib/Target/Mips/Mips16FrameLowering.cpp
[1438/2138] /Users/buildslave/jenkins/workspace/clang-stage2-cmake-RgTSan/host-compiler/bin/clang++  -DBUILD_EXAMPLES -DGTEST_HAS_RTTI=0 -D__STDC_CONSTANT_MACROS -D__STDC_FORMAT_MACROS -D__STDC_LIMIT_MACROS -Ilib/Target/Mips -I/Users/buildslave/jenkins/workspace/clang-stage2-cmake-RgTSan/llvm-project/llvm/lib/Target/Mips -I/usr/include/libxml2 -Iinclude -I/Users/buildslave/jenkins/workspace/clang-stage2-cmake-RgTSan/llvm-project/llvm/include -fPIC -fvisibility-inlines-hidden -Werror=date-time -Werror=unguarded-availability-new -Wall -Wextra -Wno-unused-parameter -Wwrite-strings -Wcast-qual -Wmissing-field-initializers -pedantic -Wno-long-long -Wimplicit-fallthrough -Wcovered-switch-default -Wno-noexcept-type -Wnon-virtual-dtor -Wdelete-non-virtual-dtor -Wstring-conversion -fno-omit-frame-pointer -fsanitize=thread -fdiagnostics-color -flto=thin -O2 -g -DNDEBUG    -fno-exceptions -fno-rtti -std=c++14 -MD -MT lib/Target/Mips/CMakeFiles/LLVMMipsCodeGen.dir/MipsAnalyzeImmediate.cpp.o -MF lib/Target/Mips/CMakeFiles/LLVMMipsCodeGen.dir/MipsAnalyzeImmediate.cpp.o.d -o lib/Target/Mips/CMakeFiles/LLVMMipsCodeGen.dir/MipsAnalyzeImmediate.cpp.o -c /Users/buildslave/jenkins/workspace/clang-stage2-cmake-RgTSan/llvm-project/llvm/lib/Target/Mips/MipsAnalyzeImmediate.cpp
[1439/2138] /Users/buildslave/jenkins/workspace/clang-stage2-cmake-RgTSan/host-compiler/bin/clang++  -DBUILD_EXAMPLES -DGTEST_HAS_RTTI=0 -D__STDC_CONSTANT_MACROS -D__STDC_FORMAT_MACROS -D__STDC_LIMIT_MACROS -Ilib/Target/Mips -I/Users/buildslave/jenkins/workspace/clang-stage2-cmake-RgTSan/llvm-project/llvm/lib/Target/Mips -I/usr/include/libxml2 -Iinclude -I/Users/buildslave/jenkins/workspace/clang-stage2-cmake-RgTSan/llvm-project/llvm/include -fPIC -fvisibility-inlines-hidden -Werror=date-time -Werror=unguarded-availability-new -Wall -Wextra -Wno-unused-parameter -Wwrite-strings -Wcast-qual -Wmissing-field-initializers -pedantic -Wno-long-long -Wimplicit-fallthrough -Wcovered-switch-default -Wno-noexcept-type -Wnon-virtual-dtor -Wdelete-non-virtual-dtor -Wstring-conversion -fno-omit-frame-pointer -fsanitize=thread -fdiagnostics-color -flto=thin -O2 -g -DNDEBUG    -fno-exceptions -fno-rtti -std=c++14 -MD -MT lib/Target/Mips/CMakeFiles/LLVMMipsCodeGen.dir/Mips16InstrInfo.cpp.o -MF lib/Target/Mips/CMakeFiles/LLVMMipsCodeGen.dir/Mips16InstrInfo.cpp.o.d -o lib/Target/Mips/CMakeFiles/LLVMMipsCodeGen.dir/Mips16InstrInfo.cpp.o -c /Users/buildslave/jenkins/workspace/clang-stage2-cmake-RgTSan/llvm-project/llvm/lib/Target/Mips/Mips16InstrInfo.cpp
[1440/2138] /Users/buildslave/jenkins/workspace/clang-stage2-cmake-RgTSan/host-compiler/bin/clang++  -DBUILD_EXAMPLES -DGTEST_HAS_RTTI=0 -D__STDC_CONSTANT_MACROS -D__STDC_FORMAT_MACROS -D__STDC_LIMIT_MACROS -Ilib/Target/Mips -I/Users/buildslave/jenkins/workspace/clang-stage2-cmake-RgTSan/llvm-project/llvm/lib/Target/Mips -I/usr/include/libxml2 -Iinclude -I/Users/buildslave/jenkins/workspace/clang-stage2-cmake-RgTSan/llvm-project/llvm/include -fPIC -fvisibility-inlines-hidden -Werror=date-time -Werror=unguarded-availability-new -Wall -Wextra -Wno-unused-parameter -Wwrite-strings -Wcast-qual -Wmissing-field-initializers -pedantic -Wno-long-long -Wimplicit-fallthrough -Wcovered-switch-default -Wno-noexcept-type -Wnon-virtual-dtor -Wdelete-non-virtual-dtor -Wstring-conversion -fno-omit-frame-pointer -fsanitize=thread -fdiagnostics-color -flto=thin -O2 -g -DNDEBUG    -fno-exceptions -fno-rtti -std=c++14 -MD -MT lib/Target/Mips/CMakeFiles/LLVMMipsCodeGen.dir/Mips16HardFloat.cpp.o -MF lib/Target/Mips/CMakeFiles/LLVMMipsCodeGen.dir/Mips16HardFloat.cpp.o.d -o lib/Target/Mips/CMakeFiles/LLVMMipsCodeGen.dir/Mips16HardFloat.cpp.o -c /Users/buildslave/jenkins/workspace/clang-stage2-cmake-RgTSan/llvm-project/llvm/lib/Target/Mips/Mips16HardFloat.cpp
[1441/2138] /Users/buildslave/jenkins/workspace/clang-stage2-cmake-RgTSan/host-compiler/bin/clang++  -DBUILD_EXAMPLES -DGTEST_HAS_RTTI=0 -D__STDC_CONSTANT_MACROS -D__STDC_FORMAT_MACROS -D__STDC_LIMIT_MACROS -Ilib/Target/Mips -I/Users/buildslave/jenkins/workspace/clang-stage2-cmake-RgTSan/llvm-project/llvm/lib/Target/Mips -I/usr/include/libxml2 -Iinclude -I/Users/buildslave/jenkins/workspace/clang-stage2-cmake-RgTSan/llvm-project/llvm/include -fPIC -fvisibility-inlines-hidden -Werror=date-time -Werror=unguarded-availability-new -Wall -Wextra -Wno-unused-parameter -Wwrite-strings -Wcast-qual -Wmissing-field-initializers -pedantic -Wno-long-long -Wimplicit-fallthrough -Wcovered-switch-default -Wno-noexcept-type -Wnon-virtual-dtor -Wdelete-non-virtual-dtor -Wstring-conversion -fno-omit-frame-pointer -fsanitize=thread -fdiagnostics-color -flto=thin -O2 -g -DNDEBUG    -fno-exceptions -fno-rtti -std=c++14 -MD -MT lib/Target/Mips/CMakeFiles/LLVMMipsCodeGen.dir/Mips16ISelLowering.cpp.o -MF lib/Target/Mips/CMakeFiles/LLVMMipsCodeGen.dir/Mips16ISelLowering.cpp.o.d -o lib/Target/Mips/CMakeFiles/LLVMMipsCodeGen.dir/Mips16ISelLowering.cpp.o -c /Users/buildslave/jenkins/workspace/clang-stage2-cmake-RgTSan/llvm-project/llvm/lib/Target/Mips/Mips16ISelLowering.cpp
[1442/2138] /Users/buildslave/jenkins/workspace/clang-stage2-cmake-RgTSan/host-compiler/bin/clang++  -DBUILD_EXAMPLES -DGTEST_HAS_RTTI=0 -D__STDC_CONSTANT_MACROS -D__STDC_FORMAT_MACROS -D__STDC_LIMIT_MACROS -Ilib/Target/Mips -I/Users/buildslave/jenkins/workspace/clang-stage2-cmake-RgTSan/llvm-project/llvm/lib/Target/Mips -I/usr/include/libxml2 -Iinclude -I/Users/buildslave/jenkins/workspace/clang-stage2-cmake-RgTSan/llvm-project/llvm/include -fPIC -fvisibility-inlines-hidden -Werror=date-time -Werror=unguarded-availability-new -Wall -Wextra -Wno-unused-parameter -Wwrite-strings -Wcast-qual -Wmissing-field-initializers -pedantic -Wno-long-long -Wimplicit-fallthrough -Wcovered-switch-default -Wno-noexcept-type -Wnon-virtual-dtor -Wdelete-non-virtual-dtor -Wstring-conversion -fno-omit-frame-pointer -fsanitize=thread -fdiagnostics-color -flto=thin -O2 -g -DNDEBUG    -fno-exceptions -fno-rtti -std=c++14 -MD -MT lib/Target/Mips/CMakeFiles/LLVMMipsCodeGen.dir/Mips16ISelDAGToDAG.cpp.o -MF lib/Target/Mips/CMakeFiles/LLVMMipsCodeGen.dir/Mips16ISelDAGToDAG.cpp.o.d -o lib/Target/Mips/CMakeFiles/LLVMMipsCodeGen.dir/Mips16ISelDAGToDAG.cpp.o -c /Users/buildslave/jenkins/workspace/clang-stage2-cmake-RgTSan/llvm-project/llvm/lib/Target/Mips/Mips16ISelDAGToDAG.cpp
[1443/2138] /Users/buildslave/jenkins/workspace/clang-stage2-cmake-RgTSan/host-compiler/bin/clang++  -DBUILD_EXAMPLES -DGTEST_HAS_RTTI=0 -D__STDC_CONSTANT_MACROS -D__STDC_FORMAT_MACROS -D__STDC_LIMIT_MACROS -Ilib/Target/Mips -I/Users/buildslave/jenkins/workspace/clang-stage2-cmake-RgTSan/llvm-project/llvm/lib/Target/Mips -I/usr/include/libxml2 -Iinclude -I/Users/buildslave/jenkins/workspace/clang-stage2-cmake-RgTSan/llvm-project/llvm/include -fPIC -fvisibility-inlines-hidden -Werror=date-time -Werror=unguarded-availability-new -Wall -Wextra -Wno-unused-parameter -Wwrite-strings -Wcast-qual -Wmissing-field-initializers -pedantic -Wno-long-long -Wimplicit-fallthrough -Wcovered-switch-default -Wno-noexcept-type -Wnon-virtual-dtor -Wdelete-non-virtual-dtor -Wstring-conversion -fno-omit-frame-pointer -fsanitize=thread -fdiagnostics-color -flto=thin -O2 -g -DNDEBUG    -fno-exceptions -fno-rtti -std=c++14 -MD -MT lib/Target/Mips/CMakeFiles/LLVMMipsCodeGen.dir/Mips16RegisterInfo.cpp.o -MF lib/Target/Mips/CMakeFiles/LLVMMipsCodeGen.dir/Mips16RegisterInfo.cpp.o.d -o lib/Target/Mips/CMakeFiles/LLVMMipsCodeGen.dir/Mips16RegisterInfo.cpp.o -c /Users/buildslave/jenkins/workspace/clang-stage2-cmake-RgTSan/llvm-project/llvm/lib/Target/Mips/Mips16RegisterInfo.cpp
[1444/2138] cd /Users/buildslave/jenkins/workspace/clang-stage2-cmake-RgTSan/clang-build && /Users/buildslave/jenkins/workspace/clang-stage2-cmake-RgTSan/clang-build/bin/llvm-tblgen -gen-instr-info -I /Users/buildslave/jenkins/workspace/clang-stage2-cmake-RgTSan/llvm-project/llvm/lib/Target/NVPTX -I /Users/buildslave/jenkins/workspace/clang-stage2-cmake-RgTSan/llvm-project/llvm/include -I /Users/buildslave/jenkins/workspace/clang-stage2-cmake-RgTSan/llvm-project/llvm/lib/Target /Users/buildslave/jenkins/workspace/clang-stage2-cmake-RgTSan/llvm-project/llvm/lib/Target/NVPTX/NVPTX.td --write-if-changed -o lib/Target/NVPTX/NVPTXGenInstrInfo.inc -d lib/Target/NVPTX/NVPTXGenInstrInfo.inc.d
[1445/2138] /Users/buildslave/jenkins/workspace/clang-stage2-cmake-RgTSan/host-compiler/bin/clang++  -DBUILD_EXAMPLES -DGTEST_HAS_RTTI=0 -D__STDC_CONSTANT_MACROS -D__STDC_FORMAT_MACROS -D__STDC_LIMIT_MACROS -Ilib/Target/Mips -I/Users/buildslave/jenkins/workspace/clang-stage2-cmake-RgTSan/llvm-project/llvm/lib/Target/Mips -I/usr/include/libxml2 -Iinclude -I/Users/buildslave/jenkins/workspace/clang-stage2-cmake-RgTSan/llvm-project/llvm/include -fPIC -fvisibility-inlines-hidden -Werror=date-time -Werror=unguarded-availability-new -Wall -Wextra -Wno-unused-parameter -Wwrite-strings -Wcast-qual -Wmissing-field-initializers -pedantic -Wno-long-long -Wimplicit-fallthrough -Wcovered-switch-default -Wno-noexcept-type -Wnon-virtual-dtor -Wdelete-non-virtual-dtor -Wstring-conversion -fno-omit-frame-pointer -fsanitize=thread -fdiagnostics-color -flto=thin -O2 -g -DNDEBUG    -fno-exceptions -fno-rtti -std=c++14 -MD -MT lib/Target/Mips/CMakeFiles/LLVMMipsCodeGen.dir/MipsCallLowering.cpp.o -MF lib/Target/Mips/CMakeFiles/LLVMMipsCodeGen.dir/MipsCallLowering.cpp.o.d -o lib/Target/Mips/CMakeFiles/LLVMMipsCodeGen.dir/MipsCallLowering.cpp.o -c /Users/buildslave/jenkins/workspace/clang-stage2-cmake-RgTSan/llvm-project/llvm/lib/Target/Mips/MipsCallLowering.cpp
[1446/2138] /Users/buildslave/jenkins/workspace/clang-stage2-cmake-RgTSan/host-compiler/bin/clang++  -DBUILD_EXAMPLES -DGTEST_HAS_RTTI=0 -D__STDC_CONSTANT_MACROS -D__STDC_FORMAT_MACROS -D__STDC_LIMIT_MACROS -Ilib/Target/Mips -I/Users/buildslave/jenkins/workspace/clang-stage2-cmake-RgTSan/llvm-project/llvm/lib/Target/Mips -I/usr/include/libxml2 -Iinclude -I/Users/buildslave/jenkins/workspace/clang-stage2-cmake-RgTSan/llvm-project/llvm/include -fPIC -fvisibility-inlines-hidden -Werror=date-time -Werror=unguarded-availability-new -Wall -Wextra -Wno-unused-parameter -Wwrite-strings -Wcast-qual -Wmissing-field-initializers -pedantic -Wno-long-long -Wimplicit-fallthrough -Wcovered-switch-default -Wno-noexcept-type -Wnon-virtual-dtor -Wdelete-non-virtual-dtor -Wstring-conversion -fno-omit-frame-pointer -fsanitize=thread -fdiagnostics-color -flto=thin -O2 -g -DNDEBUG    -fno-exceptions -fno-rtti -std=c++14 -MD -MT lib/Target/Mips/CMakeFiles/LLVMMipsCodeGen.dir/MipsAsmPrinter.cpp.o -MF lib/Target/Mips/CMakeFiles/LLVMMipsCodeGen.dir/MipsAsmPrinter.cpp.o.d -o lib/Target/Mips/CMakeFiles/LLVMMipsCodeGen.dir/MipsAsmPrinter.cpp.o -c /Users/buildslave/jenkins/workspace/clang-stage2-cmake-RgTSan/llvm-project/llvm/lib/Target/Mips/MipsAsmPrinter.cpp
[1447/2138] /Users/buildslave/jenkins/workspace/clang-stage2-cmake-RgTSan/host-compiler/bin/clang++  -DBUILD_EXAMPLES -DGTEST_HAS_RTTI=0 -D__STDC_CONSTANT_MACROS -D__STDC_FORMAT_MACROS -D__STDC_LIMIT_MACROS -Ilib/Target/Mips -I/Users/buildslave/jenkins/workspace/clang-stage2-cmake-RgTSan/llvm-project/llvm/lib/Target/Mips -I/usr/include/libxml2 -Iinclude -I/Users/buildslave/jenkins/workspace/clang-stage2-cmake-RgTSan/llvm-project/llvm/include -fPIC -fvisibility-inlines-hidden -Werror=date-time -Werror=unguarded-availability-new -Wall -Wextra -Wno-unused-parameter -Wwrite-strings -Wcast-qual -Wmissing-field-initializers -pedantic -Wno-long-long -Wimplicit-fallthrough -Wcovered-switch-default -Wno-noexcept-type -Wnon-virtual-dtor -Wdelete-non-virtual-dtor -Wstring-conversion -fno-omit-frame-pointer -fsanitize=thread -fdiagnostics-color -flto=thin -O2 -g -DNDEBUG    -fno-exceptions -fno-rtti -std=c++14 -MD -MT lib/Target/Mips/CMakeFiles/LLVMMipsCodeGen.dir/MipsCCState.cpp.o -MF lib/Target/Mips/CMakeFiles/LLVMMipsCodeGen.dir/MipsCCState.cpp.o.d -o lib/Target/Mips/CMakeFiles/LLVMMipsCodeGen.dir/MipsCCState.cpp.o -c /Users/buildslave/jenkins/workspace/clang-stage2-cmake-RgTSan/llvm-project/llvm/lib/Target/Mips/MipsCCState.cpp
[1448/2138] cd /Users/buildslave/jenkins/workspace/clang-stage2-cmake-RgTSan/clang-build && /Users/buildslave/jenkins/workspace/clang-stage2-cmake-RgTSan/clang-build/bin/llvm-tblgen -gen-dag-isel -I /Users/buildslave/jenkins/workspace/clang-stage2-cmake-RgTSan/llvm-project/llvm/lib/Target/NVPTX -I /Users/buildslave/jenkins/workspace/clang-stage2-cmake-RgTSan/llvm-project/llvm/include -I /Users/buildslave/jenkins/workspace/clang-stage2-cmake-RgTSan/llvm-project/llvm/lib/Target /Users/buildslave/jenkins/workspace/clang-stage2-cmake-RgTSan/llvm-project/llvm/lib/Target/NVPTX/NVPTX.td --write-if-changed -o lib/Target/NVPTX/NVPTXGenDAGISel.inc -d lib/Target/NVPTX/NVPTXGenDAGISel.inc.d
[1449/2138] /Users/buildslave/jenkins/workspace/clang-stage2-cmake-RgTSan/host-compiler/bin/clang++  -DBUILD_EXAMPLES -DGTEST_HAS_RTTI=0 -D__STDC_CONSTANT_MACROS -D__STDC_FORMAT_MACROS -D__STDC_LIMIT_MACROS -Ilib/Target/Mips -I/Users/buildslave/jenkins/workspace/clang-stage2-cmake-RgTSan/llvm-project/llvm/lib/Target/Mips -I/usr/include/libxml2 -Iinclude -I/Users/buildslave/jenkins/workspace/clang-stage2-cmake-RgTSan/llvm-project/llvm/include -fPIC -fvisibility-inlines-hidden -Werror=date-time -Werror=unguarded-availability-new -Wall -Wextra -Wno-unused-parameter -Wwrite-strings -Wcast-qual -Wmissing-field-initializers -pedantic -Wno-long-long -Wimplicit-fallthrough -Wcovered-switch-default -Wno-noexcept-type -Wnon-virtual-dtor -Wdelete-non-virtual-dtor -Wstring-conversion -fno-omit-frame-pointer -fsanitize=thread -fdiagnostics-color -flto=thin -O2 -g -DNDEBUG    -fno-exceptions -fno-rtti -std=c++14 -MD -MT lib/Target/Mips/CMakeFiles/LLVMMipsCodeGen.dir/MipsExpandPseudo.cpp.o -MF lib/Target/Mips/CMakeFiles/LLVMMipsCodeGen.dir/MipsExpandPseudo.cpp.o.d -o lib/Target/Mips/CMakeFiles/LLVMMipsCodeGen.dir/MipsExpandPseudo.cpp.o -c /Users/buildslave/jenkins/workspace/clang-stage2-cmake-RgTSan/llvm-project/llvm/lib/Target/Mips/MipsExpandPseudo.cpp
[1450/2138] /Users/buildslave/jenkins/workspace/clang-stage2-cmake-RgTSan/host-compiler/bin/clang++  -DBUILD_EXAMPLES -DGTEST_HAS_RTTI=0 -D__STDC_CONSTANT_MACROS -D__STDC_FORMAT_MACROS -D__STDC_LIMIT_MACROS -Ilib/Target/Mips -I/Users/buildslave/jenkins/workspace/clang-stage2-cmake-RgTSan/llvm-project/llvm/lib/Target/Mips -I/usr/include/libxml2 -Iinclude -I/Users/buildslave/jenkins/workspace/clang-stage2-cmake-RgTSan/llvm-project/llvm/include -fPIC -fvisibility-inlines-hidden -Werror=date-time -Werror=unguarded-availability-new -Wall -Wextra -Wno-unused-parameter -Wwrite-strings -Wcast-qual -Wmissing-field-initializers -pedantic -Wno-long-long -Wimplicit-fallthrough -Wcovered-switch-default -Wno-noexcept-type -Wnon-virtual-dtor -Wdelete-non-virtual-dtor -Wstring-conversion -fno-omit-frame-pointer -fsanitize=thread -fdiagnostics-color -flto=thin -O2 -g -DNDEBUG    -fno-exceptions -fno-rtti -std=c++14 -MD -MT lib/Target/Mips/CMakeFiles/LLVMMipsCodeGen.dir/MipsConstantIslandPass.cpp.o -MF lib/Target/Mips/CMakeFiles/LLVMMipsCodeGen.dir/MipsConstantIslandPass.cpp.o.d -o lib/Target/Mips/CMakeFiles/LLVMMipsCodeGen.dir/MipsConstantIslandPass.cpp.o -c /Users/buildslave/jenkins/workspace/clang-stage2-cmake-RgTSan/llvm-project/llvm/lib/Target/Mips/MipsConstantIslandPass.cpp
[1451/2138] /Users/buildslave/jenkins/workspace/clang-stage2-cmake-RgTSan/host-compiler/bin/clang++  -DBUILD_EXAMPLES -DGTEST_HAS_RTTI=0 -D__STDC_CONSTANT_MACROS -D__STDC_FORMAT_MACROS -D__STDC_LIMIT_MACROS -Ilib/Target/Mips -I/Users/buildslave/jenkins/workspace/clang-stage2-cmake-RgTSan/llvm-project/llvm/lib/Target/Mips -I/usr/include/libxml2 -Iinclude -I/Users/buildslave/jenkins/workspace/clang-stage2-cmake-RgTSan/llvm-project/llvm/include -fPIC -fvisibility-inlines-hidden -Werror=date-time -Werror=unguarded-availability-new -Wall -Wextra -Wno-unused-parameter -Wwrite-strings -Wcast-qual -Wmissing-field-initializers -pedantic -Wno-long-long -Wimplicit-fallthrough -Wcovered-switch-default -Wno-noexcept-type -Wnon-virtual-dtor -Wdelete-non-virtual-dtor -Wstring-conversion -fno-omit-frame-pointer -fsanitize=thread -fdiagnostics-color -flto=thin -O2 -g -DNDEBUG    -fno-exceptions -fno-rtti -std=c++14 -MD -MT lib/Target/Mips/CMakeFiles/LLVMMipsCodeGen.dir/MipsDelaySlotFiller.cpp.o -MF lib/Target/Mips/CMakeFiles/LLVMMipsCodeGen.dir/MipsDelaySlotFiller.cpp.o.d -o lib/Target/Mips/CMakeFiles/LLVMMipsCodeGen.dir/MipsDelaySlotFiller.cpp.o -c /Users/buildslave/jenkins/workspace/clang-stage2-cmake-RgTSan/llvm-project/llvm/lib/Target/Mips/MipsDelaySlotFiller.cpp
[1452/2138] /Users/buildslave/jenkins/workspace/clang-stage2-cmake-RgTSan/host-compiler/bin/clang++  -DBUILD_EXAMPLES -DGTEST_HAS_RTTI=0 -D__STDC_CONSTANT_MACROS -D__STDC_FORMAT_MACROS -D__STDC_LIMIT_MACROS -Ilib/Target/Mips -I/Users/buildslave/jenkins/workspace/clang-stage2-cmake-RgTSan/llvm-project/llvm/lib/Target/Mips -I/usr/include/libxml2 -Iinclude -I/Users/buildslave/jenkins/workspace/clang-stage2-cmake-RgTSan/llvm-project/llvm/include -fPIC -fvisibility-inlines-hidden -Werror=date-time -Werror=unguarded-availability-new -Wall -Wextra -Wno-unused-parameter -Wwrite-strings -Wcast-qual -Wmissing-field-initializers -pedantic -Wno-long-long -Wimplicit-fallthrough -Wcovered-switch-default -Wno-noexcept-type -Wnon-virtual-dtor -Wdelete-non-virtual-dtor -Wstring-conversion -fno-omit-frame-pointer -fsanitize=thread -fdiagnostics-color -flto=thin -O2 -g -DNDEBUG    -fno-exceptions -fno-rtti -std=c++14 -MD -MT lib/Target/Mips/CMakeFiles/LLVMMipsCodeGen.dir/MipsInstrInfo.cpp.o -MF lib/Target/Mips/CMakeFiles/LLVMMipsCodeGen.dir/MipsInstrInfo.cpp.o.d -o lib/Target/Mips/CMakeFiles/LLVMMipsCodeGen.dir/MipsInstrInfo.cpp.o -c /Users/buildslave/jenkins/workspace/clang-stage2-cmake-RgTSan/llvm-project/llvm/lib/Target/Mips/MipsInstrInfo.cpp
[1453/2138] /Users/buildslave/jenkins/workspace/clang-stage2-cmake-RgTSan/host-compiler/bin/clang++  -DBUILD_EXAMPLES -DGTEST_HAS_RTTI=0 -D__STDC_CONSTANT_MACROS -D__STDC_FORMAT_MACROS -D__STDC_LIMIT_MACROS -Ilib/Target/Mips -I/Users/buildslave/jenkins/workspace/clang-stage2-cmake-RgTSan/llvm-project/llvm/lib/Target/Mips -I/usr/include/libxml2 -Iinclude -I/Users/buildslave/jenkins/workspace/clang-stage2-cmake-RgTSan/llvm-project/llvm/include -fPIC -fvisibility-inlines-hidden -Werror=date-time -Werror=unguarded-availability-new -Wall -Wextra -Wno-unused-parameter -Wwrite-strings -Wcast-qual -Wmissing-field-initializers -pedantic -Wno-long-long -Wimplicit-fallthrough -Wcovered-switch-default -Wno-noexcept-type -Wnon-virtual-dtor -Wdelete-non-virtual-dtor -Wstring-conversion -fno-omit-frame-pointer -fsanitize=thread -fdiagnostics-color -flto=thin -O2 -g -DNDEBUG    -fno-exceptions -fno-rtti -std=c++14 -MD -MT lib/Target/Mips/CMakeFiles/LLVMMipsCodeGen.dir/MipsISelDAGToDAG.cpp.o -MF lib/Target/Mips/CMakeFiles/LLVMMipsCodeGen.dir/MipsISelDAGToDAG.cpp.o.d -o lib/Target/Mips/CMakeFiles/LLVMMipsCodeGen.dir/MipsISelDAGToDAG.cpp.o -c /Users/buildslave/jenkins/workspace/clang-stage2-cmake-RgTSan/llvm-project/llvm/lib/Target/Mips/MipsISelDAGToDAG.cpp
[1454/2138] /Users/buildslave/jenkins/workspace/clang-stage2-cmake-RgTSan/host-compiler/bin/clang++  -DBUILD_EXAMPLES -DGTEST_HAS_RTTI=0 -D__STDC_CONSTANT_MACROS -D__STDC_FORMAT_MACROS -D__STDC_LIMIT_MACROS -Ilib/Target/Mips -I/Users/buildslave/jenkins/workspace/clang-stage2-cmake-RgTSan/llvm-project/llvm/lib/Target/Mips -I/usr/include/libxml2 -Iinclude -I/Users/buildslave/jenkins/workspace/clang-stage2-cmake-RgTSan/llvm-project/llvm/include -fPIC -fvisibility-inlines-hidden -Werror=date-time -Werror=unguarded-availability-new -Wall -Wextra -Wno-unused-parameter -Wwrite-strings -Wcast-qual -Wmissing-field-initializers -pedantic -Wno-long-long -Wimplicit-fallthrough -Wcovered-switch-default -Wno-noexcept-type -Wnon-virtual-dtor -Wdelete-non-virtual-dtor -Wstring-conversion -fno-omit-frame-pointer -fsanitize=thread -fdiagnostics-color -flto=thin -O2 -g -DNDEBUG    -fno-exceptions -fno-rtti -std=c++14 -MD -MT lib/Target/Mips/CMakeFiles/LLVMMipsCodeGen.dir/MipsFastISel.cpp.o -MF lib/Target/Mips/CMakeFiles/LLVMMipsCodeGen.dir/MipsFastISel.cpp.o.d -o lib/Target/Mips/CMakeFiles/LLVMMipsCodeGen.dir/MipsFastISel.cpp.o -c /Users/buildslave/jenkins/workspace/clang-stage2-cmake-RgTSan/llvm-project/llvm/lib/Target/Mips/MipsFastISel.cpp
[1455/2138] /Users/buildslave/jenkins/workspace/clang-stage2-cmake-RgTSan/host-compiler/bin/clang++  -DBUILD_EXAMPLES -DGTEST_HAS_RTTI=0 -D__STDC_CONSTANT_MACROS -D__STDC_FORMAT_MACROS -D__STDC_LIMIT_MACROS -Ilib/Target/Mips -I/Users/buildslave/jenkins/workspace/clang-stage2-cmake-RgTSan/llvm-project/llvm/lib/Target/Mips -I/usr/include/libxml2 -Iinclude -I/Users/buildslave/jenkins/workspace/clang-stage2-cmake-RgTSan/llvm-project/llvm/include -fPIC -fvisibility-inlines-hidden -Werror=date-time -Werror=unguarded-availability-new -Wall -Wextra -Wno-unused-parameter -Wwrite-strings -Wcast-qual -Wmissing-field-initializers -pedantic -Wno-long-long -Wimplicit-fallthrough -Wcovered-switch-default -Wno-noexcept-type -Wnon-virtual-dtor -Wdelete-non-virtual-dtor -Wstring-conversion -fno-omit-frame-pointer -fsanitize=thread -fdiagnostics-color -flto=thin -O2 -g -DNDEBUG    -fno-exceptions -fno-rtti -std=c++14 -MD -MT lib/Target/Mips/CMakeFiles/LLVMMipsCodeGen.dir/MipsInstructionSelector.cpp.o -MF lib/Target/Mips/CMakeFiles/LLVMMipsCodeGen.dir/MipsInstructionSelector.cpp.o.d -o lib/Target/Mips/CMakeFiles/LLVMMipsCodeGen.dir/MipsInstructionSelector.cpp.o -c /Users/buildslave/jenkins/workspace/clang-stage2-cmake-RgTSan/llvm-project/llvm/lib/Target/Mips/MipsInstructionSelector.cpp
[1456/2138] /Users/buildslave/jenkins/workspace/clang-stage2-cmake-RgTSan/host-compiler/bin/clang++  -DBUILD_EXAMPLES -DGTEST_HAS_RTTI=0 -D__STDC_CONSTANT_MACROS -D__STDC_FORMAT_MACROS -D__STDC_LIMIT_MACROS -Ilib/Target/Mips -I/Users/buildslave/jenkins/workspace/clang-stage2-cmake-RgTSan/llvm-project/llvm/lib/Target/Mips -I/usr/include/libxml2 -Iinclude -I/Users/buildslave/jenkins/workspace/clang-stage2-cmake-RgTSan/llvm-project/llvm/include -fPIC -fvisibility-inlines-hidden -Werror=date-time -Werror=unguarded-availability-new -Wall -Wextra -Wno-unused-parameter -Wwrite-strings -Wcast-qual -Wmissing-field-initializers -pedantic -Wno-long-long -Wimplicit-fallthrough -Wcovered-switch-default -Wno-noexcept-type -Wnon-virtual-dtor -Wdelete-non-virtual-dtor -Wstring-conversion -fno-omit-frame-pointer -fsanitize=thread -fdiagnostics-color -flto=thin -O2 -g -DNDEBUG    -fno-exceptions -fno-rtti -std=c++14 -MD -MT lib/Target/Mips/CMakeFiles/LLVMMipsCodeGen.dir/MipsFrameLowering.cpp.o -MF lib/Target/Mips/CMakeFiles/LLVMMipsCodeGen.dir/MipsFrameLowering.cpp.o.d -o lib/Target/Mips/CMakeFiles/LLVMMipsCodeGen.dir/MipsFrameLowering.cpp.o -c /Users/buildslave/jenkins/workspace/clang-stage2-cmake-RgTSan/llvm-project/llvm/lib/Target/Mips/MipsFrameLowering.cpp
[1457/2138] /Users/buildslave/jenkins/workspace/clang-stage2-cmake-RgTSan/host-compiler/bin/clang++  -DBUILD_EXAMPLES -DGTEST_HAS_RTTI=0 -D__STDC_CONSTANT_MACROS -D__STDC_FORMAT_MACROS -D__STDC_LIMIT_MACROS -Ilib/Target/Mips -I/Users/buildslave/jenkins/workspace/clang-stage2-cmake-RgTSan/llvm-project/llvm/lib/Target/Mips -I/usr/include/libxml2 -Iinclude -I/Users/buildslave/jenkins/workspace/clang-stage2-cmake-RgTSan/llvm-project/llvm/include -fPIC -fvisibility-inlines-hidden -Werror=date-time -Werror=unguarded-availability-new -Wall -Wextra -Wno-unused-parameter -Wwrite-strings -Wcast-qual -Wmissing-field-initializers -pedantic -Wno-long-long -Wimplicit-fallthrough -Wcovered-switch-default -Wno-noexcept-type -Wnon-virtual-dtor -Wdelete-non-virtual-dtor -Wstring-conversion -fno-omit-frame-pointer -fsanitize=thread -fdiagnostics-color -flto=thin -O2 -g -DNDEBUG    -fno-exceptions -fno-rtti -std=c++14 -MD -MT lib/Target/Mips/CMakeFiles/LLVMMipsCodeGen.dir/MipsISelLowering.cpp.o -MF lib/Target/Mips/CMakeFiles/LLVMMipsCodeGen.dir/MipsISelLowering.cpp.o.d -o lib/Target/Mips/CMakeFiles/LLVMMipsCodeGen.dir/MipsISelLowering.cpp.o -c /Users/buildslave/jenkins/workspace/clang-stage2-cmake-RgTSan/llvm-project/llvm/lib/Target/Mips/MipsISelLowering.cpp
[1458/2138] /Users/buildslave/jenkins/workspace/clang-stage2-cmake-RgTSan/host-compiler/bin/clang++  -DBUILD_EXAMPLES -DGTEST_HAS_RTTI=0 -D__STDC_CONSTANT_MACROS -D__STDC_FORMAT_MACROS -D__STDC_LIMIT_MACROS -Ilib/Target/Mips -I/Users/buildslave/jenkins/workspace/clang-stage2-cmake-RgTSan/llvm-project/llvm/lib/Target/Mips -I/usr/include/libxml2 -Iinclude -I/Users/buildslave/jenkins/workspace/clang-stage2-cmake-RgTSan/llvm-project/llvm/include -fPIC -fvisibility-inlines-hidden -Werror=date-time -Werror=unguarded-availability-new -Wall -Wextra -Wno-unused-parameter -Wwrite-strings -Wcast-qual -Wmissing-field-initializers -pedantic -Wno-long-long -Wimplicit-fallthrough -Wcovered-switch-default -Wno-noexcept-type -Wnon-virtual-dtor -Wdelete-non-virtual-dtor -Wstring-conversion -fno-omit-frame-pointer -fsanitize=thread -fdiagnostics-color -flto=thin -O2 -g -DNDEBUG    -fno-exceptions -fno-rtti -std=c++14 -MD -MT lib/Target/Mips/CMakeFiles/LLVMMipsCodeGen.dir/MipsMCInstLower.cpp.o -MF lib/Target/Mips/CMakeFiles/LLVMMipsCodeGen.dir/MipsMCInstLower.cpp.o.d -o lib/Target/Mips/CMakeFiles/LLVMMipsCodeGen.dir/MipsMCInstLower.cpp.o -c /Users/buildslave/jenkins/workspace/clang-stage2-cmake-RgTSan/llvm-project/llvm/lib/Target/Mips/MipsMCInstLower.cpp
[1459/2138] /Users/buildslave/jenkins/workspace/clang-stage2-cmake-RgTSan/host-compiler/bin/clang++  -DBUILD_EXAMPLES -DGTEST_HAS_RTTI=0 -D__STDC_CONSTANT_MACROS -D__STDC_FORMAT_MACROS -D__STDC_LIMIT_MACROS -Ilib/Target/Mips -I/Users/buildslave/jenkins/workspace/clang-stage2-cmake-RgTSan/llvm-project/llvm/lib/Target/Mips -I/usr/include/libxml2 -Iinclude -I/Users/buildslave/jenkins/workspace/clang-stage2-cmake-RgTSan/llvm-project/llvm/include -fPIC -fvisibility-inlines-hidden -Werror=date-time -Werror=unguarded-availability-new -Wall -Wextra -Wno-unused-parameter -Wwrite-strings -Wcast-qual -Wmissing-field-initializers -pedantic -Wno-long-long -Wimplicit-fallthrough -Wcovered-switch-default -Wno-noexcept-type -Wnon-virtual-dtor -Wdelete-non-virtual-dtor -Wstring-conversion -fno-omit-frame-pointer -fsanitize=thread -fdiagnostics-color -flto=thin -O2 -g -DNDEBUG    -fno-exceptions -fno-rtti -std=c++14 -MD -MT lib/Target/Mips/CMakeFiles/LLVMMipsCodeGen.dir/MipsLegalizerInfo.cpp.o -MF lib/Target/Mips/CMakeFiles/LLVMMipsCodeGen.dir/MipsLegalizerInfo.cpp.o.d -o lib/Target/Mips/CMakeFiles/LLVMMipsCodeGen.dir/MipsLegalizerInfo.cpp.o -c /Users/buildslave/jenkins/workspace/clang-stage2-cmake-RgTSan/llvm-project/llvm/lib/Target/Mips/MipsLegalizerInfo.cpp
[1460/2138] /Users/buildslave/jenkins/workspace/clang-stage2-cmake-RgTSan/host-compiler/bin/clang++  -DBUILD_EXAMPLES -DGTEST_HAS_RTTI=0 -D__STDC_CONSTANT_MACROS -D__STDC_FORMAT_MACROS -D__STDC_LIMIT_MACROS -Ilib/Target/Mips -I/Users/buildslave/jenkins/workspace/clang-stage2-cmake-RgTSan/llvm-project/llvm/lib/Target/Mips -I/usr/include/libxml2 -Iinclude -I/Users/buildslave/jenkins/workspace/clang-stage2-cmake-RgTSan/llvm-project/llvm/include -fPIC -fvisibility-inlines-hidden -Werror=date-time -Werror=unguarded-availability-new -Wall -Wextra -Wno-unused-parameter -Wwrite-strings -Wcast-qual -Wmissing-field-initializers -pedantic -Wno-long-long -Wimplicit-fallthrough -Wcovered-switch-default -Wno-noexcept-type -Wnon-virtual-dtor -Wdelete-non-virtual-dtor -Wstring-conversion -fno-omit-frame-pointer -fsanitize=thread -fdiagnostics-color -flto=thin -O2 -g -DNDEBUG    -fno-exceptions -fno-rtti -std=c++14 -MD -MT lib/Target/Mips/CMakeFiles/LLVMMipsCodeGen.dir/MipsOs16.cpp.o -MF lib/Target/Mips/CMakeFiles/LLVMMipsCodeGen.dir/MipsOs16.cpp.o.d -o lib/Target/Mips/CMakeFiles/LLVMMipsCodeGen.dir/MipsOs16.cpp.o -c /Users/buildslave/jenkins/workspace/clang-stage2-cmake-RgTSan/llvm-project/llvm/lib/Target/Mips/MipsOs16.cpp
[1461/2138] /Users/buildslave/jenkins/workspace/clang-stage2-cmake-RgTSan/host-compiler/bin/clang++  -DBUILD_EXAMPLES -DGTEST_HAS_RTTI=0 -D__STDC_CONSTANT_MACROS -D__STDC_FORMAT_MACROS -D__STDC_LIMIT_MACROS -Ilib/Target/Mips -I/Users/buildslave/jenkins/workspace/clang-stage2-cmake-RgTSan/llvm-project/llvm/lib/Target/Mips -I/usr/include/libxml2 -Iinclude -I/Users/buildslave/jenkins/workspace/clang-stage2-cmake-RgTSan/llvm-project/llvm/include -fPIC -fvisibility-inlines-hidden -Werror=date-time -Werror=unguarded-availability-new -Wall -Wextra -Wno-unused-parameter -Wwrite-strings -Wcast-qual -Wmissing-field-initializers -pedantic -Wno-long-long -Wimplicit-fallthrough -Wcovered-switch-default -Wno-noexcept-type -Wnon-virtual-dtor -Wdelete-non-virtual-dtor -Wstring-conversion -fno-omit-frame-pointer -fsanitize=thread -fdiagnostics-color -flto=thin -O2 -g -DNDEBUG    -fno-exceptions -fno-rtti -std=c++14 -MD -MT lib/Target/Mips/CMakeFiles/LLVMMipsCodeGen.dir/MipsBranchExpansion.cpp.o -MF lib/Target/Mips/CMakeFiles/LLVMMipsCodeGen.dir/MipsBranchExpansion.cpp.o.d -o lib/Target/Mips/CMakeFiles/LLVMMipsCodeGen.dir/MipsBranchExpansion.cpp.o -c /Users/buildslave/jenkins/workspace/clang-stage2-cmake-RgTSan/llvm-project/llvm/lib/Target/Mips/MipsBranchExpansion.cpp
[1462/2138] /Users/buildslave/jenkins/workspace/clang-stage2-cmake-RgTSan/host-compiler/bin/clang++  -DBUILD_EXAMPLES -DGTEST_HAS_RTTI=0 -D__STDC_CONSTANT_MACROS -D__STDC_FORMAT_MACROS -D__STDC_LIMIT_MACROS -Ilib/Target/Mips -I/Users/buildslave/jenkins/workspace/clang-stage2-cmake-RgTSan/llvm-project/llvm/lib/Target/Mips -I/usr/include/libxml2 -Iinclude -I/Users/buildslave/jenkins/workspace/clang-stage2-cmake-RgTSan/llvm-project/llvm/include -fPIC -fvisibility-inlines-hidden -Werror=date-time -Werror=unguarded-availability-new -Wall -Wextra -Wno-unused-parameter -Wwrite-strings -Wcast-qual -Wmissing-field-initializers -pedantic -Wno-long-long -Wimplicit-fallthrough -Wcovered-switch-default -Wno-noexcept-type -Wnon-virtual-dtor -Wdelete-non-virtual-dtor -Wstring-conversion -fno-omit-frame-pointer -fsanitize=thread -fdiagnostics-color -flto=thin -O2 -g -DNDEBUG    -fno-exceptions -fno-rtti -std=c++14 -MD -MT lib/Target/Mips/CMakeFiles/LLVMMipsCodeGen.dir/MipsMachineFunction.cpp.o -MF lib/Target/Mips/CMakeFiles/LLVMMipsCodeGen.dir/MipsMachineFunction.cpp.o.d -o lib/Target/Mips/CMakeFiles/LLVMMipsCodeGen.dir/MipsMachineFunction.cpp.o -c /Users/buildslave/jenkins/workspace/clang-stage2-cmake-RgTSan/llvm-project/llvm/lib/Target/Mips/MipsMachineFunction.cpp
[1463/2138] /Users/buildslave/jenkins/workspace/clang-stage2-cmake-RgTSan/host-compiler/bin/clang++  -DBUILD_EXAMPLES -DGTEST_HAS_RTTI=0 -D__STDC_CONSTANT_MACROS -D__STDC_FORMAT_MACROS -D__STDC_LIMIT_MACROS -Ilib/Target/Mips -I/Users/buildslave/jenkins/workspace/clang-stage2-cmake-RgTSan/llvm-project/llvm/lib/Target/Mips -I/usr/include/libxml2 -Iinclude -I/Users/buildslave/jenkins/workspace/clang-stage2-cmake-RgTSan/llvm-project/llvm/include -fPIC -fvisibility-inlines-hidden -Werror=date-time -Werror=unguarded-availability-new -Wall -Wextra -Wno-unused-parameter -Wwrite-strings -Wcast-qual -Wmissing-field-initializers -pedantic -Wno-long-long -Wimplicit-fallthrough -Wcovered-switch-default -Wno-noexcept-type -Wnon-virtual-dtor -Wdelete-non-virtual-dtor -Wstring-conversion -fno-omit-frame-pointer -fsanitize=thread -fdiagnostics-color -flto=thin -O2 -g -DNDEBUG    -fno-exceptions -fno-rtti -std=c++14 -MD -MT lib/Target/Mips/CMakeFiles/LLVMMipsCodeGen.dir/MipsModuleISelDAGToDAG.cpp.o -MF lib/Target/Mips/CMakeFiles/LLVMMipsCodeGen.dir/MipsModuleISelDAGToDAG.cpp.o.d -o lib/Target/Mips/CMakeFiles/LLVMMipsCodeGen.dir/MipsModuleISelDAGToDAG.cpp.o -c /Users/buildslave/jenkins/workspace/clang-stage2-cmake-RgTSan/llvm-project/llvm/lib/Target/Mips/MipsModuleISelDAGToDAG.cpp
[1464/2138] /Users/buildslave/jenkins/workspace/clang-stage2-cmake-RgTSan/host-compiler/bin/clang++  -DBUILD_EXAMPLES -DGTEST_HAS_RTTI=0 -D__STDC_CONSTANT_MACROS -D__STDC_FORMAT_MACROS -D__STDC_LIMIT_MACROS -Ilib/Target/Mips -I/Users/buildslave/jenkins/workspace/clang-stage2-cmake-RgTSan/llvm-project/llvm/lib/Target/Mips -I/usr/include/libxml2 -Iinclude -I/Users/buildslave/jenkins/workspace/clang-stage2-cmake-RgTSan/llvm-project/llvm/include -fPIC -fvisibility-inlines-hidden -Werror=date-time -Werror=unguarded-availability-new -Wall -Wextra -Wno-unused-parameter -Wwrite-strings -Wcast-qual -Wmissing-field-initializers -pedantic -Wno-long-long -Wimplicit-fallthrough -Wcovered-switch-default -Wno-noexcept-type -Wnon-virtual-dtor -Wdelete-non-virtual-dtor -Wstring-conversion -fno-omit-frame-pointer -fsanitize=thread -fdiagnostics-color -flto=thin -O2 -g -DNDEBUG    -fno-exceptions -fno-rtti -std=c++14 -MD -MT lib/Target/Mips/CMakeFiles/LLVMMipsCodeGen.dir/MipsOptimizePICCall.cpp.o -MF lib/Target/Mips/CMakeFiles/LLVMMipsCodeGen.dir/MipsOptimizePICCall.cpp.o.d -o lib/Target/Mips/CMakeFiles/LLVMMipsCodeGen.dir/MipsOptimizePICCall.cpp.o -c /Users/buildslave/jenkins/workspace/clang-stage2-cmake-RgTSan/llvm-project/llvm/lib/Target/Mips/MipsOptimizePICCall.cpp
[1465/2138] /Users/buildslave/jenkins/workspace/clang-stage2-cmake-RgTSan/host-compiler/bin/clang++  -DBUILD_EXAMPLES -DGTEST_HAS_RTTI=0 -D__STDC_CONSTANT_MACROS -D__STDC_FORMAT_MACROS -D__STDC_LIMIT_MACROS -Ilib/Target/Mips -I/Users/buildslave/jenkins/workspace/clang-stage2-cmake-RgTSan/llvm-project/llvm/lib/Target/Mips -I/usr/include/libxml2 -Iinclude -I/Users/buildslave/jenkins/workspace/clang-stage2-cmake-RgTSan/llvm-project/llvm/include -fPIC -fvisibility-inlines-hidden -Werror=date-time -Werror=unguarded-availability-new -Wall -Wextra -Wno-unused-parameter -Wwrite-strings -Wcast-qual -Wmissing-field-initializers -pedantic -Wno-long-long -Wimplicit-fallthrough -Wcovered-switch-default -Wno-noexcept-type -Wnon-virtual-dtor -Wdelete-non-virtual-dtor -Wstring-conversion -fno-omit-frame-pointer -fsanitize=thread -fdiagnostics-color -flto=thin -O2 -g -DNDEBUG    -fno-exceptions -fno-rtti -std=c++14 -MD -MT lib/Target/Mips/CMakeFiles/LLVMMipsCodeGen.dir/MipsPreLegalizerCombiner.cpp.o -MF lib/Target/Mips/CMakeFiles/LLVMMipsCodeGen.dir/MipsPreLegalizerCombiner.cpp.o.d -o lib/Target/Mips/CMakeFiles/LLVMMipsCodeGen.dir/MipsPreLegalizerCombiner.cpp.o -c /Users/buildslave/jenkins/workspace/clang-stage2-cmake-RgTSan/llvm-project/llvm/lib/Target/Mips/MipsPreLegalizerCombiner.cpp
[1466/2138] /Users/buildslave/jenkins/workspace/clang-stage2-cmake-RgTSan/host-compiler/bin/clang++  -DBUILD_EXAMPLES -DGTEST_HAS_RTTI=0 -D__STDC_CONSTANT_MACROS -D__STDC_FORMAT_MACROS -D__STDC_LIMIT_MACROS -Ilib/Target/Mips -I/Users/buildslave/jenkins/workspace/clang-stage2-cmake-RgTSan/llvm-project/llvm/lib/Target/Mips -I/usr/include/libxml2 -Iinclude -I/Users/buildslave/jenkins/workspace/clang-stage2-cmake-RgTSan/llvm-project/llvm/include -fPIC -fvisibility-inlines-hidden -Werror=date-time -Werror=unguarded-availability-new -Wall -Wextra -Wno-unused-parameter -Wwrite-strings -Wcast-qual -Wmissing-field-initializers -pedantic -Wno-long-long -Wimplicit-fallthrough -Wcovered-switch-default -Wno-noexcept-type -Wnon-virtual-dtor -Wdelete-non-virtual-dtor -Wstring-conversion -fno-omit-frame-pointer -fsanitize=thread -fdiagnostics-color -flto=thin -O2 -g -DNDEBUG    -fno-exceptions -fno-rtti -std=c++14 -MD -MT lib/Target/Mips/CMakeFiles/LLVMMipsCodeGen.dir/MipsRegisterInfo.cpp.o -MF lib/Target/Mips/CMakeFiles/LLVMMipsCodeGen.dir/MipsRegisterInfo.cpp.o.d -o lib/Target/Mips/CMakeFiles/LLVMMipsCodeGen.dir/MipsRegisterInfo.cpp.o -c /Users/buildslave/jenkins/workspace/clang-stage2-cmake-RgTSan/llvm-project/llvm/lib/Target/Mips/MipsRegisterInfo.cpp
[1467/2138] /Users/buildslave/jenkins/workspace/clang-stage2-cmake-RgTSan/host-compiler/bin/clang++  -DBUILD_EXAMPLES -DGTEST_HAS_RTTI=0 -D__STDC_CONSTANT_MACROS -D__STDC_FORMAT_MACROS -D__STDC_LIMIT_MACROS -Ilib/Target/Mips -I/Users/buildslave/jenkins/workspace/clang-stage2-cmake-RgTSan/llvm-project/llvm/lib/Target/Mips -I/usr/include/libxml2 -Iinclude -I/Users/buildslave/jenkins/workspace/clang-stage2-cmake-RgTSan/llvm-project/llvm/include -fPIC -fvisibility-inlines-hidden -Werror=date-time -Werror=unguarded-availability-new -Wall -Wextra -Wno-unused-parameter -Wwrite-strings -Wcast-qual -Wmissing-field-initializers -pedantic -Wno-long-long -Wimplicit-fallthrough -Wcovered-switch-default -Wno-noexcept-type -Wnon-virtual-dtor -Wdelete-non-virtual-dtor -Wstring-conversion -fno-omit-frame-pointer -fsanitize=thread -fdiagnostics-color -flto=thin -O2 -g -DNDEBUG    -fno-exceptions -fno-rtti -std=c++14 -MD -MT lib/Target/Mips/CMakeFiles/LLVMMipsCodeGen.dir/MipsRegisterBankInfo.cpp.o -MF lib/Target/Mips/CMakeFiles/LLVMMipsCodeGen.dir/MipsRegisterBankInfo.cpp.o.d -o lib/Target/Mips/CMakeFiles/LLVMMipsCodeGen.dir/MipsRegisterBankInfo.cpp.o -c /Users/buildslave/jenkins/workspace/clang-stage2-cmake-RgTSan/llvm-project/llvm/lib/Target/Mips/MipsRegisterBankInfo.cpp
[1468/2138] /Users/buildslave/jenkins/workspace/clang-stage2-cmake-RgTSan/host-compiler/bin/clang++  -DBUILD_EXAMPLES -DGTEST_HAS_RTTI=0 -D__STDC_CONSTANT_MACROS -D__STDC_FORMAT_MACROS -D__STDC_LIMIT_MACROS -Ilib/Target/Mips -I/Users/buildslave/jenkins/workspace/clang-stage2-cmake-RgTSan/llvm-project/llvm/lib/Target/Mips -I/usr/include/libxml2 -Iinclude -I/Users/buildslave/jenkins/workspace/clang-stage2-cmake-RgTSan/llvm-project/llvm/include -fPIC -fvisibility-inlines-hidden -Werror=date-time -Werror=unguarded-availability-new -Wall -Wextra -Wno-unused-parameter -Wwrite-strings -Wcast-qual -Wmissing-field-initializers -pedantic -Wno-long-long -Wimplicit-fallthrough -Wcovered-switch-default -Wno-noexcept-type -Wnon-virtual-dtor -Wdelete-non-virtual-dtor -Wstring-conversion -fno-omit-frame-pointer -fsanitize=thread -fdiagnostics-color -flto=thin -O2 -g -DNDEBUG    -fno-exceptions -fno-rtti -std=c++14 -MD -MT lib/Target/Mips/CMakeFiles/LLVMMipsCodeGen.dir/MipsSEInstrInfo.cpp.o -MF lib/Target/Mips/CMakeFiles/LLVMMipsCodeGen.dir/MipsSEInstrInfo.cpp.o.d -o lib/Target/Mips/CMakeFiles/LLVMMipsCodeGen.dir/MipsSEInstrInfo.cpp.o -c /Users/buildslave/jenkins/workspace/clang-stage2-cmake-RgTSan/llvm-project/llvm/lib/Target/Mips/MipsSEInstrInfo.cpp
[1469/2138] /Users/buildslave/jenkins/workspace/clang-stage2-cmake-RgTSan/host-compiler/bin/clang++  -DBUILD_EXAMPLES -DGTEST_HAS_RTTI=0 -D__STDC_CONSTANT_MACROS -D__STDC_FORMAT_MACROS -D__STDC_LIMIT_MACROS -Ilib/Target/Mips -I/Users/buildslave/jenkins/workspace/clang-stage2-cmake-RgTSan/llvm-project/llvm/lib/Target/Mips -I/usr/include/libxml2 -Iinclude -I/Users/buildslave/jenkins/workspace/clang-stage2-cmake-RgTSan/llvm-project/llvm/include -fPIC -fvisibility-inlines-hidden -Werror=date-time -Werror=unguarded-availability-new -Wall -Wextra -Wno-unused-parameter -Wwrite-strings -Wcast-qual -Wmissing-field-initializers -pedantic -Wno-long-long -Wimplicit-fallthrough -Wcovered-switch-default -Wno-noexcept-type -Wnon-virtual-dtor -Wdelete-non-virtual-dtor -Wstring-conversion -fno-omit-frame-pointer -fsanitize=thread -fdiagnostics-color -flto=thin -O2 -g -DNDEBUG    -fno-exceptions -fno-rtti -std=c++14 -MD -MT lib/Target/Mips/CMakeFiles/LLVMMipsCodeGen.dir/MipsSEFrameLowering.cpp.o -MF lib/Target/Mips/CMakeFiles/LLVMMipsCodeGen.dir/MipsSEFrameLowering.cpp.o.d -o lib/Target/Mips/CMakeFiles/LLVMMipsCodeGen.dir/MipsSEFrameLowering.cpp.o -c /Users/buildslave/jenkins/workspace/clang-stage2-cmake-RgTSan/llvm-project/llvm/lib/Target/Mips/MipsSEFrameLowering.cpp
[1470/2138] /Users/buildslave/jenkins/workspace/clang-stage2-cmake-RgTSan/host-compiler/bin/clang++  -DBUILD_EXAMPLES -DGTEST_HAS_RTTI=0 -D__STDC_CONSTANT_MACROS -D__STDC_FORMAT_MACROS -D__STDC_LIMIT_MACROS -Ilib/Target/Mips -I/Users/buildslave/jenkins/workspace/clang-stage2-cmake-RgTSan/llvm-project/llvm/lib/Target/Mips -I/usr/include/libxml2 -Iinclude -I/Users/buildslave/jenkins/workspace/clang-stage2-cmake-RgTSan/llvm-project/llvm/include -fPIC -fvisibility-inlines-hidden -Werror=date-time -Werror=unguarded-availability-new -Wall -Wextra -Wno-unused-parameter -Wwrite-strings -Wcast-qual -Wmissing-field-initializers -pedantic -Wno-long-long -Wimplicit-fallthrough -Wcovered-switch-default -Wno-noexcept-type -Wnon-virtual-dtor -Wdelete-non-virtual-dtor -Wstring-conversion -fno-omit-frame-pointer -fsanitize=thread -fdiagnostics-color -flto=thin -O2 -g -DNDEBUG    -fno-exceptions -fno-rtti -std=c++14 -MD -MT lib/Target/Mips/CMakeFiles/LLVMMipsCodeGen.dir/MipsSERegisterInfo.cpp.o -MF lib/Target/Mips/CMakeFiles/LLVMMipsCodeGen.dir/MipsSERegisterInfo.cpp.o.d -o lib/Target/Mips/CMakeFiles/LLVMMipsCodeGen.dir/MipsSERegisterInfo.cpp.o -c /Users/buildslave/jenkins/workspace/clang-stage2-cmake-RgTSan/llvm-project/llvm/lib/Target/Mips/MipsSERegisterInfo.cpp
[1471/2138] /Users/buildslave/jenkins/workspace/clang-stage2-cmake-RgTSan/host-compiler/bin/clang++  -DBUILD_EXAMPLES -DGTEST_HAS_RTTI=0 -D__STDC_CONSTANT_MACROS -D__STDC_FORMAT_MACROS -D__STDC_LIMIT_MACROS -Ilib/Target/Mips -I/Users/buildslave/jenkins/workspace/clang-stage2-cmake-RgTSan/llvm-project/llvm/lib/Target/Mips -I/usr/include/libxml2 -Iinclude -I/Users/buildslave/jenkins/workspace/clang-stage2-cmake-RgTSan/llvm-project/llvm/include -fPIC -fvisibility-inlines-hidden -Werror=date-time -Werror=unguarded-availability-new -Wall -Wextra -Wno-unused-parameter -Wwrite-strings -Wcast-qual -Wmissing-field-initializers -pedantic -Wno-long-long -Wimplicit-fallthrough -Wcovered-switch-default -Wno-noexcept-type -Wnon-virtual-dtor -Wdelete-non-virtual-dtor -Wstring-conversion -fno-omit-frame-pointer -fsanitize=thread -fdiagnostics-color -flto=thin -O2 -g -DNDEBUG    -fno-exceptions -fno-rtti -std=c++14 -MD -MT lib/Target/Mips/CMakeFiles/LLVMMipsCodeGen.dir/MipsSEISelDAGToDAG.cpp.o -MF lib/Target/Mips/CMakeFiles/LLVMMipsCodeGen.dir/MipsSEISelDAGToDAG.cpp.o.d -o lib/Target/Mips/CMakeFiles/LLVMMipsCodeGen.dir/MipsSEISelDAGToDAG.cpp.o -c /Users/buildslave/jenkins/workspace/clang-stage2-cmake-RgTSan/llvm-project/llvm/lib/Target/Mips/MipsSEISelDAGToDAG.cpp
[1472/2138] /Users/buildslave/jenkins/workspace/clang-stage2-cmake-RgTSan/host-compiler/bin/clang++  -DBUILD_EXAMPLES -DGTEST_HAS_RTTI=0 -D__STDC_CONSTANT_MACROS -D__STDC_FORMAT_MACROS -D__STDC_LIMIT_MACROS -Ilib/Target/Mips -I/Users/buildslave/jenkins/workspace/clang-stage2-cmake-RgTSan/llvm-project/llvm/lib/Target/Mips -I/usr/include/libxml2 -Iinclude -I/Users/buildslave/jenkins/workspace/clang-stage2-cmake-RgTSan/llvm-project/llvm/include -fPIC -fvisibility-inlines-hidden -Werror=date-time -Werror=unguarded-availability-new -Wall -Wextra -Wno-unused-parameter -Wwrite-strings -Wcast-qual -Wmissing-field-initializers -pedantic -Wno-long-long -Wimplicit-fallthrough -Wcovered-switch-default -Wno-noexcept-type -Wnon-virtual-dtor -Wdelete-non-virtual-dtor -Wstring-conversion -fno-omit-frame-pointer -fsanitize=thread -fdiagnostics-color -flto=thin -O2 -g -DNDEBUG    -fno-exceptions -fno-rtti -std=c++14 -MD -MT lib/Target/Mips/CMakeFiles/LLVMMipsCodeGen.dir/MipsSEISelLowering.cpp.o -MF lib/Target/Mips/CMakeFiles/LLVMMipsCodeGen.dir/MipsSEISelLowering.cpp.o.d -o lib/Target/Mips/CMakeFiles/LLVMMipsCodeGen.dir/MipsSEISelLowering.cpp.o -c /Users/buildslave/jenkins/workspace/clang-stage2-cmake-RgTSan/llvm-project/llvm/lib/Target/Mips/MipsSEISelLowering.cpp
[1473/2138] /Users/buildslave/jenkins/workspace/clang-stage2-cmake-RgTSan/host-compiler/bin/clang++  -DBUILD_EXAMPLES -DGTEST_HAS_RTTI=0 -D__STDC_CONSTANT_MACROS -D__STDC_FORMAT_MACROS -D__STDC_LIMIT_MACROS -Ilib/Target/Mips/MCTargetDesc -I/Users/buildslave/jenkins/workspace/clang-stage2-cmake-RgTSan/llvm-project/llvm/lib/Target/Mips/MCTargetDesc -I/Users/buildslave/jenkins/workspace/clang-stage2-cmake-RgTSan/llvm-project/llvm/lib/Target/Mips -Ilib/Target/Mips -I/usr/include/libxml2 -Iinclude -I/Users/buildslave/jenkins/workspace/clang-stage2-cmake-RgTSan/llvm-project/llvm/include -fPIC -fvisibility-inlines-hidden -Werror=date-time -Werror=unguarded-availability-new -Wall -Wextra -Wno-unused-parameter -Wwrite-strings -Wcast-qual -Wmissing-field-initializers -pedantic -Wno-long-long -Wimplicit-fallthrough -Wcovered-switch-default -Wno-noexcept-type -Wnon-virtual-dtor -Wdelete-non-virtual-dtor -Wstring-conversion -fno-omit-frame-pointer -fsanitize=thread -fdiagnostics-color -flto=thin -O2 -g -DNDEBUG    -fno-exceptions -fno-rtti -std=c++14 -MD -MT lib/Target/Mips/MCTargetDesc/CMakeFiles/LLVMMipsDesc.dir/MipsABIFlagsSection.cpp.o -MF lib/Target/Mips/MCTargetDesc/CMakeFiles/LLVMMipsDesc.dir/MipsABIFlagsSection.cpp.o.d -o lib/Target/Mips/MCTargetDesc/CMakeFiles/LLVMMipsDesc.dir/MipsABIFlagsSection.cpp.o -c /Users/buildslave/jenkins/workspace/clang-stage2-cmake-RgTSan/llvm-project/llvm/lib/Target/Mips/MCTargetDesc/MipsABIFlagsSection.cpp
[1474/2138] /Users/buildslave/jenkins/workspace/clang-stage2-cmake-RgTSan/host-compiler/bin/clang++  -DBUILD_EXAMPLES -DGTEST_HAS_RTTI=0 -D__STDC_CONSTANT_MACROS -D__STDC_FORMAT_MACROS -D__STDC_LIMIT_MACROS -Ilib/Target/Mips -I/Users/buildslave/jenkins/workspace/clang-stage2-cmake-RgTSan/llvm-project/llvm/lib/Target/Mips -I/usr/include/libxml2 -Iinclude -I/Users/buildslave/jenkins/workspace/clang-stage2-cmake-RgTSan/llvm-project/llvm/include -fPIC -fvisibility-inlines-hidden -Werror=date-time -Werror=unguarded-availability-new -Wall -Wextra -Wno-unused-parameter -Wwrite-strings -Wcast-qual -Wmissing-field-initializers -pedantic -Wno-long-long -Wimplicit-fallthrough -Wcovered-switch-default -Wno-noexcept-type -Wnon-virtual-dtor -Wdelete-non-virtual-dtor -Wstring-conversion -fno-omit-frame-pointer -fsanitize=thread -fdiagnostics-color -flto=thin -O2 -g -DNDEBUG    -fno-exceptions -fno-rtti -std=c++14 -MD -MT lib/Target/Mips/CMakeFiles/LLVMMipsCodeGen.dir/MipsSubtarget.cpp.o -MF lib/Target/Mips/CMakeFiles/LLVMMipsCodeGen.dir/MipsSubtarget.cpp.o.d -o lib/Target/Mips/CMakeFiles/LLVMMipsCodeGen.dir/MipsSubtarget.cpp.o -c /Users/buildslave/jenkins/workspace/clang-stage2-cmake-RgTSan/llvm-project/llvm/lib/Target/Mips/MipsSubtarget.cpp
[1475/2138] /Users/buildslave/jenkins/workspace/clang-stage2-cmake-RgTSan/host-compiler/bin/clang++  -DBUILD_EXAMPLES -DGTEST_HAS_RTTI=0 -D__STDC_CONSTANT_MACROS -D__STDC_FORMAT_MACROS -D__STDC_LIMIT_MACROS -Ilib/Target/Mips/MCTargetDesc -I/Users/buildslave/jenkins/workspace/clang-stage2-cmake-RgTSan/llvm-project/llvm/lib/Target/Mips/MCTargetDesc -I/Users/buildslave/jenkins/workspace/clang-stage2-cmake-RgTSan/llvm-project/llvm/lib/Target/Mips -Ilib/Target/Mips -I/usr/include/libxml2 -Iinclude -I/Users/buildslave/jenkins/workspace/clang-stage2-cmake-RgTSan/llvm-project/llvm/include -fPIC -fvisibility-inlines-hidden -Werror=date-time -Werror=unguarded-availability-new -Wall -Wextra -Wno-unused-parameter -Wwrite-strings -Wcast-qual -Wmissing-field-initializers -pedantic -Wno-long-long -Wimplicit-fallthrough -Wcovered-switch-default -Wno-noexcept-type -Wnon-virtual-dtor -Wdelete-non-virtual-dtor -Wstring-conversion -fno-omit-frame-pointer -fsanitize=thread -fdiagnostics-color -flto=thin -O2 -g -DNDEBUG    -fno-exceptions -fno-rtti -std=c++14 -MD -MT lib/Target/Mips/MCTargetDesc/CMakeFiles/LLVMMipsDesc.dir/MipsABIInfo.cpp.o -MF lib/Target/Mips/MCTargetDesc/CMakeFiles/LLVMMipsDesc.dir/MipsABIInfo.cpp.o.d -o lib/Target/Mips/MCTargetDesc/CMakeFiles/LLVMMipsDesc.dir/MipsABIInfo.cpp.o -c /Users/buildslave/jenkins/workspace/clang-stage2-cmake-RgTSan/llvm-project/llvm/lib/Target/Mips/MCTargetDesc/MipsABIInfo.cpp
[1476/2138] /Users/buildslave/jenkins/workspace/clang-stage2-cmake-RgTSan/host-compiler/bin/clang++  -DBUILD_EXAMPLES -DGTEST_HAS_RTTI=0 -D__STDC_CONSTANT_MACROS -D__STDC_FORMAT_MACROS -D__STDC_LIMIT_MACROS -Ilib/Target/Mips -I/Users/buildslave/jenkins/workspace/clang-stage2-cmake-RgTSan/llvm-project/llvm/lib/Target/Mips -I/usr/include/libxml2 -Iinclude -I/Users/buildslave/jenkins/workspace/clang-stage2-cmake-RgTSan/llvm-project/llvm/include -fPIC -fvisibility-inlines-hidden -Werror=date-time -Werror=unguarded-availability-new -Wall -Wextra -Wno-unused-parameter -Wwrite-strings -Wcast-qual -Wmissing-field-initializers -pedantic -Wno-long-long -Wimplicit-fallthrough -Wcovered-switch-default -Wno-noexcept-type -Wnon-virtual-dtor -Wdelete-non-virtual-dtor -Wstring-conversion -fno-omit-frame-pointer -fsanitize=thread -fdiagnostics-color -flto=thin -O2 -g -DNDEBUG    -fno-exceptions -fno-rtti -std=c++14 -MD -MT lib/Target/Mips/CMakeFiles/LLVMMipsCodeGen.dir/MipsTargetObjectFile.cpp.o -MF lib/Target/Mips/CMakeFiles/LLVMMipsCodeGen.dir/MipsTargetObjectFile.cpp.o.d -o lib/Target/Mips/CMakeFiles/LLVMMipsCodeGen.dir/MipsTargetObjectFile.cpp.o -c /Users/buildslave/jenkins/workspace/clang-stage2-cmake-RgTSan/llvm-project/llvm/lib/Target/Mips/MipsTargetObjectFile.cpp
[1477/2138] /Users/buildslave/jenkins/workspace/clang-stage2-cmake-RgTSan/host-compiler/bin/clang++  -DBUILD_EXAMPLES -DGTEST_HAS_RTTI=0 -D__STDC_CONSTANT_MACROS -D__STDC_FORMAT_MACROS -D__STDC_LIMIT_MACROS -Ilib/Target/Mips -I/Users/buildslave/jenkins/workspace/clang-stage2-cmake-RgTSan/llvm-project/llvm/lib/Target/Mips -I/usr/include/libxml2 -Iinclude -I/Users/buildslave/jenkins/workspace/clang-stage2-cmake-RgTSan/llvm-project/llvm/include -fPIC -fvisibility-inlines-hidden -Werror=date-time -Werror=unguarded-availability-new -Wall -Wextra -Wno-unused-parameter -Wwrite-strings -Wcast-qual -Wmissing-field-initializers -pedantic -Wno-long-long -Wimplicit-fallthrough -Wcovered-switch-default -Wno-noexcept-type -Wnon-virtual-dtor -Wdelete-non-virtual-dtor -Wstring-conversion -fno-omit-frame-pointer -fsanitize=thread -fdiagnostics-color -flto=thin -O2 -g -DNDEBUG    -fno-exceptions -fno-rtti -std=c++14 -MD -MT lib/Target/Mips/CMakeFiles/LLVMMipsCodeGen.dir/MicroMipsSizeReduction.cpp.o -MF lib/Target/Mips/CMakeFiles/LLVMMipsCodeGen.dir/MicroMipsSizeReduction.cpp.o.d -o lib/Target/Mips/CMakeFiles/LLVMMipsCodeGen.dir/MicroMipsSizeReduction.cpp.o -c /Users/buildslave/jenkins/workspace/clang-stage2-cmake-RgTSan/llvm-project/llvm/lib/Target/Mips/MicroMipsSizeReduction.cpp
[1478/2138] /Users/buildslave/jenkins/workspace/clang-stage2-cmake-RgTSan/host-compiler/bin/clang++  -DBUILD_EXAMPLES -DGTEST_HAS_RTTI=0 -D__STDC_CONSTANT_MACROS -D__STDC_FORMAT_MACROS -D__STDC_LIMIT_MACROS -Ilib/Target/Mips/MCTargetDesc -I/Users/buildslave/jenkins/workspace/clang-stage2-cmake-RgTSan/llvm-project/llvm/lib/Target/Mips/MCTargetDesc -I/Users/buildslave/jenkins/workspace/clang-stage2-cmake-RgTSan/llvm-project/llvm/lib/Target/Mips -Ilib/Target/Mips -I/usr/include/libxml2 -Iinclude -I/Users/buildslave/jenkins/workspace/clang-stage2-cmake-RgTSan/llvm-project/llvm/include -fPIC -fvisibility-inlines-hidden -Werror=date-time -Werror=unguarded-availability-new -Wall -Wextra -Wno-unused-parameter -Wwrite-strings -Wcast-qual -Wmissing-field-initializers -pedantic -Wno-long-long -Wimplicit-fallthrough -Wcovered-switch-default -Wno-noexcept-type -Wnon-virtual-dtor -Wdelete-non-virtual-dtor -Wstring-conversion -fno-omit-frame-pointer -fsanitize=thread -fdiagnostics-color -flto=thin -O2 -g -DNDEBUG    -fno-exceptions -fno-rtti -std=c++14 -MD -MT lib/Target/Mips/MCTargetDesc/CMakeFiles/LLVMMipsDesc.dir/MipsAsmBackend.cpp.o -MF lib/Target/Mips/MCTargetDesc/CMakeFiles/LLVMMipsDesc.dir/MipsAsmBackend.cpp.o.d -o lib/Target/Mips/MCTargetDesc/CMakeFiles/LLVMMipsDesc.dir/MipsAsmBackend.cpp.o -c /Users/buildslave/jenkins/workspace/clang-stage2-cmake-RgTSan/llvm-project/llvm/lib/Target/Mips/MCTargetDesc/MipsAsmBackend.cpp
[1479/2138] /Users/buildslave/jenkins/workspace/clang-stage2-cmake-RgTSan/host-compiler/bin/clang++  -DBUILD_EXAMPLES -DGTEST_HAS_RTTI=0 -D__STDC_CONSTANT_MACROS -D__STDC_FORMAT_MACROS -D__STDC_LIMIT_MACROS -Ilib/Target/Mips/MCTargetDesc -I/Users/buildslave/jenkins/workspace/clang-stage2-cmake-RgTSan/llvm-project/llvm/lib/Target/Mips/MCTargetDesc -I/Users/buildslave/jenkins/workspace/clang-stage2-cmake-RgTSan/llvm-project/llvm/lib/Target/Mips -Ilib/Target/Mips -I/usr/include/libxml2 -Iinclude -I/Users/buildslave/jenkins/workspace/clang-stage2-cmake-RgTSan/llvm-project/llvm/include -fPIC -fvisibility-inlines-hidden -Werror=date-time -Werror=unguarded-availability-new -Wall -Wextra -Wno-unused-parameter -Wwrite-strings -Wcast-qual -Wmissing-field-initializers -pedantic -Wno-long-long -Wimplicit-fallthrough -Wcovered-switch-default -Wno-noexcept-type -Wnon-virtual-dtor -Wdelete-non-virtual-dtor -Wstring-conversion -fno-omit-frame-pointer -fsanitize=thread -fdiagnostics-color -flto=thin -O2 -g -DNDEBUG    -fno-exceptions -fno-rtti -std=c++14 -MD -MT lib/Target/Mips/MCTargetDesc/CMakeFiles/LLVMMipsDesc.dir/MipsELFObjectWriter.cpp.o -MF lib/Target/Mips/MCTargetDesc/CMakeFiles/LLVMMipsDesc.dir/MipsELFObjectWriter.cpp.o.d -o lib/Target/Mips/MCTargetDesc/CMakeFiles/LLVMMipsDesc.dir/MipsELFObjectWriter.cpp.o -c /Users/buildslave/jenkins/workspace/clang-stage2-cmake-RgTSan/llvm-project/llvm/lib/Target/Mips/MCTargetDesc/MipsELFObjectWriter.cpp
[1480/2138] /Users/buildslave/jenkins/workspace/clang-stage2-cmake-RgTSan/host-compiler/bin/clang++  -DBUILD_EXAMPLES -DGTEST_HAS_RTTI=0 -D__STDC_CONSTANT_MACROS -D__STDC_FORMAT_MACROS -D__STDC_LIMIT_MACROS -Ilib/Target/Mips/MCTargetDesc -I/Users/buildslave/jenkins/workspace/clang-stage2-cmake-RgTSan/llvm-project/llvm/lib/Target/Mips/MCTargetDesc -I/Users/buildslave/jenkins/workspace/clang-stage2-cmake-RgTSan/llvm-project/llvm/lib/Target/Mips -Ilib/Target/Mips -I/usr/include/libxml2 -Iinclude -I/Users/buildslave/jenkins/workspace/clang-stage2-cmake-RgTSan/llvm-project/llvm/include -fPIC -fvisibility-inlines-hidden -Werror=date-time -Werror=unguarded-availability-new -Wall -Wextra -Wno-unused-parameter -Wwrite-strings -Wcast-qual -Wmissing-field-initializers -pedantic -Wno-long-long -Wimplicit-fallthrough -Wcovered-switch-default -Wno-noexcept-type -Wnon-virtual-dtor -Wdelete-non-virtual-dtor -Wstring-conversion -fno-omit-frame-pointer -fsanitize=thread -fdiagnostics-color -flto=thin -O2 -g -DNDEBUG    -fno-exceptions -fno-rtti -std=c++14 -MD -MT lib/Target/Mips/MCTargetDesc/CMakeFiles/LLVMMipsDesc.dir/MipsMCAsmInfo.cpp.o -MF lib/Target/Mips/MCTargetDesc/CMakeFiles/LLVMMipsDesc.dir/MipsMCAsmInfo.cpp.o.d -o lib/Target/Mips/MCTargetDesc/CMakeFiles/LLVMMipsDesc.dir/MipsMCAsmInfo.cpp.o -c /Users/buildslave/jenkins/workspace/clang-stage2-cmake-RgTSan/llvm-project/llvm/lib/Target/Mips/MCTargetDesc/MipsMCAsmInfo.cpp
[1481/2138] /Users/buildslave/jenkins/workspace/clang-stage2-cmake-RgTSan/host-compiler/bin/clang++  -DBUILD_EXAMPLES -DGTEST_HAS_RTTI=0 -D__STDC_CONSTANT_MACROS -D__STDC_FORMAT_MACROS -D__STDC_LIMIT_MACROS -Ilib/Target/Mips/MCTargetDesc -I/Users/buildslave/jenkins/workspace/clang-stage2-cmake-RgTSan/llvm-project/llvm/lib/Target/Mips/MCTargetDesc -I/Users/buildslave/jenkins/workspace/clang-stage2-cmake-RgTSan/llvm-project/llvm/lib/Target/Mips -Ilib/Target/Mips -I/usr/include/libxml2 -Iinclude -I/Users/buildslave/jenkins/workspace/clang-stage2-cmake-RgTSan/llvm-project/llvm/include -fPIC -fvisibility-inlines-hidden -Werror=date-time -Werror=unguarded-availability-new -Wall -Wextra -Wno-unused-parameter -Wwrite-strings -Wcast-qual -Wmissing-field-initializers -pedantic -Wno-long-long -Wimplicit-fallthrough -Wcovered-switch-default -Wno-noexcept-type -Wnon-virtual-dtor -Wdelete-non-virtual-dtor -Wstring-conversion -fno-omit-frame-pointer -fsanitize=thread -fdiagnostics-color -flto=thin -O2 -g -DNDEBUG    -fno-exceptions -fno-rtti -std=c++14 -MD -MT lib/Target/Mips/MCTargetDesc/CMakeFiles/LLVMMipsDesc.dir/MipsELFStreamer.cpp.o -MF lib/Target/Mips/MCTargetDesc/CMakeFiles/LLVMMipsDesc.dir/MipsELFStreamer.cpp.o.d -o lib/Target/Mips/MCTargetDesc/CMakeFiles/LLVMMipsDesc.dir/MipsELFStreamer.cpp.o -c /Users/buildslave/jenkins/workspace/clang-stage2-cmake-RgTSan/llvm-project/llvm/lib/Target/Mips/MCTargetDesc/MipsELFStreamer.cpp
[1482/2138] /Users/buildslave/jenkins/workspace/clang-stage2-cmake-RgTSan/host-compiler/bin/clang++  -DBUILD_EXAMPLES -DGTEST_HAS_RTTI=0 -D__STDC_CONSTANT_MACROS -D__STDC_FORMAT_MACROS -D__STDC_LIMIT_MACROS -Ilib/Target/Mips/AsmParser -I/Users/buildslave/jenkins/workspace/clang-stage2-cmake-RgTSan/llvm-project/llvm/lib/Target/Mips/AsmParser -I/Users/buildslave/jenkins/workspace/clang-stage2-cmake-RgTSan/llvm-project/llvm/lib/Target/Mips -Ilib/Target/Mips -I/usr/include/libxml2 -Iinclude -I/Users/buildslave/jenkins/workspace/clang-stage2-cmake-RgTSan/llvm-project/llvm/include -fPIC -fvisibility-inlines-hidden -Werror=date-time -Werror=unguarded-availability-new -Wall -Wextra -Wno-unused-parameter -Wwrite-strings -Wcast-qual -Wmissing-field-initializers -pedantic -Wno-long-long -Wimplicit-fallthrough -Wcovered-switch-default -Wno-noexcept-type -Wnon-virtual-dtor -Wdelete-non-virtual-dtor -Wstring-conversion -fno-omit-frame-pointer -fsanitize=thread -fdiagnostics-color -flto=thin -O2 -g -DNDEBUG    -fno-exceptions -fno-rtti -std=c++14 -MD -MT lib/Target/Mips/AsmParser/CMakeFiles/LLVMMipsAsmParser.dir/MipsAsmParser.cpp.o -MF lib/Target/Mips/AsmParser/CMakeFiles/LLVMMipsAsmParser.dir/MipsAsmParser.cpp.o.d -o lib/Target/Mips/AsmParser/CMakeFiles/LLVMMipsAsmParser.dir/MipsAsmParser.cpp.o -c /Users/buildslave/jenkins/workspace/clang-stage2-cmake-RgTSan/llvm-project/llvm/lib/Target/Mips/AsmParser/MipsAsmParser.cpp
[1483/2138] : && DYLD_LIBRARY_PATH=/Users/buildslave/jenkins/workspace/clang-stage2-cmake-RgTSan/host-compiler/lib/ "/Applications/Xcode.app/Contents/Developer/Toolchains/XcodeDefault.xctoolchain/usr/bin/libtool" -static -no_warning_for_no_symbols -o lib/libLLVMMipsAsmParser.a  lib/Target/Mips/AsmParser/CMakeFiles/LLVMMipsAsmParser.dir/MipsAsmParser.cpp.o && :
[1484/2138] /Users/buildslave/jenkins/workspace/clang-stage2-cmake-RgTSan/host-compiler/bin/clang++  -DBUILD_EXAMPLES -DGTEST_HAS_RTTI=0 -D__STDC_CONSTANT_MACROS -D__STDC_FORMAT_MACROS -D__STDC_LIMIT_MACROS -Ilib/Target/Mips/MCTargetDesc -I/Users/buildslave/jenkins/workspace/clang-stage2-cmake-RgTSan/llvm-project/llvm/lib/Target/Mips/MCTargetDesc -I/Users/buildslave/jenkins/workspace/clang-stage2-cmake-RgTSan/llvm-project/llvm/lib/Target/Mips -Ilib/Target/Mips -I/usr/include/libxml2 -Iinclude -I/Users/buildslave/jenkins/workspace/clang-stage2-cmake-RgTSan/llvm-project/llvm/include -fPIC -fvisibility-inlines-hidden -Werror=date-time -Werror=unguarded-availability-new -Wall -Wextra -Wno-unused-parameter -Wwrite-strings -Wcast-qual -Wmissing-field-initializers -pedantic -Wno-long-long -Wimplicit-fallthrough -Wcovered-switch-default -Wno-noexcept-type -Wnon-virtual-dtor -Wdelete-non-virtual-dtor -Wstring-conversion -fno-omit-frame-pointer -fsanitize=thread -fdiagnostics-color -flto=thin -O2 -g -DNDEBUG    -fno-exceptions -fno-rtti -std=c++14 -MD -MT lib/Target/Mips/MCTargetDesc/CMakeFiles/LLVMMipsDesc.dir/MipsMCExpr.cpp.o -MF lib/Target/Mips/MCTargetDesc/CMakeFiles/LLVMMipsDesc.dir/MipsMCExpr.cpp.o.d -o lib/Target/Mips/MCTargetDesc/CMakeFiles/LLVMMipsDesc.dir/MipsMCExpr.cpp.o -c /Users/buildslave/jenkins/workspace/clang-stage2-cmake-RgTSan/llvm-project/llvm/lib/Target/Mips/MCTargetDesc/MipsMCExpr.cpp
[1485/2138] /Users/buildslave/jenkins/workspace/clang-stage2-cmake-RgTSan/host-compiler/bin/clang++  -DBUILD_EXAMPLES -DGTEST_HAS_RTTI=0 -D__STDC_CONSTANT_MACROS -D__STDC_FORMAT_MACROS -D__STDC_LIMIT_MACROS -Ilib/Target/Mips -I/Users/buildslave/jenkins/workspace/clang-stage2-cmake-RgTSan/llvm-project/llvm/lib/Target/Mips -I/usr/include/libxml2 -Iinclude -I/Users/buildslave/jenkins/workspace/clang-stage2-cmake-RgTSan/llvm-project/llvm/include -fPIC -fvisibility-inlines-hidden -Werror=date-time -Werror=unguarded-availability-new -Wall -Wextra -Wno-unused-parameter -Wwrite-strings -Wcast-qual -Wmissing-field-initializers -pedantic -Wno-long-long -Wimplicit-fallthrough -Wcovered-switch-default -Wno-noexcept-type -Wnon-virtual-dtor -Wdelete-non-virtual-dtor -Wstring-conversion -fno-omit-frame-pointer -fsanitize=thread -fdiagnostics-color -flto=thin -O2 -g -DNDEBUG    -fno-exceptions -fno-rtti -std=c++14 -MD -MT lib/Target/Mips/CMakeFiles/LLVMMipsCodeGen.dir/MipsTargetMachine.cpp.o -MF lib/Target/Mips/CMakeFiles/LLVMMipsCodeGen.dir/MipsTargetMachine.cpp.o.d -o lib/Target/Mips/CMakeFiles/LLVMMipsCodeGen.dir/MipsTargetMachine.cpp.o -c /Users/buildslave/jenkins/workspace/clang-stage2-cmake-RgTSan/llvm-project/llvm/lib/Target/Mips/MipsTargetMachine.cpp
[1486/2138] /Users/buildslave/jenkins/workspace/clang-stage2-cmake-RgTSan/host-compiler/bin/clang++  -DBUILD_EXAMPLES -DGTEST_HAS_RTTI=0 -D__STDC_CONSTANT_MACROS -D__STDC_FORMAT_MACROS -D__STDC_LIMIT_MACROS -Ilib/Target/Mips/MCTargetDesc -I/Users/buildslave/jenkins/workspace/clang-stage2-cmake-RgTSan/llvm-project/llvm/lib/Target/Mips/MCTargetDesc -I/Users/buildslave/jenkins/workspace/clang-stage2-cmake-RgTSan/llvm-project/llvm/lib/Target/Mips -Ilib/Target/Mips -I/usr/include/libxml2 -Iinclude -I/Users/buildslave/jenkins/workspace/clang-stage2-cmake-RgTSan/llvm-project/llvm/include -fPIC -fvisibility-inlines-hidden -Werror=date-time -Werror=unguarded-availability-new -Wall -Wextra -Wno-unused-parameter -Wwrite-strings -Wcast-qual -Wmissing-field-initializers -pedantic -Wno-long-long -Wimplicit-fallthrough -Wcovered-switch-default -Wno-noexcept-type -Wnon-virtual-dtor -Wdelete-non-virtual-dtor -Wstring-conversion -fno-omit-frame-pointer -fsanitize=thread -fdiagnostics-color -flto=thin -O2 -g -DNDEBUG    -fno-exceptions -fno-rtti -std=c++14 -MD -MT lib/Target/Mips/MCTargetDesc/CMakeFiles/LLVMMipsDesc.dir/MipsMCCodeEmitter.cpp.o -MF lib/Target/Mips/MCTargetDesc/CMakeFiles/LLVMMipsDesc.dir/MipsMCCodeEmitter.cpp.o.d -o lib/Target/Mips/MCTargetDesc/CMakeFiles/LLVMMipsDesc.dir/MipsMCCodeEmitter.cpp.o -c /Users/buildslave/jenkins/workspace/clang-stage2-cmake-RgTSan/llvm-project/llvm/lib/Target/Mips/MCTargetDesc/MipsMCCodeEmitter.cpp
[1487/2138] /Users/buildslave/jenkins/workspace/clang-stage2-cmake-RgTSan/host-compiler/bin/clang++  -DBUILD_EXAMPLES -DGTEST_HAS_RTTI=0 -D__STDC_CONSTANT_MACROS -D__STDC_FORMAT_MACROS -D__STDC_LIMIT_MACROS -Ilib/Target/Mips/TargetInfo -I/Users/buildslave/jenkins/workspace/clang-stage2-cmake-RgTSan/llvm-project/llvm/lib/Target/Mips/TargetInfo -I/Users/buildslave/jenkins/workspace/clang-stage2-cmake-RgTSan/llvm-project/llvm/lib/Target/Mips -Ilib/Target/Mips -I/usr/include/libxml2 -Iinclude -I/Users/buildslave/jenkins/workspace/clang-stage2-cmake-RgTSan/llvm-project/llvm/include -fPIC -fvisibility-inlines-hidden -Werror=date-time -Werror=unguarded-availability-new -Wall -Wextra -Wno-unused-parameter -Wwrite-strings -Wcast-qual -Wmissing-field-initializers -pedantic -Wno-long-long -Wimplicit-fallthrough -Wcovered-switch-default -Wno-noexcept-type -Wnon-virtual-dtor -Wdelete-non-virtual-dtor -Wstring-conversion -fno-omit-frame-pointer -fsanitize=thread -fdiagnostics-color -flto=thin -O2 -g -DNDEBUG    -fno-exceptions -fno-rtti -std=c++14 -MD -MT lib/Target/Mips/TargetInfo/CMakeFiles/LLVMMipsInfo.dir/MipsTargetInfo.cpp.o -MF lib/Target/Mips/TargetInfo/CMakeFiles/LLVMMipsInfo.dir/MipsTargetInfo.cpp.o.d -o lib/Target/Mips/TargetInfo/CMakeFiles/LLVMMipsInfo.dir/MipsTargetInfo.cpp.o -c /Users/buildslave/jenkins/workspace/clang-stage2-cmake-RgTSan/llvm-project/llvm/lib/Target/Mips/TargetInfo/MipsTargetInfo.cpp
[1488/2138] : && DYLD_LIBRARY_PATH=/Users/buildslave/jenkins/workspace/clang-stage2-cmake-RgTSan/host-compiler/lib/ "/Applications/Xcode.app/Contents/Developer/Toolchains/XcodeDefault.xctoolchain/usr/bin/libtool" -static -no_warning_for_no_symbols -o lib/libLLVMMipsInfo.a  lib/Target/Mips/TargetInfo/CMakeFiles/LLVMMipsInfo.dir/MipsTargetInfo.cpp.o && :
[1489/2138] /Users/buildslave/jenkins/workspace/clang-stage2-cmake-RgTSan/host-compiler/bin/clang++  -DBUILD_EXAMPLES -DGTEST_HAS_RTTI=0 -D__STDC_CONSTANT_MACROS -D__STDC_FORMAT_MACROS -D__STDC_LIMIT_MACROS -Ilib/Target/Mips/MCTargetDesc -I/Users/buildslave/jenkins/workspace/clang-stage2-cmake-RgTSan/llvm-project/llvm/lib/Target/Mips/MCTargetDesc -I/Users/buildslave/jenkins/workspace/clang-stage2-cmake-RgTSan/llvm-project/llvm/lib/Target/Mips -Ilib/Target/Mips -I/usr/include/libxml2 -Iinclude -I/Users/buildslave/jenkins/workspace/clang-stage2-cmake-RgTSan/llvm-project/llvm/include -fPIC -fvisibility-inlines-hidden -Werror=date-time -Werror=unguarded-availability-new -Wall -Wextra -Wno-unused-parameter -Wwrite-strings -Wcast-qual -Wmissing-field-initializers -pedantic -Wno-long-long -Wimplicit-fallthrough -Wcovered-switch-default -Wno-noexcept-type -Wnon-virtual-dtor -Wdelete-non-virtual-dtor -Wstring-conversion -fno-omit-frame-pointer -fsanitize=thread -fdiagnostics-color -flto=thin -O2 -g -DNDEBUG    -fno-exceptions -fno-rtti -std=c++14 -MD -MT lib/Target/Mips/MCTargetDesc/CMakeFiles/LLVMMipsDesc.dir/MipsInstPrinter.cpp.o -MF lib/Target/Mips/MCTargetDesc/CMakeFiles/LLVMMipsDesc.dir/MipsInstPrinter.cpp.o.d -o lib/Target/Mips/MCTargetDesc/CMakeFiles/LLVMMipsDesc.dir/MipsInstPrinter.cpp.o -c /Users/buildslave/jenkins/workspace/clang-stage2-cmake-RgTSan/llvm-project/llvm/lib/Target/Mips/MCTargetDesc/MipsInstPrinter.cpp
[1490/2138] /Users/buildslave/jenkins/workspace/clang-stage2-cmake-RgTSan/host-compiler/bin/clang++  -DBUILD_EXAMPLES -DGTEST_HAS_RTTI=0 -D__STDC_CONSTANT_MACROS -D__STDC_FORMAT_MACROS -D__STDC_LIMIT_MACROS -Ilib/Target/Mips/MCTargetDesc -I/Users/buildslave/jenkins/workspace/clang-stage2-cmake-RgTSan/llvm-project/llvm/lib/Target/Mips/MCTargetDesc -I/Users/buildslave/jenkins/workspace/clang-stage2-cmake-RgTSan/llvm-project/llvm/lib/Target/Mips -Ilib/Target/Mips -I/usr/include/libxml2 -Iinclude -I/Users/buildslave/jenkins/workspace/clang-stage2-cmake-RgTSan/llvm-project/llvm/include -fPIC -fvisibility-inlines-hidden -Werror=date-time -Werror=unguarded-availability-new -Wall -Wextra -Wno-unused-parameter -Wwrite-strings -Wcast-qual -Wmissing-field-initializers -pedantic -Wno-long-long -Wimplicit-fallthrough -Wcovered-switch-default -Wno-noexcept-type -Wnon-virtual-dtor -Wdelete-non-virtual-dtor -Wstring-conversion -fno-omit-frame-pointer -fsanitize=thread -fdiagnostics-color -flto=thin -O2 -g -DNDEBUG    -fno-exceptions -fno-rtti -std=c++14 -MD -MT lib/Target/Mips/MCTargetDesc/CMakeFiles/LLVMMipsDesc.dir/MipsOptionRecord.cpp.o -MF lib/Target/Mips/MCTargetDesc/CMakeFiles/LLVMMipsDesc.dir/MipsOptionRecord.cpp.o.d -o lib/Target/Mips/MCTargetDesc/CMakeFiles/LLVMMipsDesc.dir/MipsOptionRecord.cpp.o -c /Users/buildslave/jenkins/workspace/clang-stage2-cmake-RgTSan/llvm-project/llvm/lib/Target/Mips/MCTargetDesc/MipsOptionRecord.cpp
[1491/2138] /Users/buildslave/jenkins/workspace/clang-stage2-cmake-RgTSan/host-compiler/bin/clang++  -DBUILD_EXAMPLES -DGTEST_HAS_RTTI=0 -D__STDC_CONSTANT_MACROS -D__STDC_FORMAT_MACROS -D__STDC_LIMIT_MACROS -Ilib/Target/Mips/MCTargetDesc -I/Users/buildslave/jenkins/workspace/clang-stage2-cmake-RgTSan/llvm-project/llvm/lib/Target/Mips/MCTargetDesc -I/Users/buildslave/jenkins/workspace/clang-stage2-cmake-RgTSan/llvm-project/llvm/lib/Target/Mips -Ilib/Target/Mips -I/usr/include/libxml2 -Iinclude -I/Users/buildslave/jenkins/workspace/clang-stage2-cmake-RgTSan/llvm-project/llvm/include -fPIC -fvisibility-inlines-hidden -Werror=date-time -Werror=unguarded-availability-new -Wall -Wextra -Wno-unused-parameter -Wwrite-strings -Wcast-qual -Wmissing-field-initializers -pedantic -Wno-long-long -Wimplicit-fallthrough -Wcovered-switch-default -Wno-noexcept-type -Wnon-virtual-dtor -Wdelete-non-virtual-dtor -Wstring-conversion -fno-omit-frame-pointer -fsanitize=thread -fdiagnostics-color -flto=thin -O2 -g -DNDEBUG    -fno-exceptions -fno-rtti -std=c++14 -MD -MT lib/Target/Mips/MCTargetDesc/CMakeFiles/LLVMMipsDesc.dir/MipsNaClELFStreamer.cpp.o -MF lib/Target/Mips/MCTargetDesc/CMakeFiles/LLVMMipsDesc.dir/MipsNaClELFStreamer.cpp.o.d -o lib/Target/Mips/MCTargetDesc/CMakeFiles/LLVMMipsDesc.dir/MipsNaClELFStreamer.cpp.o -c /Users/buildslave/jenkins/workspace/clang-stage2-cmake-RgTSan/llvm-project/llvm/lib/Target/Mips/MCTargetDesc/MipsNaClELFStreamer.cpp
[1492/2138] : && DYLD_LIBRARY_PATH=/Users/buildslave/jenkins/workspace/clang-stage2-cmake-RgTSan/host-compiler/lib/ "/Applications/Xcode.app/Contents/Developer/Toolchains/XcodeDefault.xctoolchain/usr/bin/libtool" -static -no_warning_for_no_symbols -o lib/libLLVMMipsCodeGen.a  lib/Target/Mips/CMakeFiles/LLVMMipsCodeGen.dir/Mips16FrameLowering.cpp.o lib/Target/Mips/CMakeFiles/LLVMMipsCodeGen.dir/Mips16HardFloat.cpp.o lib/Target/Mips/CMakeFiles/LLVMMipsCodeGen.dir/Mips16HardFloatInfo.cpp.o lib/Target/Mips/CMakeFiles/LLVMMipsCodeGen.dir/Mips16InstrInfo.cpp.o lib/Target/Mips/CMakeFiles/LLVMMipsCodeGen.dir/Mips16ISelDAGToDAG.cpp.o lib/Target/Mips/CMakeFiles/LLVMMipsCodeGen.dir/Mips16ISelLowering.cpp.o lib/Target/Mips/CMakeFiles/LLVMMipsCodeGen.dir/Mips16RegisterInfo.cpp.o lib/Target/Mips/CMakeFiles/LLVMMipsCodeGen.dir/MipsAnalyzeImmediate.cpp.o lib/Target/Mips/CMakeFiles/LLVMMipsCodeGen.dir/MipsAsmPrinter.cpp.o lib/Target/Mips/CMakeFiles/LLVMMipsCodeGen.dir/MipsCallLowering.cpp.o lib/Target/Mips/CMakeFiles/LLVMMipsCodeGen.dir/MipsCCState.cpp.o lib/Target/Mips/CMakeFiles/LLVMMipsCodeGen.dir/MipsConstantIslandPass.cpp.o lib/Target/Mips/CMakeFiles/LLVMMipsCodeGen.dir/MipsDelaySlotFiller.cpp.o lib/Target/Mips/CMakeFiles/LLVMMipsCodeGen.dir/MipsExpandPseudo.cpp.o lib/Target/Mips/CMakeFiles/LLVMMipsCodeGen.dir/MipsFastISel.cpp.o lib/Target/Mips/CMakeFiles/LLVMMipsCodeGen.dir/MipsInstrInfo.cpp.o lib/Target/Mips/CMakeFiles/LLVMMipsCodeGen.dir/MipsInstructionSelector.cpp.o lib/Target/Mips/CMakeFiles/LLVMMipsCodeGen.dir/MipsISelDAGToDAG.cpp.o lib/Target/Mips/CMakeFiles/LLVMMipsCodeGen.dir/MipsISelLowering.cpp.o lib/Target/Mips/CMakeFiles/LLVMMipsCodeGen.dir/MipsFrameLowering.cpp.o lib/Target/Mips/CMakeFiles/LLVMMipsCodeGen.dir/MipsLegalizerInfo.cpp.o lib/Target/Mips/CMakeFiles/LLVMMipsCodeGen.dir/MipsBranchExpansion.cpp.o lib/Target/Mips/CMakeFiles/LLVMMipsCodeGen.dir/MipsMCInstLower.cpp.o lib/Target/Mips/CMakeFiles/LLVMMipsCodeGen.dir/MipsMachineFunction.cpp.o lib/Target/Mips/CMakeFiles/LLVMMipsCodeGen.dir/MipsModuleISelDAGToDAG.cpp.o lib/Target/Mips/CMakeFiles/LLVMMipsCodeGen.dir/MipsOptimizePICCall.cpp.o lib/Target/Mips/CMakeFiles/LLVMMipsCodeGen.dir/MipsOs16.cpp.o lib/Target/Mips/CMakeFiles/LLVMMipsCodeGen.dir/MipsPreLegalizerCombiner.cpp.o lib/Target/Mips/CMakeFiles/LLVMMipsCodeGen.dir/MipsRegisterBankInfo.cpp.o lib/Target/Mips/CMakeFiles/LLVMMipsCodeGen.dir/MipsRegisterInfo.cpp.o lib/Target/Mips/CMakeFiles/LLVMMipsCodeGen.dir/MipsSEFrameLowering.cpp.o lib/Target/Mips/CMakeFiles/LLVMMipsCodeGen.dir/MipsSEInstrInfo.cpp.o lib/Target/Mips/CMakeFiles/LLVMMipsCodeGen.dir/MipsSEISelDAGToDAG.cpp.o lib/Target/Mips/CMakeFiles/LLVMMipsCodeGen.dir/MipsSEISelLowering.cpp.o lib/Target/Mips/CMakeFiles/LLVMMipsCodeGen.dir/MipsSERegisterInfo.cpp.o lib/Target/Mips/CMakeFiles/LLVMMipsCodeGen.dir/MipsSubtarget.cpp.o lib/Target/Mips/CMakeFiles/LLVMMipsCodeGen.dir/MipsTargetMachine.cpp.o lib/Target/Mips/CMakeFiles/LLVMMipsCodeGen.dir/MipsTargetObjectFile.cpp.o lib/Target/Mips/CMakeFiles/LLVMMipsCodeGen.dir/MicroMipsSizeReduction.cpp.o && :
[1493/2138] /Users/buildslave/jenkins/workspace/clang-stage2-cmake-RgTSan/host-compiler/bin/clang++  -DBUILD_EXAMPLES -DGTEST_HAS_RTTI=0 -D__STDC_CONSTANT_MACROS -D__STDC_FORMAT_MACROS -D__STDC_LIMIT_MACROS -Ilib/Target/Mips/MCTargetDesc -I/Users/buildslave/jenkins/workspace/clang-stage2-cmake-RgTSan/llvm-project/llvm/lib/Target/Mips/MCTargetDesc -I/Users/buildslave/jenkins/workspace/clang-stage2-cmake-RgTSan/llvm-project/llvm/lib/Target/Mips -Ilib/Target/Mips -I/usr/include/libxml2 -Iinclude -I/Users/buildslave/jenkins/workspace/clang-stage2-cmake-RgTSan/llvm-project/llvm/include -fPIC -fvisibility-inlines-hidden -Werror=date-time -Werror=unguarded-availability-new -Wall -Wextra -Wno-unused-parameter -Wwrite-strings -Wcast-qual -Wmissing-field-initializers -pedantic -Wno-long-long -Wimplicit-fallthrough -Wcovered-switch-default -Wno-noexcept-type -Wnon-virtual-dtor -Wdelete-non-virtual-dtor -Wstring-conversion -fno-omit-frame-pointer -fsanitize=thread -fdiagnostics-color -flto=thin -O2 -g -DNDEBUG    -fno-exceptions -fno-rtti -std=c++14 -MD -MT lib/Target/Mips/MCTargetDesc/CMakeFiles/LLVMMipsDesc.dir/MipsMCTargetDesc.cpp.o -MF lib/Target/Mips/MCTargetDesc/CMakeFiles/LLVMMipsDesc.dir/MipsMCTargetDesc.cpp.o.d -o lib/Target/Mips/MCTargetDesc/CMakeFiles/LLVMMipsDesc.dir/MipsMCTargetDesc.cpp.o -c /Users/buildslave/jenkins/workspace/clang-stage2-cmake-RgTSan/llvm-project/llvm/lib/Target/Mips/MCTargetDesc/MipsMCTargetDesc.cpp
[1494/2138] /Users/buildslave/jenkins/workspace/clang-stage2-cmake-RgTSan/host-compiler/bin/clang++  -DBUILD_EXAMPLES -DGTEST_HAS_RTTI=0 -D__STDC_CONSTANT_MACROS -D__STDC_FORMAT_MACROS -D__STDC_LIMIT_MACROS -Ilib/Target/Mips/Disassembler -I/Users/buildslave/jenkins/workspace/clang-stage2-cmake-RgTSan/llvm-project/llvm/lib/Target/Mips/Disassembler -I/Users/buildslave/jenkins/workspace/clang-stage2-cmake-RgTSan/llvm-project/llvm/lib/Target/Mips -Ilib/Target/Mips -I/usr/include/libxml2 -Iinclude -I/Users/buildslave/jenkins/workspace/clang-stage2-cmake-RgTSan/llvm-project/llvm/include -fPIC -fvisibility-inlines-hidden -Werror=date-time -Werror=unguarded-availability-new -Wall -Wextra -Wno-unused-parameter -Wwrite-strings -Wcast-qual -Wmissing-field-initializers -pedantic -Wno-long-long -Wimplicit-fallthrough -Wcovered-switch-default -Wno-noexcept-type -Wnon-virtual-dtor -Wdelete-non-virtual-dtor -Wstring-conversion -fno-omit-frame-pointer -fsanitize=thread -fdiagnostics-color -flto=thin -O2 -g -DNDEBUG    -fno-exceptions -fno-rtti -std=c++14 -MD -MT lib/Target/Mips/Disassembler/CMakeFiles/LLVMMipsDisassembler.dir/MipsDisassembler.cpp.o -MF lib/Target/Mips/Disassembler/CMakeFiles/LLVMMipsDisassembler.dir/MipsDisassembler.cpp.o.d -o lib/Target/Mips/Disassembler/CMakeFiles/LLVMMipsDisassembler.dir/MipsDisassembler.cpp.o -c /Users/buildslave/jenkins/workspace/clang-stage2-cmake-RgTSan/llvm-project/llvm/lib/Target/Mips/Disassembler/MipsDisassembler.cpp
[1495/2138] : && DYLD_LIBRARY_PATH=/Users/buildslave/jenkins/workspace/clang-stage2-cmake-RgTSan/host-compiler/lib/ "/Applications/Xcode.app/Contents/Developer/Toolchains/XcodeDefault.xctoolchain/usr/bin/libtool" -static -no_warning_for_no_symbols -o lib/libLLVMMipsDisassembler.a  lib/Target/Mips/Disassembler/CMakeFiles/LLVMMipsDisassembler.dir/MipsDisassembler.cpp.o && :
[1496/2138] /Users/buildslave/jenkins/workspace/clang-stage2-cmake-RgTSan/host-compiler/bin/clang++  -DBUILD_EXAMPLES -DGTEST_HAS_RTTI=0 -D__STDC_CONSTANT_MACROS -D__STDC_FORMAT_MACROS -D__STDC_LIMIT_MACROS -Ilib/Target/MSP430 -I/Users/buildslave/jenkins/workspace/clang-stage2-cmake-RgTSan/llvm-project/llvm/lib/Target/MSP430 -I/usr/include/libxml2 -Iinclude -I/Users/buildslave/jenkins/workspace/clang-stage2-cmake-RgTSan/llvm-project/llvm/include -fPIC -fvisibility-inlines-hidden -Werror=date-time -Werror=unguarded-availability-new -Wall -Wextra -Wno-unused-parameter -Wwrite-strings -Wcast-qual -Wmissing-field-initializers -pedantic -Wno-long-long -Wimplicit-fallthrough -Wcovered-switch-default -Wno-noexcept-type -Wnon-virtual-dtor -Wdelete-non-virtual-dtor -Wstring-conversion -fno-omit-frame-pointer -fsanitize=thread -fdiagnostics-color -flto=thin -O2 -g -DNDEBUG    -fno-exceptions -fno-rtti -std=c++14 -MD -MT lib/Target/MSP430/CMakeFiles/LLVMMSP430CodeGen.dir/MSP430MachineFunctionInfo.cpp.o -MF lib/Target/MSP430/CMakeFiles/LLVMMSP430CodeGen.dir/MSP430MachineFunctionInfo.cpp.o.d -o lib/Target/MSP430/CMakeFiles/LLVMMSP430CodeGen.dir/MSP430MachineFunctionInfo.cpp.o -c /Users/buildslave/jenkins/workspace/clang-stage2-cmake-RgTSan/llvm-project/llvm/lib/Target/MSP430/MSP430MachineFunctionInfo.cpp
[1497/2138] /Users/buildslave/jenkins/workspace/clang-stage2-cmake-RgTSan/host-compiler/bin/clang++  -DBUILD_EXAMPLES -DGTEST_HAS_RTTI=0 -D__STDC_CONSTANT_MACROS -D__STDC_FORMAT_MACROS -D__STDC_LIMIT_MACROS -Ilib/Target/Mips/MCTargetDesc -I/Users/buildslave/jenkins/workspace/clang-stage2-cmake-RgTSan/llvm-project/llvm/lib/Target/Mips/MCTargetDesc -I/Users/buildslave/jenkins/workspace/clang-stage2-cmake-RgTSan/llvm-project/llvm/lib/Target/Mips -Ilib/Target/Mips -I/usr/include/libxml2 -Iinclude -I/Users/buildslave/jenkins/workspace/clang-stage2-cmake-RgTSan/llvm-project/llvm/include -fPIC -fvisibility-inlines-hidden -Werror=date-time -Werror=unguarded-availability-new -Wall -Wextra -Wno-unused-parameter -Wwrite-strings -Wcast-qual -Wmissing-field-initializers -pedantic -Wno-long-long -Wimplicit-fallthrough -Wcovered-switch-default -Wno-noexcept-type -Wnon-virtual-dtor -Wdelete-non-virtual-dtor -Wstring-conversion -fno-omit-frame-pointer -fsanitize=thread -fdiagnostics-color -flto=thin -O2 -g -DNDEBUG    -fno-exceptions -fno-rtti -std=c++14 -MD -MT lib/Target/Mips/MCTargetDesc/CMakeFiles/LLVMMipsDesc.dir/MipsTargetStreamer.cpp.o -MF lib/Target/Mips/MCTargetDesc/CMakeFiles/LLVMMipsDesc.dir/MipsTargetStreamer.cpp.o.d -o lib/Target/Mips/MCTargetDesc/CMakeFiles/LLVMMipsDesc.dir/MipsTargetStreamer.cpp.o -c /Users/buildslave/jenkins/workspace/clang-stage2-cmake-RgTSan/llvm-project/llvm/lib/Target/Mips/MCTargetDesc/MipsTargetStreamer.cpp
[1498/2138] : && DYLD_LIBRARY_PATH=/Users/buildslave/jenkins/workspace/clang-stage2-cmake-RgTSan/host-compiler/lib/ "/Applications/Xcode.app/Contents/Developer/Toolchains/XcodeDefault.xctoolchain/usr/bin/libtool" -static -no_warning_for_no_symbols -o lib/libLLVMMipsDesc.a  lib/Target/Mips/MCTargetDesc/CMakeFiles/LLVMMipsDesc.dir/MipsABIInfo.cpp.o lib/Target/Mips/MCTargetDesc/CMakeFiles/LLVMMipsDesc.dir/MipsABIFlagsSection.cpp.o lib/Target/Mips/MCTargetDesc/CMakeFiles/LLVMMipsDesc.dir/MipsAsmBackend.cpp.o lib/Target/Mips/MCTargetDesc/CMakeFiles/LLVMMipsDesc.dir/MipsELFObjectWriter.cpp.o lib/Target/Mips/MCTargetDesc/CMakeFiles/LLVMMipsDesc.dir/MipsELFStreamer.cpp.o lib/Target/Mips/MCTargetDesc/CMakeFiles/LLVMMipsDesc.dir/MipsInstPrinter.cpp.o lib/Target/Mips/MCTargetDesc/CMakeFiles/LLVMMipsDesc.dir/MipsMCAsmInfo.cpp.o lib/Target/Mips/MCTargetDesc/CMakeFiles/LLVMMipsDesc.dir/MipsMCCodeEmitter.cpp.o lib/Target/Mips/MCTargetDesc/CMakeFiles/LLVMMipsDesc.dir/MipsMCExpr.cpp.o lib/Target/Mips/MCTargetDesc/CMakeFiles/LLVMMipsDesc.dir/MipsMCTargetDesc.cpp.o lib/Target/Mips/MCTargetDesc/CMakeFiles/LLVMMipsDesc.dir/MipsNaClELFStreamer.cpp.o lib/Target/Mips/MCTargetDesc/CMakeFiles/LLVMMipsDesc.dir/MipsOptionRecord.cpp.o lib/Target/Mips/MCTargetDesc/CMakeFiles/LLVMMipsDesc.dir/MipsTargetStreamer.cpp.o && :
[1499/2138] /Users/buildslave/jenkins/workspace/clang-stage2-cmake-RgTSan/host-compiler/bin/clang++  -DBUILD_EXAMPLES -DGTEST_HAS_RTTI=0 -D__STDC_CONSTANT_MACROS -D__STDC_FORMAT_MACROS -D__STDC_LIMIT_MACROS -Ilib/Target/MSP430 -I/Users/buildslave/jenkins/workspace/clang-stage2-cmake-RgTSan/llvm-project/llvm/lib/Target/MSP430 -I/usr/include/libxml2 -Iinclude -I/Users/buildslave/jenkins/workspace/clang-stage2-cmake-RgTSan/llvm-project/llvm/include -fPIC -fvisibility-inlines-hidden -Werror=date-time -Werror=unguarded-availability-new -Wall -Wextra -Wno-unused-parameter -Wwrite-strings -Wcast-qual -Wmissing-field-initializers -pedantic -Wno-long-long -Wimplicit-fallthrough -Wcovered-switch-default -Wno-noexcept-type -Wnon-virtual-dtor -Wdelete-non-virtual-dtor -Wstring-conversion -fno-omit-frame-pointer -fsanitize=thread -fdiagnostics-color -flto=thin -O2 -g -DNDEBUG    -fno-exceptions -fno-rtti -std=c++14 -MD -MT lib/Target/MSP430/CMakeFiles/LLVMMSP430CodeGen.dir/MSP430ISelDAGToDAG.cpp.o -MF lib/Target/MSP430/CMakeFiles/LLVMMSP430CodeGen.dir/MSP430ISelDAGToDAG.cpp.o.d -o lib/Target/MSP430/CMakeFiles/LLVMMSP430CodeGen.dir/MSP430ISelDAGToDAG.cpp.o -c /Users/buildslave/jenkins/workspace/clang-stage2-cmake-RgTSan/llvm-project/llvm/lib/Target/MSP430/MSP430ISelDAGToDAG.cpp
[1500/2138] /Users/buildslave/jenkins/workspace/clang-stage2-cmake-RgTSan/host-compiler/bin/clang++  -DBUILD_EXAMPLES -DGTEST_HAS_RTTI=0 -D__STDC_CONSTANT_MACROS -D__STDC_FORMAT_MACROS -D__STDC_LIMIT_MACROS -Ilib/Target/MSP430 -I/Users/buildslave/jenkins/workspace/clang-stage2-cmake-RgTSan/llvm-project/llvm/lib/Target/MSP430 -I/usr/include/libxml2 -Iinclude -I/Users/buildslave/jenkins/workspace/clang-stage2-cmake-RgTSan/llvm-project/llvm/include -fPIC -fvisibility-inlines-hidden -Werror=date-time -Werror=unguarded-availability-new -Wall -Wextra -Wno-unused-parameter -Wwrite-strings -Wcast-qual -Wmissing-field-initializers -pedantic -Wno-long-long -Wimplicit-fallthrough -Wcovered-switch-default -Wno-noexcept-type -Wnon-virtual-dtor -Wdelete-non-virtual-dtor -Wstring-conversion -fno-omit-frame-pointer -fsanitize=thread -fdiagnostics-color -flto=thin -O2 -g -DNDEBUG    -fno-exceptions -fno-rtti -std=c++14 -MD -MT lib/Target/MSP430/CMakeFiles/LLVMMSP430CodeGen.dir/MSP430InstrInfo.cpp.o -MF lib/Target/MSP430/CMakeFiles/LLVMMSP430CodeGen.dir/MSP430InstrInfo.cpp.o.d -o lib/Target/MSP430/CMakeFiles/LLVMMSP430CodeGen.dir/MSP430InstrInfo.cpp.o -c /Users/buildslave/jenkins/workspace/clang-stage2-cmake-RgTSan/llvm-project/llvm/lib/Target/MSP430/MSP430InstrInfo.cpp
[1501/2138] /Users/buildslave/jenkins/workspace/clang-stage2-cmake-RgTSan/host-compiler/bin/clang++  -DBUILD_EXAMPLES -DGTEST_HAS_RTTI=0 -D__STDC_CONSTANT_MACROS -D__STDC_FORMAT_MACROS -D__STDC_LIMIT_MACROS -Ilib/Target/MSP430 -I/Users/buildslave/jenkins/workspace/clang-stage2-cmake-RgTSan/llvm-project/llvm/lib/Target/MSP430 -I/usr/include/libxml2 -Iinclude -I/Users/buildslave/jenkins/workspace/clang-stage2-cmake-RgTSan/llvm-project/llvm/include -fPIC -fvisibility-inlines-hidden -Werror=date-time -Werror=unguarded-availability-new -Wall -Wextra -Wno-unused-parameter -Wwrite-strings -Wcast-qual -Wmissing-field-initializers -pedantic -Wno-long-long -Wimplicit-fallthrough -Wcovered-switch-default -Wno-noexcept-type -Wnon-virtual-dtor -Wdelete-non-virtual-dtor -Wstring-conversion -fno-omit-frame-pointer -fsanitize=thread -fdiagnostics-color -flto=thin -O2 -g -DNDEBUG    -fno-exceptions -fno-rtti -std=c++14 -MD -MT lib/Target/MSP430/CMakeFiles/LLVMMSP430CodeGen.dir/MSP430RegisterInfo.cpp.o -MF lib/Target/MSP430/CMakeFiles/LLVMMSP430CodeGen.dir/MSP430RegisterInfo.cpp.o.d -o lib/Target/MSP430/CMakeFiles/LLVMMSP430CodeGen.dir/MSP430RegisterInfo.cpp.o -c /Users/buildslave/jenkins/workspace/clang-stage2-cmake-RgTSan/llvm-project/llvm/lib/Target/MSP430/MSP430RegisterInfo.cpp
[1502/2138] /Users/buildslave/jenkins/workspace/clang-stage2-cmake-RgTSan/host-compiler/bin/clang++  -DBUILD_EXAMPLES -DGTEST_HAS_RTTI=0 -D__STDC_CONSTANT_MACROS -D__STDC_FORMAT_MACROS -D__STDC_LIMIT_MACROS -Ilib/Target/MSP430 -I/Users/buildslave/jenkins/workspace/clang-stage2-cmake-RgTSan/llvm-project/llvm/lib/Target/MSP430 -I/usr/include/libxml2 -Iinclude -I/Users/buildslave/jenkins/workspace/clang-stage2-cmake-RgTSan/llvm-project/llvm/include -fPIC -fvisibility-inlines-hidden -Werror=date-time -Werror=unguarded-availability-new -Wall -Wextra -Wno-unused-parameter -Wwrite-strings -Wcast-qual -Wmissing-field-initializers -pedantic -Wno-long-long -Wimplicit-fallthrough -Wcovered-switch-default -Wno-noexcept-type -Wnon-virtual-dtor -Wdelete-non-virtual-dtor -Wstring-conversion -fno-omit-frame-pointer -fsanitize=thread -fdiagnostics-color -flto=thin -O2 -g -DNDEBUG    -fno-exceptions -fno-rtti -std=c++14 -MD -MT lib/Target/MSP430/CMakeFiles/LLVMMSP430CodeGen.dir/MSP430FrameLowering.cpp.o -MF lib/Target/MSP430/CMakeFiles/LLVMMSP430CodeGen.dir/MSP430FrameLowering.cpp.o.d -o lib/Target/MSP430/CMakeFiles/LLVMMSP430CodeGen.dir/MSP430FrameLowering.cpp.o -c /Users/buildslave/jenkins/workspace/clang-stage2-cmake-RgTSan/llvm-project/llvm/lib/Target/MSP430/MSP430FrameLowering.cpp
[1503/2138] /Users/buildslave/jenkins/workspace/clang-stage2-cmake-RgTSan/host-compiler/bin/clang++  -DBUILD_EXAMPLES -DGTEST_HAS_RTTI=0 -D__STDC_CONSTANT_MACROS -D__STDC_FORMAT_MACROS -D__STDC_LIMIT_MACROS -Ilib/Target/MSP430 -I/Users/buildslave/jenkins/workspace/clang-stage2-cmake-RgTSan/llvm-project/llvm/lib/Target/MSP430 -I/usr/include/libxml2 -Iinclude -I/Users/buildslave/jenkins/workspace/clang-stage2-cmake-RgTSan/llvm-project/llvm/include -fPIC -fvisibility-inlines-hidden -Werror=date-time -Werror=unguarded-availability-new -Wall -Wextra -Wno-unused-parameter -Wwrite-strings -Wcast-qual -Wmissing-field-initializers -pedantic -Wno-long-long -Wimplicit-fallthrough -Wcovered-switch-default -Wno-noexcept-type -Wnon-virtual-dtor -Wdelete-non-virtual-dtor -Wstring-conversion -fno-omit-frame-pointer -fsanitize=thread -fdiagnostics-color -flto=thin -O2 -g -DNDEBUG    -fno-exceptions -fno-rtti -std=c++14 -MD -MT lib/Target/MSP430/CMakeFiles/LLVMMSP430CodeGen.dir/MSP430ISelLowering.cpp.o -MF lib/Target/MSP430/CMakeFiles/LLVMMSP430CodeGen.dir/MSP430ISelLowering.cpp.o.d -o lib/Target/MSP430/CMakeFiles/LLVMMSP430CodeGen.dir/MSP430ISelLowering.cpp.o -c /Users/buildslave/jenkins/workspace/clang-stage2-cmake-RgTSan/llvm-project/llvm/lib/Target/MSP430/MSP430ISelLowering.cpp
[1504/2138] /Users/buildslave/jenkins/workspace/clang-stage2-cmake-RgTSan/host-compiler/bin/clang++  -DBUILD_EXAMPLES -DGTEST_HAS_RTTI=0 -D__STDC_CONSTANT_MACROS -D__STDC_FORMAT_MACROS -D__STDC_LIMIT_MACROS -Ilib/Target/MSP430 -I/Users/buildslave/jenkins/workspace/clang-stage2-cmake-RgTSan/llvm-project/llvm/lib/Target/MSP430 -I/usr/include/libxml2 -Iinclude -I/Users/buildslave/jenkins/workspace/clang-stage2-cmake-RgTSan/llvm-project/llvm/include -fPIC -fvisibility-inlines-hidden -Werror=date-time -Werror=unguarded-availability-new -Wall -Wextra -Wno-unused-parameter -Wwrite-strings -Wcast-qual -Wmissing-field-initializers -pedantic -Wno-long-long -Wimplicit-fallthrough -Wcovered-switch-default -Wno-noexcept-type -Wnon-virtual-dtor -Wdelete-non-virtual-dtor -Wstring-conversion -fno-omit-frame-pointer -fsanitize=thread -fdiagnostics-color -flto=thin -O2 -g -DNDEBUG    -fno-exceptions -fno-rtti -std=c++14 -MD -MT lib/Target/MSP430/CMakeFiles/LLVMMSP430CodeGen.dir/MSP430Subtarget.cpp.o -MF lib/Target/MSP430/CMakeFiles/LLVMMSP430CodeGen.dir/MSP430Subtarget.cpp.o.d -o lib/Target/MSP430/CMakeFiles/LLVMMSP430CodeGen.dir/MSP430Subtarget.cpp.o -c /Users/buildslave/jenkins/workspace/clang-stage2-cmake-RgTSan/llvm-project/llvm/lib/Target/MSP430/MSP430Subtarget.cpp
[1505/2138] /Users/buildslave/jenkins/workspace/clang-stage2-cmake-RgTSan/host-compiler/bin/clang++  -DBUILD_EXAMPLES -DGTEST_HAS_RTTI=0 -D__STDC_CONSTANT_MACROS -D__STDC_FORMAT_MACROS -D__STDC_LIMIT_MACROS -Ilib/Target/MSP430/MCTargetDesc -I/Users/buildslave/jenkins/workspace/clang-stage2-cmake-RgTSan/llvm-project/llvm/lib/Target/MSP430/MCTargetDesc -I/Users/buildslave/jenkins/workspace/clang-stage2-cmake-RgTSan/llvm-project/llvm/lib/Target/MSP430 -Ilib/Target/MSP430 -I/usr/include/libxml2 -Iinclude -I/Users/buildslave/jenkins/workspace/clang-stage2-cmake-RgTSan/llvm-project/llvm/include -fPIC -fvisibility-inlines-hidden -Werror=date-time -Werror=unguarded-availability-new -Wall -Wextra -Wno-unused-parameter -Wwrite-strings -Wcast-qual -Wmissing-field-initializers -pedantic -Wno-long-long -Wimplicit-fallthrough -Wcovered-switch-default -Wno-noexcept-type -Wnon-virtual-dtor -Wdelete-non-virtual-dtor -Wstring-conversion -fno-omit-frame-pointer -fsanitize=thread -fdiagnostics-color -flto=thin -O2 -g -DNDEBUG    -fno-exceptions -fno-rtti -std=c++14 -MD -MT lib/Target/MSP430/MCTargetDesc/CMakeFiles/LLVMMSP430Desc.dir/MSP430ELFObjectWriter.cpp.o -MF lib/Target/MSP430/MCTargetDesc/CMakeFiles/LLVMMSP430Desc.dir/MSP430ELFObjectWriter.cpp.o.d -o lib/Target/MSP430/MCTargetDesc/CMakeFiles/LLVMMSP430Desc.dir/MSP430ELFObjectWriter.cpp.o -c /Users/buildslave/jenkins/workspace/clang-stage2-cmake-RgTSan/llvm-project/llvm/lib/Target/MSP430/MCTargetDesc/MSP430ELFObjectWriter.cpp
[1506/2138] /Users/buildslave/jenkins/workspace/clang-stage2-cmake-RgTSan/host-compiler/bin/clang++  -DBUILD_EXAMPLES -DGTEST_HAS_RTTI=0 -D__STDC_CONSTANT_MACROS -D__STDC_FORMAT_MACROS -D__STDC_LIMIT_MACROS -Ilib/Target/MSP430/MCTargetDesc -I/Users/buildslave/jenkins/workspace/clang-stage2-cmake-RgTSan/llvm-project/llvm/lib/Target/MSP430/MCTargetDesc -I/Users/buildslave/jenkins/workspace/clang-stage2-cmake-RgTSan/llvm-project/llvm/lib/Target/MSP430 -Ilib/Target/MSP430 -I/usr/include/libxml2 -Iinclude -I/Users/buildslave/jenkins/workspace/clang-stage2-cmake-RgTSan/llvm-project/llvm/include -fPIC -fvisibility-inlines-hidden -Werror=date-time -Werror=unguarded-availability-new -Wall -Wextra -Wno-unused-parameter -Wwrite-strings -Wcast-qual -Wmissing-field-initializers -pedantic -Wno-long-long -Wimplicit-fallthrough -Wcovered-switch-default -Wno-noexcept-type -Wnon-virtual-dtor -Wdelete-non-virtual-dtor -Wstring-conversion -fno-omit-frame-pointer -fsanitize=thread -fdiagnostics-color -flto=thin -O2 -g -DNDEBUG    -fno-exceptions -fno-rtti -std=c++14 -MD -MT lib/Target/MSP430/MCTargetDesc/CMakeFiles/LLVMMSP430Desc.dir/MSP430MCAsmInfo.cpp.o -MF lib/Target/MSP430/MCTargetDesc/CMakeFiles/LLVMMSP430Desc.dir/MSP430MCAsmInfo.cpp.o.d -o lib/Target/MSP430/MCTargetDesc/CMakeFiles/LLVMMSP430Desc.dir/MSP430MCAsmInfo.cpp.o -c /Users/buildslave/jenkins/workspace/clang-stage2-cmake-RgTSan/llvm-project/llvm/lib/Target/MSP430/MCTargetDesc/MSP430MCAsmInfo.cpp
[1507/2138] /Users/buildslave/jenkins/workspace/clang-stage2-cmake-RgTSan/host-compiler/bin/clang++  -DBUILD_EXAMPLES -DGTEST_HAS_RTTI=0 -D__STDC_CONSTANT_MACROS -D__STDC_FORMAT_MACROS -D__STDC_LIMIT_MACROS -Ilib/Target/MSP430/MCTargetDesc -I/Users/buildslave/jenkins/workspace/clang-stage2-cmake-RgTSan/llvm-project/llvm/lib/Target/MSP430/MCTargetDesc -I/Users/buildslave/jenkins/workspace/clang-stage2-cmake-RgTSan/llvm-project/llvm/lib/Target/MSP430 -Ilib/Target/MSP430 -I/usr/include/libxml2 -Iinclude -I/Users/buildslave/jenkins/workspace/clang-stage2-cmake-RgTSan/llvm-project/llvm/include -fPIC -fvisibility-inlines-hidden -Werror=date-time -Werror=unguarded-availability-new -Wall -Wextra -Wno-unused-parameter -Wwrite-strings -Wcast-qual -Wmissing-field-initializers -pedantic -Wno-long-long -Wimplicit-fallthrough -Wcovered-switch-default -Wno-noexcept-type -Wnon-virtual-dtor -Wdelete-non-virtual-dtor -Wstring-conversion -fno-omit-frame-pointer -fsanitize=thread -fdiagnostics-color -flto=thin -O2 -g -DNDEBUG    -fno-exceptions -fno-rtti -std=c++14 -MD -MT lib/Target/MSP430/MCTargetDesc/CMakeFiles/LLVMMSP430Desc.dir/MSP430AsmBackend.cpp.o -MF lib/Target/MSP430/MCTargetDesc/CMakeFiles/LLVMMSP430Desc.dir/MSP430AsmBackend.cpp.o.d -o lib/Target/MSP430/MCTargetDesc/CMakeFiles/LLVMMSP430Desc.dir/MSP430AsmBackend.cpp.o -c /Users/buildslave/jenkins/workspace/clang-stage2-cmake-RgTSan/llvm-project/llvm/lib/Target/MSP430/MCTargetDesc/MSP430AsmBackend.cpp
[1508/2138] /Users/buildslave/jenkins/workspace/clang-stage2-cmake-RgTSan/host-compiler/bin/clang++  -DBUILD_EXAMPLES -DGTEST_HAS_RTTI=0 -D__STDC_CONSTANT_MACROS -D__STDC_FORMAT_MACROS -D__STDC_LIMIT_MACROS -Ilib/Target/MSP430/MCTargetDesc -I/Users/buildslave/jenkins/workspace/clang-stage2-cmake-RgTSan/llvm-project/llvm/lib/Target/MSP430/MCTargetDesc -I/Users/buildslave/jenkins/workspace/clang-stage2-cmake-RgTSan/llvm-project/llvm/lib/Target/MSP430 -Ilib/Target/MSP430 -I/usr/include/libxml2 -Iinclude -I/Users/buildslave/jenkins/workspace/clang-stage2-cmake-RgTSan/llvm-project/llvm/include -fPIC -fvisibility-inlines-hidden -Werror=date-time -Werror=unguarded-availability-new -Wall -Wextra -Wno-unused-parameter -Wwrite-strings -Wcast-qual -Wmissing-field-initializers -pedantic -Wno-long-long -Wimplicit-fallthrough -Wcovered-switch-default -Wno-noexcept-type -Wnon-virtual-dtor -Wdelete-non-virtual-dtor -Wstring-conversion -fno-omit-frame-pointer -fsanitize=thread -fdiagnostics-color -flto=thin -O2 -g -DNDEBUG    -fno-exceptions -fno-rtti -std=c++14 -MD -MT lib/Target/MSP430/MCTargetDesc/CMakeFiles/LLVMMSP430Desc.dir/MSP430InstPrinter.cpp.o -MF lib/Target/MSP430/MCTargetDesc/CMakeFiles/LLVMMSP430Desc.dir/MSP430InstPrinter.cpp.o.d -o lib/Target/MSP430/MCTargetDesc/CMakeFiles/LLVMMSP430Desc.dir/MSP430InstPrinter.cpp.o -c /Users/buildslave/jenkins/workspace/clang-stage2-cmake-RgTSan/llvm-project/llvm/lib/Target/MSP430/MCTargetDesc/MSP430InstPrinter.cpp
[1509/2138] /Users/buildslave/jenkins/workspace/clang-stage2-cmake-RgTSan/host-compiler/bin/clang++  -DBUILD_EXAMPLES -DGTEST_HAS_RTTI=0 -D__STDC_CONSTANT_MACROS -D__STDC_FORMAT_MACROS -D__STDC_LIMIT_MACROS -Ilib/Target/MSP430 -I/Users/buildslave/jenkins/workspace/clang-stage2-cmake-RgTSan/llvm-project/llvm/lib/Target/MSP430 -I/usr/include/libxml2 -Iinclude -I/Users/buildslave/jenkins/workspace/clang-stage2-cmake-RgTSan/llvm-project/llvm/include -fPIC -fvisibility-inlines-hidden -Werror=date-time -Werror=unguarded-availability-new -Wall -Wextra -Wno-unused-parameter -Wwrite-strings -Wcast-qual -Wmissing-field-initializers -pedantic -Wno-long-long -Wimplicit-fallthrough -Wcovered-switch-default -Wno-noexcept-type -Wnon-virtual-dtor -Wdelete-non-virtual-dtor -Wstring-conversion -fno-omit-frame-pointer -fsanitize=thread -fdiagnostics-color -flto=thin -O2 -g -DNDEBUG    -fno-exceptions -fno-rtti -std=c++14 -MD -MT lib/Target/MSP430/CMakeFiles/LLVMMSP430CodeGen.dir/MSP430TargetMachine.cpp.o -MF lib/Target/MSP430/CMakeFiles/LLVMMSP430CodeGen.dir/MSP430TargetMachine.cpp.o.d -o lib/Target/MSP430/CMakeFiles/LLVMMSP430CodeGen.dir/MSP430TargetMachine.cpp.o -c /Users/buildslave/jenkins/workspace/clang-stage2-cmake-RgTSan/llvm-project/llvm/lib/Target/MSP430/MSP430TargetMachine.cpp
[1510/2138] /Users/buildslave/jenkins/workspace/clang-stage2-cmake-RgTSan/host-compiler/bin/clang++  -DBUILD_EXAMPLES -DGTEST_HAS_RTTI=0 -D__STDC_CONSTANT_MACROS -D__STDC_FORMAT_MACROS -D__STDC_LIMIT_MACROS -Ilib/Target/MSP430/TargetInfo -I/Users/buildslave/jenkins/workspace/clang-stage2-cmake-RgTSan/llvm-project/llvm/lib/Target/MSP430/TargetInfo -I/Users/buildslave/jenkins/workspace/clang-stage2-cmake-RgTSan/llvm-project/llvm/lib/Target/MSP430 -Ilib/Target/MSP430 -I/usr/include/libxml2 -Iinclude -I/Users/buildslave/jenkins/workspace/clang-stage2-cmake-RgTSan/llvm-project/llvm/include -fPIC -fvisibility-inlines-hidden -Werror=date-time -Werror=unguarded-availability-new -Wall -Wextra -Wno-unused-parameter -Wwrite-strings -Wcast-qual -Wmissing-field-initializers -pedantic -Wno-long-long -Wimplicit-fallthrough -Wcovered-switch-default -Wno-noexcept-type -Wnon-virtual-dtor -Wdelete-non-virtual-dtor -Wstring-conversion -fno-omit-frame-pointer -fsanitize=thread -fdiagnostics-color -flto=thin -O2 -g -DNDEBUG    -fno-exceptions -fno-rtti -std=c++14 -MD -MT lib/Target/MSP430/TargetInfo/CMakeFiles/LLVMMSP430Info.dir/MSP430TargetInfo.cpp.o -MF lib/Target/MSP430/TargetInfo/CMakeFiles/LLVMMSP430Info.dir/MSP430TargetInfo.cpp.o.d -o lib/Target/MSP430/TargetInfo/CMakeFiles/LLVMMSP430Info.dir/MSP430TargetInfo.cpp.o -c /Users/buildslave/jenkins/workspace/clang-stage2-cmake-RgTSan/llvm-project/llvm/lib/Target/MSP430/TargetInfo/MSP430TargetInfo.cpp
[1511/2138] /Users/buildslave/jenkins/workspace/clang-stage2-cmake-RgTSan/host-compiler/bin/clang++  -DBUILD_EXAMPLES -DGTEST_HAS_RTTI=0 -D__STDC_CONSTANT_MACROS -D__STDC_FORMAT_MACROS -D__STDC_LIMIT_MACROS -Ilib/Target/MSP430/MCTargetDesc -I/Users/buildslave/jenkins/workspace/clang-stage2-cmake-RgTSan/llvm-project/llvm/lib/Target/MSP430/MCTargetDesc -I/Users/buildslave/jenkins/workspace/clang-stage2-cmake-RgTSan/llvm-project/llvm/lib/Target/MSP430 -Ilib/Target/MSP430 -I/usr/include/libxml2 -Iinclude -I/Users/buildslave/jenkins/workspace/clang-stage2-cmake-RgTSan/llvm-project/llvm/include -fPIC -fvisibility-inlines-hidden -Werror=date-time -Werror=unguarded-availability-new -Wall -Wextra -Wno-unused-parameter -Wwrite-strings -Wcast-qual -Wmissing-field-initializers -pedantic -Wno-long-long -Wimplicit-fallthrough -Wcovered-switch-default -Wno-noexcept-type -Wnon-virtual-dtor -Wdelete-non-virtual-dtor -Wstring-conversion -fno-omit-frame-pointer -fsanitize=thread -fdiagnostics-color -flto=thin -O2 -g -DNDEBUG    -fno-exceptions -fno-rtti -std=c++14 -MD -MT lib/Target/MSP430/MCTargetDesc/CMakeFiles/LLVMMSP430Desc.dir/MSP430ELFStreamer.cpp.o -MF lib/Target/MSP430/MCTargetDesc/CMakeFiles/LLVMMSP430Desc.dir/MSP430ELFStreamer.cpp.o.d -o lib/Target/MSP430/MCTargetDesc/CMakeFiles/LLVMMSP430Desc.dir/MSP430ELFStreamer.cpp.o -c /Users/buildslave/jenkins/workspace/clang-stage2-cmake-RgTSan/llvm-project/llvm/lib/Target/MSP430/MCTargetDesc/MSP430ELFStreamer.cpp
[1512/2138] : && DYLD_LIBRARY_PATH=/Users/buildslave/jenkins/workspace/clang-stage2-cmake-RgTSan/host-compiler/lib/ "/Applications/Xcode.app/Contents/Developer/Toolchains/XcodeDefault.xctoolchain/usr/bin/libtool" -static -no_warning_for_no_symbols -o lib/libLLVMMSP430Info.a  lib/Target/MSP430/TargetInfo/CMakeFiles/LLVMMSP430Info.dir/MSP430TargetInfo.cpp.o && :
[1513/2138] /Users/buildslave/jenkins/workspace/clang-stage2-cmake-RgTSan/host-compiler/bin/clang++  -DBUILD_EXAMPLES -DGTEST_HAS_RTTI=0 -D__STDC_CONSTANT_MACROS -D__STDC_FORMAT_MACROS -D__STDC_LIMIT_MACROS -Ilib/Target/MSP430/MCTargetDesc -I/Users/buildslave/jenkins/workspace/clang-stage2-cmake-RgTSan/llvm-project/llvm/lib/Target/MSP430/MCTargetDesc -I/Users/buildslave/jenkins/workspace/clang-stage2-cmake-RgTSan/llvm-project/llvm/lib/Target/MSP430 -Ilib/Target/MSP430 -I/usr/include/libxml2 -Iinclude -I/Users/buildslave/jenkins/workspace/clang-stage2-cmake-RgTSan/llvm-project/llvm/include -fPIC -fvisibility-inlines-hidden -Werror=date-time -Werror=unguarded-availability-new -Wall -Wextra -Wno-unused-parameter -Wwrite-strings -Wcast-qual -Wmissing-field-initializers -pedantic -Wno-long-long -Wimplicit-fallthrough -Wcovered-switch-default -Wno-noexcept-type -Wnon-virtual-dtor -Wdelete-non-virtual-dtor -Wstring-conversion -fno-omit-frame-pointer -fsanitize=thread -fdiagnostics-color -flto=thin -O2 -g -DNDEBUG    -fno-exceptions -fno-rtti -std=c++14 -MD -MT lib/Target/MSP430/MCTargetDesc/CMakeFiles/LLVMMSP430Desc.dir/MSP430MCTargetDesc.cpp.o -MF lib/Target/MSP430/MCTargetDesc/CMakeFiles/LLVMMSP430Desc.dir/MSP430MCTargetDesc.cpp.o.d -o lib/Target/MSP430/MCTargetDesc/CMakeFiles/LLVMMSP430Desc.dir/MSP430MCTargetDesc.cpp.o -c /Users/buildslave/jenkins/workspace/clang-stage2-cmake-RgTSan/llvm-project/llvm/lib/Target/MSP430/MCTargetDesc/MSP430MCTargetDesc.cpp
[1514/2138] /Users/buildslave/jenkins/workspace/clang-stage2-cmake-RgTSan/host-compiler/bin/clang++  -DBUILD_EXAMPLES -DGTEST_HAS_RTTI=0 -D__STDC_CONSTANT_MACROS -D__STDC_FORMAT_MACROS -D__STDC_LIMIT_MACROS -Ilib/Target/MSP430 -I/Users/buildslave/jenkins/workspace/clang-stage2-cmake-RgTSan/llvm-project/llvm/lib/Target/MSP430 -I/usr/include/libxml2 -Iinclude -I/Users/buildslave/jenkins/workspace/clang-stage2-cmake-RgTSan/llvm-project/llvm/include -fPIC -fvisibility-inlines-hidden -Werror=date-time -Werror=unguarded-availability-new -Wall -Wextra -Wno-unused-parameter -Wwrite-strings -Wcast-qual -Wmissing-field-initializers -pedantic -Wno-long-long -Wimplicit-fallthrough -Wcovered-switch-default -Wno-noexcept-type -Wnon-virtual-dtor -Wdelete-non-virtual-dtor -Wstring-conversion -fno-omit-frame-pointer -fsanitize=thread -fdiagnostics-color -flto=thin -O2 -g -DNDEBUG    -fno-exceptions -fno-rtti -std=c++14 -MD -MT lib/Target/MSP430/CMakeFiles/LLVMMSP430CodeGen.dir/MSP430MCInstLower.cpp.o -MF lib/Target/MSP430/CMakeFiles/LLVMMSP430CodeGen.dir/MSP430MCInstLower.cpp.o.d -o lib/Target/MSP430/CMakeFiles/LLVMMSP430CodeGen.dir/MSP430MCInstLower.cpp.o -c /Users/buildslave/jenkins/workspace/clang-stage2-cmake-RgTSan/llvm-project/llvm/lib/Target/MSP430/MSP430MCInstLower.cpp
[1515/2138] /Users/buildslave/jenkins/workspace/clang-stage2-cmake-RgTSan/host-compiler/bin/clang++  -DBUILD_EXAMPLES -DGTEST_HAS_RTTI=0 -D__STDC_CONSTANT_MACROS -D__STDC_FORMAT_MACROS -D__STDC_LIMIT_MACROS -Ilib/Target/MSP430 -I/Users/buildslave/jenkins/workspace/clang-stage2-cmake-RgTSan/llvm-project/llvm/lib/Target/MSP430 -I/usr/include/libxml2 -Iinclude -I/Users/buildslave/jenkins/workspace/clang-stage2-cmake-RgTSan/llvm-project/llvm/include -fPIC -fvisibility-inlines-hidden -Werror=date-time -Werror=unguarded-availability-new -Wall -Wextra -Wno-unused-parameter -Wwrite-strings -Wcast-qual -Wmissing-field-initializers -pedantic -Wno-long-long -Wimplicit-fallthrough -Wcovered-switch-default -Wno-noexcept-type -Wnon-virtual-dtor -Wdelete-non-virtual-dtor -Wstring-conversion -fno-omit-frame-pointer -fsanitize=thread -fdiagnostics-color -flto=thin -O2 -g -DNDEBUG    -fno-exceptions -fno-rtti -std=c++14 -MD -MT lib/Target/MSP430/CMakeFiles/LLVMMSP430CodeGen.dir/MSP430AsmPrinter.cpp.o -MF lib/Target/MSP430/CMakeFiles/LLVMMSP430CodeGen.dir/MSP430AsmPrinter.cpp.o.d -o lib/Target/MSP430/CMakeFiles/LLVMMSP430CodeGen.dir/MSP430AsmPrinter.cpp.o -c /Users/buildslave/jenkins/workspace/clang-stage2-cmake-RgTSan/llvm-project/llvm/lib/Target/MSP430/MSP430AsmPrinter.cpp
[1516/2138] /Users/buildslave/jenkins/workspace/clang-stage2-cmake-RgTSan/host-compiler/bin/clang++  -DBUILD_EXAMPLES -DGTEST_HAS_RTTI=0 -D__STDC_CONSTANT_MACROS -D__STDC_FORMAT_MACROS -D__STDC_LIMIT_MACROS -Ilib/Target/MSP430/MCTargetDesc -I/Users/buildslave/jenkins/workspace/clang-stage2-cmake-RgTSan/llvm-project/llvm/lib/Target/MSP430/MCTargetDesc -I/Users/buildslave/jenkins/workspace/clang-stage2-cmake-RgTSan/llvm-project/llvm/lib/Target/MSP430 -Ilib/Target/MSP430 -I/usr/include/libxml2 -Iinclude -I/Users/buildslave/jenkins/workspace/clang-stage2-cmake-RgTSan/llvm-project/llvm/include -fPIC -fvisibility-inlines-hidden -Werror=date-time -Werror=unguarded-availability-new -Wall -Wextra -Wno-unused-parameter -Wwrite-strings -Wcast-qual -Wmissing-field-initializers -pedantic -Wno-long-long -Wimplicit-fallthrough -Wcovered-switch-default -Wno-noexcept-type -Wnon-virtual-dtor -Wdelete-non-virtual-dtor -Wstring-conversion -fno-omit-frame-pointer -fsanitize=thread -fdiagnostics-color -flto=thin -O2 -g -DNDEBUG    -fno-exceptions -fno-rtti -std=c++14 -MD -MT lib/Target/MSP430/MCTargetDesc/CMakeFiles/LLVMMSP430Desc.dir/MSP430MCCodeEmitter.cpp.o -MF lib/Target/MSP430/MCTargetDesc/CMakeFiles/LLVMMSP430Desc.dir/MSP430MCCodeEmitter.cpp.o.d -o lib/Target/MSP430/MCTargetDesc/CMakeFiles/LLVMMSP430Desc.dir/MSP430MCCodeEmitter.cpp.o -c /Users/buildslave/jenkins/workspace/clang-stage2-cmake-RgTSan/llvm-project/llvm/lib/Target/MSP430/MCTargetDesc/MSP430MCCodeEmitter.cpp
[1517/2138] : && DYLD_LIBRARY_PATH=/Users/buildslave/jenkins/workspace/clang-stage2-cmake-RgTSan/host-compiler/lib/ "/Applications/Xcode.app/Contents/Developer/Toolchains/XcodeDefault.xctoolchain/usr/bin/libtool" -static -no_warning_for_no_symbols -o lib/libLLVMMSP430Desc.a  lib/Target/MSP430/MCTargetDesc/CMakeFiles/LLVMMSP430Desc.dir/MSP430AsmBackend.cpp.o lib/Target/MSP430/MCTargetDesc/CMakeFiles/LLVMMSP430Desc.dir/MSP430ELFObjectWriter.cpp.o lib/Target/MSP430/MCTargetDesc/CMakeFiles/LLVMMSP430Desc.dir/MSP430ELFStreamer.cpp.o lib/Target/MSP430/MCTargetDesc/CMakeFiles/LLVMMSP430Desc.dir/MSP430InstPrinter.cpp.o lib/Target/MSP430/MCTargetDesc/CMakeFiles/LLVMMSP430Desc.dir/MSP430MCAsmInfo.cpp.o lib/Target/MSP430/MCTargetDesc/CMakeFiles/LLVMMSP430Desc.dir/MSP430MCCodeEmitter.cpp.o lib/Target/MSP430/MCTargetDesc/CMakeFiles/LLVMMSP430Desc.dir/MSP430MCTargetDesc.cpp.o && :
[1518/2138] : && DYLD_LIBRARY_PATH=/Users/buildslave/jenkins/workspace/clang-stage2-cmake-RgTSan/host-compiler/lib/ "/Applications/Xcode.app/Contents/Developer/Toolchains/XcodeDefault.xctoolchain/usr/bin/libtool" -static -no_warning_for_no_symbols -o lib/libLLVMMSP430CodeGen.a  lib/Target/MSP430/CMakeFiles/LLVMMSP430CodeGen.dir/MSP430BranchSelector.cpp.o lib/Target/MSP430/CMakeFiles/LLVMMSP430CodeGen.dir/MSP430ISelDAGToDAG.cpp.o lib/Target/MSP430/CMakeFiles/LLVMMSP430CodeGen.dir/MSP430ISelLowering.cpp.o lib/Target/MSP430/CMakeFiles/LLVMMSP430CodeGen.dir/MSP430InstrInfo.cpp.o lib/Target/MSP430/CMakeFiles/LLVMMSP430CodeGen.dir/MSP430FrameLowering.cpp.o lib/Target/MSP430/CMakeFiles/LLVMMSP430CodeGen.dir/MSP430MachineFunctionInfo.cpp.o lib/Target/MSP430/CMakeFiles/LLVMMSP430CodeGen.dir/MSP430RegisterInfo.cpp.o lib/Target/MSP430/CMakeFiles/LLVMMSP430CodeGen.dir/MSP430Subtarget.cpp.o lib/Target/MSP430/CMakeFiles/LLVMMSP430CodeGen.dir/MSP430TargetMachine.cpp.o lib/Target/MSP430/CMakeFiles/LLVMMSP430CodeGen.dir/MSP430AsmPrinter.cpp.o lib/Target/MSP430/CMakeFiles/LLVMMSP430CodeGen.dir/MSP430MCInstLower.cpp.o && :
[1519/2138] /Users/buildslave/jenkins/workspace/clang-stage2-cmake-RgTSan/host-compiler/bin/clang++  -DBUILD_EXAMPLES -DGTEST_HAS_RTTI=0 -D__STDC_CONSTANT_MACROS -D__STDC_FORMAT_MACROS -D__STDC_LIMIT_MACROS -Ilib/Target/NVPTX -I/Users/buildslave/jenkins/workspace/clang-stage2-cmake-RgTSan/llvm-project/llvm/lib/Target/NVPTX -I/usr/include/libxml2 -Iinclude -I/Users/buildslave/jenkins/workspace/clang-stage2-cmake-RgTSan/llvm-project/llvm/include -fPIC -fvisibility-inlines-hidden -Werror=date-time -Werror=unguarded-availability-new -Wall -Wextra -Wno-unused-parameter -Wwrite-strings -Wcast-qual -Wmissing-field-initializers -pedantic -Wno-long-long -Wimplicit-fallthrough -Wcovered-switch-default -Wno-noexcept-type -Wnon-virtual-dtor -Wdelete-non-virtual-dtor -Wstring-conversion -fno-omit-frame-pointer -fsanitize=thread -fdiagnostics-color -flto=thin -O2 -g -DNDEBUG    -fno-exceptions -fno-rtti -std=c++14 -MD -MT lib/Target/NVPTX/CMakeFiles/LLVMNVPTXCodeGen.dir/NVPTXAssignValidGlobalNames.cpp.o -MF lib/Target/NVPTX/CMakeFiles/LLVMNVPTXCodeGen.dir/NVPTXAssignValidGlobalNames.cpp.o.d -o lib/Target/NVPTX/CMakeFiles/LLVMNVPTXCodeGen.dir/NVPTXAssignValidGlobalNames.cpp.o -c /Users/buildslave/jenkins/workspace/clang-stage2-cmake-RgTSan/llvm-project/llvm/lib/Target/NVPTX/NVPTXAssignValidGlobalNames.cpp
[1520/2138] /Users/buildslave/jenkins/workspace/clang-stage2-cmake-RgTSan/host-compiler/bin/clang++  -DBUILD_EXAMPLES -DGTEST_HAS_RTTI=0 -D__STDC_CONSTANT_MACROS -D__STDC_FORMAT_MACROS -D__STDC_LIMIT_MACROS -Ilib/Target/NVPTX -I/Users/buildslave/jenkins/workspace/clang-stage2-cmake-RgTSan/llvm-project/llvm/lib/Target/NVPTX -I/usr/include/libxml2 -Iinclude -I/Users/buildslave/jenkins/workspace/clang-stage2-cmake-RgTSan/llvm-project/llvm/include -fPIC -fvisibility-inlines-hidden -Werror=date-time -Werror=unguarded-availability-new -Wall -Wextra -Wno-unused-parameter -Wwrite-strings -Wcast-qual -Wmissing-field-initializers -pedantic -Wno-long-long -Wimplicit-fallthrough -Wcovered-switch-default -Wno-noexcept-type -Wnon-virtual-dtor -Wdelete-non-virtual-dtor -Wstring-conversion -fno-omit-frame-pointer -fsanitize=thread -fdiagnostics-color -flto=thin -O2 -g -DNDEBUG    -fno-exceptions -fno-rtti -std=c++14 -MD -MT lib/Target/NVPTX/CMakeFiles/LLVMNVPTXCodeGen.dir/NVPTXAllocaHoisting.cpp.o -MF lib/Target/NVPTX/CMakeFiles/LLVMNVPTXCodeGen.dir/NVPTXAllocaHoisting.cpp.o.d -o lib/Target/NVPTX/CMakeFiles/LLVMNVPTXCodeGen.dir/NVPTXAllocaHoisting.cpp.o -c /Users/buildslave/jenkins/workspace/clang-stage2-cmake-RgTSan/llvm-project/llvm/lib/Target/NVPTX/NVPTXAllocaHoisting.cpp
[1521/2138] /Users/buildslave/jenkins/workspace/clang-stage2-cmake-RgTSan/host-compiler/bin/clang++  -DBUILD_EXAMPLES -DGTEST_HAS_RTTI=0 -D__STDC_CONSTANT_MACROS -D__STDC_FORMAT_MACROS -D__STDC_LIMIT_MACROS -Ilib/Target/MSP430/Disassembler -I/Users/buildslave/jenkins/workspace/clang-stage2-cmake-RgTSan/llvm-project/llvm/lib/Target/MSP430/Disassembler -I/Users/buildslave/jenkins/workspace/clang-stage2-cmake-RgTSan/llvm-project/llvm/lib/Target/MSP430 -Ilib/Target/MSP430 -I/usr/include/libxml2 -Iinclude -I/Users/buildslave/jenkins/workspace/clang-stage2-cmake-RgTSan/llvm-project/llvm/include -fPIC -fvisibility-inlines-hidden -Werror=date-time -Werror=unguarded-availability-new -Wall -Wextra -Wno-unused-parameter -Wwrite-strings -Wcast-qual -Wmissing-field-initializers -pedantic -Wno-long-long -Wimplicit-fallthrough -Wcovered-switch-default -Wno-noexcept-type -Wnon-virtual-dtor -Wdelete-non-virtual-dtor -Wstring-conversion -fno-omit-frame-pointer -fsanitize=thread -fdiagnostics-color -flto=thin -O2 -g -DNDEBUG    -fno-exceptions -fno-rtti -std=c++14 -MD -MT lib/Target/MSP430/Disassembler/CMakeFiles/LLVMMSP430Disassembler.dir/MSP430Disassembler.cpp.o -MF lib/Target/MSP430/Disassembler/CMakeFiles/LLVMMSP430Disassembler.dir/MSP430Disassembler.cpp.o.d -o lib/Target/MSP430/Disassembler/CMakeFiles/LLVMMSP430Disassembler.dir/MSP430Disassembler.cpp.o -c /Users/buildslave/jenkins/workspace/clang-stage2-cmake-RgTSan/llvm-project/llvm/lib/Target/MSP430/Disassembler/MSP430Disassembler.cpp
[1522/2138] : && DYLD_LIBRARY_PATH=/Users/buildslave/jenkins/workspace/clang-stage2-cmake-RgTSan/host-compiler/lib/ "/Applications/Xcode.app/Contents/Developer/Toolchains/XcodeDefault.xctoolchain/usr/bin/libtool" -static -no_warning_for_no_symbols -o lib/libLLVMMSP430Disassembler.a  lib/Target/MSP430/Disassembler/CMakeFiles/LLVMMSP430Disassembler.dir/MSP430Disassembler.cpp.o && :
[1523/2138] /Users/buildslave/jenkins/workspace/clang-stage2-cmake-RgTSan/host-compiler/bin/clang++  -DBUILD_EXAMPLES -DGTEST_HAS_RTTI=0 -D__STDC_CONSTANT_MACROS -D__STDC_FORMAT_MACROS -D__STDC_LIMIT_MACROS -Ilib/Target/MSP430/AsmParser -I/Users/buildslave/jenkins/workspace/clang-stage2-cmake-RgTSan/llvm-project/llvm/lib/Target/MSP430/AsmParser -I/Users/buildslave/jenkins/workspace/clang-stage2-cmake-RgTSan/llvm-project/llvm/lib/Target/MSP430 -Ilib/Target/MSP430 -I/usr/include/libxml2 -Iinclude -I/Users/buildslave/jenkins/workspace/clang-stage2-cmake-RgTSan/llvm-project/llvm/include -fPIC -fvisibility-inlines-hidden -Werror=date-time -Werror=unguarded-availability-new -Wall -Wextra -Wno-unused-parameter -Wwrite-strings -Wcast-qual -Wmissing-field-initializers -pedantic -Wno-long-long -Wimplicit-fallthrough -Wcovered-switch-default -Wno-noexcept-type -Wnon-virtual-dtor -Wdelete-non-virtual-dtor -Wstring-conversion -fno-omit-frame-pointer -fsanitize=thread -fdiagnostics-color -flto=thin -O2 -g -DNDEBUG    -fno-exceptions -fno-rtti -std=c++14 -MD -MT lib/Target/MSP430/AsmParser/CMakeFiles/LLVMMSP430AsmParser.dir/MSP430AsmParser.cpp.o -MF lib/Target/MSP430/AsmParser/CMakeFiles/LLVMMSP430AsmParser.dir/MSP430AsmParser.cpp.o.d -o lib/Target/MSP430/AsmParser/CMakeFiles/LLVMMSP430AsmParser.dir/MSP430AsmParser.cpp.o -c /Users/buildslave/jenkins/workspace/clang-stage2-cmake-RgTSan/llvm-project/llvm/lib/Target/MSP430/AsmParser/MSP430AsmParser.cpp
[1524/2138] : && DYLD_LIBRARY_PATH=/Users/buildslave/jenkins/workspace/clang-stage2-cmake-RgTSan/host-compiler/lib/ "/Applications/Xcode.app/Contents/Developer/Toolchains/XcodeDefault.xctoolchain/usr/bin/libtool" -static -no_warning_for_no_symbols -o lib/libLLVMMSP430AsmParser.a  lib/Target/MSP430/AsmParser/CMakeFiles/LLVMMSP430AsmParser.dir/MSP430AsmParser.cpp.o && :
[1525/2138] /Users/buildslave/jenkins/workspace/clang-stage2-cmake-RgTSan/host-compiler/bin/clang++  -DBUILD_EXAMPLES -DGTEST_HAS_RTTI=0 -D__STDC_CONSTANT_MACROS -D__STDC_FORMAT_MACROS -D__STDC_LIMIT_MACROS -Ilib/Target/NVPTX -I/Users/buildslave/jenkins/workspace/clang-stage2-cmake-RgTSan/llvm-project/llvm/lib/Target/NVPTX -I/usr/include/libxml2 -Iinclude -I/Users/buildslave/jenkins/workspace/clang-stage2-cmake-RgTSan/llvm-project/llvm/include -fPIC -fvisibility-inlines-hidden -Werror=date-time -Werror=unguarded-availability-new -Wall -Wextra -Wno-unused-parameter -Wwrite-strings -Wcast-qual -Wmissing-field-initializers -pedantic -Wno-long-long -Wimplicit-fallthrough -Wcovered-switch-default -Wno-noexcept-type -Wnon-virtual-dtor -Wdelete-non-virtual-dtor -Wstring-conversion -fno-omit-frame-pointer -fsanitize=thread -fdiagnostics-color -flto=thin -O2 -g -DNDEBUG    -fno-exceptions -fno-rtti -std=c++14 -MD -MT lib/Target/NVPTX/CMakeFiles/LLVMNVPTXCodeGen.dir/NVPTXImageOptimizer.cpp.o -MF lib/Target/NVPTX/CMakeFiles/LLVMNVPTXCodeGen.dir/NVPTXImageOptimizer.cpp.o.d -o lib/Target/NVPTX/CMakeFiles/LLVMNVPTXCodeGen.dir/NVPTXImageOptimizer.cpp.o -c /Users/buildslave/jenkins/workspace/clang-stage2-cmake-RgTSan/llvm-project/llvm/lib/Target/NVPTX/NVPTXImageOptimizer.cpp
[1526/2138] /Users/buildslave/jenkins/workspace/clang-stage2-cmake-RgTSan/host-compiler/bin/clang++  -DBUILD_EXAMPLES -DGTEST_HAS_RTTI=0 -D__STDC_CONSTANT_MACROS -D__STDC_FORMAT_MACROS -D__STDC_LIMIT_MACROS -Ilib/Target/NVPTX -I/Users/buildslave/jenkins/workspace/clang-stage2-cmake-RgTSan/llvm-project/llvm/lib/Target/NVPTX -I/usr/include/libxml2 -Iinclude -I/Users/buildslave/jenkins/workspace/clang-stage2-cmake-RgTSan/llvm-project/llvm/include -fPIC -fvisibility-inlines-hidden -Werror=date-time -Werror=unguarded-availability-new -Wall -Wextra -Wno-unused-parameter -Wwrite-strings -Wcast-qual -Wmissing-field-initializers -pedantic -Wno-long-long -Wimplicit-fallthrough -Wcovered-switch-default -Wno-noexcept-type -Wnon-virtual-dtor -Wdelete-non-virtual-dtor -Wstring-conversion -fno-omit-frame-pointer -fsanitize=thread -fdiagnostics-color -flto=thin -O2 -g -DNDEBUG    -fno-exceptions -fno-rtti -std=c++14 -MD -MT lib/Target/NVPTX/CMakeFiles/LLVMNVPTXCodeGen.dir/NVPTXGenericToNVVM.cpp.o -MF lib/Target/NVPTX/CMakeFiles/LLVMNVPTXCodeGen.dir/NVPTXGenericToNVVM.cpp.o.d -o lib/Target/NVPTX/CMakeFiles/LLVMNVPTXCodeGen.dir/NVPTXGenericToNVVM.cpp.o -c /Users/buildslave/jenkins/workspace/clang-stage2-cmake-RgTSan/llvm-project/llvm/lib/Target/NVPTX/NVPTXGenericToNVVM.cpp
[1527/2138] /Users/buildslave/jenkins/workspace/clang-stage2-cmake-RgTSan/host-compiler/bin/clang++  -DBUILD_EXAMPLES -DGTEST_HAS_RTTI=0 -D__STDC_CONSTANT_MACROS -D__STDC_FORMAT_MACROS -D__STDC_LIMIT_MACROS -Ilib/Target/NVPTX -I/Users/buildslave/jenkins/workspace/clang-stage2-cmake-RgTSan/llvm-project/llvm/lib/Target/NVPTX -I/usr/include/libxml2 -Iinclude -I/Users/buildslave/jenkins/workspace/clang-stage2-cmake-RgTSan/llvm-project/llvm/include -fPIC -fvisibility-inlines-hidden -Werror=date-time -Werror=unguarded-availability-new -Wall -Wextra -Wno-unused-parameter -Wwrite-strings -Wcast-qual -Wmissing-field-initializers -pedantic -Wno-long-long -Wimplicit-fallthrough -Wcovered-switch-default -Wno-noexcept-type -Wnon-virtual-dtor -Wdelete-non-virtual-dtor -Wstring-conversion -fno-omit-frame-pointer -fsanitize=thread -fdiagnostics-color -flto=thin -O2 -g -DNDEBUG    -fno-exceptions -fno-rtti -std=c++14 -MD -MT lib/Target/NVPTX/CMakeFiles/LLVMNVPTXCodeGen.dir/NVPTXFrameLowering.cpp.o -MF lib/Target/NVPTX/CMakeFiles/LLVMNVPTXCodeGen.dir/NVPTXFrameLowering.cpp.o.d -o lib/Target/NVPTX/CMakeFiles/LLVMNVPTXCodeGen.dir/NVPTXFrameLowering.cpp.o -c /Users/buildslave/jenkins/workspace/clang-stage2-cmake-RgTSan/llvm-project/llvm/lib/Target/NVPTX/NVPTXFrameLowering.cpp
[1528/2138] /Users/buildslave/jenkins/workspace/clang-stage2-cmake-RgTSan/host-compiler/bin/clang++  -DBUILD_EXAMPLES -DGTEST_HAS_RTTI=0 -D__STDC_CONSTANT_MACROS -D__STDC_FORMAT_MACROS -D__STDC_LIMIT_MACROS -Ilib/Target/NVPTX -I/Users/buildslave/jenkins/workspace/clang-stage2-cmake-RgTSan/llvm-project/llvm/lib/Target/NVPTX -I/usr/include/libxml2 -Iinclude -I/Users/buildslave/jenkins/workspace/clang-stage2-cmake-RgTSan/llvm-project/llvm/include -fPIC -fvisibility-inlines-hidden -Werror=date-time -Werror=unguarded-availability-new -Wall -Wextra -Wno-unused-parameter -Wwrite-strings -Wcast-qual -Wmissing-field-initializers -pedantic -Wno-long-long -Wimplicit-fallthrough -Wcovered-switch-default -Wno-noexcept-type -Wnon-virtual-dtor -Wdelete-non-virtual-dtor -Wstring-conversion -fno-omit-frame-pointer -fsanitize=thread -fdiagnostics-color -flto=thin -O2 -g -DNDEBUG    -fno-exceptions -fno-rtti -std=c++14 -MD -MT lib/Target/NVPTX/CMakeFiles/LLVMNVPTXCodeGen.dir/NVPTXLowerAggrCopies.cpp.o -MF lib/Target/NVPTX/CMakeFiles/LLVMNVPTXCodeGen.dir/NVPTXLowerAggrCopies.cpp.o.d -o lib/Target/NVPTX/CMakeFiles/LLVMNVPTXCodeGen.dir/NVPTXLowerAggrCopies.cpp.o -c /Users/buildslave/jenkins/workspace/clang-stage2-cmake-RgTSan/llvm-project/llvm/lib/Target/NVPTX/NVPTXLowerAggrCopies.cpp
[1529/2138] /Users/buildslave/jenkins/workspace/clang-stage2-cmake-RgTSan/host-compiler/bin/clang++  -DBUILD_EXAMPLES -DGTEST_HAS_RTTI=0 -D__STDC_CONSTANT_MACROS -D__STDC_FORMAT_MACROS -D__STDC_LIMIT_MACROS -Ilib/Target/NVPTX -I/Users/buildslave/jenkins/workspace/clang-stage2-cmake-RgTSan/llvm-project/llvm/lib/Target/NVPTX -I/usr/include/libxml2 -Iinclude -I/Users/buildslave/jenkins/workspace/clang-stage2-cmake-RgTSan/llvm-project/llvm/include -fPIC -fvisibility-inlines-hidden -Werror=date-time -Werror=unguarded-availability-new -Wall -Wextra -Wno-unused-parameter -Wwrite-strings -Wcast-qual -Wmissing-field-initializers -pedantic -Wno-long-long -Wimplicit-fallthrough -Wcovered-switch-default -Wno-noexcept-type -Wnon-virtual-dtor -Wdelete-non-virtual-dtor -Wstring-conversion -fno-omit-frame-pointer -fsanitize=thread -fdiagnostics-color -flto=thin -O2 -g -DNDEBUG    -fno-exceptions -fno-rtti -std=c++14 -MD -MT lib/Target/NVPTX/CMakeFiles/LLVMNVPTXCodeGen.dir/NVPTXLowerAlloca.cpp.o -MF lib/Target/NVPTX/CMakeFiles/LLVMNVPTXCodeGen.dir/NVPTXLowerAlloca.cpp.o.d -o lib/Target/NVPTX/CMakeFiles/LLVMNVPTXCodeGen.dir/NVPTXLowerAlloca.cpp.o -c /Users/buildslave/jenkins/workspace/clang-stage2-cmake-RgTSan/llvm-project/llvm/lib/Target/NVPTX/NVPTXLowerAlloca.cpp
[1530/2138] /Users/buildslave/jenkins/workspace/clang-stage2-cmake-RgTSan/host-compiler/bin/clang++  -DBUILD_EXAMPLES -DGTEST_HAS_RTTI=0 -D__STDC_CONSTANT_MACROS -D__STDC_FORMAT_MACROS -D__STDC_LIMIT_MACROS -Ilib/Target/NVPTX -I/Users/buildslave/jenkins/workspace/clang-stage2-cmake-RgTSan/llvm-project/llvm/lib/Target/NVPTX -I/usr/include/libxml2 -Iinclude -I/Users/buildslave/jenkins/workspace/clang-stage2-cmake-RgTSan/llvm-project/llvm/include -fPIC -fvisibility-inlines-hidden -Werror=date-time -Werror=unguarded-availability-new -Wall -Wextra -Wno-unused-parameter -Wwrite-strings -Wcast-qual -Wmissing-field-initializers -pedantic -Wno-long-long -Wimplicit-fallthrough -Wcovered-switch-default -Wno-noexcept-type -Wnon-virtual-dtor -Wdelete-non-virtual-dtor -Wstring-conversion -fno-omit-frame-pointer -fsanitize=thread -fdiagnostics-color -flto=thin -O2 -g -DNDEBUG    -fno-exceptions -fno-rtti -std=c++14 -MD -MT lib/Target/NVPTX/CMakeFiles/LLVMNVPTXCodeGen.dir/NVPTXInstrInfo.cpp.o -MF lib/Target/NVPTX/CMakeFiles/LLVMNVPTXCodeGen.dir/NVPTXInstrInfo.cpp.o.d -o lib/Target/NVPTX/CMakeFiles/LLVMNVPTXCodeGen.dir/NVPTXInstrInfo.cpp.o -c /Users/buildslave/jenkins/workspace/clang-stage2-cmake-RgTSan/llvm-project/llvm/lib/Target/NVPTX/NVPTXInstrInfo.cpp
[1531/2138] /Users/buildslave/jenkins/workspace/clang-stage2-cmake-RgTSan/host-compiler/bin/clang++  -DBUILD_EXAMPLES -DGTEST_HAS_RTTI=0 -D__STDC_CONSTANT_MACROS -D__STDC_FORMAT_MACROS -D__STDC_LIMIT_MACROS -Ilib/Target/NVPTX -I/Users/buildslave/jenkins/workspace/clang-stage2-cmake-RgTSan/llvm-project/llvm/lib/Target/NVPTX -I/usr/include/libxml2 -Iinclude -I/Users/buildslave/jenkins/workspace/clang-stage2-cmake-RgTSan/llvm-project/llvm/include -fPIC -fvisibility-inlines-hidden -Werror=date-time -Werror=unguarded-availability-new -Wall -Wextra -Wno-unused-parameter -Wwrite-strings -Wcast-qual -Wmissing-field-initializers -pedantic -Wno-long-long -Wimplicit-fallthrough -Wcovered-switch-default -Wno-noexcept-type -Wnon-virtual-dtor -Wdelete-non-virtual-dtor -Wstring-conversion -fno-omit-frame-pointer -fsanitize=thread -fdiagnostics-color -flto=thin -O2 -g -DNDEBUG    -fno-exceptions -fno-rtti -std=c++14 -MD -MT lib/Target/NVPTX/CMakeFiles/LLVMNVPTXCodeGen.dir/NVPTXMCExpr.cpp.o -MF lib/Target/NVPTX/CMakeFiles/LLVMNVPTXCodeGen.dir/NVPTXMCExpr.cpp.o.d -o lib/Target/NVPTX/CMakeFiles/LLVMNVPTXCodeGen.dir/NVPTXMCExpr.cpp.o -c /Users/buildslave/jenkins/workspace/clang-stage2-cmake-RgTSan/llvm-project/llvm/lib/Target/NVPTX/NVPTXMCExpr.cpp
[1532/2138] /Users/buildslave/jenkins/workspace/clang-stage2-cmake-RgTSan/host-compiler/bin/clang++  -DBUILD_EXAMPLES -DGTEST_HAS_RTTI=0 -D__STDC_CONSTANT_MACROS -D__STDC_FORMAT_MACROS -D__STDC_LIMIT_MACROS -Ilib/Target/NVPTX -I/Users/buildslave/jenkins/workspace/clang-stage2-cmake-RgTSan/llvm-project/llvm/lib/Target/NVPTX -I/usr/include/libxml2 -Iinclude -I/Users/buildslave/jenkins/workspace/clang-stage2-cmake-RgTSan/llvm-project/llvm/include -fPIC -fvisibility-inlines-hidden -Werror=date-time -Werror=unguarded-availability-new -Wall -Wextra -Wno-unused-parameter -Wwrite-strings -Wcast-qual -Wmissing-field-initializers -pedantic -Wno-long-long -Wimplicit-fallthrough -Wcovered-switch-default -Wno-noexcept-type -Wnon-virtual-dtor -Wdelete-non-virtual-dtor -Wstring-conversion -fno-omit-frame-pointer -fsanitize=thread -fdiagnostics-color -flto=thin -O2 -g -DNDEBUG    -fno-exceptions -fno-rtti -std=c++14 -MD -MT lib/Target/NVPTX/CMakeFiles/LLVMNVPTXCodeGen.dir/NVPTXISelDAGToDAG.cpp.o -MF lib/Target/NVPTX/CMakeFiles/LLVMNVPTXCodeGen.dir/NVPTXISelDAGToDAG.cpp.o.d -o lib/Target/NVPTX/CMakeFiles/LLVMNVPTXCodeGen.dir/NVPTXISelDAGToDAG.cpp.o -c /Users/buildslave/jenkins/workspace/clang-stage2-cmake-RgTSan/llvm-project/llvm/lib/Target/NVPTX/NVPTXISelDAGToDAG.cpp
[1533/2138] /Users/buildslave/jenkins/workspace/clang-stage2-cmake-RgTSan/host-compiler/bin/clang++  -DBUILD_EXAMPLES -DGTEST_HAS_RTTI=0 -D__STDC_CONSTANT_MACROS -D__STDC_FORMAT_MACROS -D__STDC_LIMIT_MACROS -Ilib/Target/NVPTX -I/Users/buildslave/jenkins/workspace/clang-stage2-cmake-RgTSan/llvm-project/llvm/lib/Target/NVPTX -I/usr/include/libxml2 -Iinclude -I/Users/buildslave/jenkins/workspace/clang-stage2-cmake-RgTSan/llvm-project/llvm/include -fPIC -fvisibility-inlines-hidden -Werror=date-time -Werror=unguarded-availability-new -Wall -Wextra -Wno-unused-parameter -Wwrite-strings -Wcast-qual -Wmissing-field-initializers -pedantic -Wno-long-long -Wimplicit-fallthrough -Wcovered-switch-default -Wno-noexcept-type -Wnon-virtual-dtor -Wdelete-non-virtual-dtor -Wstring-conversion -fno-omit-frame-pointer -fsanitize=thread -fdiagnostics-color -flto=thin -O2 -g -DNDEBUG    -fno-exceptions -fno-rtti -std=c++14 -MD -MT lib/Target/NVPTX/CMakeFiles/LLVMNVPTXCodeGen.dir/NVPTXLowerArgs.cpp.o -MF lib/Target/NVPTX/CMakeFiles/LLVMNVPTXCodeGen.dir/NVPTXLowerArgs.cpp.o.d -o lib/Target/NVPTX/CMakeFiles/LLVMNVPTXCodeGen.dir/NVPTXLowerArgs.cpp.o -c /Users/buildslave/jenkins/workspace/clang-stage2-cmake-RgTSan/llvm-project/llvm/lib/Target/NVPTX/NVPTXLowerArgs.cpp
[1534/2138] /Users/buildslave/jenkins/workspace/clang-stage2-cmake-RgTSan/host-compiler/bin/clang++  -DBUILD_EXAMPLES -DGTEST_HAS_RTTI=0 -D__STDC_CONSTANT_MACROS -D__STDC_FORMAT_MACROS -D__STDC_LIMIT_MACROS -Ilib/Target/NVPTX -I/Users/buildslave/jenkins/workspace/clang-stage2-cmake-RgTSan/llvm-project/llvm/lib/Target/NVPTX -I/usr/include/libxml2 -Iinclude -I/Users/buildslave/jenkins/workspace/clang-stage2-cmake-RgTSan/llvm-project/llvm/include -fPIC -fvisibility-inlines-hidden -Werror=date-time -Werror=unguarded-availability-new -Wall -Wextra -Wno-unused-parameter -Wwrite-strings -Wcast-qual -Wmissing-field-initializers -pedantic -Wno-long-long -Wimplicit-fallthrough -Wcovered-switch-default -Wno-noexcept-type -Wnon-virtual-dtor -Wdelete-non-virtual-dtor -Wstring-conversion -fno-omit-frame-pointer -fsanitize=thread -fdiagnostics-color -flto=thin -O2 -g -DNDEBUG    -fno-exceptions -fno-rtti -std=c++14 -MD -MT lib/Target/NVPTX/CMakeFiles/LLVMNVPTXCodeGen.dir/NVPTXPeephole.cpp.o -MF lib/Target/NVPTX/CMakeFiles/LLVMNVPTXCodeGen.dir/NVPTXPeephole.cpp.o.d -o lib/Target/NVPTX/CMakeFiles/LLVMNVPTXCodeGen.dir/NVPTXPeephole.cpp.o -c /Users/buildslave/jenkins/workspace/clang-stage2-cmake-RgTSan/llvm-project/llvm/lib/Target/NVPTX/NVPTXPeephole.cpp
[1535/2138] /Users/buildslave/jenkins/workspace/clang-stage2-cmake-RgTSan/host-compiler/bin/clang++  -DBUILD_EXAMPLES -DGTEST_HAS_RTTI=0 -D__STDC_CONSTANT_MACROS -D__STDC_FORMAT_MACROS -D__STDC_LIMIT_MACROS -Ilib/Target/NVPTX -I/Users/buildslave/jenkins/workspace/clang-stage2-cmake-RgTSan/llvm-project/llvm/lib/Target/NVPTX -I/usr/include/libxml2 -Iinclude -I/Users/buildslave/jenkins/workspace/clang-stage2-cmake-RgTSan/llvm-project/llvm/include -fPIC -fvisibility-inlines-hidden -Werror=date-time -Werror=unguarded-availability-new -Wall -Wextra -Wno-unused-parameter -Wwrite-strings -Wcast-qual -Wmissing-field-initializers -pedantic -Wno-long-long -Wimplicit-fallthrough -Wcovered-switch-default -Wno-noexcept-type -Wnon-virtual-dtor -Wdelete-non-virtual-dtor -Wstring-conversion -fno-omit-frame-pointer -fsanitize=thread -fdiagnostics-color -flto=thin -O2 -g -DNDEBUG    -fno-exceptions -fno-rtti -std=c++14 -MD -MT lib/Target/NVPTX/CMakeFiles/LLVMNVPTXCodeGen.dir/NVPTXAsmPrinter.cpp.o -MF lib/Target/NVPTX/CMakeFiles/LLVMNVPTXCodeGen.dir/NVPTXAsmPrinter.cpp.o.d -o lib/Target/NVPTX/CMakeFiles/LLVMNVPTXCodeGen.dir/NVPTXAsmPrinter.cpp.o -c /Users/buildslave/jenkins/workspace/clang-stage2-cmake-RgTSan/llvm-project/llvm/lib/Target/NVPTX/NVPTXAsmPrinter.cpp
[1536/2138] /Users/buildslave/jenkins/workspace/clang-stage2-cmake-RgTSan/host-compiler/bin/clang++  -DBUILD_EXAMPLES -DGTEST_HAS_RTTI=0 -D__STDC_CONSTANT_MACROS -D__STDC_FORMAT_MACROS -D__STDC_LIMIT_MACROS -Ilib/Target/NVPTX -I/Users/buildslave/jenkins/workspace/clang-stage2-cmake-RgTSan/llvm-project/llvm/lib/Target/NVPTX -I/usr/include/libxml2 -Iinclude -I/Users/buildslave/jenkins/workspace/clang-stage2-cmake-RgTSan/llvm-project/llvm/include -fPIC -fvisibility-inlines-hidden -Werror=date-time -Werror=unguarded-availability-new -Wall -Wextra -Wno-unused-parameter -Wwrite-strings -Wcast-qual -Wmissing-field-initializers -pedantic -Wno-long-long -Wimplicit-fallthrough -Wcovered-switch-default -Wno-noexcept-type -Wnon-virtual-dtor -Wdelete-non-virtual-dtor -Wstring-conversion -fno-omit-frame-pointer -fsanitize=thread -fdiagnostics-color -flto=thin -O2 -g -DNDEBUG    -fno-exceptions -fno-rtti -std=c++14 -MD -MT lib/Target/NVPTX/CMakeFiles/LLVMNVPTXCodeGen.dir/NVPTXISelLowering.cpp.o -MF lib/Target/NVPTX/CMakeFiles/LLVMNVPTXCodeGen.dir/NVPTXISelLowering.cpp.o.d -o lib/Target/NVPTX/CMakeFiles/LLVMNVPTXCodeGen.dir/NVPTXISelLowering.cpp.o -c /Users/buildslave/jenkins/workspace/clang-stage2-cmake-RgTSan/llvm-project/llvm/lib/Target/NVPTX/NVPTXISelLowering.cpp
[1537/2138] /Users/buildslave/jenkins/workspace/clang-stage2-cmake-RgTSan/host-compiler/bin/clang++  -DBUILD_EXAMPLES -DGTEST_HAS_RTTI=0 -D__STDC_CONSTANT_MACROS -D__STDC_FORMAT_MACROS -D__STDC_LIMIT_MACROS -Ilib/Target/NVPTX -I/Users/buildslave/jenkins/workspace/clang-stage2-cmake-RgTSan/llvm-project/llvm/lib/Target/NVPTX -I/usr/include/libxml2 -Iinclude -I/Users/buildslave/jenkins/workspace/clang-stage2-cmake-RgTSan/llvm-project/llvm/include -fPIC -fvisibility-inlines-hidden -Werror=date-time -Werror=unguarded-availability-new -Wall -Wextra -Wno-unused-parameter -Wwrite-strings -Wcast-qual -Wmissing-field-initializers -pedantic -Wno-long-long -Wimplicit-fallthrough -Wcovered-switch-default -Wno-noexcept-type -Wnon-virtual-dtor -Wdelete-non-virtual-dtor -Wstring-conversion -fno-omit-frame-pointer -fsanitize=thread -fdiagnostics-color -flto=thin -O2 -g -DNDEBUG    -fno-exceptions -fno-rtti -std=c++14 -MD -MT lib/Target/NVPTX/CMakeFiles/LLVMNVPTXCodeGen.dir/NVPTXPrologEpilogPass.cpp.o -MF lib/Target/NVPTX/CMakeFiles/LLVMNVPTXCodeGen.dir/NVPTXPrologEpilogPass.cpp.o.d -o lib/Target/NVPTX/CMakeFiles/LLVMNVPTXCodeGen.dir/NVPTXPrologEpilogPass.cpp.o -c /Users/buildslave/jenkins/workspace/clang-stage2-cmake-RgTSan/llvm-project/llvm/lib/Target/NVPTX/NVPTXPrologEpilogPass.cpp
[1538/2138] /Users/buildslave/jenkins/workspace/clang-stage2-cmake-RgTSan/host-compiler/bin/clang++  -DBUILD_EXAMPLES -DGTEST_HAS_RTTI=0 -D__STDC_CONSTANT_MACROS -D__STDC_FORMAT_MACROS -D__STDC_LIMIT_MACROS -Ilib/Target/NVPTX -I/Users/buildslave/jenkins/workspace/clang-stage2-cmake-RgTSan/llvm-project/llvm/lib/Target/NVPTX -I/usr/include/libxml2 -Iinclude -I/Users/buildslave/jenkins/workspace/clang-stage2-cmake-RgTSan/llvm-project/llvm/include -fPIC -fvisibility-inlines-hidden -Werror=date-time -Werror=unguarded-availability-new -Wall -Wextra -Wno-unused-parameter -Wwrite-strings -Wcast-qual -Wmissing-field-initializers -pedantic -Wno-long-long -Wimplicit-fallthrough -Wcovered-switch-default -Wno-noexcept-type -Wnon-virtual-dtor -Wdelete-non-virtual-dtor -Wstring-conversion -fno-omit-frame-pointer -fsanitize=thread -fdiagnostics-color -flto=thin -O2 -g -DNDEBUG    -fno-exceptions -fno-rtti -std=c++14 -MD -MT lib/Target/NVPTX/CMakeFiles/LLVMNVPTXCodeGen.dir/NVPTXUtilities.cpp.o -MF lib/Target/NVPTX/CMakeFiles/LLVMNVPTXCodeGen.dir/NVPTXUtilities.cpp.o.d -o lib/Target/NVPTX/CMakeFiles/LLVMNVPTXCodeGen.dir/NVPTXUtilities.cpp.o -c /Users/buildslave/jenkins/workspace/clang-stage2-cmake-RgTSan/llvm-project/llvm/lib/Target/NVPTX/NVPTXUtilities.cpp
[1539/2138] /Users/buildslave/jenkins/workspace/clang-stage2-cmake-RgTSan/host-compiler/bin/clang++  -DBUILD_EXAMPLES -DGTEST_HAS_RTTI=0 -D__STDC_CONSTANT_MACROS -D__STDC_FORMAT_MACROS -D__STDC_LIMIT_MACROS -Ilib/Target/NVPTX -I/Users/buildslave/jenkins/workspace/clang-stage2-cmake-RgTSan/llvm-project/llvm/lib/Target/NVPTX -I/usr/include/libxml2 -Iinclude -I/Users/buildslave/jenkins/workspace/clang-stage2-cmake-RgTSan/llvm-project/llvm/include -fPIC -fvisibility-inlines-hidden -Werror=date-time -Werror=unguarded-availability-new -Wall -Wextra -Wno-unused-parameter -Wwrite-strings -Wcast-qual -Wmissing-field-initializers -pedantic -Wno-long-long -Wimplicit-fallthrough -Wcovered-switch-default -Wno-noexcept-type -Wnon-virtual-dtor -Wdelete-non-virtual-dtor -Wstring-conversion -fno-omit-frame-pointer -fsanitize=thread -fdiagnostics-color -flto=thin -O2 -g -DNDEBUG    -fno-exceptions -fno-rtti -std=c++14 -MD -MT lib/Target/NVPTX/CMakeFiles/LLVMNVPTXCodeGen.dir/NVVMIntrRange.cpp.o -MF lib/Target/NVPTX/CMakeFiles/LLVMNVPTXCodeGen.dir/NVVMIntrRange.cpp.o.d -o lib/Target/NVPTX/CMakeFiles/LLVMNVPTXCodeGen.dir/NVVMIntrRange.cpp.o -c /Users/buildslave/jenkins/workspace/clang-stage2-cmake-RgTSan/llvm-project/llvm/lib/Target/NVPTX/NVVMIntrRange.cpp
[1540/2138] /Users/buildslave/jenkins/workspace/clang-stage2-cmake-RgTSan/host-compiler/bin/clang++  -DBUILD_EXAMPLES -DGTEST_HAS_RTTI=0 -D__STDC_CONSTANT_MACROS -D__STDC_FORMAT_MACROS -D__STDC_LIMIT_MACROS -Ilib/Target/NVPTX -I/Users/buildslave/jenkins/workspace/clang-stage2-cmake-RgTSan/llvm-project/llvm/lib/Target/NVPTX -I/usr/include/libxml2 -Iinclude -I/Users/buildslave/jenkins/workspace/clang-stage2-cmake-RgTSan/llvm-project/llvm/include -fPIC -fvisibility-inlines-hidden -Werror=date-time -Werror=unguarded-availability-new -Wall -Wextra -Wno-unused-parameter -Wwrite-strings -Wcast-qual -Wmissing-field-initializers -pedantic -Wno-long-long -Wimplicit-fallthrough -Wcovered-switch-default -Wno-noexcept-type -Wnon-virtual-dtor -Wdelete-non-virtual-dtor -Wstring-conversion -fno-omit-frame-pointer -fsanitize=thread -fdiagnostics-color -flto=thin -O2 -g -DNDEBUG    -fno-exceptions -fno-rtti -std=c++14 -MD -MT lib/Target/NVPTX/CMakeFiles/LLVMNVPTXCodeGen.dir/NVPTXRegisterInfo.cpp.o -MF lib/Target/NVPTX/CMakeFiles/LLVMNVPTXCodeGen.dir/NVPTXRegisterInfo.cpp.o.d -o lib/Target/NVPTX/CMakeFiles/LLVMNVPTXCodeGen.dir/NVPTXRegisterInfo.cpp.o -c /Users/buildslave/jenkins/workspace/clang-stage2-cmake-RgTSan/llvm-project/llvm/lib/Target/NVPTX/NVPTXRegisterInfo.cpp
[1541/2138] /Users/buildslave/jenkins/workspace/clang-stage2-cmake-RgTSan/host-compiler/bin/clang++  -DBUILD_EXAMPLES -DGTEST_HAS_RTTI=0 -D__STDC_CONSTANT_MACROS -D__STDC_FORMAT_MACROS -D__STDC_LIMIT_MACROS -Ilib/Target/NVPTX -I/Users/buildslave/jenkins/workspace/clang-stage2-cmake-RgTSan/llvm-project/llvm/lib/Target/NVPTX -I/usr/include/libxml2 -Iinclude -I/Users/buildslave/jenkins/workspace/clang-stage2-cmake-RgTSan/llvm-project/llvm/include -fPIC -fvisibility-inlines-hidden -Werror=date-time -Werror=unguarded-availability-new -Wall -Wextra -Wno-unused-parameter -Wwrite-strings -Wcast-qual -Wmissing-field-initializers -pedantic -Wno-long-long -Wimplicit-fallthrough -Wcovered-switch-default -Wno-noexcept-type -Wnon-virtual-dtor -Wdelete-non-virtual-dtor -Wstring-conversion -fno-omit-frame-pointer -fsanitize=thread -fdiagnostics-color -flto=thin -O2 -g -DNDEBUG    -fno-exceptions -fno-rtti -std=c++14 -MD -MT lib/Target/NVPTX/CMakeFiles/LLVMNVPTXCodeGen.dir/NVVMReflect.cpp.o -MF lib/Target/NVPTX/CMakeFiles/LLVMNVPTXCodeGen.dir/NVVMReflect.cpp.o.d -o lib/Target/NVPTX/CMakeFiles/LLVMNVPTXCodeGen.dir/NVVMReflect.cpp.o -c /Users/buildslave/jenkins/workspace/clang-stage2-cmake-RgTSan/llvm-project/llvm/lib/Target/NVPTX/NVVMReflect.cpp
[1542/2138] /Users/buildslave/jenkins/workspace/clang-stage2-cmake-RgTSan/host-compiler/bin/clang++  -DBUILD_EXAMPLES -DGTEST_HAS_RTTI=0 -D__STDC_CONSTANT_MACROS -D__STDC_FORMAT_MACROS -D__STDC_LIMIT_MACROS -Ilib/Target/NVPTX/MCTargetDesc -I/Users/buildslave/jenkins/workspace/clang-stage2-cmake-RgTSan/llvm-project/llvm/lib/Target/NVPTX/MCTargetDesc -I/Users/buildslave/jenkins/workspace/clang-stage2-cmake-RgTSan/llvm-project/llvm/lib/Target/NVPTX -Ilib/Target/NVPTX -I/usr/include/libxml2 -Iinclude -I/Users/buildslave/jenkins/workspace/clang-stage2-cmake-RgTSan/llvm-project/llvm/include -fPIC -fvisibility-inlines-hidden -Werror=date-time -Werror=unguarded-availability-new -Wall -Wextra -Wno-unused-parameter -Wwrite-strings -Wcast-qual -Wmissing-field-initializers -pedantic -Wno-long-long -Wimplicit-fallthrough -Wcovered-switch-default -Wno-noexcept-type -Wnon-virtual-dtor -Wdelete-non-virtual-dtor -Wstring-conversion -fno-omit-frame-pointer -fsanitize=thread -fdiagnostics-color -flto=thin -O2 -g -DNDEBUG    -fno-exceptions -fno-rtti -std=c++14 -MD -MT lib/Target/NVPTX/MCTargetDesc/CMakeFiles/LLVMNVPTXDesc.dir/NVPTXMCAsmInfo.cpp.o -MF lib/Target/NVPTX/MCTargetDesc/CMakeFiles/LLVMNVPTXDesc.dir/NVPTXMCAsmInfo.cpp.o.d -o lib/Target/NVPTX/MCTargetDesc/CMakeFiles/LLVMNVPTXDesc.dir/NVPTXMCAsmInfo.cpp.o -c /Users/buildslave/jenkins/workspace/clang-stage2-cmake-RgTSan/llvm-project/llvm/lib/Target/NVPTX/MCTargetDesc/NVPTXMCAsmInfo.cpp
[1543/2138] /Users/buildslave/jenkins/workspace/clang-stage2-cmake-RgTSan/host-compiler/bin/clang++  -DBUILD_EXAMPLES -DGTEST_HAS_RTTI=0 -D__STDC_CONSTANT_MACROS -D__STDC_FORMAT_MACROS -D__STDC_LIMIT_MACROS -Ilib/Target/NVPTX -I/Users/buildslave/jenkins/workspace/clang-stage2-cmake-RgTSan/llvm-project/llvm/lib/Target/NVPTX -I/usr/include/libxml2 -Iinclude -I/Users/buildslave/jenkins/workspace/clang-stage2-cmake-RgTSan/llvm-project/llvm/include -fPIC -fvisibility-inlines-hidden -Werror=date-time -Werror=unguarded-availability-new -Wall -Wextra -Wno-unused-parameter -Wwrite-strings -Wcast-qual -Wmissing-field-initializers -pedantic -Wno-long-long -Wimplicit-fallthrough -Wcovered-switch-default -Wno-noexcept-type -Wnon-virtual-dtor -Wdelete-non-virtual-dtor -Wstring-conversion -fno-omit-frame-pointer -fsanitize=thread -fdiagnostics-color -flto=thin -O2 -g -DNDEBUG    -fno-exceptions -fno-rtti -std=c++14 -MD -MT lib/Target/NVPTX/CMakeFiles/LLVMNVPTXCodeGen.dir/NVPTXReplaceImageHandles.cpp.o -MF lib/Target/NVPTX/CMakeFiles/LLVMNVPTXCodeGen.dir/NVPTXReplaceImageHandles.cpp.o.d -o lib/Target/NVPTX/CMakeFiles/LLVMNVPTXCodeGen.dir/NVPTXReplaceImageHandles.cpp.o -c /Users/buildslave/jenkins/workspace/clang-stage2-cmake-RgTSan/llvm-project/llvm/lib/Target/NVPTX/NVPTXReplaceImageHandles.cpp
[1544/2138] /Users/buildslave/jenkins/workspace/clang-stage2-cmake-RgTSan/host-compiler/bin/clang++  -DBUILD_EXAMPLES -DGTEST_HAS_RTTI=0 -D__STDC_CONSTANT_MACROS -D__STDC_FORMAT_MACROS -D__STDC_LIMIT_MACROS -Ilib/Target/NVPTX -I/Users/buildslave/jenkins/workspace/clang-stage2-cmake-RgTSan/llvm-project/llvm/lib/Target/NVPTX -I/usr/include/libxml2 -Iinclude -I/Users/buildslave/jenkins/workspace/clang-stage2-cmake-RgTSan/llvm-project/llvm/include -fPIC -fvisibility-inlines-hidden -Werror=date-time -Werror=unguarded-availability-new -Wall -Wextra -Wno-unused-parameter -Wwrite-strings -Wcast-qual -Wmissing-field-initializers -pedantic -Wno-long-long -Wimplicit-fallthrough -Wcovered-switch-default -Wno-noexcept-type -Wnon-virtual-dtor -Wdelete-non-virtual-dtor -Wstring-conversion -fno-omit-frame-pointer -fsanitize=thread -fdiagnostics-color -flto=thin -O2 -g -DNDEBUG    -fno-exceptions -fno-rtti -std=c++14 -MD -MT lib/Target/NVPTX/CMakeFiles/LLVMNVPTXCodeGen.dir/NVPTXSubtarget.cpp.o -MF lib/Target/NVPTX/CMakeFiles/LLVMNVPTXCodeGen.dir/NVPTXSubtarget.cpp.o.d -o lib/Target/NVPTX/CMakeFiles/LLVMNVPTXCodeGen.dir/NVPTXSubtarget.cpp.o -c /Users/buildslave/jenkins/workspace/clang-stage2-cmake-RgTSan/llvm-project/llvm/lib/Target/NVPTX/NVPTXSubtarget.cpp
[1545/2138] /Users/buildslave/jenkins/workspace/clang-stage2-cmake-RgTSan/host-compiler/bin/clang++  -DBUILD_EXAMPLES -DGTEST_HAS_RTTI=0 -D__STDC_CONSTANT_MACROS -D__STDC_FORMAT_MACROS -D__STDC_LIMIT_MACROS -Ilib/Target/NVPTX/TargetInfo -I/Users/buildslave/jenkins/workspace/clang-stage2-cmake-RgTSan/llvm-project/llvm/lib/Target/NVPTX/TargetInfo -I/Users/buildslave/jenkins/workspace/clang-stage2-cmake-RgTSan/llvm-project/llvm/lib/Target/NVPTX -Ilib/Target/NVPTX -I/usr/include/libxml2 -Iinclude -I/Users/buildslave/jenkins/workspace/clang-stage2-cmake-RgTSan/llvm-project/llvm/include -fPIC -fvisibility-inlines-hidden -Werror=date-time -Werror=unguarded-availability-new -Wall -Wextra -Wno-unused-parameter -Wwrite-strings -Wcast-qual -Wmissing-field-initializers -pedantic -Wno-long-long -Wimplicit-fallthrough -Wcovered-switch-default -Wno-noexcept-type -Wnon-virtual-dtor -Wdelete-non-virtual-dtor -Wstring-conversion -fno-omit-frame-pointer -fsanitize=thread -fdiagnostics-color -flto=thin -O2 -g -DNDEBUG    -fno-exceptions -fno-rtti -std=c++14 -MD -MT lib/Target/NVPTX/TargetInfo/CMakeFiles/LLVMNVPTXInfo.dir/NVPTXTargetInfo.cpp.o -MF lib/Target/NVPTX/TargetInfo/CMakeFiles/LLVMNVPTXInfo.dir/NVPTXTargetInfo.cpp.o.d -o lib/Target/NVPTX/TargetInfo/CMakeFiles/LLVMNVPTXInfo.dir/NVPTXTargetInfo.cpp.o -c /Users/buildslave/jenkins/workspace/clang-stage2-cmake-RgTSan/llvm-project/llvm/lib/Target/NVPTX/TargetInfo/NVPTXTargetInfo.cpp
[1546/2138] : && DYLD_LIBRARY_PATH=/Users/buildslave/jenkins/workspace/clang-stage2-cmake-RgTSan/host-compiler/lib/ "/Applications/Xcode.app/Contents/Developer/Toolchains/XcodeDefault.xctoolchain/usr/bin/libtool" -static -no_warning_for_no_symbols -o lib/libLLVMNVPTXInfo.a  lib/Target/NVPTX/TargetInfo/CMakeFiles/LLVMNVPTXInfo.dir/NVPTXTargetInfo.cpp.o && :
[1547/2138] /Users/buildslave/jenkins/workspace/clang-stage2-cmake-RgTSan/host-compiler/bin/clang++  -DBUILD_EXAMPLES -DGTEST_HAS_RTTI=0 -D__STDC_CONSTANT_MACROS -D__STDC_FORMAT_MACROS -D__STDC_LIMIT_MACROS -Ilib/Target/NVPTX/MCTargetDesc -I/Users/buildslave/jenkins/workspace/clang-stage2-cmake-RgTSan/llvm-project/llvm/lib/Target/NVPTX/MCTargetDesc -I/Users/buildslave/jenkins/workspace/clang-stage2-cmake-RgTSan/llvm-project/llvm/lib/Target/NVPTX -Ilib/Target/NVPTX -I/usr/include/libxml2 -Iinclude -I/Users/buildslave/jenkins/workspace/clang-stage2-cmake-RgTSan/llvm-project/llvm/include -fPIC -fvisibility-inlines-hidden -Werror=date-time -Werror=unguarded-availability-new -Wall -Wextra -Wno-unused-parameter -Wwrite-strings -Wcast-qual -Wmissing-field-initializers -pedantic -Wno-long-long -Wimplicit-fallthrough -Wcovered-switch-default -Wno-noexcept-type -Wnon-virtual-dtor -Wdelete-non-virtual-dtor -Wstring-conversion -fno-omit-frame-pointer -fsanitize=thread -fdiagnostics-color -flto=thin -O2 -g -DNDEBUG    -fno-exceptions -fno-rtti -std=c++14 -MD -MT lib/Target/NVPTX/MCTargetDesc/CMakeFiles/LLVMNVPTXDesc.dir/NVPTXTargetStreamer.cpp.o -MF lib/Target/NVPTX/MCTargetDesc/CMakeFiles/LLVMNVPTXDesc.dir/NVPTXTargetStreamer.cpp.o.d -o lib/Target/NVPTX/MCTargetDesc/CMakeFiles/LLVMNVPTXDesc.dir/NVPTXTargetStreamer.cpp.o -c /Users/buildslave/jenkins/workspace/clang-stage2-cmake-RgTSan/llvm-project/llvm/lib/Target/NVPTX/MCTargetDesc/NVPTXTargetStreamer.cpp
[1548/2138] /Users/buildslave/jenkins/workspace/clang-stage2-cmake-RgTSan/host-compiler/bin/clang++  -DBUILD_EXAMPLES -DGTEST_HAS_RTTI=0 -D__STDC_CONSTANT_MACROS -D__STDC_FORMAT_MACROS -D__STDC_LIMIT_MACROS -Ilib/Target/NVPTX -I/Users/buildslave/jenkins/workspace/clang-stage2-cmake-RgTSan/llvm-project/llvm/lib/Target/NVPTX -I/usr/include/libxml2 -Iinclude -I/Users/buildslave/jenkins/workspace/clang-stage2-cmake-RgTSan/llvm-project/llvm/include -fPIC -fvisibility-inlines-hidden -Werror=date-time -Werror=unguarded-availability-new -Wall -Wextra -Wno-unused-parameter -Wwrite-strings -Wcast-qual -Wmissing-field-initializers -pedantic -Wno-long-long -Wimplicit-fallthrough -Wcovered-switch-default -Wno-noexcept-type -Wnon-virtual-dtor -Wdelete-non-virtual-dtor -Wstring-conversion -fno-omit-frame-pointer -fsanitize=thread -fdiagnostics-color -flto=thin -O2 -g -DNDEBUG    -fno-exceptions -fno-rtti -std=c++14 -MD -MT lib/Target/NVPTX/CMakeFiles/LLVMNVPTXCodeGen.dir/NVPTXProxyRegErasure.cpp.o -MF lib/Target/NVPTX/CMakeFiles/LLVMNVPTXCodeGen.dir/NVPTXProxyRegErasure.cpp.o.d -o lib/Target/NVPTX/CMakeFiles/LLVMNVPTXCodeGen.dir/NVPTXProxyRegErasure.cpp.o -c /Users/buildslave/jenkins/workspace/clang-stage2-cmake-RgTSan/llvm-project/llvm/lib/Target/NVPTX/NVPTXProxyRegErasure.cpp
[1549/2138] /Users/buildslave/jenkins/workspace/clang-stage2-cmake-RgTSan/host-compiler/bin/clang++  -DBUILD_EXAMPLES -DGTEST_HAS_RTTI=0 -D__STDC_CONSTANT_MACROS -D__STDC_FORMAT_MACROS -D__STDC_LIMIT_MACROS -Ilib/Target/NVPTX -I/Users/buildslave/jenkins/workspace/clang-stage2-cmake-RgTSan/llvm-project/llvm/lib/Target/NVPTX -I/usr/include/libxml2 -Iinclude -I/Users/buildslave/jenkins/workspace/clang-stage2-cmake-RgTSan/llvm-project/llvm/include -fPIC -fvisibility-inlines-hidden -Werror=date-time -Werror=unguarded-availability-new -Wall -Wextra -Wno-unused-parameter -Wwrite-strings -Wcast-qual -Wmissing-field-initializers -pedantic -Wno-long-long -Wimplicit-fallthrough -Wcovered-switch-default -Wno-noexcept-type -Wnon-virtual-dtor -Wdelete-non-virtual-dtor -Wstring-conversion -fno-omit-frame-pointer -fsanitize=thread -fdiagnostics-color -flto=thin -O2 -g -DNDEBUG    -fno-exceptions -fno-rtti -std=c++14 -MD -MT lib/Target/NVPTX/CMakeFiles/LLVMNVPTXCodeGen.dir/NVPTXTargetTransformInfo.cpp.o -MF lib/Target/NVPTX/CMakeFiles/LLVMNVPTXCodeGen.dir/NVPTXTargetTransformInfo.cpp.o.d -o lib/Target/NVPTX/CMakeFiles/LLVMNVPTXCodeGen.dir/NVPTXTargetTransformInfo.cpp.o -c /Users/buildslave/jenkins/workspace/clang-stage2-cmake-RgTSan/llvm-project/llvm/lib/Target/NVPTX/NVPTXTargetTransformInfo.cpp
FATAL: command execution failed
java.io.EOFException
	at java.io.ObjectInputStream$PeekInputStream.readFully(ObjectInputStream.java:2681)
	at java.io.ObjectInputStream$BlockDataInputStream.readShort(ObjectInputStream.java:3156)
	at java.io.ObjectInputStream.readStreamHeader(ObjectInputStream.java:862)
	at java.io.ObjectInputStream.<init>(ObjectInputStream.java:358)
	at hudson.remoting.ObjectInputStreamEx.<init>(ObjectInputStreamEx.java:49)
	at hudson.remoting.Command.readFrom(Command.java:140)
	at hudson.remoting.Command.readFrom(Command.java:126)
	at hudson.remoting.AbstractSynchronousByteArrayCommandTransport.read(AbstractSynchronousByteArrayCommandTransport.java:36)
	at hudson.remoting.SynchronousCommandTransport$ReaderThread.run(SynchronousCommandTransport.java:63)
Caused: java.io.IOException: Unexpected termination of the channel
	at hudson.remoting.SynchronousCommandTransport$ReaderThread.run(SynchronousCommandTransport.java:77)
Caused: java.io.IOException: Backing channel 'green-dragon-08' is disconnected.
	at hudson.remoting.RemoteInvocationHandler.channelOrFail(RemoteInvocationHandler.java:214)
	at hudson.remoting.RemoteInvocationHandler.invoke(RemoteInvocationHandler.java:283)
	at com.sun.proxy.$Proxy101.isAlive(Unknown Source)
	at hudson.Launcher$RemoteLauncher$ProcImpl.isAlive(Launcher.java:1150)
	at hudson.Launcher$RemoteLauncher$ProcImpl.join(Launcher.java:1142)
	at hudson.tasks.CommandInterpreter.join(CommandInterpreter.java:155)
	at hudson.tasks.CommandInterpreter.perform(CommandInterpreter.java:109)
	at hudson.tasks.CommandInterpreter.perform(CommandInterpreter.java:66)
	at hudson.tasks.BuildStepMonitor$1.perform(BuildStepMonitor.java:20)
	at hudson.model.AbstractBuild$AbstractBuildExecution.perform(AbstractBuild.java:741)
	at hudson.model.Build$BuildExecution.build(Build.java:206)
	at hudson.model.Build$BuildExecution.doRun(Build.java:163)
	at hudson.model.AbstractBuild$AbstractBuildExecution.run(AbstractBuild.java:504)
	at hudson.model.Run.execute(Run.java:1818)
	at hudson.model.FreeStyleBuild.run(FreeStyleBuild.java:43)
	at hudson.model.ResourceController.execute(ResourceController.java:97)
	at hudson.model.Executor.run(Executor.java:429)
FATAL: Unable to delete script file /var/folders/9t/lrs73ptj6lv644zvh1fk2_gc0000gn/T/jenkins5353684438811920260.sh
java.io.EOFException
	at java.io.ObjectInputStream$PeekInputStream.readFully(ObjectInputStream.java:2681)
	at java.io.ObjectInputStream$BlockDataInputStream.readShort(ObjectInputStream.java:3156)
	at java.io.ObjectInputStream.readStreamHeader(ObjectInputStream.java:862)
	at java.io.ObjectInputStream.<init>(ObjectInputStream.java:358)
	at hudson.remoting.ObjectInputStreamEx.<init>(ObjectInputStreamEx.java:49)
	at hudson.remoting.Command.readFrom(Command.java:140)
	at hudson.remoting.Command.readFrom(Command.java:126)
	at hudson.remoting.AbstractSynchronousByteArrayCommandTransport.read(AbstractSynchronousByteArrayCommandTransport.java:36)
	at hudson.remoting.SynchronousCommandTransport$ReaderThread.run(SynchronousCommandTransport.java:63)
Caused: java.io.IOException: Unexpected termination of the channel
	at hudson.remoting.SynchronousCommandTransport$ReaderThread.run(SynchronousCommandTransport.java:77)
Caused: hudson.remoting.ChannelClosedException: Channel "unknown": Remote call on green-dragon-08 failed. The channel is closing down or has closed down
	at hudson.remoting.Channel.call(Channel.java:950)
	at hudson.FilePath.act(FilePath.java:1070)
	at hudson.FilePath.act(FilePath.java:1059)
	at hudson.FilePath.delete(FilePath.java:1540)
	at hudson.tasks.CommandInterpreter.perform(CommandInterpreter.java:123)
	at hudson.tasks.CommandInterpreter.perform(CommandInterpreter.java:66)
	at hudson.tasks.BuildStepMonitor$1.perform(BuildStepMonitor.java:20)
	at hudson.model.AbstractBuild$AbstractBuildExecution.perform(AbstractBuild.java:741)
	at hudson.model.Build$BuildExecution.build(Build.java:206)
	at hudson.model.Build$BuildExecution.doRun(Build.java:163)
	at hudson.model.AbstractBuild$AbstractBuildExecution.run(AbstractBuild.java:504)
	at hudson.model.Run.execute(Run.java:1818)
	at hudson.model.FreeStyleBuild.run(FreeStyleBuild.java:43)
	at hudson.model.ResourceController.execute(ResourceController.java:97)
	at hudson.model.Executor.run(Executor.java:429)
Build step 'Execute shell' marked build as failure
ERROR: Step ‘[Deprecated] Scan for compiler warnings’ failed: no workspace for clang-stage2-cmake-RgTSan #19625
Finished: FAILURE