FailedConsole Output

Skipping 7,827 KB.. Full Log
PASS: UBSan-AddressSanitizer-x86_64 :: TestCases/Integer/usub-overflow.cpp (2558 of 3112)
PASS: UBSan-AddressSanitizer-x86_64 :: TestCases/Misc/builtins.cpp (2559 of 3112)
PASS: UBSan-AddressSanitizer-x86_64 :: TestCases/Integer/shift.cpp (2560 of 3112)
PASS: UBSan-AddressSanitizer-x86_64 :: TestCases/Misc/bounds.cpp (2561 of 3112)
PASS: UBSan-AddressSanitizer-x86_64 :: TestCases/Misc/deduplication.cpp (2562 of 3112)
PASS: UBSan-AddressSanitizer-x86_64 :: TestCases/Misc/log-path_test.cpp (2563 of 3112)
PASS: UBSan-AddressSanitizer-x86_64 :: TestCases/Misc/enum.cpp (2564 of 3112)
PASS: UBSan-AddressSanitizer-x86_64 :: TestCases/Misc/monitor.cpp (2565 of 3112)
UNSUPPORTED: UBSan-AddressSanitizer-x86_64 :: TestCases/Misc/no-interception.cpp (2566 of 3112)
PASS: UBSan-AddressSanitizer-x86_64 :: TestCases/Misc/missing_return.cpp (2567 of 3112)
PASS: UBSan-AddressSanitizer-x86_64 :: TestCases/Misc/coverage-levels.cpp (2568 of 3112)
PASS: UBSan-AddressSanitizer-x86_64 :: TestCases/Misc/nullability.c (2569 of 3112)
PASS: UBSan-AddressSanitizer-x86_64 :: TestCases/Misc/nonnull-arg.cpp (2570 of 3112)
PASS: UBSan-AddressSanitizer-x86_64 :: TestCases/Misc/nonnull.cpp (2571 of 3112)
PASS: UBSan-AddressSanitizer-x86_64 :: TestCases/Misc/print_summary.c (2572 of 3112)
PASS: UBSan-AddressSanitizer-x86_64 :: TestCases/Misc/unreachable.cpp (2573 of 3112)
PASS: UBSan-AddressSanitizer-x86_64 :: TestCases/Misc/vla.c (2574 of 3112)
PASS: UBSan-AddressSanitizer-x86_64 :: TestCases/Misc/objc-cast.m (2575 of 3112)
PASS: UBSan-AddressSanitizer-x86_64 :: TestCases/Pointer/alignment-assumption-attribute-align_value-on-lvalue.cpp (2576 of 3112)
PASS: UBSan-AddressSanitizer-x86_64 :: TestCases/Pointer/alignment-assumption-attribute-align_value-on-paramvar.cpp (2577 of 3112)
PASS: UBSan-AddressSanitizer-x86_64 :: TestCases/Pointer/alignment-assumption-attribute-alloc_align-on-function-variable.cpp (2578 of 3112)
PASS: UBSan-AddressSanitizer-x86_64 :: TestCases/Pointer/alignment-assumption-attribute-alloc_align-on-function.cpp (2579 of 3112)
PASS: UBSan-AddressSanitizer-x86_64 :: TestCases/Pointer/alignment-assumption-attribute-assume_aligned-on-function-two-params.cpp (2580 of 3112)
PASS: UBSan-AddressSanitizer-x86_64 :: TestCases/Pointer/alignment-assumption-blacklist.cpp (2581 of 3112)
PASS: UBSan-AddressSanitizer-x86_64 :: TestCases/Pointer/alignment-assumption-attribute-assume_aligned-on-function.cpp (2582 of 3112)
PASS: UBSan-AddressSanitizer-x86_64 :: TestCases/Pointer/alignment-assumption-builtin_assume_aligned-three-params-variable.cpp (2583 of 3112)
PASS: UBSan-AddressSanitizer-x86_64 :: TestCases/Pointer/alignment-assumption-builtin_assume_aligned-three-params.cpp (2584 of 3112)
PASS: UBSan-AddressSanitizer-x86_64 :: TestCases/Pointer/alignment-assumption-summary.cpp (2585 of 3112)
PASS: UBSan-AddressSanitizer-x86_64 :: TestCases/Pointer/alignment-assumption-builtin_assume_aligned-two-params.cpp (2586 of 3112)
PASS: UBSan-AddressSanitizer-x86_64 :: TestCases/Pointer/index-overflow.cpp (2587 of 3112)
PASS: UBSan-AddressSanitizer-x86_64 :: TestCases/Pointer/alignment-assumption-openmp.cpp (2588 of 3112)
PASS: UBSan-AddressSanitizer-x86_64 :: TestCases/Pointer/nullptr-and-nonzero-offset-summary.cpp (2589 of 3112)
PASS: UBSan-Minimal-x86_64 :: TestCases/alignment-assumption.c (2590 of 3112)
PASS: UBSan-Minimal-x86_64 :: TestCases/implicit-integer-sign-change.c (2591 of 3112)
PASS: UBSan-AddressSanitizer-x86_64 :: TestCases/Pointer/unsigned-index-expression.cpp (2592 of 3112)
PASS: UBSan-Minimal-x86_64 :: TestCases/implicit-signed-integer-truncation-or-sign-change.c (2593 of 3112)
PASS: UBSan-Minimal-x86_64 :: TestCases/implicit-signed-integer-truncation.c (2594 of 3112)
PASS: UBSan-Minimal-x86_64 :: TestCases/implicit-unsigned-integer-truncation.c (2595 of 3112)
PASS: UBSan-Minimal-x86_64 :: TestCases/recover-dedup-limit.cpp (2596 of 3112)
PASS: UBSan-Minimal-x86_64 :: TestCases/test-darwin-interface.c (2597 of 3112)
PASS: UBSan-Minimal-x86_64 :: TestCases/recover-dedup.cpp (2598 of 3112)
PASS: UBSan-Minimal-x86_64 :: TestCases/nullptr-and-nonzero-offset.c (2599 of 3112)
PASS: UBSan-Standalone-x86_64 :: TestCases/Float/cast-overflow.cpp (2600 of 3112)
PASS: UBSan-Minimal-x86_64 :: TestCases/uadd-overflow.cpp (2601 of 3112)
UNSUPPORTED: UBSan-AddressSanitizer-x86_64 :: TestCases/TypeCheck/Linux/PR33221.cpp (2602 of 3112)
PASS: UBSan-AddressSanitizer-x86_64 :: TestCases/Pointer/nullptr-and-nonzero-offset-constants.cpp (2603 of 3112)
PASS: UBSan-AddressSanitizer-x86_64 :: TestCases/TypeCheck/Function/function.cpp (2604 of 3112)
UNSUPPORTED: UBSan-Standalone-x86_64 :: TestCases/ImplicitConversion/integer-sign-change-summary.cpp (2605 of 3112)
PASS: UBSan-AddressSanitizer-x86_64 :: TestCases/TypeCheck/PR33221.cpp (2606 of 3112)
PASS: UBSan-AddressSanitizer-x86_64 :: TestCases/TypeCheck/null.cpp (2607 of 3112)
PASS: UBSan-AddressSanitizer-x86_64 :: TestCases/TypeCheck/vptr-corrupted-vtable-itanium.cpp (2608 of 3112)
PASS: UBSan-AddressSanitizer-x86_64 :: TestCases/TypeCheck/misaligned.cpp (2609 of 3112)
UNSUPPORTED: UBSan-AddressSanitizer-x86_64 :: TestCases/TypeCheck/vptr-ptrauth-unauthenticated.cpp (2610 of 3112)
UNSUPPORTED: UBSan-Standalone-x86_64 :: TestCases/ImplicitConversion/signed-integer-truncation-or-sign-change-summary.cpp (2611 of 3112)
UNSUPPORTED: UBSan-Standalone-x86_64 :: TestCases/ImplicitConversion/signed-integer-truncation-summary.cpp (2612 of 3112)
PASS: UBSan-Standalone-x86_64 :: TestCases/ImplicitConversion/integer-conversion-incdec.c (2613 of 3112)
PASS: UBSan-AddressSanitizer-x86_64 :: TestCases/TypeCheck/vptr-non-unique-typeinfo.cpp (2614 of 3112)
UNSUPPORTED: UBSan-Standalone-x86_64 :: TestCases/ImplicitConversion/unsigned-integer-truncation-summary.cpp (2615 of 3112)
PASS: UBSan-AddressSanitizer-x86_64 :: TestCases/TypeCheck/vptr-virtual-base-construction.cpp (2616 of 3112)
PASS: UBSan-Standalone-x86_64 :: TestCases/ImplicitConversion/integer-sign-change-incdec.c (2617 of 3112)
PASS: UBSan-Standalone-x86_64 :: TestCases/ImplicitConversion/integer-sign-change-blacklist.c (2618 of 3112)
PASS: UBSan-AddressSanitizer-x86_64 :: TestCases/TypeCheck/vptr-virtual-base.cpp (2619 of 3112)
PASS: UBSan-Standalone-x86_64 :: TestCases/Integer/div-overflow.cpp (2620 of 3112)
FAIL: UBSan-AddressSanitizer-x86_64 :: TestCases/TypeCheck/vptr.cpp (2621 of 3112)
******************** TEST 'UBSan-AddressSanitizer-x86_64 :: TestCases/TypeCheck/vptr.cpp' FAILED ********************
Script:
--
: 'RUN: at line 1';      /Users/buildslave/jenkins/workspace/clang-stage2-Rthinlto/clang-build/Build/./bin/clang  --driver-mode=g++ -fsanitize=address  -arch x86_64 -stdlib=libc++ -mmacosx-version-min=10.10 -isysroot /Applications/Xcode.app/Contents/Developer/Platforms/MacOSX.platform/Developer/SDKs/MacOSX10.15.sdk  -frtti -fsanitize=null,vptr -g /Users/buildslave/jenkins/workspace/clang-stage2-Rthinlto/llvm-project/compiler-rt/test/ubsan/TestCases/TypeCheck/vptr.cpp -O3 -o /Users/buildslave/jenkins/workspace/clang-stage2-Rthinlto/clang-build/Build/tools/clang/runtime/compiler-rt-bins/test/ubsan/AddressSanitizer-x86_64/TestCases/TypeCheck/Output/vptr.cpp.tmp -mllvm -enable-tail-merge=false
: 'RUN: at line 2';   env UBSAN_OPTIONS=abort_on_error=0:log_to_syslog=0:detect_leaks=0:halt_on_error=1  /Users/buildslave/jenkins/workspace/clang-stage2-Rthinlto/clang-build/Build/tools/clang/runtime/compiler-rt-bins/test/ubsan/AddressSanitizer-x86_64/TestCases/TypeCheck/Output/vptr.cpp.tmp rT
: 'RUN: at line 3';   env UBSAN_OPTIONS=abort_on_error=0:log_to_syslog=0:detect_leaks=0:halt_on_error=1  /Users/buildslave/jenkins/workspace/clang-stage2-Rthinlto/clang-build/Build/tools/clang/runtime/compiler-rt-bins/test/ubsan/AddressSanitizer-x86_64/TestCases/TypeCheck/Output/vptr.cpp.tmp mT
: 'RUN: at line 4';   env UBSAN_OPTIONS=abort_on_error=0:log_to_syslog=0:detect_leaks=0:halt_on_error=1  /Users/buildslave/jenkins/workspace/clang-stage2-Rthinlto/clang-build/Build/tools/clang/runtime/compiler-rt-bins/test/ubsan/AddressSanitizer-x86_64/TestCases/TypeCheck/Output/vptr.cpp.tmp fT
: 'RUN: at line 5';   env UBSAN_OPTIONS=abort_on_error=0:log_to_syslog=0:detect_leaks=0:halt_on_error=1  /Users/buildslave/jenkins/workspace/clang-stage2-Rthinlto/clang-build/Build/tools/clang/runtime/compiler-rt-bins/test/ubsan/AddressSanitizer-x86_64/TestCases/TypeCheck/Output/vptr.cpp.tmp cT
: 'RUN: at line 6';   env UBSAN_OPTIONS=abort_on_error=0:log_to_syslog=0:detect_leaks=0:halt_on_error=1  /Users/buildslave/jenkins/workspace/clang-stage2-Rthinlto/clang-build/Build/tools/clang/runtime/compiler-rt-bins/test/ubsan/AddressSanitizer-x86_64/TestCases/TypeCheck/Output/vptr.cpp.tmp rU
: 'RUN: at line 7';   env UBSAN_OPTIONS=abort_on_error=0:log_to_syslog=0:detect_leaks=0:halt_on_error=1  /Users/buildslave/jenkins/workspace/clang-stage2-Rthinlto/clang-build/Build/tools/clang/runtime/compiler-rt-bins/test/ubsan/AddressSanitizer-x86_64/TestCases/TypeCheck/Output/vptr.cpp.tmp mU
: 'RUN: at line 8';   env UBSAN_OPTIONS=abort_on_error=0:log_to_syslog=0:detect_leaks=0:halt_on_error=1  /Users/buildslave/jenkins/workspace/clang-stage2-Rthinlto/clang-build/Build/tools/clang/runtime/compiler-rt-bins/test/ubsan/AddressSanitizer-x86_64/TestCases/TypeCheck/Output/vptr.cpp.tmp fU
: 'RUN: at line 9';   env UBSAN_OPTIONS=abort_on_error=0:log_to_syslog=0:detect_leaks=0:halt_on_error=1  /Users/buildslave/jenkins/workspace/clang-stage2-Rthinlto/clang-build/Build/tools/clang/runtime/compiler-rt-bins/test/ubsan/AddressSanitizer-x86_64/TestCases/TypeCheck/Output/vptr.cpp.tmp cU
: 'RUN: at line 10';   env UBSAN_OPTIONS=abort_on_error=0:log_to_syslog=0:detect_leaks=0:halt_on_error=1  /Users/buildslave/jenkins/workspace/clang-stage2-Rthinlto/clang-build/Build/tools/clang/runtime/compiler-rt-bins/test/ubsan/AddressSanitizer-x86_64/TestCases/TypeCheck/Output/vptr.cpp.tmp rS
: 'RUN: at line 11';   env UBSAN_OPTIONS=abort_on_error=0:log_to_syslog=0:detect_leaks=0:halt_on_error=1  /Users/buildslave/jenkins/workspace/clang-stage2-Rthinlto/clang-build/Build/tools/clang/runtime/compiler-rt-bins/test/ubsan/AddressSanitizer-x86_64/TestCases/TypeCheck/Output/vptr.cpp.tmp rV
: 'RUN: at line 12';   env UBSAN_OPTIONS=abort_on_error=0:log_to_syslog=0:detect_leaks=0:halt_on_error=1  /Users/buildslave/jenkins/workspace/clang-stage2-Rthinlto/clang-build/Build/tools/clang/runtime/compiler-rt-bins/test/ubsan/AddressSanitizer-x86_64/TestCases/TypeCheck/Output/vptr.cpp.tmp oV
: 'RUN: at line 13';   env UBSAN_OPTIONS=abort_on_error=0:log_to_syslog=0:detect_leaks=0:halt_on_error=1  /Users/buildslave/jenkins/workspace/clang-stage2-Rthinlto/clang-build/Build/tools/clang/runtime/compiler-rt-bins/test/ubsan/AddressSanitizer-x86_64/TestCases/TypeCheck/Output/vptr.cpp.tmp zN
: 'RUN: at line 14';   env UBSAN_OPTIONS=abort_on_error=0:log_to_syslog=0:detect_leaks=0:halt_on_error=1:print_stacktrace=1 not  /Users/buildslave/jenkins/workspace/clang-stage2-Rthinlto/clang-build/Build/tools/clang/runtime/compiler-rt-bins/test/ubsan/AddressSanitizer-x86_64/TestCases/TypeCheck/Output/vptr.cpp.tmp mS 2>&1 | FileCheck /Users/buildslave/jenkins/workspace/clang-stage2-Rthinlto/llvm-project/compiler-rt/test/ubsan/TestCases/TypeCheck/vptr.cpp --check-prefix=CHECK-MEMBER --check-prefix=CHECK-Darwin-MEMBER --strict-whitespace
: 'RUN: at line 15';   env UBSAN_OPTIONS=abort_on_error=0:log_to_syslog=0:detect_leaks=0:halt_on_error=1:print_stacktrace=1 not  /Users/buildslave/jenkins/workspace/clang-stage2-Rthinlto/clang-build/Build/tools/clang/runtime/compiler-rt-bins/test/ubsan/AddressSanitizer-x86_64/TestCases/TypeCheck/Output/vptr.cpp.tmp fS 2>&1 | FileCheck /Users/buildslave/jenkins/workspace/clang-stage2-Rthinlto/llvm-project/compiler-rt/test/ubsan/TestCases/TypeCheck/vptr.cpp --check-prefix=CHECK-MEMFUN --strict-whitespace
: 'RUN: at line 16';   env UBSAN_OPTIONS=abort_on_error=0:log_to_syslog=0:detect_leaks=0:halt_on_error=1:print_stacktrace=1 not  /Users/buildslave/jenkins/workspace/clang-stage2-Rthinlto/clang-build/Build/tools/clang/runtime/compiler-rt-bins/test/ubsan/AddressSanitizer-x86_64/TestCases/TypeCheck/Output/vptr.cpp.tmp cS 2>&1 | FileCheck /Users/buildslave/jenkins/workspace/clang-stage2-Rthinlto/llvm-project/compiler-rt/test/ubsan/TestCases/TypeCheck/vptr.cpp --check-prefix=CHECK-DOWNCAST --check-prefix=CHECK-Darwin-DOWNCAST --strict-whitespace
: 'RUN: at line 17';   env UBSAN_OPTIONS=abort_on_error=0:log_to_syslog=0:detect_leaks=0:halt_on_error=1:print_stacktrace=1 not  /Users/buildslave/jenkins/workspace/clang-stage2-Rthinlto/clang-build/Build/tools/clang/runtime/compiler-rt-bins/test/ubsan/AddressSanitizer-x86_64/TestCases/TypeCheck/Output/vptr.cpp.tmp mV 2>&1 | FileCheck /Users/buildslave/jenkins/workspace/clang-stage2-Rthinlto/llvm-project/compiler-rt/test/ubsan/TestCases/TypeCheck/vptr.cpp --check-prefix=CHECK-MEMBER --check-prefix=CHECK-Darwin-MEMBER --strict-whitespace
: 'RUN: at line 18';   env UBSAN_OPTIONS=abort_on_error=0:log_to_syslog=0:detect_leaks=0:halt_on_error=1:print_stacktrace=1 not  /Users/buildslave/jenkins/workspace/clang-stage2-Rthinlto/clang-build/Build/tools/clang/runtime/compiler-rt-bins/test/ubsan/AddressSanitizer-x86_64/TestCases/TypeCheck/Output/vptr.cpp.tmp fV 2>&1 | FileCheck /Users/buildslave/jenkins/workspace/clang-stage2-Rthinlto/llvm-project/compiler-rt/test/ubsan/TestCases/TypeCheck/vptr.cpp --check-prefix=CHECK-MEMFUN --strict-whitespace
: 'RUN: at line 19';   env UBSAN_OPTIONS=abort_on_error=0:log_to_syslog=0:detect_leaks=0:halt_on_error=1:print_stacktrace=1 not  /Users/buildslave/jenkins/workspace/clang-stage2-Rthinlto/clang-build/Build/tools/clang/runtime/compiler-rt-bins/test/ubsan/AddressSanitizer-x86_64/TestCases/TypeCheck/Output/vptr.cpp.tmp cV 2>&1 | FileCheck /Users/buildslave/jenkins/workspace/clang-stage2-Rthinlto/llvm-project/compiler-rt/test/ubsan/TestCases/TypeCheck/vptr.cpp --check-prefix=CHECK-DOWNCAST --check-prefix=CHECK-Darwin-DOWNCAST --strict-whitespace
: 'RUN: at line 20';   env UBSAN_OPTIONS=abort_on_error=0:log_to_syslog=0:detect_leaks=0:halt_on_error=1:print_stacktrace=1 not  /Users/buildslave/jenkins/workspace/clang-stage2-Rthinlto/clang-build/Build/tools/clang/runtime/compiler-rt-bins/test/ubsan/AddressSanitizer-x86_64/TestCases/TypeCheck/Output/vptr.cpp.tmp oU 2>&1 | FileCheck /Users/buildslave/jenkins/workspace/clang-stage2-Rthinlto/llvm-project/compiler-rt/test/ubsan/TestCases/TypeCheck/vptr.cpp --check-prefix=CHECK-OFFSET --check-prefix=CHECK-Darwin-OFFSET --strict-whitespace
: 'RUN: at line 21';   env UBSAN_OPTIONS=abort_on_error=0:log_to_syslog=0:detect_leaks=0:halt_on_error=1:print_stacktrace=1 not  /Users/buildslave/jenkins/workspace/clang-stage2-Rthinlto/clang-build/Build/tools/clang/runtime/compiler-rt-bins/test/ubsan/AddressSanitizer-x86_64/TestCases/TypeCheck/Output/vptr.cpp.tmp m0 2>&1 | FileCheck /Users/buildslave/jenkins/workspace/clang-stage2-Rthinlto/llvm-project/compiler-rt/test/ubsan/TestCases/TypeCheck/vptr.cpp --check-prefix=CHECK-INVALID-MEMBER --check-prefix=CHECK-Darwin-NULL-MEMBER --strict-whitespace
: 'RUN: at line 22';   env UBSAN_OPTIONS=abort_on_error=0:log_to_syslog=0:detect_leaks=0:halt_on_error=1:print_stacktrace=1 not  /Users/buildslave/jenkins/workspace/clang-stage2-Rthinlto/clang-build/Build/tools/clang/runtime/compiler-rt-bins/test/ubsan/AddressSanitizer-x86_64/TestCases/TypeCheck/Output/vptr.cpp.tmp m0 2>&1 | FileCheck /Users/buildslave/jenkins/workspace/clang-stage2-Rthinlto/llvm-project/compiler-rt/test/ubsan/TestCases/TypeCheck/vptr.cpp --check-prefix=CHECK-INVALID-MEMBER --check-prefix=CHECK-Darwin-NULL-MEMBER --strict-whitespace
: 'RUN: at line 23';   env UBSAN_OPTIONS=abort_on_error=0:log_to_syslog=0:detect_leaks=0:halt_on_error=1 not  /Users/buildslave/jenkins/workspace/clang-stage2-Rthinlto/clang-build/Build/tools/clang/runtime/compiler-rt-bins/test/ubsan/AddressSanitizer-x86_64/TestCases/TypeCheck/Output/vptr.cpp.tmp nN 2>&1 | FileCheck /Users/buildslave/jenkins/workspace/clang-stage2-Rthinlto/llvm-project/compiler-rt/test/ubsan/TestCases/TypeCheck/vptr.cpp --check-prefix=CHECK-NULL-MEMFUN --strict-whitespace
: 'RUN: at line 24';   env UBSAN_OPTIONS=abort_on_error=0:log_to_syslog=0:detect_leaks=0:print_stacktrace=1  /Users/buildslave/jenkins/workspace/clang-stage2-Rthinlto/clang-build/Build/tools/clang/runtime/compiler-rt-bins/test/ubsan/AddressSanitizer-x86_64/TestCases/TypeCheck/Output/vptr.cpp.tmp dT 2>&1 | FileCheck /Users/buildslave/jenkins/workspace/clang-stage2-Rthinlto/llvm-project/compiler-rt/test/ubsan/TestCases/TypeCheck/vptr.cpp --check-prefix=CHECK-DYNAMIC --check-prefix=CHECK-Darwin-DYNAMIC --strict-whitespace
: 'RUN: at line 26';   (echo "vptr_check:S"; echo "vptr_check:T"; echo "vptr_check:U") > /Users/buildslave/jenkins/workspace/clang-stage2-Rthinlto/clang-build/Build/tools/clang/runtime/compiler-rt-bins/test/ubsan/AddressSanitizer-x86_64/TestCases/TypeCheck/Output/vptr.cpp.tmp.supp
: 'RUN: at line 27';   env UBSAN_OPTIONS=abort_on_error=0:log_to_syslog=0:detect_leaks=0:halt_on_error=1:suppressions='"/Users/buildslave/jenkins/workspace/clang-stage2-Rthinlto/clang-build/Build/tools/clang/runtime/compiler-rt-bins/test/ubsan/AddressSanitizer-x86_64/TestCases/TypeCheck/Output/vptr.cpp.tmp.supp"'  /Users/buildslave/jenkins/workspace/clang-stage2-Rthinlto/clang-build/Build/tools/clang/runtime/compiler-rt-bins/test/ubsan/AddressSanitizer-x86_64/TestCases/TypeCheck/Output/vptr.cpp.tmp mS
: 'RUN: at line 28';   env UBSAN_OPTIONS=abort_on_error=0:log_to_syslog=0:detect_leaks=0:halt_on_error=1:suppressions='"/Users/buildslave/jenkins/workspace/clang-stage2-Rthinlto/clang-build/Build/tools/clang/runtime/compiler-rt-bins/test/ubsan/AddressSanitizer-x86_64/TestCases/TypeCheck/Output/vptr.cpp.tmp.supp"'  /Users/buildslave/jenkins/workspace/clang-stage2-Rthinlto/clang-build/Build/tools/clang/runtime/compiler-rt-bins/test/ubsan/AddressSanitizer-x86_64/TestCases/TypeCheck/Output/vptr.cpp.tmp fS
: 'RUN: at line 29';   env UBSAN_OPTIONS=abort_on_error=0:log_to_syslog=0:detect_leaks=0:halt_on_error=1:suppressions='"/Users/buildslave/jenkins/workspace/clang-stage2-Rthinlto/clang-build/Build/tools/clang/runtime/compiler-rt-bins/test/ubsan/AddressSanitizer-x86_64/TestCases/TypeCheck/Output/vptr.cpp.tmp.supp"'  /Users/buildslave/jenkins/workspace/clang-stage2-Rthinlto/clang-build/Build/tools/clang/runtime/compiler-rt-bins/test/ubsan/AddressSanitizer-x86_64/TestCases/TypeCheck/Output/vptr.cpp.tmp cS
: 'RUN: at line 30';   env UBSAN_OPTIONS=abort_on_error=0:log_to_syslog=0:detect_leaks=0:halt_on_error=1:suppressions='"/Users/buildslave/jenkins/workspace/clang-stage2-Rthinlto/clang-build/Build/tools/clang/runtime/compiler-rt-bins/test/ubsan/AddressSanitizer-x86_64/TestCases/TypeCheck/Output/vptr.cpp.tmp.supp"'  /Users/buildslave/jenkins/workspace/clang-stage2-Rthinlto/clang-build/Build/tools/clang/runtime/compiler-rt-bins/test/ubsan/AddressSanitizer-x86_64/TestCases/TypeCheck/Output/vptr.cpp.tmp mV
: 'RUN: at line 31';   env UBSAN_OPTIONS=abort_on_error=0:log_to_syslog=0:detect_leaks=0:halt_on_error=1:suppressions='"/Users/buildslave/jenkins/workspace/clang-stage2-Rthinlto/clang-build/Build/tools/clang/runtime/compiler-rt-bins/test/ubsan/AddressSanitizer-x86_64/TestCases/TypeCheck/Output/vptr.cpp.tmp.supp"'  /Users/buildslave/jenkins/workspace/clang-stage2-Rthinlto/clang-build/Build/tools/clang/runtime/compiler-rt-bins/test/ubsan/AddressSanitizer-x86_64/TestCases/TypeCheck/Output/vptr.cpp.tmp fV
: 'RUN: at line 32';   env UBSAN_OPTIONS=abort_on_error=0:log_to_syslog=0:detect_leaks=0:halt_on_error=1:suppressions='"/Users/buildslave/jenkins/workspace/clang-stage2-Rthinlto/clang-build/Build/tools/clang/runtime/compiler-rt-bins/test/ubsan/AddressSanitizer-x86_64/TestCases/TypeCheck/Output/vptr.cpp.tmp.supp"'  /Users/buildslave/jenkins/workspace/clang-stage2-Rthinlto/clang-build/Build/tools/clang/runtime/compiler-rt-bins/test/ubsan/AddressSanitizer-x86_64/TestCases/TypeCheck/Output/vptr.cpp.tmp cV
: 'RUN: at line 33';   env UBSAN_OPTIONS=abort_on_error=0:log_to_syslog=0:detect_leaks=0:halt_on_error=1:suppressions='"/Users/buildslave/jenkins/workspace/clang-stage2-Rthinlto/clang-build/Build/tools/clang/runtime/compiler-rt-bins/test/ubsan/AddressSanitizer-x86_64/TestCases/TypeCheck/Output/vptr.cpp.tmp.supp"'  /Users/buildslave/jenkins/workspace/clang-stage2-Rthinlto/clang-build/Build/tools/clang/runtime/compiler-rt-bins/test/ubsan/AddressSanitizer-x86_64/TestCases/TypeCheck/Output/vptr.cpp.tmp oU
: 'RUN: at line 34';   env UBSAN_OPTIONS=abort_on_error=0:log_to_syslog=0:detect_leaks=0:halt_on_error=1:suppressions='"/Users/buildslave/jenkins/workspace/clang-stage2-Rthinlto/clang-build/Build/tools/clang/runtime/compiler-rt-bins/test/ubsan/AddressSanitizer-x86_64/TestCases/TypeCheck/Output/vptr.cpp.tmp.supp"'  /Users/buildslave/jenkins/workspace/clang-stage2-Rthinlto/clang-build/Build/tools/clang/runtime/compiler-rt-bins/test/ubsan/AddressSanitizer-x86_64/TestCases/TypeCheck/Output/vptr.cpp.tmp dT
: 'RUN: at line 36';   echo "vptr_check:S" > /Users/buildslave/jenkins/workspace/clang-stage2-Rthinlto/clang-build/Build/tools/clang/runtime/compiler-rt-bins/test/ubsan/AddressSanitizer-x86_64/TestCases/TypeCheck/Output/vptr.cpp.tmp.loc-supp
: 'RUN: at line 37';   env UBSAN_OPTIONS=abort_on_error=0:log_to_syslog=0:detect_leaks=0:halt_on_error=1:suppressions='"/Users/buildslave/jenkins/workspace/clang-stage2-Rthinlto/clang-build/Build/tools/clang/runtime/compiler-rt-bins/test/ubsan/AddressSanitizer-x86_64/TestCases/TypeCheck/Output/vptr.cpp.tmp.loc-supp"' not  /Users/buildslave/jenkins/workspace/clang-stage2-Rthinlto/clang-build/Build/tools/clang/runtime/compiler-rt-bins/test/ubsan/AddressSanitizer-x86_64/TestCases/TypeCheck/Output/vptr.cpp.tmp x- 2>&1 | FileCheck /Users/buildslave/jenkins/workspace/clang-stage2-Rthinlto/llvm-project/compiler-rt/test/ubsan/TestCases/TypeCheck/vptr.cpp --check-prefix=CHECK-LOC-SUPPRESS
--
Exit Code: 2

Hide Details

Command Output (stderr): -- + : 'RUN: at line 1' + /Users/buildslave/jenkins/workspace/clang-stage2-Rthinlto/clang-build/Build/./bin/clang --driver-mode=g++ -fsanitize=address -arch x86_64 -stdlib=libc++ -mmacosx-version-min=10.10 -isysroot /Applications/Xcode.app/Contents/Developer/Platforms/MacOSX.platform/Developer/SDKs/MacOSX10.15.sdk -frtti -fsanitize=null,vptr -g /Users/buildslave/jenkins/workspace/clang-stage2-Rthinlto/llvm-project/compiler-rt/test/ubsan/TestCases/TypeCheck/vptr.cpp -O3 -o /Users/buildslave/jenkins/workspace/clang-stage2-Rthinlto/clang-build/Build/tools/clang/runtime/compiler-rt-bins/test/ubsan/AddressSanitizer-x86_64/TestCases/TypeCheck/Output/vptr.cpp.tmp -mllvm -enable-tail-merge=false /Users/buildslave/jenkins/workspace/clang-stage2-Rthinlto/llvm-project/compiler-rt/test/ubsan/TestCases/TypeCheck/vptr.cpp:67:12: warning: direct base 'S' is inaccessible due to ambiguity: struct U -> struct S struct U -> struct T -> struct S [-Winaccessible-base] struct U : S, T { virtual int v() { return 2; } }; ^ /Users/buildslave/jenkins/workspace/clang-stage2-Rthinlto/llvm-project/compiler-rt/test/ubsan/TestCases/TypeCheck/vptr.cpp:131:9: warning: 'reinterpret_cast' from class 'U *' to its base at non-zero offset 'T *' behaves differently from 'static_cast' [-Wreinterpret-base-class] p = reinterpret_cast<T*>(new U); ^~~~~~~~~~~~~~~~~~~~~~~~~~~ /Users/buildslave/jenkins/workspace/clang-stage2-Rthinlto/llvm-project/compiler-rt/test/ubsan/TestCases/TypeCheck/vptr.cpp:131:9: note: use 'static_cast' to adjust the pointer correctly while upcasting p = reinterpret_cast<T*>(new U); ^~~~~~~~~~~~~~~~ static_cast /Users/buildslave/jenkins/workspace/clang-stage2-Rthinlto/llvm-project/compiler-rt/test/ubsan/TestCases/TypeCheck/vptr.cpp:194:12: warning: 'reinterpret_cast' to class 'U *' from its base at non-zero offset 'T *' behaves differently from 'static_cast' [-Wreinterpret-base-class] return reinterpret_cast<U*>(p)->v() - 2; ^~~~~~~~~~~~~~~~~~~~~~~ /Users/buildslave/jenkins/workspace/clang-stage2-Rthinlto/llvm-project/compiler-rt/test/ubsan/TestCases/TypeCheck/vptr.cpp:194:12: note: use 'static_cast' to adjust the pointer correctly while downcasting return reinterpret_cast<U*>(p)->v() - 2; ^~~~~~~~~~~~~~~~ static_cast 3 warnings generated. + : 'RUN: at line 2' + env UBSAN_OPTIONS=abort_on_error=0:log_to_syslog=0:detect_leaks=0:halt_on_error=1 /Users/buildslave/jenkins/workspace/clang-stage2-Rthinlto/clang-build/Build/tools/clang/runtime/compiler-rt-bins/test/ubsan/AddressSanitizer-x86_64/TestCases/TypeCheck/Output/vptr.cpp.tmp rT Test case: rT + : 'RUN: at line 3' + env UBSAN_OPTIONS=abort_on_error=0:log_to_syslog=0:detect_leaks=0:halt_on_error=1 /Users/buildslave/jenkins/workspace/clang-stage2-Rthinlto/clang-build/Build/tools/clang/runtime/compiler-rt-bins/test/ubsan/AddressSanitizer-x86_64/TestCases/TypeCheck/Output/vptr.cpp.tmp mT Test case: mT + : 'RUN: at line 4' + env UBSAN_OPTIONS=abort_on_error=0:log_to_syslog=0:detect_leaks=0:halt_on_error=1 /Users/buildslave/jenkins/workspace/clang-stage2-Rthinlto/clang-build/Build/tools/clang/runtime/compiler-rt-bins/test/ubsan/AddressSanitizer-x86_64/TestCases/TypeCheck/Output/vptr.cpp.tmp fT Test case: fT + : 'RUN: at line 5' + env UBSAN_OPTIONS=abort_on_error=0:log_to_syslog=0:detect_leaks=0:halt_on_error=1 /Users/buildslave/jenkins/workspace/clang-stage2-Rthinlto/clang-build/Build/tools/clang/runtime/compiler-rt-bins/test/ubsan/AddressSanitizer-x86_64/TestCases/TypeCheck/Output/vptr.cpp.tmp cT Test case: cT + : 'RUN: at line 6' + env UBSAN_OPTIONS=abort_on_error=0:log_to_syslog=0:detect_leaks=0:halt_on_error=1 /Users/buildslave/jenkins/workspace/clang-stage2-Rthinlto/clang-build/Build/tools/clang/runtime/compiler-rt-bins/test/ubsan/AddressSanitizer-x86_64/TestCases/TypeCheck/Output/vptr.cpp.tmp rU Test case: rU + : 'RUN: at line 7' + env UBSAN_OPTIONS=abort_on_error=0:log_to_syslog=0:detect_leaks=0:halt_on_error=1 /Users/buildslave/jenkins/workspace/clang-stage2-Rthinlto/clang-build/Build/tools/clang/runtime/compiler-rt-bins/test/ubsan/AddressSanitizer-x86_64/TestCases/TypeCheck/Output/vptr.cpp.tmp mU Test case: mU + : 'RUN: at line 8' + env UBSAN_OPTIONS=abort_on_error=0:log_to_syslog=0:detect_leaks=0:halt_on_error=1 /Users/buildslave/jenkins/workspace/clang-stage2-Rthinlto/clang-build/Build/tools/clang/runtime/compiler-rt-bins/test/ubsan/AddressSanitizer-x86_64/TestCases/TypeCheck/Output/vptr.cpp.tmp fU Test case: fU + : 'RUN: at line 9' + env UBSAN_OPTIONS=abort_on_error=0:log_to_syslog=0:detect_leaks=0:halt_on_error=1 /Users/buildslave/jenkins/workspace/clang-stage2-Rthinlto/clang-build/Build/tools/clang/runtime/compiler-rt-bins/test/ubsan/AddressSanitizer-x86_64/TestCases/TypeCheck/Output/vptr.cpp.tmp cU Test case: cU + : 'RUN: at line 10' + env UBSAN_OPTIONS=abort_on_error=0:log_to_syslog=0:detect_leaks=0:halt_on_error=1 /Users/buildslave/jenkins/workspace/clang-stage2-Rthinlto/clang-build/Build/tools/clang/runtime/compiler-rt-bins/test/ubsan/AddressSanitizer-x86_64/TestCases/TypeCheck/Output/vptr.cpp.tmp rS Test case: rS + : 'RUN: at line 11' + env UBSAN_OPTIONS=abort_on_error=0:log_to_syslog=0:detect_leaks=0:halt_on_error=1 /Users/buildslave/jenkins/workspace/clang-stage2-Rthinlto/clang-build/Build/tools/clang/runtime/compiler-rt-bins/test/ubsan/AddressSanitizer-x86_64/TestCases/TypeCheck/Output/vptr.cpp.tmp rV Test case: rV + : 'RUN: at line 12' + env UBSAN_OPTIONS=abort_on_error=0:log_to_syslog=0:detect_leaks=0:halt_on_error=1 /Users/buildslave/jenkins/workspace/clang-stage2-Rthinlto/clang-build/Build/tools/clang/runtime/compiler-rt-bins/test/ubsan/AddressSanitizer-x86_64/TestCases/TypeCheck/Output/vptr.cpp.tmp oV Test case: oV + : 'RUN: at line 13' + env UBSAN_OPTIONS=abort_on_error=0:log_to_syslog=0:detect_leaks=0:halt_on_error=1 /Users/buildslave/jenkins/workspace/clang-stage2-Rthinlto/clang-build/Build/tools/clang/runtime/compiler-rt-bins/test/ubsan/AddressSanitizer-x86_64/TestCases/TypeCheck/Output/vptr.cpp.tmp zN Test case: zN + : 'RUN: at line 14' + env UBSAN_OPTIONS=abort_on_error=0:log_to_syslog=0:detect_leaks=0:halt_on_error=1:print_stacktrace=1 not /Users/buildslave/jenkins/workspace/clang-stage2-Rthinlto/clang-build/Build/tools/clang/runtime/compiler-rt-bins/test/ubsan/AddressSanitizer-x86_64/TestCases/TypeCheck/Output/vptr.cpp.tmp mS + FileCheck /Users/buildslave/jenkins/workspace/clang-stage2-Rthinlto/llvm-project/compiler-rt/test/ubsan/TestCases/TypeCheck/vptr.cpp --check-prefix=CHECK-MEMBER --check-prefix=CHECK-Darwin-MEMBER --strict-whitespace error: no check strings found with prefix 'CHECK-Darwin-MEMBER:'

Hide Details

--

Hide Details

******************** PASS: UBSan-Standalone-x86_64 :: TestCases/Integer/mul-overflow.cpp (2622 of 3112) PASS: UBSan-Standalone-x86_64 :: TestCases/Integer/add-overflow.cpp (2623 of 3112) PASS: UBSan-AddressSanitizer-x86_64 :: TestCases/Pointer/nullptr-and-nonzero-offset-variable.cpp (2624 of 3112) PASS: UBSan-Standalone-x86_64 :: TestCases/Integer/div-zero.cpp (2625 of 3112) UNSUPPORTED: UBSan-Standalone-x86_64 :: TestCases/Integer/summary.cpp (2626 of 3112) PASS: UBSan-Standalone-x86_64 :: TestCases/Integer/incdec-overflow.cpp (2627 of 3112) PASS: UBSan-Standalone-x86_64 :: TestCases/Integer/negate-overflow.cpp (2628 of 3112) PASS: UBSan-Standalone-x86_64 :: TestCases/Integer/no-recover.cpp (2629 of 3112) PASS: UBSan-Standalone-x86_64 :: TestCases/ImplicitConversion/signed-integer-truncation-incdec.c (2630 of 3112) PASS: UBSan-Standalone-x86_64 :: TestCases/Integer/umul-overflow.cpp (2631 of 3112) PASS: UBSan-Standalone-x86_64 :: TestCases/Integer/sub-overflow.cpp (2632 of 3112) UNSUPPORTED: UBSan-Standalone-x86_64 :: TestCases/Misc/Linux/print_stack_trace.cpp (2633 of 3112) UNSUPPORTED: UBSan-Standalone-x86_64 :: TestCases/Misc/Linux/ubsan_options.cpp (2634 of 3112) PASS: UBSan-Standalone-x86_64 :: TestCases/Integer/suppressions.cpp (2635 of 3112) PASS: UBSan-Standalone-x86_64 :: TestCases/ImplicitConversion/integer-arithmetic-value-change.c (2636 of 3112) PASS: UBSan-Standalone-x86_64 :: TestCases/Misc/bool.cpp (2637 of 3112) PASS: UBSan-Standalone-x86_64 :: TestCases/Misc/bool.m (2638 of 3112) PASS: UBSan-Standalone-x86_64 :: TestCases/Misc/bounds.cpp (2639 of 3112) PASS: UBSan-Standalone-x86_64 :: TestCases/Integer/unsigned-shift.cpp (2640 of 3112) PASS: UBSan-Standalone-x86_64 :: TestCases/ImplicitConversion/integer-sign-change.c (2641 of 3112) PASS: UBSan-Standalone-x86_64 :: TestCases/Integer/uadd-overflow.cpp (2642 of 3112) PASS: UBSan-Standalone-x86_64 :: TestCases/ImplicitConversion/integer-conversion.c (2643 of 3112) PASS: UBSan-Standalone-x86_64 :: TestCases/Misc/deduplication.cpp (2644 of 3112) UNSUPPORTED: UBSan-Standalone-x86_64 :: TestCases/Misc/no-interception.cpp (2645 of 3112) PASS: UBSan-Standalone-x86_64 :: TestCases/Misc/log-path_test.cpp (2646 of 3112) PASS: UBSan-Standalone-x86_64 :: TestCases/Integer/uincdec-overflow.cpp (2647 of 3112) PASS: UBSan-Standalone-x86_64 :: TestCases/Misc/missing_return.cpp (2648 of 3112) PASS: UBSan-Standalone-x86_64 :: TestCases/Integer/usub-overflow.cpp (2649 of 3112) PASS: UBSan-Standalone-x86_64 :: TestCases/Misc/monitor.cpp (2650 of 3112) PASS: UBSan-Standalone-x86_64 :: TestCases/Misc/builtins.cpp (2651 of 3112) PASS: UBSan-Standalone-x86_64 :: TestCases/Misc/nonnull-arg.cpp (2652 of 3112) PASS: UBSan-Standalone-x86_64 :: TestCases/Misc/nullability.c (2653 of 3112) PASS: UBSan-Standalone-x86_64 :: TestCases/ImplicitConversion/integer-truncation.c (2654 of 3112) PASS: UBSan-Standalone-x86_64 :: TestCases/Misc/print_summary.c (2655 of 3112) PASS: UBSan-Standalone-x86_64 :: TestCases/Misc/unreachable.cpp (2656 of 3112) PASS: UBSan-Standalone-x86_64 :: TestCases/Misc/vla.c (2657 of 3112) PASS: UBSan-Standalone-x86_64 :: TestCases/Misc/enum.cpp (2658 of 3112) PASS: UBSan-Standalone-x86_64 :: TestCases/Misc/nonnull.cpp (2659 of 3112) PASS: UBSan-Standalone-x86_64 :: TestCases/Misc/objc-cast.m (2660 of 3112) PASS: UBSan-Standalone-x86_64 :: TestCases/Pointer/alignment-assumption-blacklist.cpp (2661 of 3112) PASS: UBSan-Standalone-x86_64 :: TestCases/Misc/coverage-levels.cpp (2662 of 3112) PASS: UBSan-Standalone-x86_64 :: TestCases/ImplicitConversion/signed-integer-truncation.c (2663 of 3112) UNSUPPORTED: UBSan-Standalone-x86_64 :: TestCases/Pointer/alignment-assumption-summary.cpp (2664 of 3112) PASS: UBSan-Standalone-x86_64 :: TestCases/ImplicitConversion/unsigned-integer-truncation.c (2665 of 3112) PASS: UBSan-Standalone-x86_64 :: TestCases/Pointer/index-overflow.cpp (2666 of 3112) UNSUPPORTED: UBSan-Standalone-x86_64 :: TestCases/Pointer/nullptr-and-nonzero-offset-summary.cpp (2667 of 3112) PASS: UBSan-Standalone-x86_64 :: TestCases/Pointer/alignment-assumption-attribute-align_value-on-lvalue.cpp (2668 of 3112) PASS: UBSan-Standalone-x86_64 :: TestCases/Pointer/alignment-assumption-attribute-align_value-on-paramvar.cpp (2669 of 3112) PASS: UBSan-Standalone-x86_64 :: TestCases/Pointer/alignment-assumption-attribute-alloc_align-on-function-variable.cpp (2670 of 3112) UNSUPPORTED: UBSan-Standalone-x86_64 :: TestCases/TypeCheck/Linux/PR33221.cpp (2671 of 3112) PASS: UBSan-Standalone-x86_64 :: TestCases/Pointer/alignment-assumption-attribute-alloc_align-on-function.cpp (2672 of 3112) PASS: UBSan-Standalone-x86_64 :: TestCases/Pointer/alignment-assumption-attribute-assume_aligned-on-function-two-params.cpp (2673 of 3112) PASS: UBSan-Standalone-x86_64 :: TestCases/Pointer/alignment-assumption-attribute-assume_aligned-on-function.cpp (2674 of 3112) PASS: UBSan-Standalone-x86_64 :: TestCases/Pointer/unsigned-index-expression.cpp (2675 of 3112) PASS: UBSan-Standalone-x86_64 :: TestCases/Pointer/alignment-assumption-builtin_assume_aligned-three-params-variable.cpp (2676 of 3112) UNSUPPORTED: UBSan-Standalone-x86_64 :: TestCases/TypeCheck/vptr-ptrauth-unauthenticated.cpp (2677 of 3112) PASS: UBSan-Standalone-x86_64 :: TestCases/Integer/shift.cpp (2678 of 3112) PASS: UBSan-Standalone-x86_64 :: TestCases/ImplicitConversion/signed-integer-truncation-or-sign-change-blacklist.c (2679 of 3112) PASS: UBSan-Standalone-x86_64 :: TestCases/TypeCheck/PR33221.cpp (2680 of 3112) PASS: UBSan-Standalone-x86_64 :: TestCases/TypeCheck/null.cpp (2681 of 3112) PASS: UBSan-Standalone-x86_64 :: TestCases/TypeCheck/vptr-corrupted-vtable-itanium.cpp (2682 of 3112) PASS: UBSan-Standalone-x86_64 :: TestCases/TypeCheck/vptr-virtual-base-construction.cpp (2683 of 3112) PASS: UBSan-Standalone-x86_64 :: TestCases/TypeCheck/vptr-virtual-base.cpp (2684 of 3112) PASS: UBSan-Standalone-x86_64 :: TestCases/ImplicitConversion/signed-integer-truncation-blacklist.c (2685 of 3112) PASS: UBSan-StandaloneStatic-x86_64 :: TestCases/Float/cast-overflow.cpp (2686 of 3112) UNSUPPORTED: UBSan-StandaloneStatic-x86_64 :: TestCases/ImplicitConversion/integer-sign-change-summary.cpp (2687 of 3112) PASS: UBSan-Standalone-x86_64 :: TestCases/Pointer/alignment-assumption-builtin_assume_aligned-three-params.cpp (2688 of 3112) FAIL: UBSan-Standalone-x86_64 :: TestCases/TypeCheck/vptr.cpp (2689 of 3112) ******************** TEST 'UBSan-Standalone-x86_64 :: TestCases/TypeCheck/vptr.cpp' FAILED ******************** Script: -- : 'RUN: at line 1'; /Users/buildslave/jenkins/workspace/clang-stage2-Rthinlto/clang-build/Build/./bin/clang --driver-mode=g++ -arch x86_64 -stdlib=libc++ -mmacosx-version-min=10.10 -isysroot /Applications/Xcode.app/Contents/Developer/Platforms/MacOSX.platform/Developer/SDKs/MacOSX10.15.sdk -frtti -fsanitize=null,vptr -g /Users/buildslave/jenkins/workspace/clang-stage2-Rthinlto/llvm-project/compiler-rt/test/ubsan/TestCases/TypeCheck/vptr.cpp -O3 -o /Users/buildslave/jenkins/workspace/clang-stage2-Rthinlto/clang-build/Build/tools/clang/runtime/compiler-rt-bins/test/ubsan/Standalone-x86_64/TestCases/TypeCheck/Output/vptr.cpp.tmp -mllvm -enable-tail-merge=false : 'RUN: at line 2'; env UBSAN_OPTIONS=abort_on_error=0:log_to_syslog=0:halt_on_error=1 /Users/buildslave/jenkins/workspace/clang-stage2-Rthinlto/clang-build/Build/tools/clang/runtime/compiler-rt-bins/test/ubsan/Standalone-x86_64/TestCases/TypeCheck/Output/vptr.cpp.tmp rT : 'RUN: at line 3'; env UBSAN_OPTIONS=abort_on_error=0:log_to_syslog=0:halt_on_error=1 /Users/buildslave/jenkins/workspace/clang-stage2-Rthinlto/clang-build/Build/tools/clang/runtime/compiler-rt-bins/test/ubsan/Standalone-x86_64/TestCases/TypeCheck/Output/vptr.cpp.tmp mT : 'RUN: at line 4'; env UBSAN_OPTIONS=abort_on_error=0:log_to_syslog=0:halt_on_error=1 /Users/buildslave/jenkins/workspace/clang-stage2-Rthinlto/clang-build/Build/tools/clang/runtime/compiler-rt-bins/test/ubsan/Standalone-x86_64/TestCases/TypeCheck/Output/vptr.cpp.tmp fT : 'RUN: at line 5'; env UBSAN_OPTIONS=abort_on_error=0:log_to_syslog=0:halt_on_error=1 /Users/buildslave/jenkins/workspace/clang-stage2-Rthinlto/clang-build/Build/tools/clang/runtime/compiler-rt-bins/test/ubsan/Standalone-x86_64/TestCases/TypeCheck/Output/vptr.cpp.tmp cT : 'RUN: at line 6'; env UBSAN_OPTIONS=abort_on_error=0:log_to_syslog=0:halt_on_error=1 /Users/buildslave/jenkins/workspace/clang-stage2-Rthinlto/clang-build/Build/tools/clang/runtime/compiler-rt-bins/test/ubsan/Standalone-x86_64/TestCases/TypeCheck/Output/vptr.cpp.tmp rU : 'RUN: at line 7'; env UBSAN_OPTIONS=abort_on_error=0:log_to_syslog=0:halt_on_error=1 /Users/buildslave/jenkins/workspace/clang-stage2-Rthinlto/clang-build/Build/tools/clang/runtime/compiler-rt-bins/test/ubsan/Standalone-x86_64/TestCases/TypeCheck/Output/vptr.cpp.tmp mU : 'RUN: at line 8'; env UBSAN_OPTIONS=abort_on_error=0:log_to_syslog=0:halt_on_error=1 /Users/buildslave/jenkins/workspace/clang-stage2-Rthinlto/clang-build/Build/tools/clang/runtime/compiler-rt-bins/test/ubsan/Standalone-x86_64/TestCases/TypeCheck/Output/vptr.cpp.tmp fU : 'RUN: at line 9'; env UBSAN_OPTIONS=abort_on_error=0:log_to_syslog=0:halt_on_error=1 /Users/buildslave/jenkins/workspace/clang-stage2-Rthinlto/clang-build/Build/tools/clang/runtime/compiler-rt-bins/test/ubsan/Standalone-x86_64/TestCases/TypeCheck/Output/vptr.cpp.tmp cU : 'RUN: at line 10'; env UBSAN_OPTIONS=abort_on_error=0:log_to_syslog=0:halt_on_error=1 /Users/buildslave/jenkins/workspace/clang-stage2-Rthinlto/clang-build/Build/tools/clang/runtime/compiler-rt-bins/test/ubsan/Standalone-x86_64/TestCases/TypeCheck/Output/vptr.cpp.tmp rS : 'RUN: at line 11'; env UBSAN_OPTIONS=abort_on_error=0:log_to_syslog=0:halt_on_error=1 /Users/buildslave/jenkins/workspace/clang-stage2-Rthinlto/clang-build/Build/tools/clang/runtime/compiler-rt-bins/test/ubsan/Standalone-x86_64/TestCases/TypeCheck/Output/vptr.cpp.tmp rV : 'RUN: at line 12'; env UBSAN_OPTIONS=abort_on_error=0:log_to_syslog=0:halt_on_error=1 /Users/buildslave/jenkins/workspace/clang-stage2-Rthinlto/clang-build/Build/tools/clang/runtime/compiler-rt-bins/test/ubsan/Standalone-x86_64/TestCases/TypeCheck/Output/vptr.cpp.tmp oV : 'RUN: at line 13'; env UBSAN_OPTIONS=abort_on_error=0:log_to_syslog=0:halt_on_error=1 /Users/buildslave/jenkins/workspace/clang-stage2-Rthinlto/clang-build/Build/tools/clang/runtime/compiler-rt-bins/test/ubsan/Standalone-x86_64/TestCases/TypeCheck/Output/vptr.cpp.tmp zN : 'RUN: at line 14'; env UBSAN_OPTIONS=abort_on_error=0:log_to_syslog=0:halt_on_error=1:print_stacktrace=1 not /Users/buildslave/jenkins/workspace/clang-stage2-Rthinlto/clang-build/Build/tools/clang/runtime/compiler-rt-bins/test/ubsan/Standalone-x86_64/TestCases/TypeCheck/Output/vptr.cpp.tmp mS 2>&1 | FileCheck /Users/buildslave/jenkins/workspace/clang-stage2-Rthinlto/llvm-project/compiler-rt/test/ubsan/TestCases/TypeCheck/vptr.cpp --check-prefix=CHECK-MEMBER --check-prefix=CHECK-Darwin-MEMBER --strict-whitespace : 'RUN: at line 15'; env UBSAN_OPTIONS=abort_on_error=0:log_to_syslog=0:halt_on_error=1:print_stacktrace=1 not /Users/buildslave/jenkins/workspace/clang-stage2-Rthinlto/clang-build/Build/tools/clang/runtime/compiler-rt-bins/test/ubsan/Standalone-x86_64/TestCases/TypeCheck/Output/vptr.cpp.tmp fS 2>&1 | FileCheck /Users/buildslave/jenkins/workspace/clang-stage2-Rthinlto/llvm-project/compiler-rt/test/ubsan/TestCases/TypeCheck/vptr.cpp --check-prefix=CHECK-MEMFUN --strict-whitespace : 'RUN: at line 16'; env UBSAN_OPTIONS=abort_on_error=0:log_to_syslog=0:halt_on_error=1:print_stacktrace=1 not /Users/buildslave/jenkins/workspace/clang-stage2-Rthinlto/clang-build/Build/tools/clang/runtime/compiler-rt-bins/test/ubsan/Standalone-x86_64/TestCases/TypeCheck/Output/vptr.cpp.tmp cS 2>&1 | FileCheck /Users/buildslave/jenkins/workspace/clang-stage2-Rthinlto/llvm-project/compiler-rt/test/ubsan/TestCases/TypeCheck/vptr.cpp --check-prefix=CHECK-DOWNCAST --check-prefix=CHECK-Darwin-DOWNCAST --strict-whitespace : 'RUN: at line 17'; env UBSAN_OPTIONS=abort_on_error=0:log_to_syslog=0:halt_on_error=1:print_stacktrace=1 not /Users/buildslave/jenkins/workspace/clang-stage2-Rthinlto/clang-build/Build/tools/clang/runtime/compiler-rt-bins/test/ubsan/Standalone-x86_64/TestCases/TypeCheck/Output/vptr.cpp.tmp mV 2>&1 | FileCheck /Users/buildslave/jenkins/workspace/clang-stage2-Rthinlto/llvm-project/compiler-rt/test/ubsan/TestCases/TypeCheck/vptr.cpp --check-prefix=CHECK-MEMBER --check-prefix=CHECK-Darwin-MEMBER --strict-whitespace : 'RUN: at line 18'; env UBSAN_OPTIONS=abort_on_error=0:log_to_syslog=0:halt_on_error=1:print_stacktrace=1 not /Users/buildslave/jenkins/workspace/clang-stage2-Rthinlto/clang-build/Build/tools/clang/runtime/compiler-rt-bins/test/ubsan/Standalone-x86_64/TestCases/TypeCheck/Output/vptr.cpp.tmp fV 2>&1 | FileCheck /Users/buildslave/jenkins/workspace/clang-stage2-Rthinlto/llvm-project/compiler-rt/test/ubsan/TestCases/TypeCheck/vptr.cpp --check-prefix=CHECK-MEMFUN --strict-whitespace : 'RUN: at line 19'; env UBSAN_OPTIONS=abort_on_error=0:log_to_syslog=0:halt_on_error=1:print_stacktrace=1 not /Users/buildslave/jenkins/workspace/clang-stage2-Rthinlto/clang-build/Build/tools/clang/runtime/compiler-rt-bins/test/ubsan/Standalone-x86_64/TestCases/TypeCheck/Output/vptr.cpp.tmp cV 2>&1 | FileCheck /Users/buildslave/jenkins/workspace/clang-stage2-Rthinlto/llvm-project/compiler-rt/test/ubsan/TestCases/TypeCheck/vptr.cpp --check-prefix=CHECK-DOWNCAST --check-prefix=CHECK-Darwin-DOWNCAST --strict-whitespace : 'RUN: at line 20'; env UBSAN_OPTIONS=abort_on_error=0:log_to_syslog=0:halt_on_error=1:print_stacktrace=1 not /Users/buildslave/jenkins/workspace/clang-stage2-Rthinlto/clang-build/Build/tools/clang/runtime/compiler-rt-bins/test/ubsan/Standalone-x86_64/TestCases/TypeCheck/Output/vptr.cpp.tmp oU 2>&1 | FileCheck /Users/buildslave/jenkins/workspace/clang-stage2-Rthinlto/llvm-project/compiler-rt/test/ubsan/TestCases/TypeCheck/vptr.cpp --check-prefix=CHECK-OFFSET --check-prefix=CHECK-Darwin-OFFSET --strict-whitespace : 'RUN: at line 21'; env UBSAN_OPTIONS=abort_on_error=0:log_to_syslog=0:halt_on_error=1:print_stacktrace=1 not /Users/buildslave/jenkins/workspace/clang-stage2-Rthinlto/clang-build/Build/tools/clang/runtime/compiler-rt-bins/test/ubsan/Standalone-x86_64/TestCases/TypeCheck/Output/vptr.cpp.tmp m0 2>&1 | FileCheck /Users/buildslave/jenkins/workspace/clang-stage2-Rthinlto/llvm-project/compiler-rt/test/ubsan/TestCases/TypeCheck/vptr.cpp --check-prefix=CHECK-INVALID-MEMBER --check-prefix=CHECK-Darwin-NULL-MEMBER --strict-whitespace : 'RUN: at line 22'; env UBSAN_OPTIONS=abort_on_error=0:log_to_syslog=0:halt_on_error=1:print_stacktrace=1 not /Users/buildslave/jenkins/workspace/clang-stage2-Rthinlto/clang-build/Build/tools/clang/runtime/compiler-rt-bins/test/ubsan/Standalone-x86_64/TestCases/TypeCheck/Output/vptr.cpp.tmp m0 2>&1 | FileCheck /Users/buildslave/jenkins/workspace/clang-stage2-Rthinlto/llvm-project/compiler-rt/test/ubsan/TestCases/TypeCheck/vptr.cpp --check-prefix=CHECK-INVALID-MEMBER --check-prefix=CHECK-Darwin-NULL-MEMBER --strict-whitespace : 'RUN: at line 23'; env UBSAN_OPTIONS=abort_on_error=0:log_to_syslog=0:halt_on_error=1 not /Users/buildslave/jenkins/workspace/clang-stage2-Rthinlto/clang-build/Build/tools/clang/runtime/compiler-rt-bins/test/ubsan/Standalone-x86_64/TestCases/TypeCheck/Output/vptr.cpp.tmp nN 2>&1 | FileCheck /Users/buildslave/jenkins/workspace/clang-stage2-Rthinlto/llvm-project/compiler-rt/test/ubsan/TestCases/TypeCheck/vptr.cpp --check-prefix=CHECK-NULL-MEMFUN --strict-whitespace : 'RUN: at line 24'; env UBSAN_OPTIONS=abort_on_error=0:log_to_syslog=0:print_stacktrace=1 /Users/buildslave/jenkins/workspace/clang-stage2-Rthinlto/clang-build/Build/tools/clang/runtime/compiler-rt-bins/test/ubsan/Standalone-x86_64/TestCases/TypeCheck/Output/vptr.cpp.tmp dT 2>&1 | FileCheck /Users/buildslave/jenkins/workspace/clang-stage2-Rthinlto/llvm-project/compiler-rt/test/ubsan/TestCases/TypeCheck/vptr.cpp --check-prefix=CHECK-DYNAMIC --check-prefix=CHECK-Darwin-DYNAMIC --strict-whitespace : 'RUN: at line 26'; (echo "vptr_check:S"; echo "vptr_check:T"; echo "vptr_check:U") > /Users/buildslave/jenkins/workspace/clang-stage2-Rthinlto/clang-build/Build/tools/clang/runtime/compiler-rt-bins/test/ubsan/Standalone-x86_64/TestCases/TypeCheck/Output/vptr.cpp.tmp.supp : 'RUN: at line 27'; env UBSAN_OPTIONS=abort_on_error=0:log_to_syslog=0:halt_on_error=1:suppressions='"/Users/buildslave/jenkins/workspace/clang-stage2-Rthinlto/clang-build/Build/tools/clang/runtime/compiler-rt-bins/test/ubsan/Standalone-x86_64/TestCases/TypeCheck/Output/vptr.cpp.tmp.supp"' /Users/buildslave/jenkins/workspace/clang-stage2-Rthinlto/clang-build/Build/tools/clang/runtime/compiler-rt-bins/test/ubsan/Standalone-x86_64/TestCases/TypeCheck/Output/vptr.cpp.tmp mS : 'RUN: at line 28'; env UBSAN_OPTIONS=abort_on_error=0:log_to_syslog=0:halt_on_error=1:suppressions='"/Users/buildslave/jenkins/workspace/clang-stage2-Rthinlto/clang-build/Build/tools/clang/runtime/compiler-rt-bins/test/ubsan/Standalone-x86_64/TestCases/TypeCheck/Output/vptr.cpp.tmp.supp"' /Users/buildslave/jenkins/workspace/clang-stage2-Rthinlto/clang-build/Build/tools/clang/runtime/compiler-rt-bins/test/ubsan/Standalone-x86_64/TestCases/TypeCheck/Output/vptr.cpp.tmp fS : 'RUN: at line 29'; env UBSAN_OPTIONS=abort_on_error=0:log_to_syslog=0:halt_on_error=1:suppressions='"/Users/buildslave/jenkins/workspace/clang-stage2-Rthinlto/clang-build/Build/tools/clang/runtime/compiler-rt-bins/test/ubsan/Standalone-x86_64/TestCases/TypeCheck/Output/vptr.cpp.tmp.supp"' /Users/buildslave/jenkins/workspace/clang-stage2-Rthinlto/clang-build/Build/tools/clang/runtime/compiler-rt-bins/test/ubsan/Standalone-x86_64/TestCases/TypeCheck/Output/vptr.cpp.tmp cS : 'RUN: at line 30'; env UBSAN_OPTIONS=abort_on_error=0:log_to_syslog=0:halt_on_error=1:suppressions='"/Users/buildslave/jenkins/workspace/clang-stage2-Rthinlto/clang-build/Build/tools/clang/runtime/compiler-rt-bins/test/ubsan/Standalone-x86_64/TestCases/TypeCheck/Output/vptr.cpp.tmp.supp"' /Users/buildslave/jenkins/workspace/clang-stage2-Rthinlto/clang-build/Build/tools/clang/runtime/compiler-rt-bins/test/ubsan/Standalone-x86_64/TestCases/TypeCheck/Output/vptr.cpp.tmp mV : 'RUN: at line 31'; env UBSAN_OPTIONS=abort_on_error=0:log_to_syslog=0:halt_on_error=1:suppressions='"/Users/buildslave/jenkins/workspace/clang-stage2-Rthinlto/clang-build/Build/tools/clang/runtime/compiler-rt-bins/test/ubsan/Standalone-x86_64/TestCases/TypeCheck/Output/vptr.cpp.tmp.supp"' /Users/buildslave/jenkins/workspace/clang-stage2-Rthinlto/clang-build/Build/tools/clang/runtime/compiler-rt-bins/test/ubsan/Standalone-x86_64/TestCases/TypeCheck/Output/vptr.cpp.tmp fV : 'RUN: at line 32'; env UBSAN_OPTIONS=abort_on_error=0:log_to_syslog=0:halt_on_error=1:suppressions='"/Users/buildslave/jenkins/workspace/clang-stage2-Rthinlto/clang-build/Build/tools/clang/runtime/compiler-rt-bins/test/ubsan/Standalone-x86_64/TestCases/TypeCheck/Output/vptr.cpp.tmp.supp"' /Users/buildslave/jenkins/workspace/clang-stage2-Rthinlto/clang-build/Build/tools/clang/runtime/compiler-rt-bins/test/ubsan/Standalone-x86_64/TestCases/TypeCheck/Output/vptr.cpp.tmp cV : 'RUN: at line 33'; env UBSAN_OPTIONS=abort_on_error=0:log_to_syslog=0:halt_on_error=1:suppressions='"/Users/buildslave/jenkins/workspace/clang-stage2-Rthinlto/clang-build/Build/tools/clang/runtime/compiler-rt-bins/test/ubsan/Standalone-x86_64/TestCases/TypeCheck/Output/vptr.cpp.tmp.supp"' /Users/buildslave/jenkins/workspace/clang-stage2-Rthinlto/clang-build/Build/tools/clang/runtime/compiler-rt-bins/test/ubsan/Standalone-x86_64/TestCases/TypeCheck/Output/vptr.cpp.tmp oU : 'RUN: at line 34'; env UBSAN_OPTIONS=abort_on_error=0:log_to_syslog=0:halt_on_error=1:suppressions='"/Users/buildslave/jenkins/workspace/clang-stage2-Rthinlto/clang-build/Build/tools/clang/runtime/compiler-rt-bins/test/ubsan/Standalone-x86_64/TestCases/TypeCheck/Output/vptr.cpp.tmp.supp"' /Users/buildslave/jenkins/workspace/clang-stage2-Rthinlto/clang-build/Build/tools/clang/runtime/compiler-rt-bins/test/ubsan/Standalone-x86_64/TestCases/TypeCheck/Output/vptr.cpp.tmp dT : 'RUN: at line 36'; echo "vptr_check:S" > /Users/buildslave/jenkins/workspace/clang-stage2-Rthinlto/clang-build/Build/tools/clang/runtime/compiler-rt-bins/test/ubsan/Standalone-x86_64/TestCases/TypeCheck/Output/vptr.cpp.tmp.loc-supp : 'RUN: at line 37'; env UBSAN_OPTIONS=abort_on_error=0:log_to_syslog=0:halt_on_error=1:suppressions='"/Users/buildslave/jenkins/workspace/clang-stage2-Rthinlto/clang-build/Build/tools/clang/runtime/compiler-rt-bins/test/ubsan/Standalone-x86_64/TestCases/TypeCheck/Output/vptr.cpp.tmp.loc-supp"' not /Users/buildslave/jenkins/workspace/clang-stage2-Rthinlto/clang-build/Build/tools/clang/runtime/compiler-rt-bins/test/ubsan/Standalone-x86_64/TestCases/TypeCheck/Output/vptr.cpp.tmp x- 2>&1 | FileCheck /Users/buildslave/jenkins/workspace/clang-stage2-Rthinlto/llvm-project/compiler-rt/test/ubsan/TestCases/TypeCheck/vptr.cpp --check-prefix=CHECK-LOC-SUPPRESS -- Exit Code: 2

Hide Details

Command Output (stderr): -- + : 'RUN: at line 1' + /Users/buildslave/jenkins/workspace/clang-stage2-Rthinlto/clang-build/Build/./bin/clang --driver-mode=g++ -arch x86_64 -stdlib=libc++ -mmacosx-version-min=10.10 -isysroot /Applications/Xcode.app/Contents/Developer/Platforms/MacOSX.platform/Developer/SDKs/MacOSX10.15.sdk -frtti -fsanitize=null,vptr -g /Users/buildslave/jenkins/workspace/clang-stage2-Rthinlto/llvm-project/compiler-rt/test/ubsan/TestCases/TypeCheck/vptr.cpp -O3 -o /Users/buildslave/jenkins/workspace/clang-stage2-Rthinlto/clang-build/Build/tools/clang/runtime/compiler-rt-bins/test/ubsan/Standalone-x86_64/TestCases/TypeCheck/Output/vptr.cpp.tmp -mllvm -enable-tail-merge=false /Users/buildslave/jenkins/workspace/clang-stage2-Rthinlto/llvm-project/compiler-rt/test/ubsan/TestCases/TypeCheck/vptr.cpp:67:12: warning: direct base 'S' is inaccessible due to ambiguity: struct U -> struct S struct U -> struct T -> struct S [-Winaccessible-base] struct U : S, T { virtual int v() { return 2; } }; ^ /Users/buildslave/jenkins/workspace/clang-stage2-Rthinlto/llvm-project/compiler-rt/test/ubsan/TestCases/TypeCheck/vptr.cpp:131:9: warning: 'reinterpret_cast' from class 'U *' to its base at non-zero offset 'T *' behaves differently from 'static_cast' [-Wreinterpret-base-class] p = reinterpret_cast<T*>(new U); ^~~~~~~~~~~~~~~~~~~~~~~~~~~ /Users/buildslave/jenkins/workspace/clang-stage2-Rthinlto/llvm-project/compiler-rt/test/ubsan/TestCases/TypeCheck/vptr.cpp:131:9: note: use 'static_cast' to adjust the pointer correctly while upcasting p = reinterpret_cast<T*>(new U); ^~~~~~~~~~~~~~~~ static_cast /Users/buildslave/jenkins/workspace/clang-stage2-Rthinlto/llvm-project/compiler-rt/test/ubsan/TestCases/TypeCheck/vptr.cpp:194:12: warning: 'reinterpret_cast' to class 'U *' from its base at non-zero offset 'T *' behaves differently from 'static_cast' [-Wreinterpret-base-class] return reinterpret_cast<U*>(p)->v() - 2; ^~~~~~~~~~~~~~~~~~~~~~~ /Users/buildslave/jenkins/workspace/clang-stage2-Rthinlto/llvm-project/compiler-rt/test/ubsan/TestCases/TypeCheck/vptr.cpp:194:12: note: use 'static_cast' to adjust the pointer correctly while downcasting return reinterpret_cast<U*>(p)->v() - 2; ^~~~~~~~~~~~~~~~ static_cast 3 warnings generated. + : 'RUN: at line 2' + env UBSAN_OPTIONS=abort_on_error=0:log_to_syslog=0:halt_on_error=1 /Users/buildslave/jenkins/workspace/clang-stage2-Rthinlto/clang-build/Build/tools/clang/runtime/compiler-rt-bins/test/ubsan/Standalone-x86_64/TestCases/TypeCheck/Output/vptr.cpp.tmp rT Test case: rT + : 'RUN: at line 3' + env UBSAN_OPTIONS=abort_on_error=0:log_to_syslog=0:halt_on_error=1 /Users/buildslave/jenkins/workspace/clang-stage2-Rthinlto/clang-build/Build/tools/clang/runtime/compiler-rt-bins/test/ubsan/Standalone-x86_64/TestCases/TypeCheck/Output/vptr.cpp.tmp mT Test case: mT + : 'RUN: at line 4' + env UBSAN_OPTIONS=abort_on_error=0:log_to_syslog=0:halt_on_error=1 /Users/buildslave/jenkins/workspace/clang-stage2-Rthinlto/clang-build/Build/tools/clang/runtime/compiler-rt-bins/test/ubsan/Standalone-x86_64/TestCases/TypeCheck/Output/vptr.cpp.tmp fT Test case: fT + : 'RUN: at line 5' + env UBSAN_OPTIONS=abort_on_error=0:log_to_syslog=0:halt_on_error=1 /Users/buildslave/jenkins/workspace/clang-stage2-Rthinlto/clang-build/Build/tools/clang/runtime/compiler-rt-bins/test/ubsan/Standalone-x86_64/TestCases/TypeCheck/Output/vptr.cpp.tmp cT Test case: cT + : 'RUN: at line 6' + env UBSAN_OPTIONS=abort_on_error=0:log_to_syslog=0:halt_on_error=1 /Users/buildslave/jenkins/workspace/clang-stage2-Rthinlto/clang-build/Build/tools/clang/runtime/compiler-rt-bins/test/ubsan/Standalone-x86_64/TestCases/TypeCheck/Output/vptr.cpp.tmp rU Test case: rU + : 'RUN: at line 7' + env UBSAN_OPTIONS=abort_on_error=0:log_to_syslog=0:halt_on_error=1 /Users/buildslave/jenkins/workspace/clang-stage2-Rthinlto/clang-build/Build/tools/clang/runtime/compiler-rt-bins/test/ubsan/Standalone-x86_64/TestCases/TypeCheck/Output/vptr.cpp.tmp mU Test case: mU + : 'RUN: at line 8' + env UBSAN_OPTIONS=abort_on_error=0:log_to_syslog=0:halt_on_error=1 /Users/buildslave/jenkins/workspace/clang-stage2-Rthinlto/clang-build/Build/tools/clang/runtime/compiler-rt-bins/test/ubsan/Standalone-x86_64/TestCases/TypeCheck/Output/vptr.cpp.tmp fU Test case: fU + : 'RUN: at line 9' + env UBSAN_OPTIONS=abort_on_error=0:log_to_syslog=0:halt_on_error=1 /Users/buildslave/jenkins/workspace/clang-stage2-Rthinlto/clang-build/Build/tools/clang/runtime/compiler-rt-bins/test/ubsan/Standalone-x86_64/TestCases/TypeCheck/Output/vptr.cpp.tmp cU Test case: cU + : 'RUN: at line 10' + env UBSAN_OPTIONS=abort_on_error=0:log_to_syslog=0:halt_on_error=1 /Users/buildslave/jenkins/workspace/clang-stage2-Rthinlto/clang-build/Build/tools/clang/runtime/compiler-rt-bins/test/ubsan/Standalone-x86_64/TestCases/TypeCheck/Output/vptr.cpp.tmp rS Test case: rS + : 'RUN: at line 11' + env UBSAN_OPTIONS=abort_on_error=0:log_to_syslog=0:halt_on_error=1 /Users/buildslave/jenkins/workspace/clang-stage2-Rthinlto/clang-build/Build/tools/clang/runtime/compiler-rt-bins/test/ubsan/Standalone-x86_64/TestCases/TypeCheck/Output/vptr.cpp.tmp rV Test case: rV + : 'RUN: at line 12' + env UBSAN_OPTIONS=abort_on_error=0:log_to_syslog=0:halt_on_error=1 /Users/buildslave/jenkins/workspace/clang-stage2-Rthinlto/clang-build/Build/tools/clang/runtime/compiler-rt-bins/test/ubsan/Standalone-x86_64/TestCases/TypeCheck/Output/vptr.cpp.tmp oV Test case: oV + : 'RUN: at line 13' + env UBSAN_OPTIONS=abort_on_error=0:log_to_syslog=0:halt_on_error=1 /Users/buildslave/jenkins/workspace/clang-stage2-Rthinlto/clang-build/Build/tools/clang/runtime/compiler-rt-bins/test/ubsan/Standalone-x86_64/TestCases/TypeCheck/Output/vptr.cpp.tmp zN Test case: zN + : 'RUN: at line 14' + env UBSAN_OPTIONS=abort_on_error=0:log_to_syslog=0:halt_on_error=1:print_stacktrace=1 not /Users/buildslave/jenkins/workspace/clang-stage2-Rthinlto/clang-build/Build/tools/clang/runtime/compiler-rt-bins/test/ubsan/Standalone-x86_64/TestCases/TypeCheck/Output/vptr.cpp.tmp mS + FileCheck /Users/buildslave/jenkins/workspace/clang-stage2-Rthinlto/llvm-project/compiler-rt/test/ubsan/TestCases/TypeCheck/vptr.cpp --check-prefix=CHECK-MEMBER --check-prefix=CHECK-Darwin-MEMBER --strict-whitespace error: no check strings found with prefix 'CHECK-Darwin-MEMBER:'

Hide Details

--

Hide Details

******************** PASS: UBSan-Standalone-x86_64 :: TestCases/Pointer/alignment-assumption-builtin_assume_aligned-two-params.cpp (2690 of 3112) PASS: UBSan-Standalone-x86_64 :: TestCases/TypeCheck/vptr-non-unique-typeinfo.cpp (2691 of 3112) PASS: UBSan-Standalone-x86_64 :: TestCases/TypeCheck/misaligned.cpp (2692 of 3112) UNSUPPORTED: UBSan-StandaloneStatic-x86_64 :: TestCases/ImplicitConversion/signed-integer-truncation-or-sign-change-summary.cpp (2693 of 3112) UNSUPPORTED: UBSan-StandaloneStatic-x86_64 :: TestCases/ImplicitConversion/signed-integer-truncation-summary.cpp (2694 of 3112) PASS: UBSan-Standalone-x86_64 :: TestCases/Pointer/alignment-assumption-openmp.cpp (2695 of 3112) PASS: UBSan-Standalone-x86_64 :: TestCases/TypeCheck/Function/function.cpp (2696 of 3112) UNSUPPORTED: UBSan-StandaloneStatic-x86_64 :: TestCases/ImplicitConversion/unsigned-integer-truncation-summary.cpp (2697 of 3112) PASS: UBSan-Standalone-x86_64 :: TestCases/ImplicitConversion/unsigned-integer-truncation-blacklist.c (2698 of 3112) PASS: UBSan-Standalone-x86_64 :: TestCases/Pointer/nullptr-and-nonzero-offset-constants.cpp (2699 of 3112) PASS: UBSan-StandaloneStatic-x86_64 :: TestCases/Integer/div-overflow.cpp (2700 of 3112) PASS: UBSan-StandaloneStatic-x86_64 :: TestCases/Integer/add-overflow.cpp (2701 of 3112) PASS: UBSan-StandaloneStatic-x86_64 :: TestCases/ImplicitConversion/integer-conversion-incdec.c (2702 of 3112) PASS: UBSan-StandaloneStatic-x86_64 :: TestCases/ImplicitConversion/integer-sign-change-blacklist.c (2703 of 3112) PASS: UBSan-StandaloneStatic-x86_64 :: TestCases/ImplicitConversion/integer-sign-change-incdec.c (2704 of 3112) PASS: UBSan-StandaloneStatic-x86_64 :: TestCases/Integer/mul-overflow.cpp (2705 of 3112) PASS: UBSan-StandaloneStatic-x86_64 :: TestCases/ImplicitConversion/signed-integer-truncation-incdec.c (2706 of 3112) PASS: UBSan-StandaloneStatic-x86_64 :: TestCases/Integer/div-zero.cpp (2707 of 3112) UNSUPPORTED: UBSan-StandaloneStatic-x86_64 :: TestCases/Integer/summary.cpp (2708 of 3112) PASS: UBSan-StandaloneStatic-x86_64 :: TestCases/Integer/incdec-overflow.cpp (2709 of 3112) PASS: UBSan-StandaloneStatic-x86_64 :: TestCases/Integer/negate-overflow.cpp (2710 of 3112) PASS: UBSan-StandaloneStatic-x86_64 :: TestCases/Integer/no-recover.cpp (2711 of 3112) PASS: UBSan-StandaloneStatic-x86_64 :: TestCases/Integer/suppressions.cpp (2712 of 3112) PASS: UBSan-StandaloneStatic-x86_64 :: TestCases/Integer/sub-overflow.cpp (2713 of 3112) PASS: UBSan-Standalone-x86_64 :: TestCases/Pointer/nullptr-and-nonzero-offset-variable.cpp (2714 of 3112) UNSUPPORTED: UBSan-StandaloneStatic-x86_64 :: TestCases/Misc/Linux/print_stack_trace.cpp (2715 of 3112) UNSUPPORTED: UBSan-StandaloneStatic-x86_64 :: TestCases/Misc/Linux/ubsan_options.cpp (2716 of 3112) PASS: UBSan-StandaloneStatic-x86_64 :: TestCases/Integer/umul-overflow.cpp (2717 of 3112) PASS: UBSan-StandaloneStatic-x86_64 :: TestCases/Misc/bool.cpp (2718 of 3112) PASS: UBSan-StandaloneStatic-x86_64 :: TestCases/Integer/uadd-overflow.cpp (2719 of 3112) PASS: UBSan-StandaloneStatic-x86_64 :: TestCases/Misc/bool.m (2720 of 3112) UNSUPPORTED: UBSan-StandaloneStatic-x86_64 :: TestCases/Misc/coverage-levels.cpp (2721 of 3112) PASS: UBSan-StandaloneStatic-x86_64 :: TestCases/Integer/unsigned-shift.cpp (2722 of 3112) PASS: UBSan-StandaloneStatic-x86_64 :: TestCases/Misc/bounds.cpp (2723 of 3112) PASS: UBSan-StandaloneStatic-x86_64 :: TestCases/Misc/deduplication.cpp (2724 of 3112) PASS: UBSan-StandaloneStatic-x86_64 :: TestCases/ImplicitConversion/integer-sign-change.c (2725 of 3112) PASS: UBSan-StandaloneStatic-x86_64 :: TestCases/Integer/usub-overflow.cpp (2726 of 3112) UNSUPPORTED: UBSan-StandaloneStatic-x86_64 :: TestCases/Misc/no-interception.cpp (2727 of 3112) PASS: UBSan-StandaloneStatic-x86_64 :: TestCases/Misc/log-path_test.cpp (2728 of 3112) PASS: UBSan-StandaloneStatic-x86_64 :: TestCases/Integer/uincdec-overflow.cpp (2729 of 3112) PASS: UBSan-StandaloneStatic-x86_64 :: TestCases/Misc/builtins.cpp (2730 of 3112) PASS: UBSan-StandaloneStatic-x86_64 :: TestCases/Misc/monitor.cpp (2731 of 3112) PASS: UBSan-StandaloneStatic-x86_64 :: TestCases/Misc/missing_return.cpp (2732 of 3112) PASS: UBSan-StandaloneStatic-x86_64 :: TestCases/ImplicitConversion/integer-arithmetic-value-change.c (2733 of 3112) PASS: UBSan-StandaloneStatic-x86_64 :: TestCases/Misc/nonnull-arg.cpp (2734 of 3112) PASS: UBSan-StandaloneStatic-x86_64 :: TestCases/ImplicitConversion/integer-conversion.c (2735 of 3112) PASS: UBSan-StandaloneStatic-x86_64 :: TestCases/Misc/nullability.c (2736 of 3112) PASS: UBSan-StandaloneStatic-x86_64 :: TestCases/Misc/print_summary.c (2737 of 3112) PASS: UBSan-StandaloneStatic-x86_64 :: TestCases/Misc/enum.cpp (2738 of 3112) PASS: UBSan-StandaloneStatic-x86_64 :: TestCases/Misc/unreachable.cpp (2739 of 3112) PASS: UBSan-StandaloneStatic-x86_64 :: TestCases/ImplicitConversion/integer-truncation.c (2740 of 3112) PASS: UBSan-StandaloneStatic-x86_64 :: TestCases/Misc/vla.c (2741 of 3112) PASS: UBSan-StandaloneStatic-x86_64 :: TestCases/Misc/nonnull.cpp (2742 of 3112) PASS: UBSan-StandaloneStatic-x86_64 :: TestCases/ImplicitConversion/signed-integer-truncation.c (2743 of 3112) PASS: UBSan-StandaloneStatic-x86_64 :: TestCases/ImplicitConversion/unsigned-integer-truncation.c (2744 of 3112) PASS: UBSan-StandaloneStatic-x86_64 :: TestCases/Misc/objc-cast.m (2745 of 3112) UNSUPPORTED: UBSan-StandaloneStatic-x86_64 :: TestCases/Pointer/alignment-assumption-summary.cpp (2746 of 3112) PASS: UBSan-StandaloneStatic-x86_64 :: TestCases/Pointer/alignment-assumption-blacklist.cpp (2747 of 3112) PASS: UBSan-StandaloneStatic-x86_64 :: TestCases/Pointer/index-overflow.cpp (2748 of 3112) UNSUPPORTED: UBSan-StandaloneStatic-x86_64 :: TestCases/Pointer/nullptr-and-nonzero-offset-summary.cpp (2749 of 3112) PASS: UBSan-StandaloneStatic-x86_64 :: TestCases/ImplicitConversion/signed-integer-truncation-or-sign-change-blacklist.c (2750 of 3112) PASS: UBSan-StandaloneStatic-x86_64 :: TestCases/Pointer/unsigned-index-expression.cpp (2751 of 3112) PASS: UBSan-StandaloneStatic-x86_64 :: TestCases/Pointer/alignment-assumption-attribute-align_value-on-lvalue.cpp (2752 of 3112) UNSUPPORTED: UBSan-StandaloneStatic-x86_64 :: TestCases/TypeCheck/Linux/PR33221.cpp (2753 of 3112) PASS: UBSan-StandaloneStatic-x86_64 :: TestCases/ImplicitConversion/signed-integer-truncation-blacklist.c (2754 of 3112) PASS: UBSan-StandaloneStatic-x86_64 :: TestCases/Pointer/alignment-assumption-attribute-align_value-on-paramvar.cpp (2755 of 3112) PASS: UBSan-StandaloneStatic-x86_64 :: TestCases/Pointer/alignment-assumption-attribute-alloc_align-on-function-variable.cpp (2756 of 3112) PASS: UBSan-StandaloneStatic-x86_64 :: TestCases/Pointer/alignment-assumption-attribute-alloc_align-on-function.cpp (2757 of 3112) PASS: UBSan-StandaloneStatic-x86_64 :: TestCases/Pointer/alignment-assumption-attribute-assume_aligned-on-function-two-params.cpp (2758 of 3112) UNSUPPORTED: UBSan-StandaloneStatic-x86_64 :: TestCases/TypeCheck/vptr-ptrauth-unauthenticated.cpp (2759 of 3112) PASS: UBSan-StandaloneStatic-x86_64 :: TestCases/Pointer/alignment-assumption-attribute-assume_aligned-on-function.cpp (2760 of 3112) PASS: UBSan-StandaloneStatic-x86_64 :: TestCases/Pointer/alignment-assumption-builtin_assume_aligned-three-params-variable.cpp (2761 of 3112) PASS: UBSan-StandaloneStatic-x86_64 :: TestCases/Integer/shift.cpp (2762 of 3112) PASS: UBSan-StandaloneStatic-x86_64 :: TestCases/Pointer/alignment-assumption-builtin_assume_aligned-three-params.cpp (2763 of 3112) PASS: UBSan-StandaloneStatic-x86_64 :: TestCases/TypeCheck/PR33221.cpp (2764 of 3112) PASS: UBSan-StandaloneStatic-x86_64 :: TestCases/ImplicitConversion/unsigned-integer-truncation-blacklist.c (2765 of 3112) PASS: UBSan-StandaloneStatic-x86_64 :: TestCases/TypeCheck/null.cpp (2766 of 3112) PASS: UBSan-StandaloneStatic-x86_64 :: TestCases/TypeCheck/Function/function.cpp (2767 of 3112) PASS: UBSan-StandaloneStatic-x86_64 :: TestCases/TypeCheck/vptr-corrupted-vtable-itanium.cpp (2768 of 3112) PASS: UBSan-StandaloneStatic-x86_64 :: TestCases/Pointer/alignment-assumption-builtin_assume_aligned-two-params.cpp (2769 of 3112) PASS: UBSan-StandaloneStatic-x86_64 :: TestCases/TypeCheck/vptr-virtual-base-construction.cpp (2770 of 3112) PASS: UBSan-StandaloneStatic-x86_64 :: TestCases/TypeCheck/vptr-virtual-base.cpp (2771 of 3112) PASS: UBSan-StandaloneStatic-x86_64 :: TestCases/Pointer/alignment-assumption-openmp.cpp (2772 of 3112) FAIL: UBSan-StandaloneStatic-x86_64 :: TestCases/TypeCheck/vptr.cpp (2773 of 3112) ******************** TEST 'UBSan-StandaloneStatic-x86_64 :: TestCases/TypeCheck/vptr.cpp' FAILED ******************** Script: -- : 'RUN: at line 1'; /Users/buildslave/jenkins/workspace/clang-stage2-Rthinlto/clang-build/Build/./bin/clang --driver-mode=g++ -static-libsan -arch x86_64 -stdlib=libc++ -mmacosx-version-min=10.10 -isysroot /Applications/Xcode.app/Contents/Developer/Platforms/MacOSX.platform/Developer/SDKs/MacOSX10.15.sdk -lc++abi -frtti -fsanitize=null,vptr -g /Users/buildslave/jenkins/workspace/clang-stage2-Rthinlto/llvm-project/compiler-rt/test/ubsan/TestCases/TypeCheck/vptr.cpp -O3 -o /Users/buildslave/jenkins/workspace/clang-stage2-Rthinlto/clang-build/Build/tools/clang/runtime/compiler-rt-bins/test/ubsan/StandaloneStatic-x86_64/TestCases/TypeCheck/Output/vptr.cpp.tmp -mllvm -enable-tail-merge=false : 'RUN: at line 2'; env UBSAN_OPTIONS=abort_on_error=0:log_to_syslog=0:halt_on_error=1 /Users/buildslave/jenkins/workspace/clang-stage2-Rthinlto/clang-build/Build/tools/clang/runtime/compiler-rt-bins/test/ubsan/StandaloneStatic-x86_64/TestCases/TypeCheck/Output/vptr.cpp.tmp rT : 'RUN: at line 3'; env UBSAN_OPTIONS=abort_on_error=0:log_to_syslog=0:halt_on_error=1 /Users/buildslave/jenkins/workspace/clang-stage2-Rthinlto/clang-build/Build/tools/clang/runtime/compiler-rt-bins/test/ubsan/StandaloneStatic-x86_64/TestCases/TypeCheck/Output/vptr.cpp.tmp mT : 'RUN: at line 4'; env UBSAN_OPTIONS=abort_on_error=0:log_to_syslog=0:halt_on_error=1 /Users/buildslave/jenkins/workspace/clang-stage2-Rthinlto/clang-build/Build/tools/clang/runtime/compiler-rt-bins/test/ubsan/StandaloneStatic-x86_64/TestCases/TypeCheck/Output/vptr.cpp.tmp fT : 'RUN: at line 5'; env UBSAN_OPTIONS=abort_on_error=0:log_to_syslog=0:halt_on_error=1 /Users/buildslave/jenkins/workspace/clang-stage2-Rthinlto/clang-build/Build/tools/clang/runtime/compiler-rt-bins/test/ubsan/StandaloneStatic-x86_64/TestCases/TypeCheck/Output/vptr.cpp.tmp cT : 'RUN: at line 6'; env UBSAN_OPTIONS=abort_on_error=0:log_to_syslog=0:halt_on_error=1 /Users/buildslave/jenkins/workspace/clang-stage2-Rthinlto/clang-build/Build/tools/clang/runtime/compiler-rt-bins/test/ubsan/StandaloneStatic-x86_64/TestCases/TypeCheck/Output/vptr.cpp.tmp rU : 'RUN: at line 7'; env UBSAN_OPTIONS=abort_on_error=0:log_to_syslog=0:halt_on_error=1 /Users/buildslave/jenkins/workspace/clang-stage2-Rthinlto/clang-build/Build/tools/clang/runtime/compiler-rt-bins/test/ubsan/StandaloneStatic-x86_64/TestCases/TypeCheck/Output/vptr.cpp.tmp mU : 'RUN: at line 8'; env UBSAN_OPTIONS=abort_on_error=0:log_to_syslog=0:halt_on_error=1 /Users/buildslave/jenkins/workspace/clang-stage2-Rthinlto/clang-build/Build/tools/clang/runtime/compiler-rt-bins/test/ubsan/StandaloneStatic-x86_64/TestCases/TypeCheck/Output/vptr.cpp.tmp fU : 'RUN: at line 9'; env UBSAN_OPTIONS=abort_on_error=0:log_to_syslog=0:halt_on_error=1 /Users/buildslave/jenkins/workspace/clang-stage2-Rthinlto/clang-build/Build/tools/clang/runtime/compiler-rt-bins/test/ubsan/StandaloneStatic-x86_64/TestCases/TypeCheck/Output/vptr.cpp.tmp cU : 'RUN: at line 10'; env UBSAN_OPTIONS=abort_on_error=0:log_to_syslog=0:halt_on_error=1 /Users/buildslave/jenkins/workspace/clang-stage2-Rthinlto/clang-build/Build/tools/clang/runtime/compiler-rt-bins/test/ubsan/StandaloneStatic-x86_64/TestCases/TypeCheck/Output/vptr.cpp.tmp rS : 'RUN: at line 11'; env UBSAN_OPTIONS=abort_on_error=0:log_to_syslog=0:halt_on_error=1 /Users/buildslave/jenkins/workspace/clang-stage2-Rthinlto/clang-build/Build/tools/clang/runtime/compiler-rt-bins/test/ubsan/StandaloneStatic-x86_64/TestCases/TypeCheck/Output/vptr.cpp.tmp rV : 'RUN: at line 12'; env UBSAN_OPTIONS=abort_on_error=0:log_to_syslog=0:halt_on_error=1 /Users/buildslave/jenkins/workspace/clang-stage2-Rthinlto/clang-build/Build/tools/clang/runtime/compiler-rt-bins/test/ubsan/StandaloneStatic-x86_64/TestCases/TypeCheck/Output/vptr.cpp.tmp oV : 'RUN: at line 13'; env UBSAN_OPTIONS=abort_on_error=0:log_to_syslog=0:halt_on_error=1 /Users/buildslave/jenkins/workspace/clang-stage2-Rthinlto/clang-build/Build/tools/clang/runtime/compiler-rt-bins/test/ubsan/StandaloneStatic-x86_64/TestCases/TypeCheck/Output/vptr.cpp.tmp zN : 'RUN: at line 14'; env UBSAN_OPTIONS=abort_on_error=0:log_to_syslog=0:halt_on_error=1:print_stacktrace=1 not /Users/buildslave/jenkins/workspace/clang-stage2-Rthinlto/clang-build/Build/tools/clang/runtime/compiler-rt-bins/test/ubsan/StandaloneStatic-x86_64/TestCases/TypeCheck/Output/vptr.cpp.tmp mS 2>&1 | FileCheck /Users/buildslave/jenkins/workspace/clang-stage2-Rthinlto/llvm-project/compiler-rt/test/ubsan/TestCases/TypeCheck/vptr.cpp --check-prefix=CHECK-MEMBER --check-prefix=CHECK-Darwin-MEMBER --strict-whitespace : 'RUN: at line 15'; env UBSAN_OPTIONS=abort_on_error=0:log_to_syslog=0:halt_on_error=1:print_stacktrace=1 not /Users/buildslave/jenkins/workspace/clang-stage2-Rthinlto/clang-build/Build/tools/clang/runtime/compiler-rt-bins/test/ubsan/StandaloneStatic-x86_64/TestCases/TypeCheck/Output/vptr.cpp.tmp fS 2>&1 | FileCheck /Users/buildslave/jenkins/workspace/clang-stage2-Rthinlto/llvm-project/compiler-rt/test/ubsan/TestCases/TypeCheck/vptr.cpp --check-prefix=CHECK-MEMFUN --strict-whitespace : 'RUN: at line 16'; env UBSAN_OPTIONS=abort_on_error=0:log_to_syslog=0:halt_on_error=1:print_stacktrace=1 not /Users/buildslave/jenkins/workspace/clang-stage2-Rthinlto/clang-build/Build/tools/clang/runtime/compiler-rt-bins/test/ubsan/StandaloneStatic-x86_64/TestCases/TypeCheck/Output/vptr.cpp.tmp cS 2>&1 | FileCheck /Users/buildslave/jenkins/workspace/clang-stage2-Rthinlto/llvm-project/compiler-rt/test/ubsan/TestCases/TypeCheck/vptr.cpp --check-prefix=CHECK-DOWNCAST --check-prefix=CHECK-Darwin-DOWNCAST --strict-whitespace : 'RUN: at line 17'; env UBSAN_OPTIONS=abort_on_error=0:log_to_syslog=0:halt_on_error=1:print_stacktrace=1 not /Users/buildslave/jenkins/workspace/clang-stage2-Rthinlto/clang-build/Build/tools/clang/runtime/compiler-rt-bins/test/ubsan/StandaloneStatic-x86_64/TestCases/TypeCheck/Output/vptr.cpp.tmp mV 2>&1 | FileCheck /Users/buildslave/jenkins/workspace/clang-stage2-Rthinlto/llvm-project/compiler-rt/test/ubsan/TestCases/TypeCheck/vptr.cpp --check-prefix=CHECK-MEMBER --check-prefix=CHECK-Darwin-MEMBER --strict-whitespace : 'RUN: at line 18'; env UBSAN_OPTIONS=abort_on_error=0:log_to_syslog=0:halt_on_error=1:print_stacktrace=1 not /Users/buildslave/jenkins/workspace/clang-stage2-Rthinlto/clang-build/Build/tools/clang/runtime/compiler-rt-bins/test/ubsan/StandaloneStatic-x86_64/TestCases/TypeCheck/Output/vptr.cpp.tmp fV 2>&1 | FileCheck /Users/buildslave/jenkins/workspace/clang-stage2-Rthinlto/llvm-project/compiler-rt/test/ubsan/TestCases/TypeCheck/vptr.cpp --check-prefix=CHECK-MEMFUN --strict-whitespace : 'RUN: at line 19'; env UBSAN_OPTIONS=abort_on_error=0:log_to_syslog=0:halt_on_error=1:print_stacktrace=1 not /Users/buildslave/jenkins/workspace/clang-stage2-Rthinlto/clang-build/Build/tools/clang/runtime/compiler-rt-bins/test/ubsan/StandaloneStatic-x86_64/TestCases/TypeCheck/Output/vptr.cpp.tmp cV 2>&1 | FileCheck /Users/buildslave/jenkins/workspace/clang-stage2-Rthinlto/llvm-project/compiler-rt/test/ubsan/TestCases/TypeCheck/vptr.cpp --check-prefix=CHECK-DOWNCAST --check-prefix=CHECK-Darwin-DOWNCAST --strict-whitespace : 'RUN: at line 20'; env UBSAN_OPTIONS=abort_on_error=0:log_to_syslog=0:halt_on_error=1:print_stacktrace=1 not /Users/buildslave/jenkins/workspace/clang-stage2-Rthinlto/clang-build/Build/tools/clang/runtime/compiler-rt-bins/test/ubsan/StandaloneStatic-x86_64/TestCases/TypeCheck/Output/vptr.cpp.tmp oU 2>&1 | FileCheck /Users/buildslave/jenkins/workspace/clang-stage2-Rthinlto/llvm-project/compiler-rt/test/ubsan/TestCases/TypeCheck/vptr.cpp --check-prefix=CHECK-OFFSET --check-prefix=CHECK-Darwin-OFFSET --strict-whitespace : 'RUN: at line 21'; env UBSAN_OPTIONS=abort_on_error=0:log_to_syslog=0:halt_on_error=1:print_stacktrace=1 not /Users/buildslave/jenkins/workspace/clang-stage2-Rthinlto/clang-build/Build/tools/clang/runtime/compiler-rt-bins/test/ubsan/StandaloneStatic-x86_64/TestCases/TypeCheck/Output/vptr.cpp.tmp m0 2>&1 | FileCheck /Users/buildslave/jenkins/workspace/clang-stage2-Rthinlto/llvm-project/compiler-rt/test/ubsan/TestCases/TypeCheck/vptr.cpp --check-prefix=CHECK-INVALID-MEMBER --check-prefix=CHECK-Darwin-NULL-MEMBER --strict-whitespace : 'RUN: at line 22'; env UBSAN_OPTIONS=abort_on_error=0:log_to_syslog=0:halt_on_error=1:print_stacktrace=1 not /Users/buildslave/jenkins/workspace/clang-stage2-Rthinlto/clang-build/Build/tools/clang/runtime/compiler-rt-bins/test/ubsan/StandaloneStatic-x86_64/TestCases/TypeCheck/Output/vptr.cpp.tmp m0 2>&1 | FileCheck /Users/buildslave/jenkins/workspace/clang-stage2-Rthinlto/llvm-project/compiler-rt/test/ubsan/TestCases/TypeCheck/vptr.cpp --check-prefix=CHECK-INVALID-MEMBER --check-prefix=CHECK-Darwin-NULL-MEMBER --strict-whitespace : 'RUN: at line 23'; env UBSAN_OPTIONS=abort_on_error=0:log_to_syslog=0:halt_on_error=1 not /Users/buildslave/jenkins/workspace/clang-stage2-Rthinlto/clang-build/Build/tools/clang/runtime/compiler-rt-bins/test/ubsan/StandaloneStatic-x86_64/TestCases/TypeCheck/Output/vptr.cpp.tmp nN 2>&1 | FileCheck /Users/buildslave/jenkins/workspace/clang-stage2-Rthinlto/llvm-project/compiler-rt/test/ubsan/TestCases/TypeCheck/vptr.cpp --check-prefix=CHECK-NULL-MEMFUN --strict-whitespace : 'RUN: at line 24'; env UBSAN_OPTIONS=abort_on_error=0:log_to_syslog=0:print_stacktrace=1 /Users/buildslave/jenkins/workspace/clang-stage2-Rthinlto/clang-build/Build/tools/clang/runtime/compiler-rt-bins/test/ubsan/StandaloneStatic-x86_64/TestCases/TypeCheck/Output/vptr.cpp.tmp dT 2>&1 | FileCheck /Users/buildslave/jenkins/workspace/clang-stage2-Rthinlto/llvm-project/compiler-rt/test/ubsan/TestCases/TypeCheck/vptr.cpp --check-prefix=CHECK-DYNAMIC --check-prefix=CHECK-Darwin-DYNAMIC --strict-whitespace : 'RUN: at line 26'; (echo "vptr_check:S"; echo "vptr_check:T"; echo "vptr_check:U") > /Users/buildslave/jenkins/workspace/clang-stage2-Rthinlto/clang-build/Build/tools/clang/runtime/compiler-rt-bins/test/ubsan/StandaloneStatic-x86_64/TestCases/TypeCheck/Output/vptr.cpp.tmp.supp : 'RUN: at line 27'; env UBSAN_OPTIONS=abort_on_error=0:log_to_syslog=0:halt_on_error=1:suppressions='"/Users/buildslave/jenkins/workspace/clang-stage2-Rthinlto/clang-build/Build/tools/clang/runtime/compiler-rt-bins/test/ubsan/StandaloneStatic-x86_64/TestCases/TypeCheck/Output/vptr.cpp.tmp.supp"' /Users/buildslave/jenkins/workspace/clang-stage2-Rthinlto/clang-build/Build/tools/clang/runtime/compiler-rt-bins/test/ubsan/StandaloneStatic-x86_64/TestCases/TypeCheck/Output/vptr.cpp.tmp mS : 'RUN: at line 28'; env UBSAN_OPTIONS=abort_on_error=0:log_to_syslog=0:halt_on_error=1:suppressions='"/Users/buildslave/jenkins/workspace/clang-stage2-Rthinlto/clang-build/Build/tools/clang/runtime/compiler-rt-bins/test/ubsan/StandaloneStatic-x86_64/TestCases/TypeCheck/Output/vptr.cpp.tmp.supp"' /Users/buildslave/jenkins/workspace/clang-stage2-Rthinlto/clang-build/Build/tools/clang/runtime/compiler-rt-bins/test/ubsan/StandaloneStatic-x86_64/TestCases/TypeCheck/Output/vptr.cpp.tmp fS : 'RUN: at line 29'; env UBSAN_OPTIONS=abort_on_error=0:log_to_syslog=0:halt_on_error=1:suppressions='"/Users/buildslave/jenkins/workspace/clang-stage2-Rthinlto/clang-build/Build/tools/clang/runtime/compiler-rt-bins/test/ubsan/StandaloneStatic-x86_64/TestCases/TypeCheck/Output/vptr.cpp.tmp.supp"' /Users/buildslave/jenkins/workspace/clang-stage2-Rthinlto/clang-build/Build/tools/clang/runtime/compiler-rt-bins/test/ubsan/StandaloneStatic-x86_64/TestCases/TypeCheck/Output/vptr.cpp.tmp cS : 'RUN: at line 30'; env UBSAN_OPTIONS=abort_on_error=0:log_to_syslog=0:halt_on_error=1:suppressions='"/Users/buildslave/jenkins/workspace/clang-stage2-Rthinlto/clang-build/Build/tools/clang/runtime/compiler-rt-bins/test/ubsan/StandaloneStatic-x86_64/TestCases/TypeCheck/Output/vptr.cpp.tmp.supp"' /Users/buildslave/jenkins/workspace/clang-stage2-Rthinlto/clang-build/Build/tools/clang/runtime/compiler-rt-bins/test/ubsan/StandaloneStatic-x86_64/TestCases/TypeCheck/Output/vptr.cpp.tmp mV : 'RUN: at line 31'; env UBSAN_OPTIONS=abort_on_error=0:log_to_syslog=0:halt_on_error=1:suppressions='"/Users/buildslave/jenkins/workspace/clang-stage2-Rthinlto/clang-build/Build/tools/clang/runtime/compiler-rt-bins/test/ubsan/StandaloneStatic-x86_64/TestCases/TypeCheck/Output/vptr.cpp.tmp.supp"' /Users/buildslave/jenkins/workspace/clang-stage2-Rthinlto/clang-build/Build/tools/clang/runtime/compiler-rt-bins/test/ubsan/StandaloneStatic-x86_64/TestCases/TypeCheck/Output/vptr.cpp.tmp fV : 'RUN: at line 32'; env UBSAN_OPTIONS=abort_on_error=0:log_to_syslog=0:halt_on_error=1:suppressions='"/Users/buildslave/jenkins/workspace/clang-stage2-Rthinlto/clang-build/Build/tools/clang/runtime/compiler-rt-bins/test/ubsan/StandaloneStatic-x86_64/TestCases/TypeCheck/Output/vptr.cpp.tmp.supp"' /Users/buildslave/jenkins/workspace/clang-stage2-Rthinlto/clang-build/Build/tools/clang/runtime/compiler-rt-bins/test/ubsan/StandaloneStatic-x86_64/TestCases/TypeCheck/Output/vptr.cpp.tmp cV : 'RUN: at line 33'; env UBSAN_OPTIONS=abort_on_error=0:log_to_syslog=0:halt_on_error=1:suppressions='"/Users/buildslave/jenkins/workspace/clang-stage2-Rthinlto/clang-build/Build/tools/clang/runtime/compiler-rt-bins/test/ubsan/StandaloneStatic-x86_64/TestCases/TypeCheck/Output/vptr.cpp.tmp.supp"' /Users/buildslave/jenkins/workspace/clang-stage2-Rthinlto/clang-build/Build/tools/clang/runtime/compiler-rt-bins/test/ubsan/StandaloneStatic-x86_64/TestCases/TypeCheck/Output/vptr.cpp.tmp oU : 'RUN: at line 34'; env UBSAN_OPTIONS=abort_on_error=0:log_to_syslog=0:halt_on_error=1:suppressions='"/Users/buildslave/jenkins/workspace/clang-stage2-Rthinlto/clang-build/Build/tools/clang/runtime/compiler-rt-bins/test/ubsan/StandaloneStatic-x86_64/TestCases/TypeCheck/Output/vptr.cpp.tmp.supp"' /Users/buildslave/jenkins/workspace/clang-stage2-Rthinlto/clang-build/Build/tools/clang/runtime/compiler-rt-bins/test/ubsan/StandaloneStatic-x86_64/TestCases/TypeCheck/Output/vptr.cpp.tmp dT : 'RUN: at line 36'; echo "vptr_check:S" > /Users/buildslave/jenkins/workspace/clang-stage2-Rthinlto/clang-build/Build/tools/clang/runtime/compiler-rt-bins/test/ubsan/StandaloneStatic-x86_64/TestCases/TypeCheck/Output/vptr.cpp.tmp.loc-supp : 'RUN: at line 37'; env UBSAN_OPTIONS=abort_on_error=0:log_to_syslog=0:halt_on_error=1:suppressions='"/Users/buildslave/jenkins/workspace/clang-stage2-Rthinlto/clang-build/Build/tools/clang/runtime/compiler-rt-bins/test/ubsan/StandaloneStatic-x86_64/TestCases/TypeCheck/Output/vptr.cpp.tmp.loc-supp"' not /Users/buildslave/jenkins/workspace/clang-stage2-Rthinlto/clang-build/Build/tools/clang/runtime/compiler-rt-bins/test/ubsan/StandaloneStatic-x86_64/TestCases/TypeCheck/Output/vptr.cpp.tmp x- 2>&1 | FileCheck /Users/buildslave/jenkins/workspace/clang-stage2-Rthinlto/llvm-project/compiler-rt/test/ubsan/TestCases/TypeCheck/vptr.cpp --check-prefix=CHECK-LOC-SUPPRESS -- Exit Code: 2

Hide Details

Command Output (stderr): -- + : 'RUN: at line 1' + /Users/buildslave/jenkins/workspace/clang-stage2-Rthinlto/clang-build/Build/./bin/clang --driver-mode=g++ -static-libsan -arch x86_64 -stdlib=libc++ -mmacosx-version-min=10.10 -isysroot /Applications/Xcode.app/Contents/Developer/Platforms/MacOSX.platform/Developer/SDKs/MacOSX10.15.sdk -lc++abi -frtti -fsanitize=null,vptr -g /Users/buildslave/jenkins/workspace/clang-stage2-Rthinlto/llvm-project/compiler-rt/test/ubsan/TestCases/TypeCheck/vptr.cpp -O3 -o /Users/buildslave/jenkins/workspace/clang-stage2-Rthinlto/clang-build/Build/tools/clang/runtime/compiler-rt-bins/test/ubsan/StandaloneStatic-x86_64/TestCases/TypeCheck/Output/vptr.cpp.tmp -mllvm -enable-tail-merge=false /Users/buildslave/jenkins/workspace/clang-stage2-Rthinlto/llvm-project/compiler-rt/test/ubsan/TestCases/TypeCheck/vptr.cpp:67:12: warning: direct base 'S' is inaccessible due to ambiguity: struct U -> struct S struct U -> struct T -> struct S [-Winaccessible-base] struct U : S, T { virtual int v() { return 2; } }; ^ /Users/buildslave/jenkins/workspace/clang-stage2-Rthinlto/llvm-project/compiler-rt/test/ubsan/TestCases/TypeCheck/vptr.cpp:131:9: warning: 'reinterpret_cast' from class 'U *' to its base at non-zero offset 'T *' behaves differently from 'static_cast' [-Wreinterpret-base-class] p = reinterpret_cast<T*>(new U); ^~~~~~~~~~~~~~~~~~~~~~~~~~~ /Users/buildslave/jenkins/workspace/clang-stage2-Rthinlto/llvm-project/compiler-rt/test/ubsan/TestCases/TypeCheck/vptr.cpp:131:9: note: use 'static_cast' to adjust the pointer correctly while upcasting p = reinterpret_cast<T*>(new U); ^~~~~~~~~~~~~~~~ static_cast /Users/buildslave/jenkins/workspace/clang-stage2-Rthinlto/llvm-project/compiler-rt/test/ubsan/TestCases/TypeCheck/vptr.cpp:194:12: warning: 'reinterpret_cast' to class 'U *' from its base at non-zero offset 'T *' behaves differently from 'static_cast' [-Wreinterpret-base-class] return reinterpret_cast<U*>(p)->v() - 2; ^~~~~~~~~~~~~~~~~~~~~~~ /Users/buildslave/jenkins/workspace/clang-stage2-Rthinlto/llvm-project/compiler-rt/test/ubsan/TestCases/TypeCheck/vptr.cpp:194:12: note: use 'static_cast' to adjust the pointer correctly while downcasting return reinterpret_cast<U*>(p)->v() - 2; ^~~~~~~~~~~~~~~~ static_cast 3 warnings generated. + : 'RUN: at line 2' + env UBSAN_OPTIONS=abort_on_error=0:log_to_syslog=0:halt_on_error=1 /Users/buildslave/jenkins/workspace/clang-stage2-Rthinlto/clang-build/Build/tools/clang/runtime/compiler-rt-bins/test/ubsan/StandaloneStatic-x86_64/TestCases/TypeCheck/Output/vptr.cpp.tmp rT Test case: rT + : 'RUN: at line 3' + env UBSAN_OPTIONS=abort_on_error=0:log_to_syslog=0:halt_on_error=1 /Users/buildslave/jenkins/workspace/clang-stage2-Rthinlto/clang-build/Build/tools/clang/runtime/compiler-rt-bins/test/ubsan/StandaloneStatic-x86_64/TestCases/TypeCheck/Output/vptr.cpp.tmp mT Test case: mT + : 'RUN: at line 4' + env UBSAN_OPTIONS=abort_on_error=0:log_to_syslog=0:halt_on_error=1 /Users/buildslave/jenkins/workspace/clang-stage2-Rthinlto/clang-build/Build/tools/clang/runtime/compiler-rt-bins/test/ubsan/StandaloneStatic-x86_64/TestCases/TypeCheck/Output/vptr.cpp.tmp fT Test case: fT + : 'RUN: at line 5' + env UBSAN_OPTIONS=abort_on_error=0:log_to_syslog=0:halt_on_error=1 /Users/buildslave/jenkins/workspace/clang-stage2-Rthinlto/clang-build/Build/tools/clang/runtime/compiler-rt-bins/test/ubsan/StandaloneStatic-x86_64/TestCases/TypeCheck/Output/vptr.cpp.tmp cT Test case: cT + : 'RUN: at line 6' + env UBSAN_OPTIONS=abort_on_error=0:log_to_syslog=0:halt_on_error=1 /Users/buildslave/jenkins/workspace/clang-stage2-Rthinlto/clang-build/Build/tools/clang/runtime/compiler-rt-bins/test/ubsan/StandaloneStatic-x86_64/TestCases/TypeCheck/Output/vptr.cpp.tmp rU Test case: rU + : 'RUN: at line 7' + env UBSAN_OPTIONS=abort_on_error=0:log_to_syslog=0:halt_on_error=1 /Users/buildslave/jenkins/workspace/clang-stage2-Rthinlto/clang-build/Build/tools/clang/runtime/compiler-rt-bins/test/ubsan/StandaloneStatic-x86_64/TestCases/TypeCheck/Output/vptr.cpp.tmp mU Test case: mU + : 'RUN: at line 8' + env UBSAN_OPTIONS=abort_on_error=0:log_to_syslog=0:halt_on_error=1 /Users/buildslave/jenkins/workspace/clang-stage2-Rthinlto/clang-build/Build/tools/clang/runtime/compiler-rt-bins/test/ubsan/StandaloneStatic-x86_64/TestCases/TypeCheck/Output/vptr.cpp.tmp fU Test case: fU + : 'RUN: at line 9' + env UBSAN_OPTIONS=abort_on_error=0:log_to_syslog=0:halt_on_error=1 /Users/buildslave/jenkins/workspace/clang-stage2-Rthinlto/clang-build/Build/tools/clang/runtime/compiler-rt-bins/test/ubsan/StandaloneStatic-x86_64/TestCases/TypeCheck/Output/vptr.cpp.tmp cU Test case: cU + : 'RUN: at line 10' + env UBSAN_OPTIONS=abort_on_error=0:log_to_syslog=0:halt_on_error=1 /Users/buildslave/jenkins/workspace/clang-stage2-Rthinlto/clang-build/Build/tools/clang/runtime/compiler-rt-bins/test/ubsan/StandaloneStatic-x86_64/TestCases/TypeCheck/Output/vptr.cpp.tmp rS Test case: rS + : 'RUN: at line 11' + env UBSAN_OPTIONS=abort_on_error=0:log_to_syslog=0:halt_on_error=1 /Users/buildslave/jenkins/workspace/clang-stage2-Rthinlto/clang-build/Build/tools/clang/runtime/compiler-rt-bins/test/ubsan/StandaloneStatic-x86_64/TestCases/TypeCheck/Output/vptr.cpp.tmp rV Test case: rV + : 'RUN: at line 12' + env UBSAN_OPTIONS=abort_on_error=0:log_to_syslog=0:halt_on_error=1 /Users/buildslave/jenkins/workspace/clang-stage2-Rthinlto/clang-build/Build/tools/clang/runtime/compiler-rt-bins/test/ubsan/StandaloneStatic-x86_64/TestCases/TypeCheck/Output/vptr.cpp.tmp oV Test case: oV + : 'RUN: at line 13' + env UBSAN_OPTIONS=abort_on_error=0:log_to_syslog=0:halt_on_error=1 /Users/buildslave/jenkins/workspace/clang-stage2-Rthinlto/clang-build/Build/tools/clang/runtime/compiler-rt-bins/test/ubsan/StandaloneStatic-x86_64/TestCases/TypeCheck/Output/vptr.cpp.tmp zN Test case: zN + : 'RUN: at line 14' + env UBSAN_OPTIONS=abort_on_error=0:log_to_syslog=0:halt_on_error=1:print_stacktrace=1 not /Users/buildslave/jenkins/workspace/clang-stage2-Rthinlto/clang-build/Build/tools/clang/runtime/compiler-rt-bins/test/ubsan/StandaloneStatic-x86_64/TestCases/TypeCheck/Output/vptr.cpp.tmp mS + FileCheck /Users/buildslave/jenkins/workspace/clang-stage2-Rthinlto/llvm-project/compiler-rt/test/ubsan/TestCases/TypeCheck/vptr.cpp --check-prefix=CHECK-MEMBER --check-prefix=CHECK-Darwin-MEMBER --strict-whitespace error: no check strings found with prefix 'CHECK-Darwin-MEMBER:'

Hide Details

--

Hide Details

******************** PASS: UBSan-StandaloneStatic-x86_64 :: TestCases/TypeCheck/vptr-non-unique-typeinfo.cpp (2774 of 3112) PASS: UBSan-StandaloneStatic-x86_64 :: TestCases/TypeCheck/misaligned.cpp (2775 of 3112) PASS: UBSan-StandaloneStatic-x86_64 :: TestCases/Pointer/nullptr-and-nonzero-offset-constants.cpp (2776 of 3112) PASS: UBSan-StandaloneStatic-x86_64 :: TestCases/Pointer/nullptr-and-nonzero-offset-variable.cpp (2777 of 3112) PASS: UBSan-ThreadSanitizer-x86_64 :: TestCases/Float/cast-overflow.cpp (2778 of 3112) PASS: UBSan-ThreadSanitizer-x86_64 :: TestCases/ImplicitConversion/integer-conversion-incdec.c (2779 of 3112) PASS: UBSan-ThreadSanitizer-x86_64 :: TestCases/ImplicitConversion/integer-sign-change-blacklist.c (2780 of 3112) PASS: UBSan-ThreadSanitizer-x86_64 :: TestCases/ImplicitConversion/integer-arithmetic-value-change.c (2781 of 3112) PASS: UBSan-ThreadSanitizer-x86_64 :: TestCases/ImplicitConversion/integer-sign-change-summary.cpp (2782 of 3112) PASS: UBSan-ThreadSanitizer-x86_64 :: TestCases/ImplicitConversion/integer-conversion.c (2783 of 3112) PASS: UBSan-ThreadSanitizer-x86_64 :: TestCases/ImplicitConversion/integer-sign-change-incdec.c (2784 of 3112) PASS: UBSan-ThreadSanitizer-x86_64 :: TestCases/ImplicitConversion/integer-sign-change.c (2785 of 3112) PASS: UBSan-ThreadSanitizer-x86_64 :: TestCases/ImplicitConversion/integer-truncation.c (2786 of 3112) PASS: UBSan-ThreadSanitizer-x86_64 :: TestCases/ImplicitConversion/signed-integer-truncation-incdec.c (2787 of 3112) PASS: UBSan-ThreadSanitizer-x86_64 :: TestCases/ImplicitConversion/signed-integer-truncation-or-sign-change-summary.cpp (2788 of 3112) PASS: UBSan-ThreadSanitizer-x86_64 :: TestCases/ImplicitConversion/signed-integer-truncation-summary.cpp (2789 of 3112) PASS: UBSan-ThreadSanitizer-x86_64 :: TestCases/ImplicitConversion/signed-integer-truncation-blacklist.c (2790 of 3112) PASS: UBSan-ThreadSanitizer-x86_64 :: TestCases/ImplicitConversion/signed-integer-truncation-or-sign-change-blacklist.c (2791 of 3112) PASS: UBSan-ThreadSanitizer-x86_64 :: TestCases/ImplicitConversion/unsigned-integer-truncation-summary.cpp (2792 of 3112) PASS: UBSan-ThreadSanitizer-x86_64 :: TestCases/ImplicitConversion/signed-integer-truncation.c (2793 of 3112) PASS: UBSan-ThreadSanitizer-x86_64 :: TestCases/Integer/add-overflow.cpp (2794 of 3112) PASS: UBSan-ThreadSanitizer-x86_64 :: TestCases/Integer/div-overflow.cpp (2795 of 3112) PASS: UBSan-ThreadSanitizer-x86_64 :: TestCases/Integer/div-zero.cpp (2796 of 3112) PASS: UBSan-ThreadSanitizer-x86_64 :: TestCases/ImplicitConversion/unsigned-integer-truncation-blacklist.c (2797 of 3112) PASS: UBSan-ThreadSanitizer-x86_64 :: TestCases/Integer/mul-overflow.cpp (2798 of 3112) PASS: UBSan-ThreadSanitizer-x86_64 :: TestCases/Integer/incdec-overflow.cpp (2799 of 3112) PASS: UBSan-ThreadSanitizer-x86_64 :: TestCases/Integer/negate-overflow.cpp (2800 of 3112) PASS: UBSan-ThreadSanitizer-x86_64 :: TestCases/ImplicitConversion/unsigned-integer-truncation.c (2801 of 3112) PASS: UBSan-ThreadSanitizer-x86_64 :: TestCases/Integer/no-recover.cpp (2802 of 3112) UNSUPPORTED: UBSan-ThreadSanitizer-x86_64 :: TestCases/Integer/summary.cpp (2803 of 3112) PASS: UBSan-ThreadSanitizer-x86_64 :: TestCases/Integer/sub-overflow.cpp (2804 of 3112) PASS: UBSan-ThreadSanitizer-x86_64 :: TestCases/Integer/suppressions.cpp (2805 of 3112) PASS: UBSan-ThreadSanitizer-x86_64 :: TestCases/Integer/uadd-overflow.cpp (2806 of 3112) PASS: UBSan-ThreadSanitizer-x86_64 :: TestCases/Integer/umul-overflow.cpp (2807 of 3112) PASS: UBSan-ThreadSanitizer-x86_64 :: TestCases/Integer/unsigned-shift.cpp (2808 of 3112) UNSUPPORTED: UBSan-ThreadSanitizer-x86_64 :: TestCases/Misc/Linux/print_stack_trace.cpp (2809 of 3112) PASS: UBSan-ThreadSanitizer-x86_64 :: TestCases/Integer/uincdec-overflow.cpp (2810 of 3112) UNSUPPORTED: UBSan-ThreadSanitizer-x86_64 :: TestCases/Misc/Linux/ubsan_options.cpp (2811 of 3112) PASS: UBSan-ThreadSanitizer-x86_64 :: TestCases/Misc/bool.cpp (2812 of 3112) PASS: UBSan-ThreadSanitizer-x86_64 :: TestCases/Integer/usub-overflow.cpp (2813 of 3112) PASS: UBSan-ThreadSanitizer-x86_64 :: TestCases/Misc/bool.m (2814 of 3112) PASS: UBSan-ThreadSanitizer-x86_64 :: TestCases/Integer/shift.cpp (2815 of 3112) XFAIL: UBSan-ThreadSanitizer-x86_64 :: TestCases/Misc/coverage-levels.cpp (2816 of 3112) PASS: UBSan-ThreadSanitizer-x86_64 :: TestCases/Misc/builtins.cpp (2817 of 3112) PASS: UBSan-ThreadSanitizer-x86_64 :: TestCases/Misc/deduplication.cpp (2818 of 3112) PASS: UBSan-ThreadSanitizer-x86_64 :: TestCases/Misc/bounds.cpp (2819 of 3112) PASS: UBSan-ThreadSanitizer-x86_64 :: TestCases/Misc/enum.cpp (2820 of 3112) PASS: UBSan-ThreadSanitizer-x86_64 :: TestCases/Misc/log-path_test.cpp (2821 of 3112) UNSUPPORTED: UBSan-ThreadSanitizer-x86_64 :: TestCases/Misc/no-interception.cpp (2822 of 3112) PASS: UBSan-ThreadSanitizer-x86_64 :: TestCases/Misc/missing_return.cpp (2823 of 3112) PASS: UBSan-ThreadSanitizer-x86_64 :: TestCases/Misc/monitor.cpp (2824 of 3112) PASS: UBSan-ThreadSanitizer-x86_64 :: TestCases/Misc/nullability.c (2825 of 3112) PASS: UBSan-ThreadSanitizer-x86_64 :: TestCases/Misc/nonnull.cpp (2826 of 3112) PASS: UBSan-ThreadSanitizer-x86_64 :: TestCases/Misc/print_summary.c (2827 of 3112) PASS: UBSan-ThreadSanitizer-x86_64 :: TestCases/Misc/nonnull-arg.cpp (2828 of 3112) PASS: UBSan-ThreadSanitizer-x86_64 :: TestCases/Misc/objc-cast.m (2829 of 3112) PASS: UBSan-ThreadSanitizer-x86_64 :: TestCases/Misc/unreachable.cpp (2830 of 3112) PASS: UBSan-ThreadSanitizer-x86_64 :: TestCases/Misc/vla.c (2831 of 3112) PASS: UBSan-ThreadSanitizer-x86_64 :: TestCases/Pointer/alignment-assumption-attribute-align_value-on-lvalue.cpp (2832 of 3112) PASS: UBSan-ThreadSanitizer-x86_64 :: TestCases/Pointer/alignment-assumption-attribute-align_value-on-paramvar.cpp (2833 of 3112) PASS: UBSan-ThreadSanitizer-x86_64 :: TestCases/Pointer/alignment-assumption-attribute-alloc_align-on-function-variable.cpp (2834 of 3112) PASS: UBSan-ThreadSanitizer-x86_64 :: TestCases/Pointer/alignment-assumption-attribute-alloc_align-on-function.cpp (2835 of 3112) PASS: UBSan-ThreadSanitizer-x86_64 :: TestCases/Pointer/alignment-assumption-attribute-assume_aligned-on-function.cpp (2836 of 3112) PASS: UBSan-ThreadSanitizer-x86_64 :: TestCases/Pointer/alignment-assumption-attribute-assume_aligned-on-function-two-params.cpp (2837 of 3112) PASS: UBSan-ThreadSanitizer-x86_64 :: TestCases/Pointer/alignment-assumption-blacklist.cpp (2838 of 3112) PASS: UBSan-ThreadSanitizer-x86_64 :: TestCases/Pointer/alignment-assumption-builtin_assume_aligned-three-params.cpp (2839 of 3112) PASS: UBSan-ThreadSanitizer-x86_64 :: TestCases/Pointer/alignment-assumption-builtin_assume_aligned-three-params-variable.cpp (2840 of 3112) PASS: UBSan-ThreadSanitizer-x86_64 :: TestCases/Pointer/alignment-assumption-builtin_assume_aligned-two-params.cpp (2841 of 3112) PASS: UBSan-ThreadSanitizer-x86_64 :: TestCases/Pointer/alignment-assumption-summary.cpp (2842 of 3112) PASS: UBSan-ThreadSanitizer-x86_64 :: TestCases/Pointer/index-overflow.cpp (2843 of 3112) PASS: UBSan-ThreadSanitizer-x86_64 :: TestCases/Pointer/nullptr-and-nonzero-offset-summary.cpp (2844 of 3112) UNSUPPORTED: XRay-x86_64-darwin :: TestCases/Posix/always-never-instrument.cpp (2845 of 3112) UNSUPPORTED: XRay-x86_64-darwin :: TestCases/Posix/arg1-arg0-logging.cpp (2846 of 3112) UNSUPPORTED: XRay-x86_64-darwin :: TestCases/Posix/arg1-logger.cpp (2847 of 3112) UNSUPPORTED: XRay-x86_64-darwin :: TestCases/Posix/arg1-logging-implicit-this.cpp (2848 of 3112) UNSUPPORTED: XRay-x86_64-darwin :: TestCases/Posix/argv0-log-file-name.cpp (2849 of 3112) UNSUPPORTED: XRay-x86_64-darwin :: TestCases/Posix/basic-filtering.cpp (2850 of 3112) UNSUPPORTED: XRay-x86_64-darwin :: TestCases/Posix/c-test.cpp (2851 of 3112) UNSUPPORTED: XRay-x86_64-darwin :: TestCases/Posix/clang-no-xray-instrument.cpp (2852 of 3112) UNSUPPORTED: XRay-x86_64-darwin :: TestCases/Posix/common-trampoline-alignment.cpp (2853 of 3112) UNSUPPORTED: XRay-x86_64-darwin :: TestCases/Posix/coverage-sample.cpp (2854 of 3112) UNSUPPORTED: XRay-x86_64-darwin :: TestCases/Posix/custom-event-handler-alignment.cpp (2855 of 3112) UNSUPPORTED: XRay-x86_64-darwin :: TestCases/Posix/custom-event-logging.cpp (2856 of 3112) UNSUPPORTED: XRay-x86_64-darwin :: TestCases/Posix/fdr-mode-inmemory.cpp (2857 of 3112) UNSUPPORTED: XRay-x86_64-darwin :: TestCases/Posix/fdr-mode-multiple.cpp (2858 of 3112) UNSUPPORTED: XRay-x86_64-darwin :: TestCases/Posix/fdr-mode.cpp (2859 of 3112) UNSUPPORTED: XRay-x86_64-darwin :: TestCases/Posix/fdr-reinit.cpp (2860 of 3112) UNSUPPORTED: XRay-x86_64-darwin :: TestCases/Posix/fdr-single-thread.cpp (2861 of 3112) UNSUPPORTED: XRay-x86_64-darwin :: TestCases/Posix/fdr-thread-order.cpp (2862 of 3112) UNSUPPORTED: XRay-x86_64-darwin :: TestCases/Posix/fixedsize-logging.cpp (2863 of 3112) UNSUPPORTED: XRay-x86_64-darwin :: TestCases/Posix/fork_basic_logging.cpp (2864 of 3112) UNSUPPORTED: XRay-x86_64-darwin :: TestCases/Posix/func-id-utils.cpp (2865 of 3112) UNSUPPORTED: XRay-x86_64-darwin :: TestCases/Posix/logging-modes.cpp (2866 of 3112) UNSUPPORTED: XRay-x86_64-darwin :: TestCases/Posix/optional-inmemory-log.cpp (2867 of 3112) UNSUPPORTED: XRay-x86_64-darwin :: TestCases/Posix/patching-unpatching.cpp (2868 of 3112) UNSUPPORTED: XRay-x86_64-darwin :: TestCases/Posix/pic_test.cpp (2869 of 3112) UNSUPPORTED: XRay-x86_64-darwin :: TestCases/Posix/profiling-multi-threaded.cpp (2870 of 3112) UNSUPPORTED: XRay-x86_64-darwin :: TestCases/Posix/profiling-single-threaded.cpp (2871 of 3112) UNSUPPORTED: XRay-x86_64-darwin :: TestCases/Posix/quiet-start.cpp (2872 of 3112) UNSUPPORTED: XRay-x86_64h-darwin :: TestCases/Posix/always-never-instrument.cpp (2873 of 3112) UNSUPPORTED: XRay-x86_64h-darwin :: TestCases/Posix/arg1-arg0-logging.cpp (2874 of 3112) UNSUPPORTED: XRay-x86_64h-darwin :: TestCases/Posix/arg1-logger.cpp (2875 of 3112) UNSUPPORTED: XRay-x86_64h-darwin :: TestCases/Posix/arg1-logging-implicit-this.cpp (2876 of 3112) UNSUPPORTED: XRay-x86_64h-darwin :: TestCases/Posix/argv0-log-file-name.cpp (2877 of 3112) UNSUPPORTED: XRay-x86_64h-darwin :: TestCases/Posix/basic-filtering.cpp (2878 of 3112) UNSUPPORTED: XRay-x86_64h-darwin :: TestCases/Posix/c-test.cpp (2879 of 3112) UNSUPPORTED: XRay-x86_64h-darwin :: TestCases/Posix/clang-no-xray-instrument.cpp (2880 of 3112) UNSUPPORTED: XRay-x86_64h-darwin :: TestCases/Posix/common-trampoline-alignment.cpp (2881 of 3112) UNSUPPORTED: XRay-x86_64h-darwin :: TestCases/Posix/coverage-sample.cpp (2882 of 3112) UNSUPPORTED: XRay-x86_64h-darwin :: TestCases/Posix/custom-event-handler-alignment.cpp (2883 of 3112) UNSUPPORTED: XRay-x86_64h-darwin :: TestCases/Posix/custom-event-logging.cpp (2884 of 3112) UNSUPPORTED: XRay-x86_64h-darwin :: TestCases/Posix/fdr-mode-inmemory.cpp (2885 of 3112) UNSUPPORTED: XRay-x86_64h-darwin :: TestCases/Posix/fdr-mode-multiple.cpp (2886 of 3112) UNSUPPORTED: XRay-x86_64h-darwin :: TestCases/Posix/fdr-mode.cpp (2887 of 3112) UNSUPPORTED: XRay-x86_64h-darwin :: TestCases/Posix/fdr-reinit.cpp (2888 of 3112) UNSUPPORTED: XRay-x86_64h-darwin :: TestCases/Posix/fdr-single-thread.cpp (2889 of 3112) UNSUPPORTED: XRay-x86_64h-darwin :: TestCases/Posix/fdr-thread-order.cpp (2890 of 3112) UNSUPPORTED: XRay-x86_64h-darwin :: TestCases/Posix/fixedsize-logging.cpp (2891 of 3112) UNSUPPORTED: XRay-x86_64h-darwin :: TestCases/Posix/fork_basic_logging.cpp (2892 of 3112) UNSUPPORTED: XRay-x86_64h-darwin :: TestCases/Posix/func-id-utils.cpp (2893 of 3112) UNSUPPORTED: XRay-x86_64h-darwin :: TestCases/Posix/logging-modes.cpp (2894 of 3112) UNSUPPORTED: XRay-x86_64h-darwin :: TestCases/Posix/optional-inmemory-log.cpp (2895 of 3112) UNSUPPORTED: XRay-x86_64h-darwin :: TestCases/Posix/patching-unpatching.cpp (2896 of 3112) UNSUPPORTED: XRay-x86_64h-darwin :: TestCases/Posix/pic_test.cpp (2897 of 3112) UNSUPPORTED: XRay-x86_64h-darwin :: TestCases/Posix/profiling-multi-threaded.cpp (2898 of 3112) UNSUPPORTED: XRay-x86_64h-darwin :: TestCases/Posix/profiling-single-threaded.cpp (2899 of 3112) UNSUPPORTED: XRay-x86_64h-darwin :: TestCases/Posix/quiet-start.cpp (2900 of 3112) PASS: UBSan-ThreadSanitizer-x86_64 :: TestCases/Pointer/alignment-assumption-openmp.cpp (2901 of 3112) PASS: UBSan-ThreadSanitizer-x86_64 :: TestCases/Pointer/unsigned-index-expression.cpp (2902 of 3112) PASS: cfi-devirt-x86_64 :: bad-split.cpp (2903 of 3112) PASS: cfi-devirt-x86_64 :: anon-namespace.cpp (2904 of 3112) UNSUPPORTED: cfi-devirt-x86_64 :: create-derivers.test (2905 of 3112) UNSUPPORTED: UBSan-ThreadSanitizer-x86_64 :: TestCases/TypeCheck/Linux/PR33221.cpp (2906 of 3112) PASS: UBSan-ThreadSanitizer-x86_64 :: TestCases/Pointer/nullptr-and-nonzero-offset-constants.cpp (2907 of 3112) UNSUPPORTED: cfi-devirt-x86_64 :: cross-dso/icall/diag.cpp (2908 of 3112) UNSUPPORTED: cfi-devirt-x86_64 :: cross-dso/icall/dlopen.cpp (2909 of 3112) UNSUPPORTED: cfi-devirt-x86_64 :: cross-dso/icall/icall-from-dso.cpp (2910 of 3112) UNSUPPORTED: cfi-devirt-x86_64 :: cross-dso/icall/icall.cpp (2911 of 3112) UNSUPPORTED: cfi-devirt-x86_64 :: cross-dso/shadow_is_read_only.cpp (2912 of 3112) UNSUPPORTED: cfi-devirt-x86_64 :: cross-dso/simple-fail.cpp (2913 of 3112) UNSUPPORTED: cfi-devirt-x86_64 :: cross-dso/simple-pass.cpp (2914 of 3112) UNSUPPORTED: cfi-devirt-x86_64 :: cross-dso/stats.cpp (2915 of 3112) UNSUPPORTED: cfi-devirt-x86_64 :: cross-dso/target_out_of_bounds.cpp (2916 of 3112) UNSUPPORTED: cfi-devirt-x86_64 :: icall/external-call.c (2917 of 3112) XFAIL: cfi-devirt-x86_64 :: icall/weak.c (2918 of 3112) UNSUPPORTED: cfi-devirt-x86_64 :: icall/wrong-signature-mixed-lto.c (2919 of 3112) PASS: cfi-devirt-x86_64 :: bad-cast.cpp (2920 of 3112) PASS: UBSan-ThreadSanitizer-x86_64 :: TestCases/TypeCheck/PR33221.cpp (2921 of 3112) PASS: cfi-devirt-x86_64 :: cross-dso-diagnostic.cpp (2922 of 3112) PASS: cfi-devirt-x86_64 :: multiple-inheritance2.cpp (2923 of 3112) PASS: cfi-devirt-x86_64 :: icall/bad-signature.c (2924 of 3112) PASS: cfi-devirt-x86_64 :: mfcall.cpp (2925 of 3112) XFAIL: cfi-devirt-x86_64 :: sibling.cpp (2926 of 3112) XFAIL: cfi-devirt-x86_64 :: simple-pass.cpp (2927 of 3112) UNSUPPORTED: cfi-devirt-x86_64 :: stats.cpp (2928 of 3112) PASS: cfi-devirt-x86_64 :: target_uninstrumented.cpp (2929 of 3112) PASS: UBSan-ThreadSanitizer-x86_64 :: TestCases/TypeCheck/Function/function.cpp (2930 of 3112) PASS: cfi-devirt-x86_64 :: multiple-inheritance.cpp (2931 of 3112) PASS: cfi-devirt-x86_64 :: nvcall.cpp (2932 of 3112) XFAIL: cfi-devirt-x86_64 :: two-vcalls.cpp (2933 of 3112) PASS: cfi-devirt-x86_64 :: vtable-may-alias.cpp (2934 of 3112) PASS: cfi-devirt-x86_64 :: overwrite.cpp (2935 of 3112) PASS: cfi-standalone-x86_64 :: bad-split.cpp (2936 of 3112) UNSUPPORTED: cfi-standalone-x86_64 :: create-derivers.test (2937 of 3112) PASS: cfi-standalone-x86_64 :: cross-dso-diagnostic.cpp (2938 of 3112) UNSUPPORTED: cfi-standalone-x86_64 :: cross-dso/icall/diag.cpp (2939 of 3112) UNSUPPORTED: cfi-standalone-x86_64 :: cross-dso/icall/dlopen.cpp (2940 of 3112) UNSUPPORTED: cfi-standalone-x86_64 :: cross-dso/icall/icall-from-dso.cpp (2941 of 3112) UNSUPPORTED: cfi-standalone-x86_64 :: cross-dso/icall/icall.cpp (2942 of 3112) UNSUPPORTED: cfi-standalone-x86_64 :: cross-dso/shadow_is_read_only.cpp (2943 of 3112) UNSUPPORTED: cfi-standalone-x86_64 :: cross-dso/simple-fail.cpp (2944 of 3112) UNSUPPORTED: cfi-standalone-x86_64 :: cross-dso/simple-pass.cpp (2945 of 3112) UNSUPPORTED: cfi-standalone-x86_64 :: cross-dso/stats.cpp (2946 of 3112) UNSUPPORTED: cfi-standalone-x86_64 :: cross-dso/target_out_of_bounds.cpp (2947 of 3112) PASS: cfi-devirt-x86_64 :: base-derived-destructor.cpp (2948 of 3112) UNSUPPORTED: cfi-standalone-x86_64 :: icall/external-call.c (2949 of 3112) XFAIL: cfi-standalone-x86_64 :: icall/weak.c (2950 of 3112) UNSUPPORTED: cfi-standalone-x86_64 :: icall/wrong-signature-mixed-lto.c (2951 of 3112) PASS: cfi-devirt-x86_64 :: vdtor.cpp (2952 of 3112) PASS: cfi-standalone-x86_64 :: anon-namespace.cpp (2953 of 3112) PASS: cfi-standalone-x86_64 :: multiple-inheritance2.cpp (2954 of 3112) PASS: cfi-standalone-x86_64 :: icall/bad-signature.c (2955 of 3112) PASS: cfi-standalone-x86_64 :: bad-cast.cpp (2956 of 3112) XFAIL: cfi-standalone-x86_64 :: sibling.cpp (2957 of 3112) PASS: cfi-standalone-x86_64 :: mfcall.cpp (2958 of 3112) XFAIL: cfi-standalone-x86_64 :: simple-pass.cpp (2959 of 3112) PASS: cfi-standalone-x86_64 :: stats.cpp (2960 of 3112) PASS: cfi-standalone-x86_64 :: multiple-inheritance.cpp (2961 of 3112) PASS: cfi-standalone-x86_64 :: nvcall.cpp (2962 of 3112) PASS: cfi-standalone-x86_64 :: overwrite.cpp (2963 of 3112) PASS: cfi-standalone-x86_64 :: vtable-may-alias.cpp (2964 of 3112) XFAIL: cfi-standalone-x86_64 :: two-vcalls.cpp (2965 of 3112) PASS: cfi-standalone-x86_64 :: target_uninstrumented.cpp (2966 of 3112) PASS: cfi-standalone-x86_64 :: base-derived-destructor.cpp (2967 of 3112) PASS: cfi-devirt-x86_64 :: simple-fail.cpp (2968 of 3112) PASS: cfi-standalone-x86_64 :: vdtor.cpp (2969 of 3112) PASS: UBSan-ThreadSanitizer-x86_64 :: TestCases/TypeCheck/null.cpp (2970 of 3112) PASS: cfi-standalone-x86_64 :: simple-fail.cpp (2971 of 3112) PASS: UBSan-ThreadSanitizer-x86_64 :: TestCases/TypeCheck/vptr-corrupted-vtable-itanium.cpp (2972 of 3112) PASS: UBSan-ThreadSanitizer-x86_64 :: TestCases/TypeCheck/vptr-non-unique-typeinfo.cpp (2973 of 3112) UNSUPPORTED: UBSan-ThreadSanitizer-x86_64 :: TestCases/TypeCheck/vptr-ptrauth-unauthenticated.cpp (2974 of 3112) PASS: UBSan-ThreadSanitizer-x86_64 :: TestCases/TypeCheck/vptr-virtual-base-construction.cpp (2975 of 3112) PASS: UBSan-ThreadSanitizer-x86_64 :: TestCases/TypeCheck/vptr-virtual-base.cpp (2976 of 3112) PASS: UBSan-ThreadSanitizer-x86_64 :: TestCases/Pointer/nullptr-and-nonzero-offset-variable.cpp (2977 of 3112) PASS: UBSan-ThreadSanitizer-x86_64 :: TestCases/TypeCheck/misaligned.cpp (2978 of 3112) UNSUPPORTED: libFuzzer :: afl-driver-close-fd-mask.test (2979 of 3112) PASS: libFuzzer :: acquire-crash-state.test (2980 of 3112) UNSUPPORTED: libFuzzer :: afl-driver.test (2981 of 3112) PASS: libFuzzer :: bad-strcmp.test (2982 of 3112) UNSUPPORTED: libFuzzer :: bcmp.test (2983 of 3112) PASS: libFuzzer :: bogus-initialize.test (2984 of 3112) PASS: libFuzzer :: afl-driver-stderr.test (2985 of 3112) PASS: libFuzzer :: buffer-overflow-on-input.test (2986 of 3112) PASS: libFuzzer :: caller-callee.test (2987 of 3112) UNSUPPORTED: libFuzzer :: compressed.test (2988 of 3112) FAIL: UBSan-ThreadSanitizer-x86_64 :: TestCases/TypeCheck/vptr.cpp (2989 of 3112) ******************** TEST 'UBSan-ThreadSanitizer-x86_64 :: TestCases/TypeCheck/vptr.cpp' FAILED ******************** Script: -- : 'RUN: at line 1'; /Users/buildslave/jenkins/workspace/clang-stage2-Rthinlto/clang-build/Build/./bin/clang --driver-mode=g++ -fsanitize=thread -arch x86_64 -stdlib=libc++ -mmacosx-version-min=10.10 -isysroot /Applications/Xcode.app/Contents/Developer/Platforms/MacOSX.platform/Developer/SDKs/MacOSX10.15.sdk -frtti -fsanitize=null,vptr -g /Users/buildslave/jenkins/workspace/clang-stage2-Rthinlto/llvm-project/compiler-rt/test/ubsan/TestCases/TypeCheck/vptr.cpp -O3 -o /Users/buildslave/jenkins/workspace/clang-stage2-Rthinlto/clang-build/Build/tools/clang/runtime/compiler-rt-bins/test/ubsan/ThreadSanitizer-x86_64/TestCases/TypeCheck/Output/vptr.cpp.tmp -mllvm -enable-tail-merge=false : 'RUN: at line 2'; env UBSAN_OPTIONS=abort_on_error=0:log_to_syslog=0:halt_on_error=1 /Users/buildslave/jenkins/workspace/clang-stage2-Rthinlto/clang-build/Build/tools/clang/runtime/compiler-rt-bins/test/ubsan/ThreadSanitizer-x86_64/TestCases/TypeCheck/Output/vptr.cpp.tmp rT : 'RUN: at line 3'; env UBSAN_OPTIONS=abort_on_error=0:log_to_syslog=0:halt_on_error=1 /Users/buildslave/jenkins/workspace/clang-stage2-Rthinlto/clang-build/Build/tools/clang/runtime/compiler-rt-bins/test/ubsan/ThreadSanitizer-x86_64/TestCases/TypeCheck/Output/vptr.cpp.tmp mT : 'RUN: at line 4'; env UBSAN_OPTIONS=abort_on_error=0:log_to_syslog=0:halt_on_error=1 /Users/buildslave/jenkins/workspace/clang-stage2-Rthinlto/clang-build/Build/tools/clang/runtime/compiler-rt-bins/test/ubsan/ThreadSanitizer-x86_64/TestCases/TypeCheck/Output/vptr.cpp.tmp fT : 'RUN: at line 5'; env UBSAN_OPTIONS=abort_on_error=0:log_to_syslog=0:halt_on_error=1 /Users/buildslave/jenkins/workspace/clang-stage2-Rthinlto/clang-build/Build/tools/clang/runtime/compiler-rt-bins/test/ubsan/ThreadSanitizer-x86_64/TestCases/TypeCheck/Output/vptr.cpp.tmp cT : 'RUN: at line 6'; env UBSAN_OPTIONS=abort_on_error=0:log_to_syslog=0:halt_on_error=1 /Users/buildslave/jenkins/workspace/clang-stage2-Rthinlto/clang-build/Build/tools/clang/runtime/compiler-rt-bins/test/ubsan/ThreadSanitizer-x86_64/TestCases/TypeCheck/Output/vptr.cpp.tmp rU : 'RUN: at line 7'; env UBSAN_OPTIONS=abort_on_error=0:log_to_syslog=0:halt_on_error=1 /Users/buildslave/jenkins/workspace/clang-stage2-Rthinlto/clang-build/Build/tools/clang/runtime/compiler-rt-bins/test/ubsan/ThreadSanitizer-x86_64/TestCases/TypeCheck/Output/vptr.cpp.tmp mU : 'RUN: at line 8'; env UBSAN_OPTIONS=abort_on_error=0:log_to_syslog=0:halt_on_error=1 /Users/buildslave/jenkins/workspace/clang-stage2-Rthinlto/clang-build/Build/tools/clang/runtime/compiler-rt-bins/test/ubsan/ThreadSanitizer-x86_64/TestCases/TypeCheck/Output/vptr.cpp.tmp fU : 'RUN: at line 9'; env UBSAN_OPTIONS=abort_on_error=0:log_to_syslog=0:halt_on_error=1 /Users/buildslave/jenkins/workspace/clang-stage2-Rthinlto/clang-build/Build/tools/clang/runtime/compiler-rt-bins/test/ubsan/ThreadSanitizer-x86_64/TestCases/TypeCheck/Output/vptr.cpp.tmp cU : 'RUN: at line 10'; env UBSAN_OPTIONS=abort_on_error=0:log_to_syslog=0:halt_on_error=1 /Users/buildslave/jenkins/workspace/clang-stage2-Rthinlto/clang-build/Build/tools/clang/runtime/compiler-rt-bins/test/ubsan/ThreadSanitizer-x86_64/TestCases/TypeCheck/Output/vptr.cpp.tmp rS : 'RUN: at line 11'; env UBSAN_OPTIONS=abort_on_error=0:log_to_syslog=0:halt_on_error=1 /Users/buildslave/jenkins/workspace/clang-stage2-Rthinlto/clang-build/Build/tools/clang/runtime/compiler-rt-bins/test/ubsan/ThreadSanitizer-x86_64/TestCases/TypeCheck/Output/vptr.cpp.tmp rV : 'RUN: at line 12'; env UBSAN_OPTIONS=abort_on_error=0:log_to_syslog=0:halt_on_error=1 /Users/buildslave/jenkins/workspace/clang-stage2-Rthinlto/clang-build/Build/tools/clang/runtime/compiler-rt-bins/test/ubsan/ThreadSanitizer-x86_64/TestCases/TypeCheck/Output/vptr.cpp.tmp oV : 'RUN: at line 13'; env UBSAN_OPTIONS=abort_on_error=0:log_to_syslog=0:halt_on_error=1 /Users/buildslave/jenkins/workspace/clang-stage2-Rthinlto/clang-build/Build/tools/clang/runtime/compiler-rt-bins/test/ubsan/ThreadSanitizer-x86_64/TestCases/TypeCheck/Output/vptr.cpp.tmp zN : 'RUN: at line 14'; env UBSAN_OPTIONS=abort_on_error=0:log_to_syslog=0:halt_on_error=1:print_stacktrace=1 not /Users/buildslave/jenkins/workspace/clang-stage2-Rthinlto/clang-build/Build/tools/clang/runtime/compiler-rt-bins/test/ubsan/ThreadSanitizer-x86_64/TestCases/TypeCheck/Output/vptr.cpp.tmp mS 2>&1 | FileCheck /Users/buildslave/jenkins/workspace/clang-stage2-Rthinlto/llvm-project/compiler-rt/test/ubsan/TestCases/TypeCheck/vptr.cpp --check-prefix=CHECK-MEMBER --check-prefix=CHECK-Darwin-MEMBER --strict-whitespace : 'RUN: at line 15'; env UBSAN_OPTIONS=abort_on_error=0:log_to_syslog=0:halt_on_error=1:print_stacktrace=1 not /Users/buildslave/jenkins/workspace/clang-stage2-Rthinlto/clang-build/Build/tools/clang/runtime/compiler-rt-bins/test/ubsan/ThreadSanitizer-x86_64/TestCases/TypeCheck/Output/vptr.cpp.tmp fS 2>&1 | FileCheck /Users/buildslave/jenkins/workspace/clang-stage2-Rthinlto/llvm-project/compiler-rt/test/ubsan/TestCases/TypeCheck/vptr.cpp --check-prefix=CHECK-MEMFUN --strict-whitespace : 'RUN: at line 16'; env UBSAN_OPTIONS=abort_on_error=0:log_to_syslog=0:halt_on_error=1:print_stacktrace=1 not /Users/buildslave/jenkins/workspace/clang-stage2-Rthinlto/clang-build/Build/tools/clang/runtime/compiler-rt-bins/test/ubsan/ThreadSanitizer-x86_64/TestCases/TypeCheck/Output/vptr.cpp.tmp cS 2>&1 | FileCheck /Users/buildslave/jenkins/workspace/clang-stage2-Rthinlto/llvm-project/compiler-rt/test/ubsan/TestCases/TypeCheck/vptr.cpp --check-prefix=CHECK-DOWNCAST --check-prefix=CHECK-Darwin-DOWNCAST --strict-whitespace : 'RUN: at line 17'; env UBSAN_OPTIONS=abort_on_error=0:log_to_syslog=0:halt_on_error=1:print_stacktrace=1 not /Users/buildslave/jenkins/workspace/clang-stage2-Rthinlto/clang-build/Build/tools/clang/runtime/compiler-rt-bins/test/ubsan/ThreadSanitizer-x86_64/TestCases/TypeCheck/Output/vptr.cpp.tmp mV 2>&1 | FileCheck /Users/buildslave/jenkins/workspace/clang-stage2-Rthinlto/llvm-project/compiler-rt/test/ubsan/TestCases/TypeCheck/vptr.cpp --check-prefix=CHECK-MEMBER --check-prefix=CHECK-Darwin-MEMBER --strict-whitespace : 'RUN: at line 18'; env UBSAN_OPTIONS=abort_on_error=0:log_to_syslog=0:halt_on_error=1:print_stacktrace=1 not /Users/buildslave/jenkins/workspace/clang-stage2-Rthinlto/clang-build/Build/tools/clang/runtime/compiler-rt-bins/test/ubsan/ThreadSanitizer-x86_64/TestCases/TypeCheck/Output/vptr.cpp.tmp fV 2>&1 | FileCheck /Users/buildslave/jenkins/workspace/clang-stage2-Rthinlto/llvm-project/compiler-rt/test/ubsan/TestCases/TypeCheck/vptr.cpp --check-prefix=CHECK-MEMFUN --strict-whitespace : 'RUN: at line 19'; env UBSAN_OPTIONS=abort_on_error=0:log_to_syslog=0:halt_on_error=1:print_stacktrace=1 not /Users/buildslave/jenkins/workspace/clang-stage2-Rthinlto/clang-build/Build/tools/clang/runtime/compiler-rt-bins/test/ubsan/ThreadSanitizer-x86_64/TestCases/TypeCheck/Output/vptr.cpp.tmp cV 2>&1 | FileCheck /Users/buildslave/jenkins/workspace/clang-stage2-Rthinlto/llvm-project/compiler-rt/test/ubsan/TestCases/TypeCheck/vptr.cpp --check-prefix=CHECK-DOWNCAST --check-prefix=CHECK-Darwin-DOWNCAST --strict-whitespace : 'RUN: at line 20'; env UBSAN_OPTIONS=abort_on_error=0:log_to_syslog=0:halt_on_error=1:print_stacktrace=1 not /Users/buildslave/jenkins/workspace/clang-stage2-Rthinlto/clang-build/Build/tools/clang/runtime/compiler-rt-bins/test/ubsan/ThreadSanitizer-x86_64/TestCases/TypeCheck/Output/vptr.cpp.tmp oU 2>&1 | FileCheck /Users/buildslave/jenkins/workspace/clang-stage2-Rthinlto/llvm-project/compiler-rt/test/ubsan/TestCases/TypeCheck/vptr.cpp --check-prefix=CHECK-OFFSET --check-prefix=CHECK-Darwin-OFFSET --strict-whitespace : 'RUN: at line 21'; env UBSAN_OPTIONS=abort_on_error=0:log_to_syslog=0:halt_on_error=1:print_stacktrace=1 not /Users/buildslave/jenkins/workspace/clang-stage2-Rthinlto/clang-build/Build/tools/clang/runtime/compiler-rt-bins/test/ubsan/ThreadSanitizer-x86_64/TestCases/TypeCheck/Output/vptr.cpp.tmp m0 2>&1 | FileCheck /Users/buildslave/jenkins/workspace/clang-stage2-Rthinlto/llvm-project/compiler-rt/test/ubsan/TestCases/TypeCheck/vptr.cpp --check-prefix=CHECK-INVALID-MEMBER --check-prefix=CHECK-Darwin-NULL-MEMBER --strict-whitespace : 'RUN: at line 22'; env UBSAN_OPTIONS=abort_on_error=0:log_to_syslog=0:halt_on_error=1:print_stacktrace=1 not /Users/buildslave/jenkins/workspace/clang-stage2-Rthinlto/clang-build/Build/tools/clang/runtime/compiler-rt-bins/test/ubsan/ThreadSanitizer-x86_64/TestCases/TypeCheck/Output/vptr.cpp.tmp m0 2>&1 | FileCheck /Users/buildslave/jenkins/workspace/clang-stage2-Rthinlto/llvm-project/compiler-rt/test/ubsan/TestCases/TypeCheck/vptr.cpp --check-prefix=CHECK-INVALID-MEMBER --check-prefix=CHECK-Darwin-NULL-MEMBER --strict-whitespace : 'RUN: at line 23'; env UBSAN_OPTIONS=abort_on_error=0:log_to_syslog=0:halt_on_error=1 not /Users/buildslave/jenkins/workspace/clang-stage2-Rthinlto/clang-build/Build/tools/clang/runtime/compiler-rt-bins/test/ubsan/ThreadSanitizer-x86_64/TestCases/TypeCheck/Output/vptr.cpp.tmp nN 2>&1 | FileCheck /Users/buildslave/jenkins/workspace/clang-stage2-Rthinlto/llvm-project/compiler-rt/test/ubsan/TestCases/TypeCheck/vptr.cpp --check-prefix=CHECK-NULL-MEMFUN --strict-whitespace : 'RUN: at line 24'; env UBSAN_OPTIONS=abort_on_error=0:log_to_syslog=0:print_stacktrace=1 /Users/buildslave/jenkins/workspace/clang-stage2-Rthinlto/clang-build/Build/tools/clang/runtime/compiler-rt-bins/test/ubsan/ThreadSanitizer-x86_64/TestCases/TypeCheck/Output/vptr.cpp.tmp dT 2>&1 | FileCheck /Users/buildslave/jenkins/workspace/clang-stage2-Rthinlto/llvm-project/compiler-rt/test/ubsan/TestCases/TypeCheck/vptr.cpp --check-prefix=CHECK-DYNAMIC --check-prefix=CHECK-Darwin-DYNAMIC --strict-whitespace : 'RUN: at line 26'; (echo "vptr_check:S"; echo "vptr_check:T"; echo "vptr_check:U") > /Users/buildslave/jenkins/workspace/clang-stage2-Rthinlto/clang-build/Build/tools/clang/runtime/compiler-rt-bins/test/ubsan/ThreadSanitizer-x86_64/TestCases/TypeCheck/Output/vptr.cpp.tmp.supp : 'RUN: at line 27'; env UBSAN_OPTIONS=abort_on_error=0:log_to_syslog=0:halt_on_error=1:suppressions='"/Users/buildslave/jenkins/workspace/clang-stage2-Rthinlto/clang-build/Build/tools/clang/runtime/compiler-rt-bins/test/ubsan/ThreadSanitizer-x86_64/TestCases/TypeCheck/Output/vptr.cpp.tmp.supp"' /Users/buildslave/jenkins/workspace/clang-stage2-Rthinlto/clang-build/Build/tools/clang/runtime/compiler-rt-bins/test/ubsan/ThreadSanitizer-x86_64/TestCases/TypeCheck/Output/vptr.cpp.tmp mS : 'RUN: at line 28'; env UBSAN_OPTIONS=abort_on_error=0:log_to_syslog=0:halt_on_error=1:suppressions='"/Users/buildslave/jenkins/workspace/clang-stage2-Rthinlto/clang-build/Build/tools/clang/runtime/compiler-rt-bins/test/ubsan/ThreadSanitizer-x86_64/TestCases/TypeCheck/Output/vptr.cpp.tmp.supp"' /Users/buildslave/jenkins/workspace/clang-stage2-Rthinlto/clang-build/Build/tools/clang/runtime/compiler-rt-bins/test/ubsan/ThreadSanitizer-x86_64/TestCases/TypeCheck/Output/vptr.cpp.tmp fS : 'RUN: at line 29'; env UBSAN_OPTIONS=abort_on_error=0:log_to_syslog=0:halt_on_error=1:suppressions='"/Users/buildslave/jenkins/workspace/clang-stage2-Rthinlto/clang-build/Build/tools/clang/runtime/compiler-rt-bins/test/ubsan/ThreadSanitizer-x86_64/TestCases/TypeCheck/Output/vptr.cpp.tmp.supp"' /Users/buildslave/jenkins/workspace/clang-stage2-Rthinlto/clang-build/Build/tools/clang/runtime/compiler-rt-bins/test/ubsan/ThreadSanitizer-x86_64/TestCases/TypeCheck/Output/vptr.cpp.tmp cS : 'RUN: at line 30'; env UBSAN_OPTIONS=abort_on_error=0:log_to_syslog=0:halt_on_error=1:suppressions='"/Users/buildslave/jenkins/workspace/clang-stage2-Rthinlto/clang-build/Build/tools/clang/runtime/compiler-rt-bins/test/ubsan/ThreadSanitizer-x86_64/TestCases/TypeCheck/Output/vptr.cpp.tmp.supp"' /Users/buildslave/jenkins/workspace/clang-stage2-Rthinlto/clang-build/Build/tools/clang/runtime/compiler-rt-bins/test/ubsan/ThreadSanitizer-x86_64/TestCases/TypeCheck/Output/vptr.cpp.tmp mV : 'RUN: at line 31'; env UBSAN_OPTIONS=abort_on_error=0:log_to_syslog=0:halt_on_error=1:suppressions='"/Users/buildslave/jenkins/workspace/clang-stage2-Rthinlto/clang-build/Build/tools/clang/runtime/compiler-rt-bins/test/ubsan/ThreadSanitizer-x86_64/TestCases/TypeCheck/Output/vptr.cpp.tmp.supp"' /Users/buildslave/jenkins/workspace/clang-stage2-Rthinlto/clang-build/Build/tools/clang/runtime/compiler-rt-bins/test/ubsan/ThreadSanitizer-x86_64/TestCases/TypeCheck/Output/vptr.cpp.tmp fV : 'RUN: at line 32'; env UBSAN_OPTIONS=abort_on_error=0:log_to_syslog=0:halt_on_error=1:suppressions='"/Users/buildslave/jenkins/workspace/clang-stage2-Rthinlto/clang-build/Build/tools/clang/runtime/compiler-rt-bins/test/ubsan/ThreadSanitizer-x86_64/TestCases/TypeCheck/Output/vptr.cpp.tmp.supp"' /Users/buildslave/jenkins/workspace/clang-stage2-Rthinlto/clang-build/Build/tools/clang/runtime/compiler-rt-bins/test/ubsan/ThreadSanitizer-x86_64/TestCases/TypeCheck/Output/vptr.cpp.tmp cV : 'RUN: at line 33'; env UBSAN_OPTIONS=abort_on_error=0:log_to_syslog=0:halt_on_error=1:suppressions='"/Users/buildslave/jenkins/workspace/clang-stage2-Rthinlto/clang-build/Build/tools/clang/runtime/compiler-rt-bins/test/ubsan/ThreadSanitizer-x86_64/TestCases/TypeCheck/Output/vptr.cpp.tmp.supp"' /Users/buildslave/jenkins/workspace/clang-stage2-Rthinlto/clang-build/Build/tools/clang/runtime/compiler-rt-bins/test/ubsan/ThreadSanitizer-x86_64/TestCases/TypeCheck/Output/vptr.cpp.tmp oU : 'RUN: at line 34'; env UBSAN_OPTIONS=abort_on_error=0:log_to_syslog=0:halt_on_error=1:suppressions='"/Users/buildslave/jenkins/workspace/clang-stage2-Rthinlto/clang-build/Build/tools/clang/runtime/compiler-rt-bins/test/ubsan/ThreadSanitizer-x86_64/TestCases/TypeCheck/Output/vptr.cpp.tmp.supp"' /Users/buildslave/jenkins/workspace/clang-stage2-Rthinlto/clang-build/Build/tools/clang/runtime/compiler-rt-bins/test/ubsan/ThreadSanitizer-x86_64/TestCases/TypeCheck/Output/vptr.cpp.tmp dT : 'RUN: at line 36'; echo "vptr_check:S" > /Users/buildslave/jenkins/workspace/clang-stage2-Rthinlto/clang-build/Build/tools/clang/runtime/compiler-rt-bins/test/ubsan/ThreadSanitizer-x86_64/TestCases/TypeCheck/Output/vptr.cpp.tmp.loc-supp : 'RUN: at line 37'; env UBSAN_OPTIONS=abort_on_error=0:log_to_syslog=0:halt_on_error=1:suppressions='"/Users/buildslave/jenkins/workspace/clang-stage2-Rthinlto/clang-build/Build/tools/clang/runtime/compiler-rt-bins/test/ubsan/ThreadSanitizer-x86_64/TestCases/TypeCheck/Output/vptr.cpp.tmp.loc-supp"' not /Users/buildslave/jenkins/workspace/clang-stage2-Rthinlto/clang-build/Build/tools/clang/runtime/compiler-rt-bins/test/ubsan/ThreadSanitizer-x86_64/TestCases/TypeCheck/Output/vptr.cpp.tmp x- 2>&1 | FileCheck /Users/buildslave/jenkins/workspace/clang-stage2-Rthinlto/llvm-project/compiler-rt/test/ubsan/TestCases/TypeCheck/vptr.cpp --check-prefix=CHECK-LOC-SUPPRESS -- Exit Code: 2

Hide Details

Command Output (stderr): -- + : 'RUN: at line 1' + /Users/buildslave/jenkins/workspace/clang-stage2-Rthinlto/clang-build/Build/./bin/clang --driver-mode=g++ -fsanitize=thread -arch x86_64 -stdlib=libc++ -mmacosx-version-min=10.10 -isysroot /Applications/Xcode.app/Contents/Developer/Platforms/MacOSX.platform/Developer/SDKs/MacOSX10.15.sdk -frtti -fsanitize=null,vptr -g /Users/buildslave/jenkins/workspace/clang-stage2-Rthinlto/llvm-project/compiler-rt/test/ubsan/TestCases/TypeCheck/vptr.cpp -O3 -o /Users/buildslave/jenkins/workspace/clang-stage2-Rthinlto/clang-build/Build/tools/clang/runtime/compiler-rt-bins/test/ubsan/ThreadSanitizer-x86_64/TestCases/TypeCheck/Output/vptr.cpp.tmp -mllvm -enable-tail-merge=false /Users/buildslave/jenkins/workspace/clang-stage2-Rthinlto/llvm-project/compiler-rt/test/ubsan/TestCases/TypeCheck/vptr.cpp:67:12: warning: direct base 'S' is inaccessible due to ambiguity: struct U -> struct S struct U -> struct T -> struct S [-Winaccessible-base] struct U : S, T { virtual int v() { return 2; } }; ^ /Users/buildslave/jenkins/workspace/clang-stage2-Rthinlto/llvm-project/compiler-rt/test/ubsan/TestCases/TypeCheck/vptr.cpp:131:9: warning: 'reinterpret_cast' from class 'U *' to its base at non-zero offset 'T *' behaves differently from 'static_cast' [-Wreinterpret-base-class] p = reinterpret_cast<T*>(new U); ^~~~~~~~~~~~~~~~~~~~~~~~~~~ /Users/buildslave/jenkins/workspace/clang-stage2-Rthinlto/llvm-project/compiler-rt/test/ubsan/TestCases/TypeCheck/vptr.cpp:131:9: note: use 'static_cast' to adjust the pointer correctly while upcasting p = reinterpret_cast<T*>(new U); ^~~~~~~~~~~~~~~~ static_cast /Users/buildslave/jenkins/workspace/clang-stage2-Rthinlto/llvm-project/compiler-rt/test/ubsan/TestCases/TypeCheck/vptr.cpp:194:12: warning: 'reinterpret_cast' to class 'U *' from its base at non-zero offset 'T *' behaves differently from 'static_cast' [-Wreinterpret-base-class] return reinterpret_cast<U*>(p)->v() - 2; ^~~~~~~~~~~~~~~~~~~~~~~ /Users/buildslave/jenkins/workspace/clang-stage2-Rthinlto/llvm-project/compiler-rt/test/ubsan/TestCases/TypeCheck/vptr.cpp:194:12: note: use 'static_cast' to adjust the pointer correctly while downcasting return reinterpret_cast<U*>(p)->v() - 2; ^~~~~~~~~~~~~~~~ static_cast 3 warnings generated. + : 'RUN: at line 2' + env UBSAN_OPTIONS=abort_on_error=0:log_to_syslog=0:halt_on_error=1 /Users/buildslave/jenkins/workspace/clang-stage2-Rthinlto/clang-build/Build/tools/clang/runtime/compiler-rt-bins/test/ubsan/ThreadSanitizer-x86_64/TestCases/TypeCheck/Output/vptr.cpp.tmp rT Test case: rT + : 'RUN: at line 3' + env UBSAN_OPTIONS=abort_on_error=0:log_to_syslog=0:halt_on_error=1 /Users/buildslave/jenkins/workspace/clang-stage2-Rthinlto/clang-build/Build/tools/clang/runtime/compiler-rt-bins/test/ubsan/ThreadSanitizer-x86_64/TestCases/TypeCheck/Output/vptr.cpp.tmp mT Test case: mT + : 'RUN: at line 4' + env UBSAN_OPTIONS=abort_on_error=0:log_to_syslog=0:halt_on_error=1 /Users/buildslave/jenkins/workspace/clang-stage2-Rthinlto/clang-build/Build/tools/clang/runtime/compiler-rt-bins/test/ubsan/ThreadSanitizer-x86_64/TestCases/TypeCheck/Output/vptr.cpp.tmp fT Test case: fT + : 'RUN: at line 5' + env UBSAN_OPTIONS=abort_on_error=0:log_to_syslog=0:halt_on_error=1 /Users/buildslave/jenkins/workspace/clang-stage2-Rthinlto/clang-build/Build/tools/clang/runtime/compiler-rt-bins/test/ubsan/ThreadSanitizer-x86_64/TestCases/TypeCheck/Output/vptr.cpp.tmp cT Test case: cT + : 'RUN: at line 6' + env UBSAN_OPTIONS=abort_on_error=0:log_to_syslog=0:halt_on_error=1 /Users/buildslave/jenkins/workspace/clang-stage2-Rthinlto/clang-build/Build/tools/clang/runtime/compiler-rt-bins/test/ubsan/ThreadSanitizer-x86_64/TestCases/TypeCheck/Output/vptr.cpp.tmp rU Test case: rU + : 'RUN: at line 7' + env UBSAN_OPTIONS=abort_on_error=0:log_to_syslog=0:halt_on_error=1 /Users/buildslave/jenkins/workspace/clang-stage2-Rthinlto/clang-build/Build/tools/clang/runtime/compiler-rt-bins/test/ubsan/ThreadSanitizer-x86_64/TestCases/TypeCheck/Output/vptr.cpp.tmp mU Test case: mU + : 'RUN: at line 8' + env UBSAN_OPTIONS=abort_on_error=0:log_to_syslog=0:halt_on_error=1 /Users/buildslave/jenkins/workspace/clang-stage2-Rthinlto/clang-build/Build/tools/clang/runtime/compiler-rt-bins/test/ubsan/ThreadSanitizer-x86_64/TestCases/TypeCheck/Output/vptr.cpp.tmp fU Test case: fU + : 'RUN: at line 9' + env UBSAN_OPTIONS=abort_on_error=0:log_to_syslog=0:halt_on_error=1 /Users/buildslave/jenkins/workspace/clang-stage2-Rthinlto/clang-build/Build/tools/clang/runtime/compiler-rt-bins/test/ubsan/ThreadSanitizer-x86_64/TestCases/TypeCheck/Output/vptr.cpp.tmp cU Test case: cU + : 'RUN: at line 10' + env UBSAN_OPTIONS=abort_on_error=0:log_to_syslog=0:halt_on_error=1 /Users/buildslave/jenkins/workspace/clang-stage2-Rthinlto/clang-build/Build/tools/clang/runtime/compiler-rt-bins/test/ubsan/ThreadSanitizer-x86_64/TestCases/TypeCheck/Output/vptr.cpp.tmp rS Test case: rS + : 'RUN: at line 11' + env UBSAN_OPTIONS=abort_on_error=0:log_to_syslog=0:halt_on_error=1 /Users/buildslave/jenkins/workspace/clang-stage2-Rthinlto/clang-build/Build/tools/clang/runtime/compiler-rt-bins/test/ubsan/ThreadSanitizer-x86_64/TestCases/TypeCheck/Output/vptr.cpp.tmp rV Test case: rV + : 'RUN: at line 12' + env UBSAN_OPTIONS=abort_on_error=0:log_to_syslog=0:halt_on_error=1 /Users/buildslave/jenkins/workspace/clang-stage2-Rthinlto/clang-build/Build/tools/clang/runtime/compiler-rt-bins/test/ubsan/ThreadSanitizer-x86_64/TestCases/TypeCheck/Output/vptr.cpp.tmp oV Test case: oV + : 'RUN: at line 13' + env UBSAN_OPTIONS=abort_on_error=0:log_to_syslog=0:halt_on_error=1 /Users/buildslave/jenkins/workspace/clang-stage2-Rthinlto/clang-build/Build/tools/clang/runtime/compiler-rt-bins/test/ubsan/ThreadSanitizer-x86_64/TestCases/TypeCheck/Output/vptr.cpp.tmp zN Test case: zN + : 'RUN: at line 14' + env UBSAN_OPTIONS=abort_on_error=0:log_to_syslog=0:halt_on_error=1:print_stacktrace=1 not /Users/buildslave/jenkins/workspace/clang-stage2-Rthinlto/clang-build/Build/tools/clang/runtime/compiler-rt-bins/test/ubsan/ThreadSanitizer-x86_64/TestCases/TypeCheck/Output/vptr.cpp.tmp mS + FileCheck /Users/buildslave/jenkins/workspace/clang-stage2-Rthinlto/llvm-project/compiler-rt/test/ubsan/TestCases/TypeCheck/vptr.cpp --check-prefix=CHECK-MEMBER --check-prefix=CHECK-Darwin-MEMBER --strict-whitespace error: no check strings found with prefix 'CHECK-Darwin-MEMBER:'

Hide Details

--

Hide Details

******************** PASS: libFuzzer :: counters.test (2990 of 3112) PASS: libFuzzer :: coverage.test (2991 of 3112) PASS: libFuzzer :: cross_over.test (2992 of 3112) PASS: libFuzzer :: cross_over_copy.test (2993 of 3112) UNSUPPORTED: libFuzzer :: cross_over_uniform_dist.test (2994 of 3112) UNSUPPORTED: libFuzzer :: custom-allocator.test (2995 of 3112) PASS: libFuzzer :: cross_over_insert.test (2996 of 3112) UNSUPPORTED: libFuzzer :: dataflow.test (2997 of 3112) PASS: libFuzzer :: dead-stripping.test (2998 of 3112) UNSUPPORTED: libFuzzer :: deep-recursion.test (2999 of 3112) PASS: libFuzzer :: cxxstring.test (3000 of 3112) UNSUPPORTED: libFuzzer :: disable-leaks.test (3001 of 3112) PASS: libFuzzer :: cleanse.test (3002 of 3112) UNSUPPORTED: libFuzzer :: entropic-scale-per-exec-time.test (3003 of 3112) UNSUPPORTED: libFuzzer :: equivalence-signals.test (3004 of 3112) UNSUPPORTED: libFuzzer :: equivalence.test (3005 of 3112) PASS: libFuzzer :: dso.test (3006 of 3112) PASS: libFuzzer :: deprecated-instrumentation.test (3007 of 3112) UNSUPPORTED: libFuzzer :: extra-counters.test (3008 of 3112) UNSUPPORTED: libFuzzer :: features_dir.test (3009 of 3112) UNSUPPORTED: libFuzzer :: focus-function.test (3010 of 3112) UNSUPPORTED: libFuzzer :: fork-sigusr.test (3011 of 3112) UNSUPPORTED: libFuzzer :: fork-ubsan.test (3012 of 3112) UNSUPPORTED: libFuzzer :: fork.test (3013 of 3112) PASS: libFuzzer :: exit-report.test (3014 of 3112) PASS: libFuzzer :: full-coverage-set.test (3015 of 3112) PASS: libFuzzer :: full-coverage.test (3016 of 3112) PASS: libFuzzer :: fuzzer-alignment-assumption.test (3017 of 3112) PASS: libFuzzer :: exit_on_src_pos.test (3018 of 3112) PASS: libFuzzer :: fuzzer-customcrossoverandmutate.test (3019 of 3112) PASS: libFuzzer :: fuzzer-customcrossover.test (3020 of 3112) PASS: libFuzzer :: fuzzer-dict.test (3021 of 3112) PASS: libFuzzer :: fuzzer-custommutator.test (3022 of 3112) PASS: libFuzzer :: fuzzer-fdmask.test (3023 of 3112) PASS: libFuzzer :: fuzzer-finalstats.test (3024 of 3112) PASS: libFuzzer :: fuzzer-dirs.test (3025 of 3112) PASS: libFuzzer :: fuzzer-implicit-integer-sign-change.test (3026 of 3112) PASS: libFuzzer :: fuzzer-flags.test (3027 of 3112) PASS: libFuzzer :: fuzzer-implicit-signed-integer-truncation-or-sign-change.test (3028 of 3112) UNSUPPORTED: libFuzzer :: fuzzer-leak.test (3029 of 3112) UNSUPPORTED: libFuzzer :: fuzzer-oom-with-profile.test (3030 of 3112) PASS: libFuzzer :: fuzzer-implicit-signed-integer-truncation.test (3031 of 3112) PASS: libFuzzer :: fuzzer-implicit-unsigned-integer-truncation.test (3032 of 3112) PASS: libFuzzer :: fuzzer-printcovpcs.test (3033 of 3112) PASS: libFuzzer :: fuzzer-runs.test (3034 of 3112) PASS: libFuzzer :: fuzzer-seed.test (3035 of 3112) PASS: libFuzzer :: fuzzer-segv.test (3036 of 3112) PASS: libFuzzer :: fuzzer-singleinputs.test (3037 of 3112) PASS: libFuzzer :: fuzzer-oom.test (3038 of 3112) PASS: libFuzzer :: fuzzer-threaded.test (3039 of 3112) UNSUPPORTED: libFuzzer :: gc-sections.test (3040 of 3112) PASS: libFuzzer :: fuzzer-ubsan.test (3041 of 3112) UNSUPPORTED: libFuzzer :: keep-seed.test (3042 of 3112) PASS: libFuzzer :: initialize.test (3043 of 3112) PASS: libFuzzer :: len_control.test (3044 of 3112) UNSUPPORTED: libFuzzer :: libcxx.test (3045 of 3112) UNSUPPORTED: libFuzzer :: magic-separator.test (3046 of 3112) PASS: libFuzzer :: max-number-of-runs.test (3047 of 3112) PASS: libFuzzer :: memcmp.test (3048 of 3112) PASS: libFuzzer :: memcmp64.test (3049 of 3112) PASS: libFuzzer :: fuzzer-timeout.test (3050 of 3112) PASS: libFuzzer :: merge-control-file.test (3051 of 3112) UNSUPPORTED: libFuzzer :: merge-sigusr.test (3052 of 3112) PASS: libFuzzer :: merge-posix.test (3053 of 3112) PASS: libFuzzer :: merge_two_step.test (3054 of 3112) PASS: libFuzzer :: merge.test (3055 of 3112) PASS: libFuzzer :: large.test (3056 of 3112) PASS: libFuzzer :: minimize_timeout.test (3057 of 3112) UNSUPPORTED: libFuzzer :: msan-param-unpoison.test (3058 of 3112) UNSUPPORTED: libFuzzer :: msan.test (3059 of 3112) UNSUPPORTED: libFuzzer :: mutation-graph.test (3060 of 3112) UNSUPPORTED: libFuzzer :: noasan-bcmp.test (3061 of 3112) UNSUPPORTED: libFuzzer :: noasan-memcmp.test (3062 of 3112) UNSUPPORTED: libFuzzer :: noasan-memcmp64.test (3063 of 3112) UNSUPPORTED: libFuzzer :: noasan-strcmp.test (3064 of 3112) UNSUPPORTED: libFuzzer :: noasan-strncmp.test (3065 of 3112) UNSUPPORTED: libFuzzer :: noasan-strstr.test (3066 of 3112) PASS: libFuzzer :: not-instrumented.test (3067 of 3112) PASS: libFuzzer :: null-deref-on-empty.test (3068 of 3112) PASS: libFuzzer :: minimize_two_crashes.test (3069 of 3112) UNSUPPORTED: libFuzzer :: only-some-bytes-fork.test (3070 of 3112) UNSUPPORTED: libFuzzer :: only-some-bytes.test (3071 of 3112) PASS: libFuzzer :: null-deref.test (3072 of 3112) UNSUPPORTED: libFuzzer :: print-func.test (3073 of 3112) PASS: libFuzzer :: overwrite-input.test (3074 of 3112) PASS: libFuzzer :: recommended-dictionary.test (3075 of 3112) PASS: libFuzzer :: read-binary.test (3076 of 3112) PASS: libFuzzer :: reduce_inputs.test (3077 of 3112) PASS: libFuzzer :: repeated-bytes.test (3078 of 3112) PASS: libFuzzer :: reload.test (3079 of 3112) PASS: libFuzzer :: minimize_crash.test (3080 of 3112) UNSUPPORTED: libFuzzer :: sigint.test (3081 of 3112) UNSUPPORTED: libFuzzer :: sigusr.test (3082 of 3112) UNSUPPORTED: libFuzzer :: simple-cmp.test (3083 of 3112) PASS: libFuzzer :: seed_inputs.test (3084 of 3112) PASS: libFuzzer :: standalone.test (3085 of 3112) PASS: libFuzzer :: strcmp.test (3086 of 3112) PASS: libFuzzer :: shrink.test (3087 of 3112) PASS: libFuzzer :: simple.test (3088 of 3112) PASS: libFuzzer :: strncmp-oob.test (3089 of 3112) PASS: libFuzzer :: strstr.test (3090 of 3112) PASS: libFuzzer :: symbolize-deadlock.test (3091 of 3112) PASS: libFuzzer :: strncmp.test (3092 of 3112) UNSUPPORTED: libFuzzer :: trace-malloc-2.test (3093 of 3112) UNSUPPORTED: libFuzzer :: trace-malloc-threaded.test (3094 of 3112) UNSUPPORTED: libFuzzer :: trace-malloc-unbalanced.test (3095 of 3112) PASS: libFuzzer :: swap-cmp.test (3096 of 3112) PASS: libFuzzer :: three-bytes.test (3097 of 3112) UNSUPPORTED: libFuzzer :: uncaught-exception.test (3098 of 3112) PASS: libFuzzer :: trace-malloc.test (3099 of 3112) PASS: libFuzzer :: ulimit.test (3100 of 3112) PASS: libFuzzer :: value-profile-cmp2.test (3101 of 3112) PASS: libFuzzer :: value-profile-cmp3.test (3102 of 3112) PASS: libFuzzer :: value-profile-cmp4.test (3103 of 3112) PASS: libFuzzer :: value-profile-cmp.test (3104 of 3112) PASS: libFuzzer :: value-profile-div.test (3105 of 3112) PASS: libFuzzer :: value-profile-load.test (3106 of 3112) PASS: libFuzzer :: value-profile-strcmp.test (3107 of 3112) PASS: libFuzzer :: value-profile-set.test (3108 of 3112) PASS: libFuzzer :: value-profile-strncmp.test (3109 of 3112) UNSUPPORTED: libFuzzer :: windows-opt-ref.test (3110 of 3112) PASS: libFuzzer :: value-profile-mem.test (3111 of 3112) PASS: libFuzzer :: value-profile-switch.test (3112 of 3112)

Hide Details

22 warning(s) in tests ******************** Failed Tests (5): AddressSanitizer-x86_64-darwin :: TestCases/use-after-delete.cpp UBSan-AddressSanitizer-x86_64 :: TestCases/TypeCheck/vptr.cpp UBSan-Standalone-x86_64 :: TestCases/TypeCheck/vptr.cpp UBSan-StandaloneStatic-x86_64 :: TestCases/TypeCheck/vptr.cpp UBSan-ThreadSanitizer-x86_64 :: TestCases/TypeCheck/vptr.cpp

Hide Details

Hide Details

Testing Time: 887.62s Unsupported : 932 Passed : 2146 Expectedly Failed: 29 Failed : 5 FAILED: test/CMakeFiles/check-compiler-rt cd /Users/buildslave/jenkins/workspace/clang-stage2-Rthinlto/clang-build/Build/tools/clang/runtime/compiler-rt-bins/test && /usr/local/Frameworks/Python.framework/Versions/3.7/bin/python3.7 /Users/buildslave/jenkins/workspace/clang-stage2-Rthinlto/clang-build/Build/./bin/llvm-lit --xunit-xml-output=testresults.xunit.xml -v -vv --timeout=600 /Users/buildslave/jenkins/workspace/clang-stage2-Rthinlto/clang-build/Build/tools/clang/runtime/compiler-rt-bins/test/builtins/TestCases /Users/buildslave/jenkins/workspace/clang-stage2-Rthinlto/clang-build/Build/tools/clang/runtime/compiler-rt-bins/test/builtins/Unit/X86_64DarwinConfig /Users/buildslave/jenkins/workspace/clang-stage2-Rthinlto/clang-build/Build/tools/clang/runtime/compiler-rt-bins/test/lsan/X86_64LsanConfig /Users/buildslave/jenkins/workspace/clang-stage2-Rthinlto/clang-build/Build/tools/clang/runtime/compiler-rt-bins/test/lsan/X86_64AsanConfig /Users/buildslave/jenkins/workspace/clang-stage2-Rthinlto/clang-build/Build/tools/clang/runtime/compiler-rt-bins/test/ubsan/Standalone-x86_64 /Users/buildslave/jenkins/workspace/clang-stage2-Rthinlto/clang-build/Build/tools/clang/runtime/compiler-rt-bins/test/ubsan/AddressSanitizer-x86_64 /Users/buildslave/jenkins/workspace/clang-stage2-Rthinlto/clang-build/Build/tools/clang/runtime/compiler-rt-bins/test/ubsan/ThreadSanitizer-x86_64 /Users/buildslave/jenkins/workspace/clang-stage2-Rthinlto/clang-build/Build/tools/clang/runtime/compiler-rt-bins/test/ubsan/StandaloneStatic-x86_64 /Users/buildslave/jenkins/workspace/clang-stage2-Rthinlto/clang-build/Build/tools/clang/runtime/compiler-rt-bins/test/cfi/Standalone-x86_64 /Users/buildslave/jenkins/workspace/clang-stage2-Rthinlto/clang-build/Build/tools/clang/runtime/compiler-rt-bins/test/cfi/Devirt-x86_64 /Users/buildslave/jenkins/workspace/clang-stage2-Rthinlto/clang-build/Build/tools/clang/runtime/compiler-rt-bins/test/sanitizer_common/asan-x86_64-Darwin /Users/buildslave/jenkins/workspace/clang-stage2-Rthinlto/clang-build/Build/tools/clang/runtime/compiler-rt-bins/test/sanitizer_common/lsan-x86_64-Darwin /Users/buildslave/jenkins/workspace/clang-stage2-Rthinlto/clang-build/Build/tools/clang/runtime/compiler-rt-bins/test/sanitizer_common/tsan-x86_64-Darwin /Users/buildslave/jenkins/workspace/clang-stage2-Rthinlto/clang-build/Build/tools/clang/runtime/compiler-rt-bins/test/sanitizer_common/ubsan-x86_64-Darwin /Users/buildslave/jenkins/workspace/clang-stage2-Rthinlto/clang-build/Build/tools/clang/runtime/compiler-rt-bins/test/sanitizer_common/Unit /Users/buildslave/jenkins/workspace/clang-stage2-Rthinlto/clang-build/Build/tools/clang/runtime/compiler-rt-bins/test/fuzzer/unit /Users/buildslave/jenkins/workspace/clang-stage2-Rthinlto/clang-build/Build/tools/clang/runtime/compiler-rt-bins/test/fuzzer/X86_64DefaultDarwinConfig/ /Users/buildslave/jenkins/workspace/clang-stage2-Rthinlto/clang-build/Build/tools/clang/runtime/compiler-rt-bins/test/asan/X86_64DarwinConfig /Users/buildslave/jenkins/workspace/clang-stage2-Rthinlto/clang-build/Build/tools/clang/runtime/compiler-rt-bins/test/asan/Unit /Users/buildslave/jenkins/workspace/clang-stage2-Rthinlto/clang-build/Build/tools/clang/runtime/compiler-rt-bins/test/tsan/X86_64Config /Users/buildslave/jenkins/workspace/clang-stage2-Rthinlto/clang-build/Build/tools/clang/runtime/compiler-rt-bins/test/tsan/Unit /Users/buildslave/jenkins/workspace/clang-stage2-Rthinlto/clang-build/Build/tools/clang/runtime/compiler-rt-bins/test/ubsan_minimal/x86_64 /Users/buildslave/jenkins/workspace/clang-stage2-Rthinlto/clang-build/Build/tools/clang/runtime/compiler-rt-bins/test/profile/Profile-x86_64 /Users/buildslave/jenkins/workspace/clang-stage2-Rthinlto/clang-build/Build/tools/clang/runtime/compiler-rt-bins/test/xray/X86_64DarwinConfig /Users/buildslave/jenkins/workspace/clang-stage2-Rthinlto/clang-build/Build/tools/clang/runtime/compiler-rt-bins/test/xray/X86_64HDarwinConfig /Users/buildslave/jenkins/workspace/clang-stage2-Rthinlto/clang-build/Build/tools/clang/runtime/compiler-rt-bins/test/shadowcallstack/arm64 ninja: build stopped: subcommand failed. [2/4] cd /Users/buildslave/jenkins/workspace/clang-stage2-Rthinlto/llvm-project/clang/bindings/python && /usr/local/Cellar/cmake/3.17.2/bin/cmake -E env CLANG_LIBRARY_PATH=/Users/buildslave/jenkins/workspace/clang-stage2-Rthinlto/clang-build/Build/lib /usr/local/Frameworks/Python.framework/Versions/3.7/bin/python3.7 -m unittest discover .............................................................................................................................. ---------------------------------------------------------------------- Ran 126 tests in 1.295s

Hide Details

OK FAILED: tools/clang/runtime/CMakeFiles/check-compiler-rt cd /Users/buildslave/jenkins/workspace/clang-stage2-Rthinlto/clang-build/Build/tools/clang/runtime/compiler-rt-bins && /usr/local/Cellar/cmake/3.17.2/bin/cmake --build . --target check-all --config RelWithDebInfo ninja: build stopped: cannot make progress due to previous errors. Command failed: Command '['env', 'MALLOC_LOG_FILE=/dev/null', '/usr/local/bin/ninja', '-v', '-k', '0', 'check-all']' returned non-zero exit status 1 Command: ['env', 'MALLOC_LOG_FILE=/dev/null', '/usr/local/bin/ninja', '-v', '-k', '0', 'check-all'] [Pipeline] } [Pipeline] // timeout [Pipeline] } [Pipeline] // stage [Pipeline] stage [Pipeline] { (Declarative: Post Actions) [Pipeline] scanForIssues [Clang (LLVM based)] Sleeping for 5 seconds due to JENKINS-32191... [Clang (LLVM based)] Parsing console log (workspace: '/Users/buildslave/jenkins/workspace/clang-stage2-Rthinlto') [Clang (LLVM based)] Successfully parsed console log [Clang (LLVM based)] -> found 12 issues (skipped 38 duplicates) [Clang (LLVM based)] [-ERROR-] Can't create fingerprints for some files: [Clang (LLVM based)] [-ERROR-] - '/tmp/gotsan.QT8vSL7Yeo/gotsan.cpp', IO exception has been thrown: java.nio.file.NoSuchFileException: /tmp/gotsan.QT8vSL7Yeo/gotsan.cpp [Clang (LLVM based)] [-ERROR-] - '/tmp/gotsan.QT8vSL7Yeo/gotsan.cpp', IO exception has been thrown: java.nio.file.NoSuchFileException: /tmp/gotsan.QT8vSL7Yeo/gotsan.cpp [Clang (LLVM based)] [-ERROR-] - '/tmp/gotsan.QT8vSL7Yeo/gotsan.cpp', IO exception has been thrown: java.nio.file.NoSuchFileException: /tmp/gotsan.QT8vSL7Yeo/gotsan.cpp [Clang (LLVM based)] [-ERROR-] - '/tmp/gotsan.QT8vSL7Yeo/gotsan.cpp', IO exception has been thrown: java.nio.file.NoSuchFileException: /tmp/gotsan.QT8vSL7Yeo/gotsan.cpp [Clang (LLVM based)] [-ERROR-] - '/tmp/gotsan.QT8vSL7Yeo/gotsan.cpp', IO exception has been thrown: java.nio.file.NoSuchFileException: /tmp/gotsan.QT8vSL7Yeo/gotsan.cpp [Clang (LLVM based)] [-ERROR-] - '/tmp/gotsan.QT8vSL7Yeo/gotsan.cpp', IO exception has been thrown: java.nio.file.NoSuchFileException: /tmp/gotsan.QT8vSL7Yeo/gotsan.cpp [Clang (LLVM based)] [-ERROR-] - '/tmp/gotsan.QT8vSL7Yeo/gotsan.cpp', IO exception has been thrown: java.nio.file.NoSuchFileException: /tmp/gotsan.QT8vSL7Yeo/gotsan.cpp [Clang (LLVM based)] [-ERROR-] - '/tmp/gotsan.QT8vSL7Yeo/gotsan.cpp', IO exception has been thrown: java.nio.file.NoSuchFileException: /tmp/gotsan.QT8vSL7Yeo/gotsan.cpp [Clang (LLVM based)] [-ERROR-] - '/Users/buildslave/jenkins/workspace/clang-stage2-Rthinlto/clang-build/Build/tools/clang/runtime/compiler-rt-bins/llvm-lit: /Users/buildslave/jenkins/workspace/clang-stage2-Rthinlto/llvm-project/compiler-rt/test/lit.common.cfg.py', IO exception has been thrown: java.nio.file.NoSuchFileException: /Users/buildslave/jenkins/workspace/clang-stage2-Rthinlto/clang-build/Build/tools/clang/runtime/compiler-rt-bins/llvm-lit: /Users/buildslave/jenkins/workspace/clang-stage2-Rthinlto/llvm-project/compiler-rt/test/lit.common.cfg.py [Clang (LLVM based)] Post processing issues on 'green-dragon-22' with source code encoding 'UTF-8' [Clang (LLVM based)] Creating SCM blamer to obtain author and commit information for affected files [Clang (LLVM based)] Creating SCM miner to obtain statistics for affected repository files [Clang (LLVM based)] Resolving file names for all issues in source directory '/Users/buildslave/jenkins/workspace/clang-stage2-Rthinlto' [Clang (LLVM based)] -> resolved paths in source directory (1 found, 2 not found) [Clang (LLVM based)] Resolving module names from module definitions (build.xml, pom.xml, or Manifest.mf files) [Clang (LLVM based)] -> resolved module names for 12 issues [Clang (LLVM based)] Resolving package names (or namespaces) by parsing the affected files [Clang (LLVM based)] -> resolved package names of 3 affected files [Clang (LLVM based)] No filter has been set, publishing all 12 issues [Clang (LLVM based)] Creating fingerprints for all affected code blocks to track issues over different builds [Clang (LLVM based)] -> created fingerprints for 3 issues (skipped 9 issues) [Clang (LLVM based)] Copying affected files to Jenkins' build folder '/Users/Shared/Jenkins/Home/jobs/clang-stage2-Rthinlto/builds/3779/files-with-issues' [Clang (LLVM based)] -> 1 copied, 0 not in workspace, 9 not-found, 0 with I/O error [Pipeline] emailext Warning: 31459023+hctim@users.noreply.github.com is not a recognized user, but sending mail anyway Warning: i@maskray.me is not a recognized user, but sending mail anyway Warning: jezng@fb.com is not a recognized user, but sending mail anyway Warning: jonathanchesterfield@gmail.com is not a recognized user, but sending mail anyway Warning: brad@comstyle.com is not a recognized user, but sending mail anyway Warning: david.green@arm.com is not a recognized user, but sending mail anyway Warning: jianzhouzh@google.com is not a recognized user, but sending mail anyway Warning: kai.wang@sifive.com is not a recognized user, but sending mail anyway Warning: martin@martin.st is not a recognized user, but sending mail anyway Warning: nicolas.vasilache@gmail.com is not a recognized user, but sending mail anyway Warning: kyrtzidis@apple.com is not a recognized user, but sending mail anyway Warning: Matthew.Arsenault@amd.com is not a recognized user, but sending mail anyway Warning: eschweitz@nvidia.com is not a recognized user, but sending mail anyway Warning: sbc@chromium.org is not a recognized user, but sending mail anyway Warning: mcgrathr@google.com is not a recognized user, but sending mail anyway Warning: Yaxun.Liu@amd.com is not a recognized user, but sending mail anyway Warning: craig.topper@intel.com is not a recognized user, but sending mail anyway Warning: thakis@chromium.org is not a recognized user, but sending mail anyway Warning: aeubanks@google.com is not a recognized user, but sending mail anyway Warning: mtrofin@google.com is not a recognized user, but sending mail anyway Warning: vtjnash@gmail.com is not a recognized user, but sending mail anyway Warning: uday@polymagelabs.com is not a recognized user, but sending mail anyway Warning: 31459023+hctim@users.noreply.github.com is not a recognized user, but sending mail anyway Warning: i@maskray.me is not a recognized user, but sending mail anyway Warning: jezng@fb.com is not a recognized user, but sending mail anyway Warning: jonathanchesterfield@gmail.com is not a recognized user, but sending mail anyway Warning: brad@comstyle.com is not a recognized user, but sending mail anyway Warning: david.green@arm.com is not a recognized user, but sending mail anyway Warning: jianzhouzh@google.com is not a recognized user, but sending mail anyway Warning: kai.wang@sifive.com is not a recognized user, but sending mail anyway Warning: martin@martin.st is not a recognized user, but sending mail anyway Warning: nicolas.vasilache@gmail.com is not a recognized user, but sending mail anyway Warning: kyrtzidis@apple.com is not a recognized user, but sending mail anyway Warning: Matthew.Arsenault@amd.com is not a recognized user, but sending mail anyway Warning: eschweitz@nvidia.com is not a recognized user, but sending mail anyway Warning: sbc@chromium.org is not a recognized user, but sending mail anyway Warning: mcgrathr@google.com is not a recognized user, but sending mail anyway Warning: Yaxun.Liu@amd.com is not a recognized user, but sending mail anyway Warning: craig.topper@intel.com is not a recognized user, but sending mail anyway Warning: thakis@chromium.org is not a recognized user, but sending mail anyway Warning: aeubanks@google.com is not a recognized user, but sending mail anyway Warning: mtrofin@google.com is not a recognized user, but sending mail anyway Warning: vtjnash@gmail.com is not a recognized user, but sending mail anyway Warning: uday@polymagelabs.com is not a recognized user, but sending mail anyway

Hide Details

Begin Pre-Send Script... groovy.lang.MissingMethodException: No signature of method: java.io.PrintStream.println() is applicable for argument types: (java.lang.String, java.lang.String) values: [Skipping:, 31459023+hctim@users.noreply.github.com] Possible solutions: println(), println(), println(java.lang.String), println([C), println(boolean), println(char) at org.codehaus.groovy.runtime.ScriptBytecodeAdapter.unwrap(ScriptBytecodeAdapter.java:58) at org.codehaus.groovy.runtime.callsite.PojoMetaClassSite.call(PojoMetaClassSite.java:49) at org.codehaus.groovy.runtime.callsite.CallSiteArray.defaultCall(CallSiteArray.java:48) at org.codehaus.groovy.runtime.callsite.AbstractCallSite.call(AbstractCallSite.java:113) at org.codehaus.groovy.runtime.callsite.AbstractCallSite.call(AbstractCallSite.java:133) at Script1.run(Script1.groovy:53) at hudson.plugins.emailext.ExtendedEmailPublisher.executeScript(ExtendedEmailPublisher.java:693) at hudson.plugins.emailext.ExtendedEmailPublisher.executePresendScript(ExtendedEmailPublisher.java:651) at hudson.plugins.emailext.ExtendedEmailPublisher.sendMail(ExtendedEmailPublisher.java:515) at hudson.plugins.emailext.EmailExtStep$EmailExtStepExecution.run(EmailExtStep.java:236) at hudson.plugins.emailext.EmailExtStep$EmailExtStepExecution.run(EmailExtStep.java:174) at org.jenkinsci.plugins.workflow.steps.AbstractSynchronousNonBlockingStepExecution$1$1.call(AbstractSynchronousNonBlockingStepExecution.java:47) at hudson.security.ACL.impersonate(ACL.java:367) at org.jenkinsci.plugins.workflow.steps.AbstractSynchronousNonBlockingStepExecution$1.run(AbstractSynchronousNonBlockingStepExecution.java:44) at java.util.concurrent.Executors$RunnableAdapter.call(Executors.java:511) at java.util.concurrent.FutureTask.run(FutureTask.java:266) at java.util.concurrent.ThreadPoolExecutor.runWorker(ThreadPoolExecutor.java:1149) at java.util.concurrent.ThreadPoolExecutor$Worker.run(ThreadPoolExecutor.java:624) at java.lang.Thread.run(Thread.java:748)

Hide Details

Sending email to: 31459023+hctim@users.noreply.github.com i@maskray.me jezng@fb.com jonathanchesterfield@gmail.com brad@comstyle.com david.green@arm.com jianzhouzh@google.com kai.wang@sifive.com martin@martin.st aemerson@apple.com nicolas.vasilache@gmail.com kyrtzidis@apple.com Matthew.Arsenault@amd.com eschweitz@nvidia.com sbc@chromium.org mcgrathr@google.com Yaxun.Liu@amd.com craig.topper@intel.com thakis@chromium.org aeubanks@google.com mtrofin@google.com vtjnash@gmail.com uday@polymagelabs.com
[Pipeline] } [Pipeline] // stage [Pipeline] } [Pipeline] // withEnv [Pipeline] } [Pipeline] // node [Pipeline] End of Pipeline ERROR: script returned exit code 1 Finished: FAILURE