FailedConsole Output

Skipping 6,304 KB.. Full Log
[4076/4196] : && /Users/buildslave/jenkins/workspace/clang-stage2-Rthinlto/host-compiler/bin/clang++  -fno-stack-protector -fno-common -Wno-profile-instr-unprofiled -fPIC -fvisibility-inlines-hidden -Werror=date-time -Werror=unguarded-availability-new -fmodules -fmodules-cache-path=/Users/buildslave/jenkins/workspace/clang-stage2-Rthinlto/clang-build/Build/module.cache -fcxx-modules -Xclang -fmodules-local-submodule-visibility -gmodules -Wall -Wextra -Wno-unused-parameter -Wwrite-strings -Wcast-qual -Wmissing-field-initializers -pedantic -Wno-long-long -Wimplicit-fallthrough -Wcovered-switch-default -Wno-noexcept-type -Wnon-virtual-dtor -Wdelete-non-virtual-dtor -Wsuggest-override -Wstring-conversion -fdiagnostics-color -flto=thin -fno-common -Woverloaded-virtual -Wno-nested-anon-types -O2 -g -DNDEBUG -isysroot /Applications/Xcode.app/Contents/Developer/Platforms/MacOSX.platform/Developer/SDKs/MacOSX10.15.sdk -Wl,-search_paths_first -Wl,-headerpad_max_install_names -flto=thin -Wl,-cache_path_lto,/Users/buildslave/jenkins/workspace/clang-stage2-Rthinlto/clang-build/Build/lto.cache    -Wl,-dead_strip tools/clang/unittests/Analysis/CMakeFiles/ClangAnalysisTests.dir/CFGDominatorTree.cpp.o tools/clang/unittests/Analysis/CMakeFiles/ClangAnalysisTests.dir/CFGTest.cpp.o tools/clang/unittests/Analysis/CMakeFiles/ClangAnalysisTests.dir/CloneDetectionTest.cpp.o tools/clang/unittests/Analysis/CMakeFiles/ClangAnalysisTests.dir/ExprMutationAnalyzerTest.cpp.o  -o tools/clang/unittests/Analysis/ClangAnalysisTests  lib/libLLVMFrontendOpenMP.a  lib/libLLVMSupport.a  lib/libLLVMSupport.a  lib/libgtest_main.a  lib/libgtest.a  lib/libclangAnalysis.a  lib/libclangAST.a  lib/libclangASTMatchers.a  lib/libclangBasic.a  lib/libclangFrontend.a  lib/libclangSerialization.a  lib/libclangTooling.a  -lpthread  lib/libclangFrontend.a  lib/libclangParse.a  lib/libclangSerialization.a  lib/libclangSema.a  lib/libclangAnalysis.a  lib/libclangASTMatchers.a  lib/libclangEdit.a  lib/libclangAST.a  lib/libLLVMFrontendOpenMP.a  lib/libLLVMTransformUtils.a  lib/libLLVMAnalysis.a  lib/libLLVMObject.a  lib/libLLVMMCParser.a  lib/libLLVMTextAPI.a  lib/libLLVMBitReader.a  lib/libclangDriver.a  lib/libLLVMProfileData.a  lib/libLLVMOption.a  lib/libclangFormat.a  lib/libclangToolingInclusions.a  lib/libclangToolingCore.a  lib/libclangRewrite.a  lib/libclangLex.a  lib/libclangBasic.a  lib/libLLVMCore.a  lib/libLLVMRemarks.a  lib/libLLVMBitstreamReader.a  lib/libLLVMMC.a  lib/libLLVMBinaryFormat.a  lib/libLLVMDebugInfoCodeView.a  lib/libLLVMDebugInfoMSF.a  lib/libLLVMSupport.a  -lm  /usr/lib/libz.dylib  /usr/lib/libcurses.dylib  lib/libLLVMDemangle.a && :
[4077/4196] : && /Users/buildslave/jenkins/workspace/clang-stage2-Rthinlto/host-compiler/bin/clang++  -fno-stack-protector -fno-common -Wno-profile-instr-unprofiled -fPIC -fvisibility-inlines-hidden -Werror=date-time -Werror=unguarded-availability-new -fmodules -fmodules-cache-path=/Users/buildslave/jenkins/workspace/clang-stage2-Rthinlto/clang-build/Build/module.cache -fcxx-modules -Xclang -fmodules-local-submodule-visibility -gmodules -Wall -Wextra -Wno-unused-parameter -Wwrite-strings -Wcast-qual -Wmissing-field-initializers -pedantic -Wno-long-long -Wimplicit-fallthrough -Wcovered-switch-default -Wno-noexcept-type -Wnon-virtual-dtor -Wdelete-non-virtual-dtor -Wsuggest-override -Wstring-conversion -fdiagnostics-color -flto=thin -fno-common -Woverloaded-virtual -Wno-nested-anon-types -O2 -g -DNDEBUG -isysroot /Applications/Xcode.app/Contents/Developer/Platforms/MacOSX.platform/Developer/SDKs/MacOSX10.15.sdk -Wl,-search_paths_first -Wl,-headerpad_max_install_names -flto=thin -Wl,-cache_path_lto,/Users/buildslave/jenkins/workspace/clang-stage2-Rthinlto/clang-build/Build/lto.cache    -Wl,-dead_strip tools/clang/unittests/StaticAnalyzer/CMakeFiles/StaticAnalysisTests.dir/AnalyzerOptionsTest.cpp.o tools/clang/unittests/StaticAnalyzer/CMakeFiles/StaticAnalysisTests.dir/CallDescriptionTest.cpp.o tools/clang/unittests/StaticAnalyzer/CMakeFiles/StaticAnalysisTests.dir/CallEventTest.cpp.o tools/clang/unittests/StaticAnalyzer/CMakeFiles/StaticAnalysisTests.dir/FalsePositiveRefutationBRVisitorTest.cpp.o tools/clang/unittests/StaticAnalyzer/CMakeFiles/StaticAnalysisTests.dir/ParamRegionTest.cpp.o tools/clang/unittests/StaticAnalyzer/CMakeFiles/StaticAnalysisTests.dir/RangeSetTest.cpp.o tools/clang/unittests/StaticAnalyzer/CMakeFiles/StaticAnalysisTests.dir/RegisterCustomCheckersTest.cpp.o tools/clang/unittests/StaticAnalyzer/CMakeFiles/StaticAnalysisTests.dir/StoreTest.cpp.o tools/clang/unittests/StaticAnalyzer/CMakeFiles/StaticAnalysisTests.dir/SymbolReaperTest.cpp.o tools/clang/unittests/StaticAnalyzer/CMakeFiles/StaticAnalysisTests.dir/TestReturnValueUnderConstruction.cpp.o  -o tools/clang/unittests/StaticAnalyzer/StaticAnalysisTests  lib/libLLVMFrontendOpenMP.a  lib/libLLVMSupport.a  lib/libLLVMSupport.a  lib/libgtest_main.a  lib/libgtest.a  lib/libclangBasic.a  lib/libclangAnalysis.a  lib/libclangAST.a  lib/libclangASTMatchers.a  lib/libclangCrossTU.a  lib/libclangFrontend.a  lib/libclangSerialization.a  lib/libclangStaticAnalyzerCore.a  lib/libclangStaticAnalyzerFrontend.a  lib/libclangTooling.a  -lpthread  lib/libclangStaticAnalyzerCheckers.a  lib/libclangStaticAnalyzerCore.a  lib/libclangCrossTU.a  lib/libclangIndex.a  lib/libclangFrontend.a  lib/libclangParse.a  lib/libclangSerialization.a  lib/libclangSema.a  lib/libclangAnalysis.a  lib/libclangASTMatchers.a  lib/libclangEdit.a  lib/libclangAST.a  lib/libLLVMFrontendOpenMP.a  lib/libLLVMTransformUtils.a  lib/libLLVMAnalysis.a  lib/libLLVMObject.a  lib/libLLVMMCParser.a  lib/libLLVMTextAPI.a  lib/libLLVMBitReader.a  lib/libclangDriver.a  lib/libLLVMProfileData.a  lib/libLLVMOption.a  lib/libclangFormat.a  lib/libclangToolingInclusions.a  lib/libclangToolingCore.a  lib/libclangRewrite.a  lib/libclangLex.a  lib/libclangBasic.a  lib/libLLVMCore.a  lib/libLLVMRemarks.a  lib/libLLVMBitstreamReader.a  lib/libLLVMMC.a  lib/libLLVMBinaryFormat.a  lib/libLLVMDebugInfoCodeView.a  lib/libLLVMDebugInfoMSF.a  lib/libLLVMSupport.a  -lm  /usr/lib/libz.dylib  /usr/lib/libcurses.dylib  lib/libLLVMDemangle.a && :
[4078/4196] : && /Users/buildslave/jenkins/workspace/clang-stage2-Rthinlto/host-compiler/bin/clang++  -fno-stack-protector -fno-common -Wno-profile-instr-unprofiled -fPIC -fvisibility-inlines-hidden -Werror=date-time -Werror=unguarded-availability-new -fmodules -fmodules-cache-path=/Users/buildslave/jenkins/workspace/clang-stage2-Rthinlto/clang-build/Build/module.cache -fcxx-modules -Xclang -fmodules-local-submodule-visibility -gmodules -Wall -Wextra -Wno-unused-parameter -Wwrite-strings -Wcast-qual -Wmissing-field-initializers -pedantic -Wno-long-long -Wimplicit-fallthrough -Wcovered-switch-default -Wno-noexcept-type -Wnon-virtual-dtor -Wdelete-non-virtual-dtor -Wsuggest-override -Wstring-conversion -fdiagnostics-color -flto=thin -fno-common -Woverloaded-virtual -Wno-nested-anon-types -O2 -g -DNDEBUG -isysroot /Applications/Xcode.app/Contents/Developer/Platforms/MacOSX.platform/Developer/SDKs/MacOSX10.15.sdk -Wl,-search_paths_first -Wl,-headerpad_max_install_names -flto=thin -Wl,-cache_path_lto,/Users/buildslave/jenkins/workspace/clang-stage2-Rthinlto/clang-build/Build/lto.cache    -Wl,-dead_strip tools/clang/unittests/ASTMatchers/CMakeFiles/ASTMatchersTests.dir/ASTMatchersInternalTest.cpp.o tools/clang/unittests/ASTMatchers/CMakeFiles/ASTMatchersTests.dir/ASTMatchersNodeTest.cpp.o tools/clang/unittests/ASTMatchers/CMakeFiles/ASTMatchersTests.dir/ASTMatchersNarrowingTest.cpp.o tools/clang/unittests/ASTMatchers/CMakeFiles/ASTMatchersTests.dir/ASTMatchersTraversalTest.cpp.o tools/clang/unittests/ASTMatchers/CMakeFiles/ASTMatchersTests.dir/GtestMatchersTest.cpp.o  -o tools/clang/unittests/ASTMatchers/ASTMatchersTests  lib/libLLVMFrontendOpenMP.a  lib/libLLVMSupport.a  lib/libLLVMSupport.a  lib/libgtest_main.a  lib/libgtest.a  lib/libclangAST.a  lib/libclangASTMatchers.a  lib/libclangBasic.a  lib/libclangFrontend.a  lib/libclangSerialization.a  lib/libclangTesting.a  lib/libclangTooling.a  lib/libLLVMTestingSupport.a  lib/libclangFrontend.a  lib/libclangParse.a  lib/libclangSerialization.a  lib/libclangSema.a  lib/libclangEdit.a  lib/libclangAnalysis.a  lib/libclangASTMatchers.a  lib/libclangAST.a  lib/libLLVMFrontendOpenMP.a  lib/libLLVMTransformUtils.a  lib/libLLVMAnalysis.a  lib/libLLVMObject.a  lib/libLLVMMCParser.a  lib/libLLVMTextAPI.a  lib/libLLVMBitReader.a  lib/libclangDriver.a  lib/libLLVMProfileData.a  lib/libLLVMOption.a  lib/libclangFormat.a  lib/libclangToolingInclusions.a  lib/libclangToolingCore.a  lib/libclangRewrite.a  lib/libclangLex.a  lib/libclangBasic.a  lib/libLLVMCore.a  lib/libLLVMRemarks.a  lib/libLLVMBitstreamReader.a  lib/libLLVMMC.a  lib/libLLVMBinaryFormat.a  lib/libLLVMDebugInfoCodeView.a  lib/libLLVMDebugInfoMSF.a  lib/libgtest.a  lib/libLLVMSupport.a  -lm  /usr/lib/libz.dylib  /usr/lib/libcurses.dylib  lib/libLLVMDemangle.a  -lpthread && :
[4079/4196] : && /Users/buildslave/jenkins/workspace/clang-stage2-Rthinlto/host-compiler/bin/clang++  -fno-stack-protector -fno-common -Wno-profile-instr-unprofiled -fPIC -fvisibility-inlines-hidden -Werror=date-time -Werror=unguarded-availability-new -fmodules -fmodules-cache-path=/Users/buildslave/jenkins/workspace/clang-stage2-Rthinlto/clang-build/Build/module.cache -fcxx-modules -Xclang -fmodules-local-submodule-visibility -gmodules -Wall -Wextra -Wno-unused-parameter -Wwrite-strings -Wcast-qual -Wmissing-field-initializers -pedantic -Wno-long-long -Wimplicit-fallthrough -Wcovered-switch-default -Wno-noexcept-type -Wnon-virtual-dtor -Wdelete-non-virtual-dtor -Wsuggest-override -Wstring-conversion -fdiagnostics-color -flto=thin -fno-common -Woverloaded-virtual -Wno-nested-anon-types -O2 -g -DNDEBUG -isysroot /Applications/Xcode.app/Contents/Developer/Platforms/MacOSX.platform/Developer/SDKs/MacOSX10.15.sdk -Wl,-search_paths_first -Wl,-headerpad_max_install_names -flto=thin -Wl,-cache_path_lto,/Users/buildslave/jenkins/workspace/clang-stage2-Rthinlto/clang-build/Build/lto.cache    -Wl,-dead_strip tools/clang/unittests/ASTMatchers/Dynamic/CMakeFiles/DynamicASTMatchersTests.dir/VariantValueTest.cpp.o tools/clang/unittests/ASTMatchers/Dynamic/CMakeFiles/DynamicASTMatchersTests.dir/ParserTest.cpp.o tools/clang/unittests/ASTMatchers/Dynamic/CMakeFiles/DynamicASTMatchersTests.dir/RegistryTest.cpp.o  -o tools/clang/unittests/ASTMatchers/Dynamic/DynamicASTMatchersTests  lib/libLLVMFrontendOpenMP.a  lib/libLLVMSupport.a  lib/libLLVMSupport.a  lib/libgtest_main.a  lib/libgtest.a  lib/libclangAST.a  lib/libclangASTMatchers.a  lib/libclangBasic.a  lib/libclangDynamicASTMatchers.a  lib/libclangFrontend.a  lib/libclangSerialization.a  lib/libclangTesting.a  lib/libclangTooling.a  -lpthread  lib/libclangFrontend.a  lib/libclangParse.a  lib/libclangSerialization.a  lib/libclangSema.a  lib/libclangEdit.a  lib/libclangAnalysis.a  lib/libclangASTMatchers.a  lib/libclangAST.a  lib/libLLVMFrontendOpenMP.a  lib/libLLVMTransformUtils.a  lib/libLLVMAnalysis.a  lib/libLLVMObject.a  lib/libLLVMMCParser.a  lib/libLLVMTextAPI.a  lib/libLLVMBitReader.a  lib/libclangDriver.a  lib/libLLVMProfileData.a  lib/libLLVMOption.a  lib/libclangFormat.a  lib/libclangToolingInclusions.a  lib/libclangToolingCore.a  lib/libclangRewrite.a  lib/libclangLex.a  lib/libclangBasic.a  lib/libLLVMCore.a  lib/libLLVMRemarks.a  lib/libLLVMBitstreamReader.a  lib/libLLVMMC.a  lib/libLLVMBinaryFormat.a  lib/libLLVMDebugInfoCodeView.a  lib/libLLVMDebugInfoMSF.a  lib/libLLVMSupport.a  -lm  /usr/lib/libz.dylib  /usr/lib/libcurses.dylib  lib/libLLVMDemangle.a && :
[4080/4196] : && /Users/buildslave/jenkins/workspace/clang-stage2-Rthinlto/host-compiler/bin/clang++  -fno-stack-protector -fno-common -Wno-profile-instr-unprofiled -fPIC -fvisibility-inlines-hidden -Werror=date-time -Werror=unguarded-availability-new -fmodules -fmodules-cache-path=/Users/buildslave/jenkins/workspace/clang-stage2-Rthinlto/clang-build/Build/module.cache -fcxx-modules -Xclang -fmodules-local-submodule-visibility -gmodules -Wall -Wextra -Wno-unused-parameter -Wwrite-strings -Wcast-qual -Wmissing-field-initializers -pedantic -Wno-long-long -Wimplicit-fallthrough -Wcovered-switch-default -Wno-noexcept-type -Wnon-virtual-dtor -Wdelete-non-virtual-dtor -Wsuggest-override -Wstring-conversion -fdiagnostics-color -flto=thin -fno-common -Woverloaded-virtual -Wno-nested-anon-types -O2 -g -DNDEBUG -isysroot /Applications/Xcode.app/Contents/Developer/Platforms/MacOSX.platform/Developer/SDKs/MacOSX10.15.sdk -Wl,-search_paths_first -Wl,-headerpad_max_install_names -flto=thin -Wl,-cache_path_lto,/Users/buildslave/jenkins/workspace/clang-stage2-Rthinlto/clang-build/Build/lto.cache    -Wl,-dead_strip tools/clang/unittests/AST/CMakeFiles/ASTTests.dir/ASTContextParentMapTest.cpp.o tools/clang/unittests/AST/CMakeFiles/ASTTests.dir/ASTImporterFixtures.cpp.o tools/clang/unittests/AST/CMakeFiles/ASTTests.dir/ASTImporterTest.cpp.o tools/clang/unittests/AST/CMakeFiles/ASTTests.dir/ASTImporterGenericRedeclTest.cpp.o tools/clang/unittests/AST/CMakeFiles/ASTTests.dir/ASTImporterODRStrategiesTest.cpp.o tools/clang/unittests/AST/CMakeFiles/ASTTests.dir/ASTImporterVisibilityTest.cpp.o tools/clang/unittests/AST/CMakeFiles/ASTTests.dir/ASTTraverserTest.cpp.o tools/clang/unittests/AST/CMakeFiles/ASTTests.dir/ASTTypeTraitsTest.cpp.o tools/clang/unittests/AST/CMakeFiles/ASTTests.dir/ASTVectorTest.cpp.o tools/clang/unittests/AST/CMakeFiles/ASTTests.dir/CommentLexer.cpp.o tools/clang/unittests/AST/CMakeFiles/ASTTests.dir/CommentParser.cpp.o tools/clang/unittests/AST/CMakeFiles/ASTTests.dir/CommentTextTest.cpp.o tools/clang/unittests/AST/CMakeFiles/ASTTests.dir/DataCollectionTest.cpp.o tools/clang/unittests/AST/CMakeFiles/ASTTests.dir/DeclPrinterTest.cpp.o tools/clang/unittests/AST/CMakeFiles/ASTTests.dir/DeclTest.cpp.o tools/clang/unittests/AST/CMakeFiles/ASTTests.dir/EvaluateAsRValueTest.cpp.o tools/clang/unittests/AST/CMakeFiles/ASTTests.dir/ExternalASTSourceTest.cpp.o tools/clang/unittests/AST/CMakeFiles/ASTTests.dir/NamedDeclPrinterTest.cpp.o tools/clang/unittests/AST/CMakeFiles/ASTTests.dir/RecursiveASTVisitorTest.cpp.o tools/clang/unittests/AST/CMakeFiles/ASTTests.dir/SizelessTypesTest.cpp.o tools/clang/unittests/AST/CMakeFiles/ASTTests.dir/SourceLocationTest.cpp.o tools/clang/unittests/AST/CMakeFiles/ASTTests.dir/StmtPrinterTest.cpp.o tools/clang/unittests/AST/CMakeFiles/ASTTests.dir/StructuralEquivalenceTest.cpp.o  -o tools/clang/unittests/AST/ASTTests  lib/libLLVMFrontendOpenMP.a  lib/libLLVMSupport.a  lib/libLLVMSupport.a  lib/libgtest_main.a  lib/libgtest.a  lib/libclangAST.a  lib/libclangASTMatchers.a  lib/libclangBasic.a  lib/libclangFrontend.a  lib/libclangSerialization.a  lib/libclangTesting.a  lib/libclangTooling.a  lib/libLLVMTestingSupport.a  lib/libclangFrontend.a  lib/libclangParse.a  lib/libclangSerialization.a  lib/libclangSema.a  lib/libclangEdit.a  lib/libclangAnalysis.a  lib/libclangASTMatchers.a  lib/libclangAST.a  lib/libLLVMFrontendOpenMP.a  lib/libLLVMTransformUtils.a  lib/libLLVMAnalysis.a  lib/libLLVMObject.a  lib/libLLVMMCParser.a  lib/libLLVMTextAPI.a  lib/libLLVMBitReader.a  lib/libclangDriver.a  lib/libLLVMProfileData.a  lib/libLLVMOption.a  lib/libclangFormat.a  lib/libclangToolingInclusions.a  lib/libclangToolingCore.a  lib/libclangRewrite.a  lib/libclangLex.a  lib/libclangBasic.a  lib/libLLVMCore.a  lib/libLLVMRemarks.a  lib/libLLVMBitstreamReader.a  lib/libLLVMMC.a  lib/libLLVMBinaryFormat.a  lib/libLLVMDebugInfoCodeView.a  lib/libLLVMDebugInfoMSF.a  lib/libgtest.a  lib/libLLVMSupport.a  -lm  /usr/lib/libz.dylib  /usr/lib/libcurses.dylib  lib/libLLVMDemangle.a  -lpthread && :
[4081/4196] : && /Users/buildslave/jenkins/workspace/clang-stage2-Rthinlto/host-compiler/bin/clang++  -fno-stack-protector -fno-common -Wno-profile-instr-unprofiled -fPIC -fvisibility-inlines-hidden -Werror=date-time -Werror=unguarded-availability-new -fmodules -fmodules-cache-path=/Users/buildslave/jenkins/workspace/clang-stage2-Rthinlto/clang-build/Build/module.cache -fcxx-modules -Xclang -fmodules-local-submodule-visibility -gmodules -Wall -Wextra -Wno-unused-parameter -Wwrite-strings -Wcast-qual -Wmissing-field-initializers -pedantic -Wno-long-long -Wimplicit-fallthrough -Wcovered-switch-default -Wno-noexcept-type -Wnon-virtual-dtor -Wdelete-non-virtual-dtor -Wsuggest-override -Wstring-conversion -fdiagnostics-color -flto=thin -fno-common -Woverloaded-virtual -Wno-nested-anon-types -O2 -g -DNDEBUG -isysroot /Applications/Xcode.app/Contents/Developer/Platforms/MacOSX.platform/Developer/SDKs/MacOSX10.15.sdk -Wl,-search_paths_first -Wl,-headerpad_max_install_names -flto=thin -Wl,-cache_path_lto,/Users/buildslave/jenkins/workspace/clang-stage2-Rthinlto/clang-build/Build/lto.cache    -Wl,-dead_strip tools/clang/unittests/Tooling/Syntax/CMakeFiles/SyntaxTests.dir/TreeTestBase.cpp.o tools/clang/unittests/Tooling/Syntax/CMakeFiles/SyntaxTests.dir/BuildTreeTest.cpp.o tools/clang/unittests/Tooling/Syntax/CMakeFiles/SyntaxTests.dir/MutationsTest.cpp.o tools/clang/unittests/Tooling/Syntax/CMakeFiles/SyntaxTests.dir/SynthesisTest.cpp.o tools/clang/unittests/Tooling/Syntax/CMakeFiles/SyntaxTests.dir/TreeTest.cpp.o tools/clang/unittests/Tooling/Syntax/CMakeFiles/SyntaxTests.dir/TokensTest.cpp.o  -o tools/clang/unittests/Tooling/Syntax/SyntaxTests  lib/libLLVMSupport.a  lib/libLLVMSupport.a  lib/libgtest_main.a  lib/libgtest.a  lib/libclangAST.a  lib/libclangBasic.a  lib/libclangFrontend.a  lib/libclangLex.a  lib/libclangSerialization.a  lib/libclangTesting.a  lib/libclangTooling.a  lib/libclangToolingCore.a  lib/libclangToolingSyntax.a  lib/libLLVMTestingSupport.a  lib/libclangFormat.a  lib/libclangToolingInclusions.a  lib/libclangFrontend.a  lib/libclangSerialization.a  lib/libclangDriver.a  lib/libclangParse.a  lib/libclangSema.a  lib/libclangEdit.a  lib/libclangAnalysis.a  lib/libclangASTMatchers.a  lib/libclangAST.a  lib/libLLVMFrontendOpenMP.a  lib/libLLVMTransformUtils.a  lib/libLLVMAnalysis.a  lib/libLLVMObject.a  lib/libLLVMMCParser.a  lib/libLLVMTextAPI.a  lib/libLLVMBitReader.a  lib/libLLVMOption.a  lib/libLLVMProfileData.a  lib/libclangToolingCore.a  lib/libclangRewrite.a  lib/libclangLex.a  lib/libclangBasic.a  lib/libLLVMCore.a  lib/libLLVMRemarks.a  lib/libLLVMBitstreamReader.a  lib/libLLVMMC.a  lib/libLLVMBinaryFormat.a  lib/libLLVMDebugInfoCodeView.a  lib/libLLVMDebugInfoMSF.a  lib/libgtest.a  lib/libLLVMSupport.a  -lm  /usr/lib/libz.dylib  /usr/lib/libcurses.dylib  lib/libLLVMDemangle.a  -lpthread && :
[4082/4196] : && /Users/buildslave/jenkins/workspace/clang-stage2-Rthinlto/host-compiler/bin/clang++  -fno-stack-protector -fno-common -Wno-profile-instr-unprofiled -fPIC -fvisibility-inlines-hidden -Werror=date-time -Werror=unguarded-availability-new -fmodules -fmodules-cache-path=/Users/buildslave/jenkins/workspace/clang-stage2-Rthinlto/clang-build/Build/module.cache -fcxx-modules -Xclang -fmodules-local-submodule-visibility -gmodules -Wall -Wextra -Wno-unused-parameter -Wwrite-strings -Wcast-qual -Wmissing-field-initializers -pedantic -Wno-long-long -Wimplicit-fallthrough -Wcovered-switch-default -Wno-noexcept-type -Wnon-virtual-dtor -Wdelete-non-virtual-dtor -Wsuggest-override -Wstring-conversion -fdiagnostics-color -flto=thin -fno-common -Woverloaded-virtual -Wno-nested-anon-types -O2 -g -DNDEBUG -isysroot /Applications/Xcode.app/Contents/Developer/Platforms/MacOSX.platform/Developer/SDKs/MacOSX10.15.sdk -Wl,-search_paths_first -Wl,-headerpad_max_install_names -flto=thin -Wl,-cache_path_lto,/Users/buildslave/jenkins/workspace/clang-stage2-Rthinlto/clang-build/Build/lto.cache    -Wl,-dead_strip tools/clang/unittests/Rewrite/CMakeFiles/RewriteTests.dir/RewriteBufferTest.cpp.o tools/clang/unittests/Rewrite/CMakeFiles/RewriteTests.dir/RewriterTest.cpp.o  -o tools/clang/unittests/Rewrite/RewriteTests  lib/libLLVMSupport.a  lib/libLLVMSupport.a  lib/libgtest_main.a  lib/libgtest.a  lib/libclangFrontend.a  lib/libclangRewrite.a  lib/libclangSerialization.a  lib/libclangTooling.a  -lpthread  lib/libclangFrontend.a  lib/libclangParse.a  lib/libclangSerialization.a  lib/libclangSema.a  lib/libclangEdit.a  lib/libclangAnalysis.a  lib/libclangDriver.a  lib/libLLVMOption.a  lib/libclangASTMatchers.a  lib/libclangAST.a  lib/libclangFormat.a  lib/libclangToolingInclusions.a  lib/libclangToolingCore.a  lib/libclangRewrite.a  lib/libclangLex.a  lib/libclangBasic.a  lib/libLLVMFrontendOpenMP.a  lib/libLLVMTransformUtils.a  lib/libLLVMAnalysis.a  lib/libLLVMProfileData.a  lib/libLLVMObject.a  lib/libLLVMBitReader.a  lib/libLLVMCore.a  lib/libLLVMRemarks.a  lib/libLLVMBitstreamReader.a  lib/libLLVMMCParser.a  lib/libLLVMMC.a  lib/libLLVMDebugInfoCodeView.a  lib/libLLVMDebugInfoMSF.a  lib/libLLVMTextAPI.a  lib/libLLVMBinaryFormat.a  lib/libLLVMSupport.a  -lm  /usr/lib/libz.dylib  /usr/lib/libcurses.dylib  lib/libLLVMDemangle.a && :
[4083/4196] : && /Users/buildslave/jenkins/workspace/clang-stage2-Rthinlto/host-compiler/bin/clang++  -fno-stack-protector -fno-common -Wno-profile-instr-unprofiled -fPIC -fvisibility-inlines-hidden -Werror=date-time -Werror=unguarded-availability-new -fmodules -fmodules-cache-path=/Users/buildslave/jenkins/workspace/clang-stage2-Rthinlto/clang-build/Build/module.cache -fcxx-modules -Xclang -fmodules-local-submodule-visibility -gmodules -Wall -Wextra -Wno-unused-parameter -Wwrite-strings -Wcast-qual -Wmissing-field-initializers -pedantic -Wno-long-long -Wimplicit-fallthrough -Wcovered-switch-default -Wno-noexcept-type -Wnon-virtual-dtor -Wdelete-non-virtual-dtor -Wsuggest-override -Wstring-conversion -fdiagnostics-color -flto=thin -fno-common -Woverloaded-virtual -Wno-nested-anon-types -O2 -g -DNDEBUG -isysroot /Applications/Xcode.app/Contents/Developer/Platforms/MacOSX.platform/Developer/SDKs/MacOSX10.15.sdk -Wl,-search_paths_first -Wl,-headerpad_max_install_names -flto=thin -Wl,-cache_path_lto,/Users/buildslave/jenkins/workspace/clang-stage2-Rthinlto/clang-build/Build/lto.cache    -Wl,-dead_strip tools/clang/unittests/Sema/CMakeFiles/SemaTests.dir/ExternalSemaSourceTest.cpp.o tools/clang/unittests/Sema/CMakeFiles/SemaTests.dir/CodeCompleteTest.cpp.o tools/clang/unittests/Sema/CMakeFiles/SemaTests.dir/GslOwnerPointerInference.cpp.o  -o tools/clang/unittests/Sema/SemaTests  lib/libLLVMFrontendOpenMP.a  lib/libLLVMSupport.a  lib/libLLVMSupport.a  lib/libgtest_main.a  lib/libgtest.a  lib/libclangAST.a  lib/libclangASTMatchers.a  lib/libclangBasic.a  lib/libclangFrontend.a  lib/libclangParse.a  lib/libclangSema.a  lib/libclangSerialization.a  lib/libclangTesting.a  lib/libclangTooling.a  lib/libLLVMTestingSupport.a  lib/libclangFrontend.a  lib/libclangParse.a  lib/libclangSerialization.a  lib/libclangSema.a  lib/libclangEdit.a  lib/libclangAnalysis.a  lib/libclangASTMatchers.a  lib/libclangAST.a  lib/libLLVMFrontendOpenMP.a  lib/libLLVMTransformUtils.a  lib/libLLVMAnalysis.a  lib/libLLVMObject.a  lib/libLLVMMCParser.a  lib/libLLVMTextAPI.a  lib/libLLVMBitReader.a  lib/libclangDriver.a  lib/libLLVMProfileData.a  lib/libLLVMOption.a  lib/libclangFormat.a  lib/libclangToolingInclusions.a  lib/libclangToolingCore.a  lib/libclangRewrite.a  lib/libclangLex.a  lib/libclangBasic.a  lib/libLLVMCore.a  lib/libLLVMRemarks.a  lib/libLLVMBitstreamReader.a  lib/libLLVMMC.a  lib/libLLVMBinaryFormat.a  lib/libLLVMDebugInfoCodeView.a  lib/libLLVMDebugInfoMSF.a  lib/libgtest.a  lib/libLLVMSupport.a  -lm  /usr/lib/libz.dylib  /usr/lib/libcurses.dylib  lib/libLLVMDemangle.a  -lpthread && :
[4084/4196] : && /Users/buildslave/jenkins/workspace/clang-stage2-Rthinlto/host-compiler/bin/clang++  -fno-stack-protector -fno-common -Wno-profile-instr-unprofiled -fPIC -fvisibility-inlines-hidden -Werror=date-time -Werror=unguarded-availability-new -fmodules -fmodules-cache-path=/Users/buildslave/jenkins/workspace/clang-stage2-Rthinlto/clang-build/Build/module.cache -fcxx-modules -Xclang -fmodules-local-submodule-visibility -gmodules -Wall -Wextra -Wno-unused-parameter -Wwrite-strings -Wcast-qual -Wmissing-field-initializers -pedantic -Wno-long-long -Wimplicit-fallthrough -Wcovered-switch-default -Wno-noexcept-type -Wnon-virtual-dtor -Wdelete-non-virtual-dtor -Wsuggest-override -Wstring-conversion -fdiagnostics-color -flto=thin -fno-common -Woverloaded-virtual -Wno-nested-anon-types -O2 -g -DNDEBUG -isysroot /Applications/Xcode.app/Contents/Developer/Platforms/MacOSX.platform/Developer/SDKs/MacOSX10.15.sdk -Wl,-search_paths_first -Wl,-headerpad_max_install_names -flto=thin -Wl,-cache_path_lto,/Users/buildslave/jenkins/workspace/clang-stage2-Rthinlto/clang-build/Build/lto.cache    -Wl,-dead_strip tools/clang/unittests/Rename/CMakeFiles/ClangRenameTests.dir/RenameClassTest.cpp.o tools/clang/unittests/Rename/CMakeFiles/ClangRenameTests.dir/RenameEnumTest.cpp.o tools/clang/unittests/Rename/CMakeFiles/ClangRenameTests.dir/RenameAliasTest.cpp.o tools/clang/unittests/Rename/CMakeFiles/ClangRenameTests.dir/RenameMemberTest.cpp.o tools/clang/unittests/Rename/CMakeFiles/ClangRenameTests.dir/RenameFunctionTest.cpp.o  -o tools/clang/unittests/Rename/ClangRenameTests  lib/libLLVMFrontendOpenMP.a  lib/libLLVMSupport.a  lib/libLLVMSupport.a  lib/libgtest_main.a  lib/libgtest.a  lib/libclangAST.a  lib/libclangASTMatchers.a  lib/libclangBasic.a  lib/libclangFormat.a  lib/libclangFrontend.a  lib/libclangRewrite.a  lib/libclangSerialization.a  lib/libclangTooling.a  lib/libclangToolingCore.a  lib/libclangToolingRefactoring.a  -lpthread  lib/libclangIndex.a  lib/libclangFormat.a  lib/libclangToolingInclusions.a  lib/libclangFrontend.a  lib/libclangDriver.a  lib/libclangParse.a  lib/libLLVMOption.a  lib/libclangSerialization.a  lib/libclangSema.a  lib/libclangEdit.a  lib/libclangAnalysis.a  lib/libclangASTMatchers.a  lib/libclangAST.a  lib/libLLVMFrontendOpenMP.a  lib/libLLVMTransformUtils.a  lib/libLLVMAnalysis.a  lib/libLLVMProfileData.a  lib/libLLVMObject.a  lib/libLLVMMCParser.a  lib/libLLVMTextAPI.a  lib/libLLVMBitReader.a  lib/libclangToolingCore.a  lib/libclangRewrite.a  lib/libclangLex.a  lib/libclangBasic.a  lib/libLLVMCore.a  lib/libLLVMRemarks.a  lib/libLLVMBitstreamReader.a  lib/libLLVMMC.a  lib/libLLVMBinaryFormat.a  lib/libLLVMDebugInfoCodeView.a  lib/libLLVMDebugInfoMSF.a  lib/libLLVMSupport.a  -lm  /usr/lib/libz.dylib  /usr/lib/libcurses.dylib  lib/libLLVMDemangle.a && :
[4085/4196] : && /Users/buildslave/jenkins/workspace/clang-stage2-Rthinlto/host-compiler/bin/clang++  -fno-stack-protector -fno-common -Wno-profile-instr-unprofiled -fPIC -fvisibility-inlines-hidden -Werror=date-time -Werror=unguarded-availability-new -fmodules -fmodules-cache-path=/Users/buildslave/jenkins/workspace/clang-stage2-Rthinlto/clang-build/Build/module.cache -fcxx-modules -Xclang -fmodules-local-submodule-visibility -gmodules -Wall -Wextra -Wno-unused-parameter -Wwrite-strings -Wcast-qual -Wmissing-field-initializers -pedantic -Wno-long-long -Wimplicit-fallthrough -Wcovered-switch-default -Wno-noexcept-type -Wnon-virtual-dtor -Wdelete-non-virtual-dtor -Wsuggest-override -Wstring-conversion -fdiagnostics-color -flto=thin -O2 -g -DNDEBUG -isysroot /Applications/Xcode.app/Contents/Developer/Platforms/MacOSX.platform/Developer/SDKs/MacOSX10.15.sdk -Wl,-search_paths_first -Wl,-headerpad_max_install_names -flto=thin -Wl,-cache_path_lto,/Users/buildslave/jenkins/workspace/clang-stage2-Rthinlto/clang-build/Build/lto.cache    -Wl,-dead_strip unittests/Analysis/CMakeFiles/AnalysisTests.dir/AliasAnalysisTest.cpp.o unittests/Analysis/CMakeFiles/AnalysisTests.dir/AliasSetTrackerTest.cpp.o unittests/Analysis/CMakeFiles/AnalysisTests.dir/AssumeBundleQueriesTest.cpp.o unittests/Analysis/CMakeFiles/AnalysisTests.dir/BasicAliasAnalysisTest.cpp.o unittests/Analysis/CMakeFiles/AnalysisTests.dir/BlockFrequencyInfoTest.cpp.o unittests/Analysis/CMakeFiles/AnalysisTests.dir/BranchProbabilityInfoTest.cpp.o unittests/Analysis/CMakeFiles/AnalysisTests.dir/CallGraphTest.cpp.o unittests/Analysis/CMakeFiles/AnalysisTests.dir/CaptureTrackingTest.cpp.o unittests/Analysis/CMakeFiles/AnalysisTests.dir/CFGTest.cpp.o unittests/Analysis/CMakeFiles/AnalysisTests.dir/CGSCCPassManagerTest.cpp.o unittests/Analysis/CMakeFiles/AnalysisTests.dir/ConstraintSystemTest.cpp.o unittests/Analysis/CMakeFiles/AnalysisTests.dir/DDGTest.cpp.o unittests/Analysis/CMakeFiles/AnalysisTests.dir/DivergenceAnalysisTest.cpp.o unittests/Analysis/CMakeFiles/AnalysisTests.dir/DomTreeUpdaterTest.cpp.o unittests/Analysis/CMakeFiles/AnalysisTests.dir/GlobalsModRefTest.cpp.o unittests/Analysis/CMakeFiles/AnalysisTests.dir/FunctionPropertiesAnalysisTest.cpp.o unittests/Analysis/CMakeFiles/AnalysisTests.dir/IRSimilarityIdentifierTest.cpp.o unittests/Analysis/CMakeFiles/AnalysisTests.dir/IVDescriptorsTest.cpp.o unittests/Analysis/CMakeFiles/AnalysisTests.dir/LazyCallGraphTest.cpp.o unittests/Analysis/CMakeFiles/AnalysisTests.dir/LoadsTest.cpp.o unittests/Analysis/CMakeFiles/AnalysisTests.dir/LoopInfoTest.cpp.o unittests/Analysis/CMakeFiles/AnalysisTests.dir/LoopNestTest.cpp.o unittests/Analysis/CMakeFiles/AnalysisTests.dir/MemoryBuiltinsTest.cpp.o unittests/Analysis/CMakeFiles/AnalysisTests.dir/MemorySSATest.cpp.o unittests/Analysis/CMakeFiles/AnalysisTests.dir/PhiValuesTest.cpp.o unittests/Analysis/CMakeFiles/AnalysisTests.dir/ProfileSummaryInfoTest.cpp.o unittests/Analysis/CMakeFiles/AnalysisTests.dir/ScalarEvolutionTest.cpp.o unittests/Analysis/CMakeFiles/AnalysisTests.dir/VectorFunctionABITest.cpp.o unittests/Analysis/CMakeFiles/AnalysisTests.dir/SparsePropagation.cpp.o unittests/Analysis/CMakeFiles/AnalysisTests.dir/TargetLibraryInfoTest.cpp.o unittests/Analysis/CMakeFiles/AnalysisTests.dir/TBAATest.cpp.o unittests/Analysis/CMakeFiles/AnalysisTests.dir/UnrollAnalyzerTest.cpp.o unittests/Analysis/CMakeFiles/AnalysisTests.dir/ValueLatticeTest.cpp.o unittests/Analysis/CMakeFiles/AnalysisTests.dir/ValueTrackingTest.cpp.o unittests/Analysis/CMakeFiles/AnalysisTests.dir/VectorUtilsTest.cpp.o  -o unittests/Analysis/AnalysisTests  lib/libLLVMAnalysis.a  lib/libLLVMAsmParser.a  lib/libLLVMCore.a  lib/libLLVMSupport.a  lib/libLLVMTransformUtils.a  lib/libLLVMSupport.a  lib/libgtest_main.a  lib/libgtest.a  lib/libLLVMTestingSupport.a  lib/libLLVMAnalysis.a  lib/libLLVMObject.a  lib/libLLVMBitReader.a  lib/libLLVMMCParser.a  lib/libLLVMMC.a  lib/libLLVMDebugInfoCodeView.a  lib/libLLVMDebugInfoMSF.a  lib/libLLVMTextAPI.a  lib/libLLVMProfileData.a  lib/libLLVMCore.a  lib/libLLVMBinaryFormat.a  lib/libLLVMRemarks.a  lib/libLLVMBitstreamReader.a  lib/libgtest.a  lib/libLLVMSupport.a  -lm  /usr/lib/libz.dylib  /usr/lib/libcurses.dylib  lib/libLLVMDemangle.a  -lpthread && :
[4086/4196] : && /Users/buildslave/jenkins/workspace/clang-stage2-Rthinlto/host-compiler/bin/clang++  -fno-stack-protector -fno-common -Wno-profile-instr-unprofiled -fPIC -fvisibility-inlines-hidden -Werror=date-time -Werror=unguarded-availability-new -fmodules -fmodules-cache-path=/Users/buildslave/jenkins/workspace/clang-stage2-Rthinlto/clang-build/Build/module.cache -fcxx-modules -Xclang -fmodules-local-submodule-visibility -gmodules -Wall -Wextra -Wno-unused-parameter -Wwrite-strings -Wcast-qual -Wmissing-field-initializers -pedantic -Wno-long-long -Wimplicit-fallthrough -Wcovered-switch-default -Wno-noexcept-type -Wnon-virtual-dtor -Wdelete-non-virtual-dtor -Wsuggest-override -Wstring-conversion -fdiagnostics-color -flto=thin -O2 -g -DNDEBUG -isysroot /Applications/Xcode.app/Contents/Developer/Platforms/MacOSX.platform/Developer/SDKs/MacOSX10.15.sdk -Wl,-search_paths_first -Wl,-headerpad_max_install_names -flto=thin -Wl,-cache_path_lto,/Users/buildslave/jenkins/workspace/clang-stage2-Rthinlto/clang-build/Build/lto.cache    -Wl,-dead_strip unittests/Transforms/Utils/CMakeFiles/UtilsTests.dir/ASanStackFrameLayoutTest.cpp.o unittests/Transforms/Utils/CMakeFiles/UtilsTests.dir/BasicBlockUtilsTest.cpp.o unittests/Transforms/Utils/CMakeFiles/UtilsTests.dir/CallPromotionUtilsTest.cpp.o unittests/Transforms/Utils/CMakeFiles/UtilsTests.dir/CloningTest.cpp.o unittests/Transforms/Utils/CMakeFiles/UtilsTests.dir/CodeExtractorTest.cpp.o unittests/Transforms/Utils/CMakeFiles/UtilsTests.dir/CodeMoverUtilsTest.cpp.o unittests/Transforms/Utils/CMakeFiles/UtilsTests.dir/FunctionComparatorTest.cpp.o unittests/Transforms/Utils/CMakeFiles/UtilsTests.dir/IntegerDivisionTest.cpp.o unittests/Transforms/Utils/CMakeFiles/UtilsTests.dir/LocalTest.cpp.o unittests/Transforms/Utils/CMakeFiles/UtilsTests.dir/LoopRotationUtilsTest.cpp.o unittests/Transforms/Utils/CMakeFiles/UtilsTests.dir/LoopUtilsTest.cpp.o unittests/Transforms/Utils/CMakeFiles/UtilsTests.dir/ScalarEvolutionExpanderTest.cpp.o unittests/Transforms/Utils/CMakeFiles/UtilsTests.dir/SizeOptsTest.cpp.o unittests/Transforms/Utils/CMakeFiles/UtilsTests.dir/SSAUpdaterBulkTest.cpp.o unittests/Transforms/Utils/CMakeFiles/UtilsTests.dir/UnrollLoopTest.cpp.o unittests/Transforms/Utils/CMakeFiles/UtilsTests.dir/ValueMapperTest.cpp.o unittests/Transforms/Utils/CMakeFiles/UtilsTests.dir/VFABIUtils.cpp.o  -o unittests/Transforms/Utils/UtilsTests  lib/libLLVMAnalysis.a  lib/libLLVMAsmParser.a  lib/libLLVMCore.a  lib/libLLVMSupport.a  lib/libLLVMTransformUtils.a  lib/libLLVMSupport.a  lib/libgtest_main.a  lib/libgtest.a  lib/libLLVMAnalysis.a  lib/libLLVMObject.a  lib/libLLVMBitReader.a  lib/libLLVMMCParser.a  lib/libLLVMMC.a  lib/libLLVMDebugInfoCodeView.a  lib/libLLVMDebugInfoMSF.a  lib/libLLVMTextAPI.a  lib/libLLVMProfileData.a  lib/libLLVMCore.a  lib/libLLVMBinaryFormat.a  lib/libLLVMRemarks.a  lib/libLLVMBitstreamReader.a  lib/libLLVMSupport.a  -lm  /usr/lib/libz.dylib  /usr/lib/libcurses.dylib  lib/libLLVMDemangle.a  -lpthread && :
[4087/4196] : && DYLD_LIBRARY_PATH=/Users/buildslave/jenkins/workspace/clang-stage2-Rthinlto/host-compiler/lib/ "/Applications/Xcode.app/Contents/Developer/Toolchains/XcodeDefault.xctoolchain/usr/bin/libtool" -static -no_warning_for_no_symbols -o lib/libLLVMInstrumentation.a  lib/Transforms/Instrumentation/CMakeFiles/LLVMInstrumentation.dir/AddressSanitizer.cpp.o lib/Transforms/Instrumentation/CMakeFiles/LLVMInstrumentation.dir/BoundsChecking.cpp.o lib/Transforms/Instrumentation/CMakeFiles/LLVMInstrumentation.dir/CGProfile.cpp.o lib/Transforms/Instrumentation/CMakeFiles/LLVMInstrumentation.dir/ControlHeightReduction.cpp.o lib/Transforms/Instrumentation/CMakeFiles/LLVMInstrumentation.dir/DataFlowSanitizer.cpp.o lib/Transforms/Instrumentation/CMakeFiles/LLVMInstrumentation.dir/GCOVProfiling.cpp.o lib/Transforms/Instrumentation/CMakeFiles/LLVMInstrumentation.dir/MemProfiler.cpp.o lib/Transforms/Instrumentation/CMakeFiles/LLVMInstrumentation.dir/MemorySanitizer.cpp.o lib/Transforms/Instrumentation/CMakeFiles/LLVMInstrumentation.dir/IndirectCallPromotion.cpp.o lib/Transforms/Instrumentation/CMakeFiles/LLVMInstrumentation.dir/Instrumentation.cpp.o lib/Transforms/Instrumentation/CMakeFiles/LLVMInstrumentation.dir/InstrOrderFile.cpp.o lib/Transforms/Instrumentation/CMakeFiles/LLVMInstrumentation.dir/InstrProfiling.cpp.o lib/Transforms/Instrumentation/CMakeFiles/LLVMInstrumentation.dir/PGOInstrumentation.cpp.o lib/Transforms/Instrumentation/CMakeFiles/LLVMInstrumentation.dir/PGOMemOPSizeOpt.cpp.o lib/Transforms/Instrumentation/CMakeFiles/LLVMInstrumentation.dir/PoisonChecking.cpp.o lib/Transforms/Instrumentation/CMakeFiles/LLVMInstrumentation.dir/SanitizerCoverage.cpp.o lib/Transforms/Instrumentation/CMakeFiles/LLVMInstrumentation.dir/ValueProfileCollector.cpp.o lib/Transforms/Instrumentation/CMakeFiles/LLVMInstrumentation.dir/ThreadSanitizer.cpp.o lib/Transforms/Instrumentation/CMakeFiles/LLVMInstrumentation.dir/HWAddressSanitizer.cpp.o && :
[4088/4196] : && DYLD_LIBRARY_PATH=/Users/buildslave/jenkins/workspace/clang-stage2-Rthinlto/host-compiler/lib/ "/Applications/Xcode.app/Contents/Developer/Toolchains/XcodeDefault.xctoolchain/usr/bin/libtool" -static -no_warning_for_no_symbols -o lib/libLLVMAggressiveInstCombine.a  lib/Transforms/AggressiveInstCombine/CMakeFiles/LLVMAggressiveInstCombine.dir/AggressiveInstCombine.cpp.o lib/Transforms/AggressiveInstCombine/CMakeFiles/LLVMAggressiveInstCombine.dir/TruncInstCombine.cpp.o && :
[4089/4196] : && DYLD_LIBRARY_PATH=/Users/buildslave/jenkins/workspace/clang-stage2-Rthinlto/host-compiler/lib/ "/Applications/Xcode.app/Contents/Developer/Toolchains/XcodeDefault.xctoolchain/usr/bin/libtool" -static -no_warning_for_no_symbols -o lib/libLLVMInstCombine.a  lib/Transforms/InstCombine/CMakeFiles/LLVMInstCombine.dir/InstructionCombining.cpp.o lib/Transforms/InstCombine/CMakeFiles/LLVMInstCombine.dir/InstCombineAddSub.cpp.o lib/Transforms/InstCombine/CMakeFiles/LLVMInstCombine.dir/InstCombineAtomicRMW.cpp.o lib/Transforms/InstCombine/CMakeFiles/LLVMInstCombine.dir/InstCombineAndOrXor.cpp.o lib/Transforms/InstCombine/CMakeFiles/LLVMInstCombine.dir/InstCombineCalls.cpp.o lib/Transforms/InstCombine/CMakeFiles/LLVMInstCombine.dir/InstCombineCasts.cpp.o lib/Transforms/InstCombine/CMakeFiles/LLVMInstCombine.dir/InstCombineCompares.cpp.o lib/Transforms/InstCombine/CMakeFiles/LLVMInstCombine.dir/InstCombineLoadStoreAlloca.cpp.o lib/Transforms/InstCombine/CMakeFiles/LLVMInstCombine.dir/InstCombineMulDivRem.cpp.o lib/Transforms/InstCombine/CMakeFiles/LLVMInstCombine.dir/InstCombineNegator.cpp.o lib/Transforms/InstCombine/CMakeFiles/LLVMInstCombine.dir/InstCombinePHI.cpp.o lib/Transforms/InstCombine/CMakeFiles/LLVMInstCombine.dir/InstCombineSelect.cpp.o lib/Transforms/InstCombine/CMakeFiles/LLVMInstCombine.dir/InstCombineShifts.cpp.o lib/Transforms/InstCombine/CMakeFiles/LLVMInstCombine.dir/InstCombineSimplifyDemanded.cpp.o lib/Transforms/InstCombine/CMakeFiles/LLVMInstCombine.dir/InstCombineVectorOps.cpp.o && :
[4090/4196] : && DYLD_LIBRARY_PATH=/Users/buildslave/jenkins/workspace/clang-stage2-Rthinlto/host-compiler/lib/ "/Applications/Xcode.app/Contents/Developer/Toolchains/XcodeDefault.xctoolchain/usr/bin/libtool" -static -no_warning_for_no_symbols -o lib/libLLVMVectorize.a  lib/Transforms/Vectorize/CMakeFiles/LLVMVectorize.dir/LoadStoreVectorizer.cpp.o lib/Transforms/Vectorize/CMakeFiles/LLVMVectorize.dir/LoopVectorizationLegality.cpp.o lib/Transforms/Vectorize/CMakeFiles/LLVMVectorize.dir/LoopVectorize.cpp.o lib/Transforms/Vectorize/CMakeFiles/LLVMVectorize.dir/SLPVectorizer.cpp.o lib/Transforms/Vectorize/CMakeFiles/LLVMVectorize.dir/Vectorize.cpp.o lib/Transforms/Vectorize/CMakeFiles/LLVMVectorize.dir/VectorCombine.cpp.o lib/Transforms/Vectorize/CMakeFiles/LLVMVectorize.dir/VPlan.cpp.o lib/Transforms/Vectorize/CMakeFiles/LLVMVectorize.dir/VPlanHCFGBuilder.cpp.o lib/Transforms/Vectorize/CMakeFiles/LLVMVectorize.dir/VPlanPredicator.cpp.o lib/Transforms/Vectorize/CMakeFiles/LLVMVectorize.dir/VPlanSLP.cpp.o lib/Transforms/Vectorize/CMakeFiles/LLVMVectorize.dir/VPlanTransforms.cpp.o lib/Transforms/Vectorize/CMakeFiles/LLVMVectorize.dir/VPlanVerifier.cpp.o && :
[4091/4196] : && DYLD_LIBRARY_PATH=/Users/buildslave/jenkins/workspace/clang-stage2-Rthinlto/host-compiler/lib/ "/Applications/Xcode.app/Contents/Developer/Toolchains/XcodeDefault.xctoolchain/usr/bin/libtool" -static -no_warning_for_no_symbols -o lib/libLLVMScalarOpts.a  lib/Transforms/Scalar/CMakeFiles/LLVMScalarOpts.dir/ADCE.cpp.o lib/Transforms/Scalar/CMakeFiles/LLVMScalarOpts.dir/AlignmentFromAssumptions.cpp.o lib/Transforms/Scalar/CMakeFiles/LLVMScalarOpts.dir/AnnotationRemarks.cpp.o lib/Transforms/Scalar/CMakeFiles/LLVMScalarOpts.dir/BDCE.cpp.o lib/Transforms/Scalar/CMakeFiles/LLVMScalarOpts.dir/CallSiteSplitting.cpp.o lib/Transforms/Scalar/CMakeFiles/LLVMScalarOpts.dir/ConstantHoisting.cpp.o lib/Transforms/Scalar/CMakeFiles/LLVMScalarOpts.dir/ConstraintElimination.cpp.o lib/Transforms/Scalar/CMakeFiles/LLVMScalarOpts.dir/CorrelatedValuePropagation.cpp.o lib/Transforms/Scalar/CMakeFiles/LLVMScalarOpts.dir/DCE.cpp.o lib/Transforms/Scalar/CMakeFiles/LLVMScalarOpts.dir/DeadStoreElimination.cpp.o lib/Transforms/Scalar/CMakeFiles/LLVMScalarOpts.dir/DivRemPairs.cpp.o lib/Transforms/Scalar/CMakeFiles/LLVMScalarOpts.dir/EarlyCSE.cpp.o lib/Transforms/Scalar/CMakeFiles/LLVMScalarOpts.dir/FlattenCFGPass.cpp.o lib/Transforms/Scalar/CMakeFiles/LLVMScalarOpts.dir/Float2Int.cpp.o lib/Transforms/Scalar/CMakeFiles/LLVMScalarOpts.dir/GuardWidening.cpp.o lib/Transforms/Scalar/CMakeFiles/LLVMScalarOpts.dir/GVN.cpp.o lib/Transforms/Scalar/CMakeFiles/LLVMScalarOpts.dir/GVNHoist.cpp.o lib/Transforms/Scalar/CMakeFiles/LLVMScalarOpts.dir/GVNSink.cpp.o lib/Transforms/Scalar/CMakeFiles/LLVMScalarOpts.dir/IVUsersPrinter.cpp.o lib/Transforms/Scalar/CMakeFiles/LLVMScalarOpts.dir/InductiveRangeCheckElimination.cpp.o lib/Transforms/Scalar/CMakeFiles/LLVMScalarOpts.dir/IndVarSimplify.cpp.o lib/Transforms/Scalar/CMakeFiles/LLVMScalarOpts.dir/InferAddressSpaces.cpp.o lib/Transforms/Scalar/CMakeFiles/LLVMScalarOpts.dir/InstSimplifyPass.cpp.o lib/Transforms/Scalar/CMakeFiles/LLVMScalarOpts.dir/JumpThreading.cpp.o lib/Transforms/Scalar/CMakeFiles/LLVMScalarOpts.dir/LICM.cpp.o lib/Transforms/Scalar/CMakeFiles/LLVMScalarOpts.dir/LoopAccessAnalysisPrinter.cpp.o lib/Transforms/Scalar/CMakeFiles/LLVMScalarOpts.dir/LoopSink.cpp.o lib/Transforms/Scalar/CMakeFiles/LLVMScalarOpts.dir/LoopDeletion.cpp.o lib/Transforms/Scalar/CMakeFiles/LLVMScalarOpts.dir/LoopDataPrefetch.cpp.o lib/Transforms/Scalar/CMakeFiles/LLVMScalarOpts.dir/LoopDistribute.cpp.o lib/Transforms/Scalar/CMakeFiles/LLVMScalarOpts.dir/LoopFuse.cpp.o lib/Transforms/Scalar/CMakeFiles/LLVMScalarOpts.dir/LoopIdiomRecognize.cpp.o lib/Transforms/Scalar/CMakeFiles/LLVMScalarOpts.dir/LoopInstSimplify.cpp.o lib/Transforms/Scalar/CMakeFiles/LLVMScalarOpts.dir/LoopInterchange.cpp.o lib/Transforms/Scalar/CMakeFiles/LLVMScalarOpts.dir/LoopFlatten.cpp.o lib/Transforms/Scalar/CMakeFiles/LLVMScalarOpts.dir/LoopLoadElimination.cpp.o lib/Transforms/Scalar/CMakeFiles/LLVMScalarOpts.dir/LoopPassManager.cpp.o lib/Transforms/Scalar/CMakeFiles/LLVMScalarOpts.dir/LoopPredication.cpp.o lib/Transforms/Scalar/CMakeFiles/LLVMScalarOpts.dir/LoopRerollPass.cpp.o lib/Transforms/Scalar/CMakeFiles/LLVMScalarOpts.dir/LoopRotation.cpp.o lib/Transforms/Scalar/CMakeFiles/LLVMScalarOpts.dir/LoopSimplifyCFG.cpp.o lib/Transforms/Scalar/CMakeFiles/LLVMScalarOpts.dir/LoopStrengthReduce.cpp.o lib/Transforms/Scalar/CMakeFiles/LLVMScalarOpts.dir/LoopUnrollPass.cpp.o lib/Transforms/Scalar/CMakeFiles/LLVMScalarOpts.dir/LoopUnrollAndJamPass.cpp.o lib/Transforms/Scalar/CMakeFiles/LLVMScalarOpts.dir/LoopUnswitch.cpp.o lib/Transforms/Scalar/CMakeFiles/LLVMScalarOpts.dir/LoopVersioningLICM.cpp.o lib/Transforms/Scalar/CMakeFiles/LLVMScalarOpts.dir/LowerAtomic.cpp.o lib/Transforms/Scalar/CMakeFiles/LLVMScalarOpts.dir/LowerConstantIntrinsics.cpp.o lib/Transforms/Scalar/CMakeFiles/LLVMScalarOpts.dir/LowerExpectIntrinsic.cpp.o lib/Transforms/Scalar/CMakeFiles/LLVMScalarOpts.dir/LowerGuardIntrinsic.cpp.o lib/Transforms/Scalar/CMakeFiles/LLVMScalarOpts.dir/LowerMatrixIntrinsics.cpp.o lib/Transforms/Scalar/CMakeFiles/LLVMScalarOpts.dir/LowerWidenableCondition.cpp.o lib/Transforms/Scalar/CMakeFiles/LLVMScalarOpts.dir/MakeGuardsExplicit.cpp.o lib/Transforms/Scalar/CMakeFiles/LLVMScalarOpts.dir/MemCpyOptimizer.cpp.o lib/Transforms/Scalar/CMakeFiles/LLVMScalarOpts.dir/MergeICmps.cpp.o lib/Transforms/Scalar/CMakeFiles/LLVMScalarOpts.dir/MergedLoadStoreMotion.cpp.o lib/Transforms/Scalar/CMakeFiles/LLVMScalarOpts.dir/NaryReassociate.cpp.o lib/Transforms/Scalar/CMakeFiles/LLVMScalarOpts.dir/NewGVN.cpp.o lib/Transforms/Scalar/CMakeFiles/LLVMScalarOpts.dir/PartiallyInlineLibCalls.cpp.o lib/Transforms/Scalar/CMakeFiles/LLVMScalarOpts.dir/PlaceSafepoints.cpp.o lib/Transforms/Scalar/CMakeFiles/LLVMScalarOpts.dir/Reassociate.cpp.o lib/Transforms/Scalar/CMakeFiles/LLVMScalarOpts.dir/Reg2Mem.cpp.o lib/Transforms/Scalar/CMakeFiles/LLVMScalarOpts.dir/RewriteStatepointsForGC.cpp.o lib/Transforms/Scalar/CMakeFiles/LLVMScalarOpts.dir/SCCP.cpp.o lib/Transforms/Scalar/CMakeFiles/LLVMScalarOpts.dir/SROA.cpp.o lib/Transforms/Scalar/CMakeFiles/LLVMScalarOpts.dir/Scalar.cpp.o lib/Transforms/Scalar/CMakeFiles/LLVMScalarOpts.dir/Scalarizer.cpp.o lib/Transforms/Scalar/CMakeFiles/LLVMScalarOpts.dir/ScalarizeMaskedMemIntrin.cpp.o lib/Transforms/Scalar/CMakeFiles/LLVMScalarOpts.dir/SeparateConstOffsetFromGEP.cpp.o lib/Transforms/Scalar/CMakeFiles/LLVMScalarOpts.dir/SimpleLoopUnswitch.cpp.o lib/Transforms/Scalar/CMakeFiles/LLVMScalarOpts.dir/SimplifyCFGPass.cpp.o lib/Transforms/Scalar/CMakeFiles/LLVMScalarOpts.dir/Sink.cpp.o lib/Transforms/Scalar/CMakeFiles/LLVMScalarOpts.dir/SpeculativeExecution.cpp.o lib/Transforms/Scalar/CMakeFiles/LLVMScalarOpts.dir/SpeculateAroundPHIs.cpp.o lib/Transforms/Scalar/CMakeFiles/LLVMScalarOpts.dir/StraightLineStrengthReduce.cpp.o lib/Transforms/Scalar/CMakeFiles/LLVMScalarOpts.dir/StructurizeCFG.cpp.o lib/Transforms/Scalar/CMakeFiles/LLVMScalarOpts.dir/TailRecursionElimination.cpp.o lib/Transforms/Scalar/CMakeFiles/LLVMScalarOpts.dir/WarnMissedTransforms.cpp.o && :
[4092/4196] : && /Users/buildslave/jenkins/workspace/clang-stage2-Rthinlto/host-compiler/bin/clang++  -fno-stack-protector -fno-common -Wno-profile-instr-unprofiled -fPIC -fvisibility-inlines-hidden -Werror=date-time -Werror=unguarded-availability-new -fmodules -fmodules-cache-path=/Users/buildslave/jenkins/workspace/clang-stage2-Rthinlto/clang-build/Build/module.cache -fcxx-modules -Xclang -fmodules-local-submodule-visibility -gmodules -Wall -Wextra -Wno-unused-parameter -Wwrite-strings -Wcast-qual -Wmissing-field-initializers -pedantic -Wno-long-long -Wimplicit-fallthrough -Wcovered-switch-default -Wno-noexcept-type -Wnon-virtual-dtor -Wdelete-non-virtual-dtor -Wsuggest-override -Wstring-conversion -fdiagnostics-color -flto=thin -O2 -g -DNDEBUG -isysroot /Applications/Xcode.app/Contents/Developer/Platforms/MacOSX.platform/Developer/SDKs/MacOSX10.15.sdk -Wl,-search_paths_first -Wl,-headerpad_max_install_names -flto=thin -Wl,-cache_path_lto,/Users/buildslave/jenkins/workspace/clang-stage2-Rthinlto/clang-build/Build/lto.cache    -Wl,-dead_strip unittests/Transforms/Vectorize/CMakeFiles/VectorizeTests.dir/VPlanDominatorTreeTest.cpp.o unittests/Transforms/Vectorize/CMakeFiles/VectorizeTests.dir/VPlanLoopInfoTest.cpp.o unittests/Transforms/Vectorize/CMakeFiles/VectorizeTests.dir/VPlanPredicatorTest.cpp.o unittests/Transforms/Vectorize/CMakeFiles/VectorizeTests.dir/VPlanTest.cpp.o unittests/Transforms/Vectorize/CMakeFiles/VectorizeTests.dir/VPlanHCFGTest.cpp.o unittests/Transforms/Vectorize/CMakeFiles/VectorizeTests.dir/VPlanSlpTest.cpp.o  -o unittests/Transforms/Vectorize/VectorizeTests  lib/libLLVMAnalysis.a  lib/libLLVMCore.a  lib/libLLVMVectorize.a  lib/libLLVMAsmParser.a  lib/libLLVMSupport.a  lib/libgtest_main.a  lib/libgtest.a  lib/libLLVMTransformUtils.a  lib/libLLVMAnalysis.a  lib/libLLVMObject.a  lib/libLLVMBitReader.a  lib/libLLVMMCParser.a  lib/libLLVMMC.a  lib/libLLVMDebugInfoCodeView.a  lib/libLLVMDebugInfoMSF.a  lib/libLLVMTextAPI.a  lib/libLLVMProfileData.a  lib/libLLVMCore.a  lib/libLLVMRemarks.a  lib/libLLVMBitstreamReader.a  lib/libLLVMBinaryFormat.a  lib/libLLVMSupport.a  -lm  /usr/lib/libz.dylib  /usr/lib/libcurses.dylib  lib/libLLVMDemangle.a  -lpthread && :
[4093/4196] : && DYLD_LIBRARY_PATH=/Users/buildslave/jenkins/workspace/clang-stage2-Rthinlto/host-compiler/lib/ "/Applications/Xcode.app/Contents/Developer/Toolchains/XcodeDefault.xctoolchain/usr/bin/libtool" -static -no_warning_for_no_symbols -o lib/libLLVMFuzzMutate.a  lib/FuzzMutate/CMakeFiles/LLVMFuzzMutate.dir/FuzzerCLI.cpp.o lib/FuzzMutate/CMakeFiles/LLVMFuzzMutate.dir/IRMutator.cpp.o lib/FuzzMutate/CMakeFiles/LLVMFuzzMutate.dir/OpDescriptor.cpp.o lib/FuzzMutate/CMakeFiles/LLVMFuzzMutate.dir/Operations.cpp.o lib/FuzzMutate/CMakeFiles/LLVMFuzzMutate.dir/RandomIRBuilder.cpp.o && :
[4094/4196] : && DYLD_LIBRARY_PATH=/Users/buildslave/jenkins/workspace/clang-stage2-Rthinlto/host-compiler/lib/ "/Applications/Xcode.app/Contents/Developer/Toolchains/XcodeDefault.xctoolchain/usr/bin/libtool" -static -no_warning_for_no_symbols -o lib/libLLVMCodeGen.a  lib/CodeGen/CMakeFiles/LLVMCodeGen.dir/AggressiveAntiDepBreaker.cpp.o lib/CodeGen/CMakeFiles/LLVMCodeGen.dir/AllocationOrder.cpp.o lib/CodeGen/CMakeFiles/LLVMCodeGen.dir/Analysis.cpp.o lib/CodeGen/CMakeFiles/LLVMCodeGen.dir/AtomicExpandPass.cpp.o lib/CodeGen/CMakeFiles/LLVMCodeGen.dir/BasicTargetTransformInfo.cpp.o lib/CodeGen/CMakeFiles/LLVMCodeGen.dir/BranchFolding.cpp.o lib/CodeGen/CMakeFiles/LLVMCodeGen.dir/BranchRelaxation.cpp.o lib/CodeGen/CMakeFiles/LLVMCodeGen.dir/BreakFalseDeps.cpp.o lib/CodeGen/CMakeFiles/LLVMCodeGen.dir/BuiltinGCs.cpp.o lib/CodeGen/CMakeFiles/LLVMCodeGen.dir/BasicBlockSections.cpp.o lib/CodeGen/CMakeFiles/LLVMCodeGen.dir/CalcSpillWeights.cpp.o lib/CodeGen/CMakeFiles/LLVMCodeGen.dir/CallingConvLower.cpp.o lib/CodeGen/CMakeFiles/LLVMCodeGen.dir/CFGuardLongjmp.cpp.o lib/CodeGen/CMakeFiles/LLVMCodeGen.dir/CFIInstrInserter.cpp.o lib/CodeGen/CMakeFiles/LLVMCodeGen.dir/CodeGen.cpp.o lib/CodeGen/CMakeFiles/LLVMCodeGen.dir/CodeGenPassBuilder.cpp.o lib/CodeGen/CMakeFiles/LLVMCodeGen.dir/CodeGenPrepare.cpp.o lib/CodeGen/CMakeFiles/LLVMCodeGen.dir/CommandFlags.cpp.o lib/CodeGen/CMakeFiles/LLVMCodeGen.dir/CriticalAntiDepBreaker.cpp.o lib/CodeGen/CMakeFiles/LLVMCodeGen.dir/DeadMachineInstructionElim.cpp.o lib/CodeGen/CMakeFiles/LLVMCodeGen.dir/DetectDeadLanes.cpp.o lib/CodeGen/CMakeFiles/LLVMCodeGen.dir/DFAPacketizer.cpp.o lib/CodeGen/CMakeFiles/LLVMCodeGen.dir/DwarfEHPrepare.cpp.o lib/CodeGen/CMakeFiles/LLVMCodeGen.dir/EarlyIfConversion.cpp.o lib/CodeGen/CMakeFiles/LLVMCodeGen.dir/EdgeBundles.cpp.o lib/CodeGen/CMakeFiles/LLVMCodeGen.dir/ExecutionDomainFix.cpp.o lib/CodeGen/CMakeFiles/LLVMCodeGen.dir/ExpandMemCmp.cpp.o lib/CodeGen/CMakeFiles/LLVMCodeGen.dir/ExpandPostRAPseudos.cpp.o lib/CodeGen/CMakeFiles/LLVMCodeGen.dir/ExpandReductions.cpp.o lib/CodeGen/CMakeFiles/LLVMCodeGen.dir/FaultMaps.cpp.o lib/CodeGen/CMakeFiles/LLVMCodeGen.dir/FEntryInserter.cpp.o lib/CodeGen/CMakeFiles/LLVMCodeGen.dir/FinalizeISel.cpp.o lib/CodeGen/CMakeFiles/LLVMCodeGen.dir/FixupStatepointCallerSaved.cpp.o lib/CodeGen/CMakeFiles/LLVMCodeGen.dir/FuncletLayout.cpp.o lib/CodeGen/CMakeFiles/LLVMCodeGen.dir/GCMetadata.cpp.o lib/CodeGen/CMakeFiles/LLVMCodeGen.dir/GCMetadataPrinter.cpp.o lib/CodeGen/CMakeFiles/LLVMCodeGen.dir/GCRootLowering.cpp.o lib/CodeGen/CMakeFiles/LLVMCodeGen.dir/GCStrategy.cpp.o lib/CodeGen/CMakeFiles/LLVMCodeGen.dir/GlobalMerge.cpp.o lib/CodeGen/CMakeFiles/LLVMCodeGen.dir/HardwareLoops.cpp.o lib/CodeGen/CMakeFiles/LLVMCodeGen.dir/IfConversion.cpp.o lib/CodeGen/CMakeFiles/LLVMCodeGen.dir/ImplicitNullChecks.cpp.o lib/CodeGen/CMakeFiles/LLVMCodeGen.dir/IndirectBrExpandPass.cpp.o lib/CodeGen/CMakeFiles/LLVMCodeGen.dir/InlineSpiller.cpp.o lib/CodeGen/CMakeFiles/LLVMCodeGen.dir/InterferenceCache.cpp.o lib/CodeGen/CMakeFiles/LLVMCodeGen.dir/InterleavedAccessPass.cpp.o lib/CodeGen/CMakeFiles/LLVMCodeGen.dir/InterleavedLoadCombinePass.cpp.o lib/CodeGen/CMakeFiles/LLVMCodeGen.dir/IntrinsicLowering.cpp.o lib/CodeGen/CMakeFiles/LLVMCodeGen.dir/LatencyPriorityQueue.cpp.o lib/CodeGen/CMakeFiles/LLVMCodeGen.dir/LazyMachineBlockFrequencyInfo.cpp.o lib/CodeGen/CMakeFiles/LLVMCodeGen.dir/LexicalScopes.cpp.o lib/CodeGen/CMakeFiles/LLVMCodeGen.dir/LiveDebugVariables.cpp.o lib/CodeGen/CMakeFiles/LLVMCodeGen.dir/LiveIntervals.cpp.o lib/CodeGen/CMakeFiles/LLVMCodeGen.dir/LiveInterval.cpp.o lib/CodeGen/CMakeFiles/LLVMCodeGen.dir/LiveIntervalUnion.cpp.o lib/CodeGen/CMakeFiles/LLVMCodeGen.dir/LivePhysRegs.cpp.o lib/CodeGen/CMakeFiles/LLVMCodeGen.dir/LiveRangeCalc.cpp.o lib/CodeGen/CMakeFiles/LLVMCodeGen.dir/LiveIntervalCalc.cpp.o lib/CodeGen/CMakeFiles/LLVMCodeGen.dir/LiveRangeEdit.cpp.o lib/CodeGen/CMakeFiles/LLVMCodeGen.dir/LiveRangeShrink.cpp.o lib/CodeGen/CMakeFiles/LLVMCodeGen.dir/LiveRegMatrix.cpp.o lib/CodeGen/CMakeFiles/LLVMCodeGen.dir/LiveRegUnits.cpp.o lib/CodeGen/CMakeFiles/LLVMCodeGen.dir/LiveStacks.cpp.o lib/CodeGen/CMakeFiles/LLVMCodeGen.dir/LiveVariables.cpp.o lib/CodeGen/CMakeFiles/LLVMCodeGen.dir/LLVMTargetMachine.cpp.o lib/CodeGen/CMakeFiles/LLVMCodeGen.dir/LocalStackSlotAllocation.cpp.o lib/CodeGen/CMakeFiles/LLVMCodeGen.dir/LoopTraversal.cpp.o lib/CodeGen/CMakeFiles/LLVMCodeGen.dir/LowLevelType.cpp.o lib/CodeGen/CMakeFiles/LLVMCodeGen.dir/LowerEmuTLS.cpp.o lib/CodeGen/CMakeFiles/LLVMCodeGen.dir/MachineBasicBlock.cpp.o lib/CodeGen/CMakeFiles/LLVMCodeGen.dir/MachineBlockFrequencyInfo.cpp.o lib/CodeGen/CMakeFiles/LLVMCodeGen.dir/MachineBlockPlacement.cpp.o lib/CodeGen/CMakeFiles/LLVMCodeGen.dir/MachineBranchProbabilityInfo.cpp.o lib/CodeGen/CMakeFiles/LLVMCodeGen.dir/MachineCombiner.cpp.o lib/CodeGen/CMakeFiles/LLVMCodeGen.dir/MachineCopyPropagation.cpp.o lib/CodeGen/CMakeFiles/LLVMCodeGen.dir/MachineCSE.cpp.o lib/CodeGen/CMakeFiles/LLVMCodeGen.dir/MachineCheckDebugify.cpp.o lib/CodeGen/CMakeFiles/LLVMCodeGen.dir/MachineDebugify.cpp.o lib/CodeGen/CMakeFiles/LLVMCodeGen.dir/MachineDominanceFrontier.cpp.o lib/CodeGen/CMakeFiles/LLVMCodeGen.dir/MachineDominators.cpp.o lib/CodeGen/CMakeFiles/LLVMCodeGen.dir/MachineFrameInfo.cpp.o lib/CodeGen/CMakeFiles/LLVMCodeGen.dir/MachineFunction.cpp.o lib/CodeGen/CMakeFiles/LLVMCodeGen.dir/MachineFunctionPass.cpp.o lib/CodeGen/CMakeFiles/LLVMCodeGen.dir/MachineFunctionPrinterPass.cpp.o lib/CodeGen/CMakeFiles/LLVMCodeGen.dir/MachineFunctionSplitter.cpp.o lib/CodeGen/CMakeFiles/LLVMCodeGen.dir/MachineInstrBundle.cpp.o lib/CodeGen/CMakeFiles/LLVMCodeGen.dir/MachineInstr.cpp.o lib/CodeGen/CMakeFiles/LLVMCodeGen.dir/MachineLICM.cpp.o lib/CodeGen/CMakeFiles/LLVMCodeGen.dir/MachineLoopInfo.cpp.o lib/CodeGen/CMakeFiles/LLVMCodeGen.dir/MachineLoopUtils.cpp.o lib/CodeGen/CMakeFiles/LLVMCodeGen.dir/MachineModuleInfo.cpp.o lib/CodeGen/CMakeFiles/LLVMCodeGen.dir/MachineModuleInfoImpls.cpp.o lib/CodeGen/CMakeFiles/LLVMCodeGen.dir/MachineOperand.cpp.o lib/CodeGen/CMakeFiles/LLVMCodeGen.dir/MachineOptimizationRemarkEmitter.cpp.o lib/CodeGen/CMakeFiles/LLVMCodeGen.dir/MachineOutliner.cpp.o lib/CodeGen/CMakeFiles/LLVMCodeGen.dir/MachinePassManager.cpp.o lib/CodeGen/CMakeFiles/LLVMCodeGen.dir/MachinePipeliner.cpp.o lib/CodeGen/CMakeFiles/LLVMCodeGen.dir/MachinePostDominators.cpp.o lib/CodeGen/CMakeFiles/LLVMCodeGen.dir/MachineRegionInfo.cpp.o lib/CodeGen/CMakeFiles/LLVMCodeGen.dir/MachineRegisterInfo.cpp.o lib/CodeGen/CMakeFiles/LLVMCodeGen.dir/MachineScheduler.cpp.o lib/CodeGen/CMakeFiles/LLVMCodeGen.dir/MachineSink.cpp.o lib/CodeGen/CMakeFiles/LLVMCodeGen.dir/MachineSizeOpts.cpp.o lib/CodeGen/CMakeFiles/LLVMCodeGen.dir/MachineSSAUpdater.cpp.o lib/CodeGen/CMakeFiles/LLVMCodeGen.dir/MachineStripDebug.cpp.o lib/CodeGen/CMakeFiles/LLVMCodeGen.dir/MachineTraceMetrics.cpp.o lib/CodeGen/CMakeFiles/LLVMCodeGen.dir/MachineVerifier.cpp.o lib/CodeGen/CMakeFiles/LLVMCodeGen.dir/ModuloSchedule.cpp.o lib/CodeGen/CMakeFiles/LLVMCodeGen.dir/MultiHazardRecognizer.cpp.o lib/CodeGen/CMakeFiles/LLVMCodeGen.dir/PatchableFunction.cpp.o lib/CodeGen/CMakeFiles/LLVMCodeGen.dir/MBFIWrapper.cpp.o lib/CodeGen/CMakeFiles/LLVMCodeGen.dir/MIRPrinter.cpp.o lib/CodeGen/CMakeFiles/LLVMCodeGen.dir/MIRPrintingPass.cpp.o lib/CodeGen/CMakeFiles/LLVMCodeGen.dir/MacroFusion.cpp.o lib/CodeGen/CMakeFiles/LLVMCodeGen.dir/NonRelocatableStringpool.cpp.o lib/CodeGen/CMakeFiles/LLVMCodeGen.dir/OptimizePHIs.cpp.o lib/CodeGen/CMakeFiles/LLVMCodeGen.dir/ParallelCG.cpp.o lib/CodeGen/CMakeFiles/LLVMCodeGen.dir/PeepholeOptimizer.cpp.o lib/CodeGen/CMakeFiles/LLVMCodeGen.dir/PHIElimination.cpp.o lib/CodeGen/CMakeFiles/LLVMCodeGen.dir/PHIEliminationUtils.cpp.o lib/CodeGen/CMakeFiles/LLVMCodeGen.dir/PostRAHazardRecognizer.cpp.o lib/CodeGen/CMakeFiles/LLVMCodeGen.dir/PostRASchedulerList.cpp.o lib/CodeGen/CMakeFiles/LLVMCodeGen.dir/PreISelIntrinsicLowering.cpp.o lib/CodeGen/CMakeFiles/LLVMCodeGen.dir/ProcessImplicitDefs.cpp.o lib/CodeGen/CMakeFiles/LLVMCodeGen.dir/PrologEpilogInserter.cpp.o lib/CodeGen/CMakeFiles/LLVMCodeGen.dir/PseudoProbeInserter.cpp.o lib/CodeGen/CMakeFiles/LLVMCodeGen.dir/PseudoSourceValue.cpp.o lib/CodeGen/CMakeFiles/LLVMCodeGen.dir/RDFGraph.cpp.o lib/CodeGen/CMakeFiles/LLVMCodeGen.dir/RDFLiveness.cpp.o lib/CodeGen/CMakeFiles/LLVMCodeGen.dir/RDFRegisters.cpp.o lib/CodeGen/CMakeFiles/LLVMCodeGen.dir/ReachingDefAnalysis.cpp.o lib/CodeGen/CMakeFiles/LLVMCodeGen.dir/RegAllocBase.cpp.o lib/CodeGen/CMakeFiles/LLVMCodeGen.dir/RegAllocBasic.cpp.o lib/CodeGen/CMakeFiles/LLVMCodeGen.dir/RegAllocFast.cpp.o lib/CodeGen/CMakeFiles/LLVMCodeGen.dir/RegAllocGreedy.cpp.o lib/CodeGen/CMakeFiles/LLVMCodeGen.dir/RegAllocPBQP.cpp.o lib/CodeGen/CMakeFiles/LLVMCodeGen.dir/RegisterClassInfo.cpp.o lib/CodeGen/CMakeFiles/LLVMCodeGen.dir/RegisterCoalescer.cpp.o lib/CodeGen/CMakeFiles/LLVMCodeGen.dir/RegisterPressure.cpp.o lib/CodeGen/CMakeFiles/LLVMCodeGen.dir/RegisterScavenging.cpp.o lib/CodeGen/CMakeFiles/LLVMCodeGen.dir/RenameIndependentSubregs.cpp.o lib/CodeGen/CMakeFiles/LLVMCodeGen.dir/MachineStableHash.cpp.o lib/CodeGen/CMakeFiles/LLVMCodeGen.dir/MIRVRegNamerUtils.cpp.o lib/CodeGen/CMakeFiles/LLVMCodeGen.dir/MIRNamerPass.cpp.o lib/CodeGen/CMakeFiles/LLVMCodeGen.dir/MIRCanonicalizerPass.cpp.o lib/CodeGen/CMakeFiles/LLVMCodeGen.dir/RegisterUsageInfo.cpp.o lib/CodeGen/CMakeFiles/LLVMCodeGen.dir/RegUsageInfoCollector.cpp.o lib/CodeGen/CMakeFiles/LLVMCodeGen.dir/RegUsageInfoPropagate.cpp.o lib/CodeGen/CMakeFiles/LLVMCodeGen.dir/ResetMachineFunctionPass.cpp.o lib/CodeGen/CMakeFiles/LLVMCodeGen.dir/SafeStack.cpp.o lib/CodeGen/CMakeFiles/LLVMCodeGen.dir/SafeStackLayout.cpp.o lib/CodeGen/CMakeFiles/LLVMCodeGen.dir/ScheduleDAG.cpp.o lib/CodeGen/CMakeFiles/LLVMCodeGen.dir/ScheduleDAGInstrs.cpp.o lib/CodeGen/CMakeFiles/LLVMCodeGen.dir/ScheduleDAGPrinter.cpp.o lib/CodeGen/CMakeFiles/LLVMCodeGen.dir/ScoreboardHazardRecognizer.cpp.o lib/CodeGen/CMakeFiles/LLVMCodeGen.dir/ShadowStackGCLowering.cpp.o lib/CodeGen/CMakeFiles/LLVMCodeGen.dir/ShrinkWrap.cpp.o lib/CodeGen/CMakeFiles/LLVMCodeGen.dir/SjLjEHPrepare.cpp.o lib/CodeGen/CMakeFiles/LLVMCodeGen.dir/SlotIndexes.cpp.o lib/CodeGen/CMakeFiles/LLVMCodeGen.dir/SpillPlacement.cpp.o lib/CodeGen/CMakeFiles/LLVMCodeGen.dir/SplitKit.cpp.o lib/CodeGen/CMakeFiles/LLVMCodeGen.dir/StackColoring.cpp.o lib/CodeGen/CMakeFiles/LLVMCodeGen.dir/StackMapLivenessAnalysis.cpp.o lib/CodeGen/CMakeFiles/LLVMCodeGen.dir/StackMaps.cpp.o lib/CodeGen/CMakeFiles/LLVMCodeGen.dir/StackProtector.cpp.o lib/CodeGen/CMakeFiles/LLVMCodeGen.dir/StackSlotColoring.cpp.o lib/CodeGen/CMakeFiles/LLVMCodeGen.dir/SwiftErrorValueTracking.cpp.o lib/CodeGen/CMakeFiles/LLVMCodeGen.dir/SwitchLoweringUtils.cpp.o lib/CodeGen/CMakeFiles/LLVMCodeGen.dir/TailDuplication.cpp.o lib/CodeGen/CMakeFiles/LLVMCodeGen.dir/TailDuplicator.cpp.o lib/CodeGen/CMakeFiles/LLVMCodeGen.dir/TargetFrameLoweringImpl.cpp.o lib/CodeGen/CMakeFiles/LLVMCodeGen.dir/TargetInstrInfo.cpp.o lib/CodeGen/CMakeFiles/LLVMCodeGen.dir/TargetLoweringBase.cpp.o lib/CodeGen/CMakeFiles/LLVMCodeGen.dir/TargetLoweringObjectFileImpl.cpp.o lib/CodeGen/CMakeFiles/LLVMCodeGen.dir/TargetOptionsImpl.cpp.o lib/CodeGen/CMakeFiles/LLVMCodeGen.dir/TargetPassConfig.cpp.o lib/CodeGen/CMakeFiles/LLVMCodeGen.dir/TargetRegisterInfo.cpp.o lib/CodeGen/CMakeFiles/LLVMCodeGen.dir/TargetSchedule.cpp.o lib/CodeGen/CMakeFiles/LLVMCodeGen.dir/TargetSubtargetInfo.cpp.o lib/CodeGen/CMakeFiles/LLVMCodeGen.dir/TypePromotion.cpp.o lib/CodeGen/CMakeFiles/LLVMCodeGen.dir/TwoAddressInstructionPass.cpp.o lib/CodeGen/CMakeFiles/LLVMCodeGen.dir/UnreachableBlockElim.cpp.o lib/CodeGen/CMakeFiles/LLVMCodeGen.dir/ValueTypes.cpp.o lib/CodeGen/CMakeFiles/LLVMCodeGen.dir/VirtRegMap.cpp.o lib/CodeGen/CMakeFiles/LLVMCodeGen.dir/WasmEHPrepare.cpp.o lib/CodeGen/CMakeFiles/LLVMCodeGen.dir/WinEHPrepare.cpp.o lib/CodeGen/CMakeFiles/LLVMCodeGen.dir/XRayInstrumentation.cpp.o lib/CodeGen/CMakeFiles/LLVMCodeGen.dir/LiveDebugValues/LiveDebugValues.cpp.o lib/CodeGen/CMakeFiles/LLVMCodeGen.dir/LiveDebugValues/VarLocBasedImpl.cpp.o lib/CodeGen/CMakeFiles/LLVMCodeGen.dir/LiveDebugValues/InstrRefBasedImpl.cpp.o && :
[4095/4196] : && /Users/buildslave/jenkins/workspace/clang-stage2-Rthinlto/host-compiler/bin/clang++  -fno-stack-protector -fno-common -Wno-profile-instr-unprofiled -fPIC -fvisibility-inlines-hidden -Werror=date-time -Werror=unguarded-availability-new -fmodules -fmodules-cache-path=/Users/buildslave/jenkins/workspace/clang-stage2-Rthinlto/clang-build/Build/module.cache -fcxx-modules -Xclang -fmodules-local-submodule-visibility -gmodules -Wall -Wextra -Wno-unused-parameter -Wwrite-strings -Wcast-qual -Wmissing-field-initializers -pedantic -Wno-long-long -Wimplicit-fallthrough -Wcovered-switch-default -Wno-noexcept-type -Wnon-virtual-dtor -Wdelete-non-virtual-dtor -Wsuggest-override -Wstring-conversion -fdiagnostics-color -flto=thin -O2 -g -DNDEBUG -isysroot /Applications/Xcode.app/Contents/Developer/Platforms/MacOSX.platform/Developer/SDKs/MacOSX10.15.sdk -Wl,-search_paths_first -Wl,-headerpad_max_install_names -flto=thin -Wl,-cache_path_lto,/Users/buildslave/jenkins/workspace/clang-stage2-Rthinlto/clang-build/Build/lto.cache    -Wl,-dead_strip -Wl,-object_path_lto,/Users/buildslave/jenkins/workspace/clang-stage2-Rthinlto/clang-build/Build/tools/llvm-itanium-demangle-fuzzer/./llvm-itanium-demangle-fuzzer-lto.o tools/llvm-itanium-demangle-fuzzer/CMakeFiles/llvm-itanium-demangle-fuzzer.dir/DummyDemanglerFuzzer.cpp.o tools/llvm-itanium-demangle-fuzzer/CMakeFiles/llvm-itanium-demangle-fuzzer.dir/llvm-itanium-demangle-fuzzer.cpp.o  -o bin/llvm-itanium-demangle-fuzzer  -Wl,-rpath,@loader_path/../lib  lib/libLLVMDemangle.a  lib/libLLVMFuzzMutate.a  lib/libLLVMSupport.a  lib/libLLVMBitWriter.a  lib/libLLVMScalarOpts.a  lib/libLLVMAggressiveInstCombine.a  lib/libLLVMInstCombine.a  lib/libLLVMTransformUtils.a  lib/libLLVMTarget.a  lib/libLLVMAnalysis.a  lib/libLLVMObject.a  lib/libLLVMBitReader.a  lib/libLLVMMCParser.a  lib/libLLVMTextAPI.a  lib/libLLVMProfileData.a  lib/libLLVMCore.a  lib/libLLVMRemarks.a  lib/libLLVMBitstreamReader.a  lib/libLLVMMC.a  lib/libLLVMBinaryFormat.a  lib/libLLVMDebugInfoCodeView.a  lib/libLLVMDebugInfoMSF.a  lib/libLLVMSupport.a  lib/libLLVMDemangle.a  -lm  /usr/lib/libz.dylib  /usr/lib/libcurses.dylib && cd /Users/buildslave/jenkins/workspace/clang-stage2-Rthinlto/clang-build/Build/tools/llvm-itanium-demangle-fuzzer && /Users/buildslave/jenkins/workspace/clang-stage2-Rthinlto/host-compiler/bin/dsymutil -o=llvm-itanium-demangle-fuzzer.dSYM /Users/buildslave/jenkins/workspace/clang-stage2-Rthinlto/clang-build/Build/bin/llvm-itanium-demangle-fuzzer && /usr/bin/strip -Sxl /Users/buildslave/jenkins/workspace/clang-stage2-Rthinlto/clang-build/Build/bin/llvm-itanium-demangle-fuzzer
[4096/4196] : && DYLD_LIBRARY_PATH=/Users/buildslave/jenkins/workspace/clang-stage2-Rthinlto/host-compiler/lib/ "/Applications/Xcode.app/Contents/Developer/Toolchains/XcodeDefault.xctoolchain/usr/bin/libtool" -static -no_warning_for_no_symbols -o lib/libLLVMInterpreter.a  lib/ExecutionEngine/Interpreter/CMakeFiles/LLVMInterpreter.dir/Execution.cpp.o lib/ExecutionEngine/Interpreter/CMakeFiles/LLVMInterpreter.dir/ExternalFunctions.cpp.o lib/ExecutionEngine/Interpreter/CMakeFiles/LLVMInterpreter.dir/Interpreter.cpp.o && :
[4097/4196] : && /Users/buildslave/jenkins/workspace/clang-stage2-Rthinlto/host-compiler/bin/clang++  -fno-stack-protector -fno-common -Wno-profile-instr-unprofiled -fPIC -fvisibility-inlines-hidden -Werror=date-time -Werror=unguarded-availability-new -fmodules -fmodules-cache-path=/Users/buildslave/jenkins/workspace/clang-stage2-Rthinlto/clang-build/Build/module.cache -fcxx-modules -Xclang -fmodules-local-submodule-visibility -gmodules -Wall -Wextra -Wno-unused-parameter -Wwrite-strings -Wcast-qual -Wmissing-field-initializers -pedantic -Wno-long-long -Wimplicit-fallthrough -Wcovered-switch-default -Wno-noexcept-type -Wnon-virtual-dtor -Wdelete-non-virtual-dtor -Wsuggest-override -Wstring-conversion -fdiagnostics-color -flto=thin -O2 -g -DNDEBUG -isysroot /Applications/Xcode.app/Contents/Developer/Platforms/MacOSX.platform/Developer/SDKs/MacOSX10.15.sdk -Wl,-search_paths_first -Wl,-headerpad_max_install_names -flto=thin -Wl,-cache_path_lto,/Users/buildslave/jenkins/workspace/clang-stage2-Rthinlto/clang-build/Build/lto.cache    -Wl,-dead_strip -Wl,-object_path_lto,/Users/buildslave/jenkins/workspace/clang-stage2-Rthinlto/clang-build/Build/tools/llvm-microsoft-demangle-fuzzer/./llvm-microsoft-demangle-fuzzer-lto.o tools/llvm-microsoft-demangle-fuzzer/CMakeFiles/llvm-microsoft-demangle-fuzzer.dir/DummyDemanglerFuzzer.cpp.o tools/llvm-microsoft-demangle-fuzzer/CMakeFiles/llvm-microsoft-demangle-fuzzer.dir/llvm-microsoft-demangle-fuzzer.cpp.o  -o bin/llvm-microsoft-demangle-fuzzer  -Wl,-rpath,@loader_path/../lib  lib/libLLVMDemangle.a  lib/libLLVMFuzzMutate.a  lib/libLLVMSupport.a  lib/libLLVMBitWriter.a  lib/libLLVMScalarOpts.a  lib/libLLVMAggressiveInstCombine.a  lib/libLLVMInstCombine.a  lib/libLLVMTransformUtils.a  lib/libLLVMTarget.a  lib/libLLVMAnalysis.a  lib/libLLVMObject.a  lib/libLLVMBitReader.a  lib/libLLVMMCParser.a  lib/libLLVMTextAPI.a  lib/libLLVMProfileData.a  lib/libLLVMCore.a  lib/libLLVMRemarks.a  lib/libLLVMBitstreamReader.a  lib/libLLVMMC.a  lib/libLLVMBinaryFormat.a  lib/libLLVMDebugInfoCodeView.a  lib/libLLVMDebugInfoMSF.a  lib/libLLVMSupport.a  lib/libLLVMDemangle.a  -lm  /usr/lib/libz.dylib  /usr/lib/libcurses.dylib && cd /Users/buildslave/jenkins/workspace/clang-stage2-Rthinlto/clang-build/Build/tools/llvm-microsoft-demangle-fuzzer && /Users/buildslave/jenkins/workspace/clang-stage2-Rthinlto/host-compiler/bin/dsymutil -o=llvm-microsoft-demangle-fuzzer.dSYM /Users/buildslave/jenkins/workspace/clang-stage2-Rthinlto/clang-build/Build/bin/llvm-microsoft-demangle-fuzzer && /usr/bin/strip -Sxl /Users/buildslave/jenkins/workspace/clang-stage2-Rthinlto/clang-build/Build/bin/llvm-microsoft-demangle-fuzzer
[4098/4196] : && /Users/buildslave/jenkins/workspace/clang-stage2-Rthinlto/host-compiler/bin/clang++  -fno-stack-protector -fno-common -Wno-profile-instr-unprofiled -fPIC -fvisibility-inlines-hidden -Werror=date-time -Werror=unguarded-availability-new -fmodules -fmodules-cache-path=/Users/buildslave/jenkins/workspace/clang-stage2-Rthinlto/clang-build/Build/module.cache -fcxx-modules -Xclang -fmodules-local-submodule-visibility -gmodules -Wall -Wextra -Wno-unused-parameter -Wwrite-strings -Wcast-qual -Wmissing-field-initializers -pedantic -Wno-long-long -Wimplicit-fallthrough -Wcovered-switch-default -Wno-noexcept-type -Wnon-virtual-dtor -Wdelete-non-virtual-dtor -Wsuggest-override -Wstring-conversion -fdiagnostics-color -flto=thin -O2 -g -DNDEBUG -isysroot /Applications/Xcode.app/Contents/Developer/Platforms/MacOSX.platform/Developer/SDKs/MacOSX10.15.sdk -Wl,-search_paths_first -Wl,-headerpad_max_install_names -flto=thin -Wl,-cache_path_lto,/Users/buildslave/jenkins/workspace/clang-stage2-Rthinlto/clang-build/Build/lto.cache    -Wl,-dead_strip -Wl,-object_path_lto,/Users/buildslave/jenkins/workspace/clang-stage2-Rthinlto/clang-build/Build/tools/llvm-special-case-list-fuzzer/./llvm-special-case-list-fuzzer-lto.o tools/llvm-special-case-list-fuzzer/CMakeFiles/llvm-special-case-list-fuzzer.dir/DummySpecialCaseListFuzzer.cpp.o tools/llvm-special-case-list-fuzzer/CMakeFiles/llvm-special-case-list-fuzzer.dir/special-case-list-fuzzer.cpp.o  -o bin/llvm-special-case-list-fuzzer  -Wl,-rpath,@loader_path/../lib  lib/libLLVMSupport.a  lib/libLLVMFuzzMutate.a  lib/libLLVMBitWriter.a  lib/libLLVMScalarOpts.a  lib/libLLVMAggressiveInstCombine.a  lib/libLLVMInstCombine.a  lib/libLLVMTransformUtils.a  lib/libLLVMTarget.a  lib/libLLVMAnalysis.a  lib/libLLVMObject.a  lib/libLLVMBitReader.a  lib/libLLVMMCParser.a  lib/libLLVMTextAPI.a  lib/libLLVMProfileData.a  lib/libLLVMCore.a  lib/libLLVMRemarks.a  lib/libLLVMBitstreamReader.a  lib/libLLVMMC.a  lib/libLLVMBinaryFormat.a  lib/libLLVMDebugInfoCodeView.a  lib/libLLVMDebugInfoMSF.a  lib/libLLVMSupport.a  -lm  /usr/lib/libz.dylib  /usr/lib/libcurses.dylib  lib/libLLVMDemangle.a && cd /Users/buildslave/jenkins/workspace/clang-stage2-Rthinlto/clang-build/Build/tools/llvm-special-case-list-fuzzer && /Users/buildslave/jenkins/workspace/clang-stage2-Rthinlto/host-compiler/bin/dsymutil -o=llvm-special-case-list-fuzzer.dSYM /Users/buildslave/jenkins/workspace/clang-stage2-Rthinlto/clang-build/Build/bin/llvm-special-case-list-fuzzer && /usr/bin/strip -Sxl /Users/buildslave/jenkins/workspace/clang-stage2-Rthinlto/clang-build/Build/bin/llvm-special-case-list-fuzzer
[4099/4196] : && /Users/buildslave/jenkins/workspace/clang-stage2-Rthinlto/host-compiler/bin/clang++  -fno-stack-protector -fno-common -Wno-profile-instr-unprofiled -fPIC -fvisibility-inlines-hidden -Werror=date-time -Werror=unguarded-availability-new -fmodules -fmodules-cache-path=/Users/buildslave/jenkins/workspace/clang-stage2-Rthinlto/clang-build/Build/module.cache -fcxx-modules -Xclang -fmodules-local-submodule-visibility -gmodules -Wall -Wextra -Wno-unused-parameter -Wwrite-strings -Wcast-qual -Wmissing-field-initializers -pedantic -Wno-long-long -Wimplicit-fallthrough -Wcovered-switch-default -Wno-noexcept-type -Wnon-virtual-dtor -Wdelete-non-virtual-dtor -Wsuggest-override -Wstring-conversion -fdiagnostics-color -flto=thin -O2 -g -DNDEBUG -isysroot /Applications/Xcode.app/Contents/Developer/Platforms/MacOSX.platform/Developer/SDKs/MacOSX10.15.sdk -Wl,-search_paths_first -Wl,-headerpad_max_install_names -flto=thin -Wl,-cache_path_lto,/Users/buildslave/jenkins/workspace/clang-stage2-Rthinlto/clang-build/Build/lto.cache    -Wl,-dead_strip -Wl,-object_path_lto,/Users/buildslave/jenkins/workspace/clang-stage2-Rthinlto/clang-build/Build/tools/llvm-yaml-numeric-parser-fuzzer/./llvm-yaml-numeric-parser-fuzzer-lto.o tools/llvm-yaml-numeric-parser-fuzzer/CMakeFiles/llvm-yaml-numeric-parser-fuzzer.dir/DummyYAMLNumericParserFuzzer.cpp.o tools/llvm-yaml-numeric-parser-fuzzer/CMakeFiles/llvm-yaml-numeric-parser-fuzzer.dir/yaml-numeric-parser-fuzzer.cpp.o  -o bin/llvm-yaml-numeric-parser-fuzzer  -Wl,-rpath,@loader_path/../lib  lib/libLLVMSupport.a  lib/libLLVMFuzzMutate.a  lib/libLLVMBitWriter.a  lib/libLLVMScalarOpts.a  lib/libLLVMAggressiveInstCombine.a  lib/libLLVMInstCombine.a  lib/libLLVMTransformUtils.a  lib/libLLVMTarget.a  lib/libLLVMAnalysis.a  lib/libLLVMObject.a  lib/libLLVMBitReader.a  lib/libLLVMMCParser.a  lib/libLLVMTextAPI.a  lib/libLLVMProfileData.a  lib/libLLVMCore.a  lib/libLLVMRemarks.a  lib/libLLVMBitstreamReader.a  lib/libLLVMMC.a  lib/libLLVMBinaryFormat.a  lib/libLLVMDebugInfoCodeView.a  lib/libLLVMDebugInfoMSF.a  lib/libLLVMSupport.a  -lm  /usr/lib/libz.dylib  /usr/lib/libcurses.dylib  lib/libLLVMDemangle.a && cd /Users/buildslave/jenkins/workspace/clang-stage2-Rthinlto/clang-build/Build/tools/llvm-yaml-numeric-parser-fuzzer && /Users/buildslave/jenkins/workspace/clang-stage2-Rthinlto/host-compiler/bin/dsymutil -o=llvm-yaml-numeric-parser-fuzzer.dSYM /Users/buildslave/jenkins/workspace/clang-stage2-Rthinlto/clang-build/Build/bin/llvm-yaml-numeric-parser-fuzzer && /usr/bin/strip -Sxl /Users/buildslave/jenkins/workspace/clang-stage2-Rthinlto/clang-build/Build/bin/llvm-yaml-numeric-parser-fuzzer
[4100/4196] : && /Users/buildslave/jenkins/workspace/clang-stage2-Rthinlto/host-compiler/bin/clang++  -fno-stack-protector -fno-common -Wno-profile-instr-unprofiled -fPIC -fvisibility-inlines-hidden -Werror=date-time -Werror=unguarded-availability-new -fmodules -fmodules-cache-path=/Users/buildslave/jenkins/workspace/clang-stage2-Rthinlto/clang-build/Build/module.cache -fcxx-modules -Xclang -fmodules-local-submodule-visibility -gmodules -Wall -Wextra -Wno-unused-parameter -Wwrite-strings -Wcast-qual -Wmissing-field-initializers -pedantic -Wno-long-long -Wimplicit-fallthrough -Wcovered-switch-default -Wno-noexcept-type -Wnon-virtual-dtor -Wdelete-non-virtual-dtor -Wsuggest-override -Wstring-conversion -fdiagnostics-color -flto=thin -O2 -g -DNDEBUG -isysroot /Applications/Xcode.app/Contents/Developer/Platforms/MacOSX.platform/Developer/SDKs/MacOSX10.15.sdk -Wl,-search_paths_first -Wl,-headerpad_max_install_names -flto=thin -Wl,-cache_path_lto,/Users/buildslave/jenkins/workspace/clang-stage2-Rthinlto/clang-build/Build/lto.cache    -Wl,-dead_strip -Wl,-object_path_lto,/Users/buildslave/jenkins/workspace/clang-stage2-Rthinlto/clang-build/Build/tools/llvm-yaml-parser-fuzzer/./llvm-yaml-parser-fuzzer-lto.o tools/llvm-yaml-parser-fuzzer/CMakeFiles/llvm-yaml-parser-fuzzer.dir/DummyYAMLParserFuzzer.cpp.o tools/llvm-yaml-parser-fuzzer/CMakeFiles/llvm-yaml-parser-fuzzer.dir/yaml-parser-fuzzer.cpp.o  -o bin/llvm-yaml-parser-fuzzer  -Wl,-rpath,@loader_path/../lib  lib/libLLVMSupport.a  lib/libLLVMFuzzMutate.a  lib/libLLVMBitWriter.a  lib/libLLVMScalarOpts.a  lib/libLLVMAggressiveInstCombine.a  lib/libLLVMInstCombine.a  lib/libLLVMTransformUtils.a  lib/libLLVMTarget.a  lib/libLLVMAnalysis.a  lib/libLLVMObject.a  lib/libLLVMBitReader.a  lib/libLLVMMCParser.a  lib/libLLVMTextAPI.a  lib/libLLVMProfileData.a  lib/libLLVMCore.a  lib/libLLVMRemarks.a  lib/libLLVMBitstreamReader.a  lib/libLLVMMC.a  lib/libLLVMBinaryFormat.a  lib/libLLVMDebugInfoCodeView.a  lib/libLLVMDebugInfoMSF.a  lib/libLLVMSupport.a  -lm  /usr/lib/libz.dylib  /usr/lib/libcurses.dylib  lib/libLLVMDemangle.a && cd /Users/buildslave/jenkins/workspace/clang-stage2-Rthinlto/clang-build/Build/tools/llvm-yaml-parser-fuzzer && /Users/buildslave/jenkins/workspace/clang-stage2-Rthinlto/host-compiler/bin/dsymutil -o=llvm-yaml-parser-fuzzer.dSYM /Users/buildslave/jenkins/workspace/clang-stage2-Rthinlto/clang-build/Build/bin/llvm-yaml-parser-fuzzer && /usr/bin/strip -Sxl /Users/buildslave/jenkins/workspace/clang-stage2-Rthinlto/clang-build/Build/bin/llvm-yaml-parser-fuzzer
[4101/4196] : && /Users/buildslave/jenkins/workspace/clang-stage2-Rthinlto/host-compiler/bin/clang++  -fno-stack-protector -fno-common -Wno-profile-instr-unprofiled -fPIC -fvisibility-inlines-hidden -Werror=date-time -Werror=unguarded-availability-new -fmodules -fmodules-cache-path=/Users/buildslave/jenkins/workspace/clang-stage2-Rthinlto/clang-build/Build/module.cache -fcxx-modules -Xclang -fmodules-local-submodule-visibility -gmodules -Wall -Wextra -Wno-unused-parameter -Wwrite-strings -Wcast-qual -Wmissing-field-initializers -pedantic -Wno-long-long -Wimplicit-fallthrough -Wcovered-switch-default -Wno-noexcept-type -Wnon-virtual-dtor -Wdelete-non-virtual-dtor -Wsuggest-override -Wstring-conversion -fdiagnostics-color -flto=thin -O2 -g -DNDEBUG -isysroot /Applications/Xcode.app/Contents/Developer/Platforms/MacOSX.platform/Developer/SDKs/MacOSX10.15.sdk -Wl,-search_paths_first -Wl,-headerpad_max_install_names -flto=thin -Wl,-cache_path_lto,/Users/buildslave/jenkins/workspace/clang-stage2-Rthinlto/clang-build/Build/lto.cache    -Wl,-dead_strip unittests/FuzzMutate/CMakeFiles/FuzzMutateTests.dir/OperationsTest.cpp.o unittests/FuzzMutate/CMakeFiles/FuzzMutateTests.dir/ReservoirSamplerTest.cpp.o unittests/FuzzMutate/CMakeFiles/FuzzMutateTests.dir/StrategiesTest.cpp.o unittests/FuzzMutate/CMakeFiles/FuzzMutateTests.dir/RandomIRBuilderTest.cpp.o  -o unittests/FuzzMutate/FuzzMutateTests  lib/libLLVMAsmParser.a  lib/libLLVMCore.a  lib/libLLVMFuzzMutate.a  lib/libLLVMSupport.a  lib/libLLVMSupport.a  lib/libgtest_main.a  lib/libgtest.a  lib/libLLVMBitWriter.a  lib/libLLVMScalarOpts.a  lib/libLLVMAggressiveInstCombine.a  lib/libLLVMInstCombine.a  lib/libLLVMTransformUtils.a  lib/libLLVMTarget.a  lib/libLLVMAnalysis.a  lib/libLLVMObject.a  lib/libLLVMBitReader.a  lib/libLLVMMCParser.a  lib/libLLVMTextAPI.a  lib/libLLVMProfileData.a  lib/libLLVMCore.a  lib/libLLVMRemarks.a  lib/libLLVMBitstreamReader.a  lib/libLLVMMC.a  lib/libLLVMBinaryFormat.a  lib/libLLVMDebugInfoCodeView.a  lib/libLLVMDebugInfoMSF.a  lib/libLLVMSupport.a  -lm  /usr/lib/libz.dylib  /usr/lib/libcurses.dylib  lib/libLLVMDemangle.a  -lpthread && :
[4102/4196] : && DYLD_LIBRARY_PATH=/Users/buildslave/jenkins/workspace/clang-stage2-Rthinlto/host-compiler/lib/ "/Applications/Xcode.app/Contents/Developer/Toolchains/XcodeDefault.xctoolchain/usr/bin/libtool" -static -no_warning_for_no_symbols -o lib/libLLVMSelectionDAG.a  lib/CodeGen/SelectionDAG/CMakeFiles/LLVMSelectionDAG.dir/DAGCombiner.cpp.o lib/CodeGen/SelectionDAG/CMakeFiles/LLVMSelectionDAG.dir/FastISel.cpp.o lib/CodeGen/SelectionDAG/CMakeFiles/LLVMSelectionDAG.dir/FunctionLoweringInfo.cpp.o lib/CodeGen/SelectionDAG/CMakeFiles/LLVMSelectionDAG.dir/InstrEmitter.cpp.o lib/CodeGen/SelectionDAG/CMakeFiles/LLVMSelectionDAG.dir/LegalizeDAG.cpp.o lib/CodeGen/SelectionDAG/CMakeFiles/LLVMSelectionDAG.dir/LegalizeFloatTypes.cpp.o lib/CodeGen/SelectionDAG/CMakeFiles/LLVMSelectionDAG.dir/LegalizeIntegerTypes.cpp.o lib/CodeGen/SelectionDAG/CMakeFiles/LLVMSelectionDAG.dir/LegalizeTypes.cpp.o lib/CodeGen/SelectionDAG/CMakeFiles/LLVMSelectionDAG.dir/LegalizeTypesGeneric.cpp.o lib/CodeGen/SelectionDAG/CMakeFiles/LLVMSelectionDAG.dir/LegalizeVectorOps.cpp.o lib/CodeGen/SelectionDAG/CMakeFiles/LLVMSelectionDAG.dir/LegalizeVectorTypes.cpp.o lib/CodeGen/SelectionDAG/CMakeFiles/LLVMSelectionDAG.dir/ResourcePriorityQueue.cpp.o lib/CodeGen/SelectionDAG/CMakeFiles/LLVMSelectionDAG.dir/ScheduleDAGFast.cpp.o lib/CodeGen/SelectionDAG/CMakeFiles/LLVMSelectionDAG.dir/ScheduleDAGRRList.cpp.o lib/CodeGen/SelectionDAG/CMakeFiles/LLVMSelectionDAG.dir/ScheduleDAGSDNodes.cpp.o lib/CodeGen/SelectionDAG/CMakeFiles/LLVMSelectionDAG.dir/ScheduleDAGVLIW.cpp.o lib/CodeGen/SelectionDAG/CMakeFiles/LLVMSelectionDAG.dir/SelectionDAGBuilder.cpp.o lib/CodeGen/SelectionDAG/CMakeFiles/LLVMSelectionDAG.dir/SelectionDAG.cpp.o lib/CodeGen/SelectionDAG/CMakeFiles/LLVMSelectionDAG.dir/SelectionDAGAddressAnalysis.cpp.o lib/CodeGen/SelectionDAG/CMakeFiles/LLVMSelectionDAG.dir/SelectionDAGDumper.cpp.o lib/CodeGen/SelectionDAG/CMakeFiles/LLVMSelectionDAG.dir/SelectionDAGISel.cpp.o lib/CodeGen/SelectionDAG/CMakeFiles/LLVMSelectionDAG.dir/SelectionDAGPrinter.cpp.o lib/CodeGen/SelectionDAG/CMakeFiles/LLVMSelectionDAG.dir/SelectionDAGTargetInfo.cpp.o lib/CodeGen/SelectionDAG/CMakeFiles/LLVMSelectionDAG.dir/StatepointLowering.cpp.o lib/CodeGen/SelectionDAG/CMakeFiles/LLVMSelectionDAG.dir/TargetLowering.cpp.o && :
[4103/4196] : && DYLD_LIBRARY_PATH=/Users/buildslave/jenkins/workspace/clang-stage2-Rthinlto/host-compiler/lib/ "/Applications/Xcode.app/Contents/Developer/Toolchains/XcodeDefault.xctoolchain/usr/bin/libtool" -static -no_warning_for_no_symbols -o lib/libLLVMAsmPrinter.a  lib/CodeGen/AsmPrinter/CMakeFiles/LLVMAsmPrinter.dir/AccelTable.cpp.o lib/CodeGen/AsmPrinter/CMakeFiles/LLVMAsmPrinter.dir/AddressPool.cpp.o lib/CodeGen/AsmPrinter/CMakeFiles/LLVMAsmPrinter.dir/AIXException.cpp.o lib/CodeGen/AsmPrinter/CMakeFiles/LLVMAsmPrinter.dir/ARMException.cpp.o lib/CodeGen/AsmPrinter/CMakeFiles/LLVMAsmPrinter.dir/AsmPrinter.cpp.o lib/CodeGen/AsmPrinter/CMakeFiles/LLVMAsmPrinter.dir/AsmPrinterDwarf.cpp.o lib/CodeGen/AsmPrinter/CMakeFiles/LLVMAsmPrinter.dir/AsmPrinterInlineAsm.cpp.o lib/CodeGen/AsmPrinter/CMakeFiles/LLVMAsmPrinter.dir/DbgEntityHistoryCalculator.cpp.o lib/CodeGen/AsmPrinter/CMakeFiles/LLVMAsmPrinter.dir/DebugHandlerBase.cpp.o lib/CodeGen/AsmPrinter/CMakeFiles/LLVMAsmPrinter.dir/DebugLocStream.cpp.o lib/CodeGen/AsmPrinter/CMakeFiles/LLVMAsmPrinter.dir/DIE.cpp.o lib/CodeGen/AsmPrinter/CMakeFiles/LLVMAsmPrinter.dir/DIEHash.cpp.o lib/CodeGen/AsmPrinter/CMakeFiles/LLVMAsmPrinter.dir/DwarfCFIException.cpp.o lib/CodeGen/AsmPrinter/CMakeFiles/LLVMAsmPrinter.dir/DwarfCompileUnit.cpp.o lib/CodeGen/AsmPrinter/CMakeFiles/LLVMAsmPrinter.dir/DwarfDebug.cpp.o lib/CodeGen/AsmPrinter/CMakeFiles/LLVMAsmPrinter.dir/DwarfExpression.cpp.o lib/CodeGen/AsmPrinter/CMakeFiles/LLVMAsmPrinter.dir/DwarfFile.cpp.o lib/CodeGen/AsmPrinter/CMakeFiles/LLVMAsmPrinter.dir/DwarfStringPool.cpp.o lib/CodeGen/AsmPrinter/CMakeFiles/LLVMAsmPrinter.dir/DwarfUnit.cpp.o lib/CodeGen/AsmPrinter/CMakeFiles/LLVMAsmPrinter.dir/EHStreamer.cpp.o lib/CodeGen/AsmPrinter/CMakeFiles/LLVMAsmPrinter.dir/ErlangGCPrinter.cpp.o lib/CodeGen/AsmPrinter/CMakeFiles/LLVMAsmPrinter.dir/OcamlGCPrinter.cpp.o lib/CodeGen/AsmPrinter/CMakeFiles/LLVMAsmPrinter.dir/PseudoProbePrinter.cpp.o lib/CodeGen/AsmPrinter/CMakeFiles/LLVMAsmPrinter.dir/WinCFGuard.cpp.o lib/CodeGen/AsmPrinter/CMakeFiles/LLVMAsmPrinter.dir/WinException.cpp.o lib/CodeGen/AsmPrinter/CMakeFiles/LLVMAsmPrinter.dir/CodeViewDebug.cpp.o lib/CodeGen/AsmPrinter/CMakeFiles/LLVMAsmPrinter.dir/WasmException.cpp.o && :
[4104/4196] : && DYLD_LIBRARY_PATH=/Users/buildslave/jenkins/workspace/clang-stage2-Rthinlto/host-compiler/lib/ "/Applications/Xcode.app/Contents/Developer/Toolchains/XcodeDefault.xctoolchain/usr/bin/libtool" -static -no_warning_for_no_symbols -o lib/libLLVMMIRParser.a  lib/CodeGen/MIRParser/CMakeFiles/LLVMMIRParser.dir/MILexer.cpp.o lib/CodeGen/MIRParser/CMakeFiles/LLVMMIRParser.dir/MIParser.cpp.o lib/CodeGen/MIRParser/CMakeFiles/LLVMMIRParser.dir/MIRParser.cpp.o && :
[4105/4196] : && DYLD_LIBRARY_PATH=/Users/buildslave/jenkins/workspace/clang-stage2-Rthinlto/host-compiler/lib/ "/Applications/Xcode.app/Contents/Developer/Toolchains/XcodeDefault.xctoolchain/usr/bin/libtool" -static -no_warning_for_no_symbols -o lib/libLLVMGlobalISel.a  lib/CodeGen/GlobalISel/CMakeFiles/LLVMGlobalISel.dir/CSEInfo.cpp.o lib/CodeGen/GlobalISel/CMakeFiles/LLVMGlobalISel.dir/GISelKnownBits.cpp.o lib/CodeGen/GlobalISel/CMakeFiles/LLVMGlobalISel.dir/CSEMIRBuilder.cpp.o lib/CodeGen/GlobalISel/CMakeFiles/LLVMGlobalISel.dir/CallLowering.cpp.o lib/CodeGen/GlobalISel/CMakeFiles/LLVMGlobalISel.dir/GlobalISel.cpp.o lib/CodeGen/GlobalISel/CMakeFiles/LLVMGlobalISel.dir/Combiner.cpp.o lib/CodeGen/GlobalISel/CMakeFiles/LLVMGlobalISel.dir/CombinerHelper.cpp.o lib/CodeGen/GlobalISel/CMakeFiles/LLVMGlobalISel.dir/GISelChangeObserver.cpp.o lib/CodeGen/GlobalISel/CMakeFiles/LLVMGlobalISel.dir/IRTranslator.cpp.o lib/CodeGen/GlobalISel/CMakeFiles/LLVMGlobalISel.dir/InlineAsmLowering.cpp.o lib/CodeGen/GlobalISel/CMakeFiles/LLVMGlobalISel.dir/InstructionSelect.cpp.o lib/CodeGen/GlobalISel/CMakeFiles/LLVMGlobalISel.dir/InstructionSelector.cpp.o lib/CodeGen/GlobalISel/CMakeFiles/LLVMGlobalISel.dir/LegalityPredicates.cpp.o lib/CodeGen/GlobalISel/CMakeFiles/LLVMGlobalISel.dir/LegalizeMutations.cpp.o lib/CodeGen/GlobalISel/CMakeFiles/LLVMGlobalISel.dir/Legalizer.cpp.o lib/CodeGen/GlobalISel/CMakeFiles/LLVMGlobalISel.dir/LegalizerHelper.cpp.o lib/CodeGen/GlobalISel/CMakeFiles/LLVMGlobalISel.dir/LegalizerInfo.cpp.o lib/CodeGen/GlobalISel/CMakeFiles/LLVMGlobalISel.dir/Localizer.cpp.o lib/CodeGen/GlobalISel/CMakeFiles/LLVMGlobalISel.dir/LostDebugLocObserver.cpp.o lib/CodeGen/GlobalISel/CMakeFiles/LLVMGlobalISel.dir/MachineIRBuilder.cpp.o lib/CodeGen/GlobalISel/CMakeFiles/LLVMGlobalISel.dir/RegBankSelect.cpp.o lib/CodeGen/GlobalISel/CMakeFiles/LLVMGlobalISel.dir/RegisterBank.cpp.o lib/CodeGen/GlobalISel/CMakeFiles/LLVMGlobalISel.dir/RegisterBankInfo.cpp.o lib/CodeGen/GlobalISel/CMakeFiles/LLVMGlobalISel.dir/Utils.cpp.o && :
[4106/4196] : && DYLD_LIBRARY_PATH=/Users/buildslave/jenkins/workspace/clang-stage2-Rthinlto/host-compiler/lib/ "/Applications/Xcode.app/Contents/Developer/Toolchains/XcodeDefault.xctoolchain/usr/bin/libtool" -static -no_warning_for_no_symbols -o lib/libLLVMDWARFLinker.a  lib/DWARFLinker/CMakeFiles/LLVMDWARFLinker.dir/DWARFLinkerCompileUnit.cpp.o lib/DWARFLinker/CMakeFiles/LLVMDWARFLinker.dir/DWARFLinkerDeclContext.cpp.o lib/DWARFLinker/CMakeFiles/LLVMDWARFLinker.dir/DWARFLinker.cpp.o lib/DWARFLinker/CMakeFiles/LLVMDWARFLinker.dir/DWARFStreamer.cpp.o && :
[4107/4196] : && DYLD_LIBRARY_PATH=/Users/buildslave/jenkins/workspace/clang-stage2-Rthinlto/host-compiler/lib/ "/Applications/Xcode.app/Contents/Developer/Toolchains/XcodeDefault.xctoolchain/usr/bin/libtool" -static -no_warning_for_no_symbols -o lib/libLLVMX86CodeGen.a  lib/Target/X86/CMakeFiles/LLVMX86CodeGen.dir/X86AsmPrinter.cpp.o lib/Target/X86/CMakeFiles/LLVMX86CodeGen.dir/X86AvoidTrailingCall.cpp.o lib/Target/X86/CMakeFiles/LLVMX86CodeGen.dir/X86CallFrameOptimization.cpp.o lib/Target/X86/CMakeFiles/LLVMX86CodeGen.dir/X86CallingConv.cpp.o lib/Target/X86/CMakeFiles/LLVMX86CodeGen.dir/X86CallLowering.cpp.o lib/Target/X86/CMakeFiles/LLVMX86CodeGen.dir/X86CmovConversion.cpp.o lib/Target/X86/CMakeFiles/LLVMX86CodeGen.dir/X86DomainReassignment.cpp.o lib/Target/X86/CMakeFiles/LLVMX86CodeGen.dir/X86DiscriminateMemOps.cpp.o lib/Target/X86/CMakeFiles/LLVMX86CodeGen.dir/X86LowerAMXType.cpp.o lib/Target/X86/CMakeFiles/LLVMX86CodeGen.dir/X86TileConfig.cpp.o lib/Target/X86/CMakeFiles/LLVMX86CodeGen.dir/X86PreTileConfig.cpp.o lib/Target/X86/CMakeFiles/LLVMX86CodeGen.dir/X86ExpandPseudo.cpp.o lib/Target/X86/CMakeFiles/LLVMX86CodeGen.dir/X86FastISel.cpp.o lib/Target/X86/CMakeFiles/LLVMX86CodeGen.dir/X86FixupBWInsts.cpp.o lib/Target/X86/CMakeFiles/LLVMX86CodeGen.dir/X86FixupLEAs.cpp.o lib/Target/X86/CMakeFiles/LLVMX86CodeGen.dir/X86AvoidStoreForwardingBlocks.cpp.o lib/Target/X86/CMakeFiles/LLVMX86CodeGen.dir/X86FixupSetCC.cpp.o lib/Target/X86/CMakeFiles/LLVMX86CodeGen.dir/X86FlagsCopyLowering.cpp.o lib/Target/X86/CMakeFiles/LLVMX86CodeGen.dir/X86FloatingPoint.cpp.o lib/Target/X86/CMakeFiles/LLVMX86CodeGen.dir/X86FrameLowering.cpp.o lib/Target/X86/CMakeFiles/LLVMX86CodeGen.dir/X86InstructionSelector.cpp.o lib/Target/X86/CMakeFiles/LLVMX86CodeGen.dir/X86ISelDAGToDAG.cpp.o lib/Target/X86/CMakeFiles/LLVMX86CodeGen.dir/X86ISelLowering.cpp.o lib/Target/X86/CMakeFiles/LLVMX86CodeGen.dir/X86IndirectBranchTracking.cpp.o lib/Target/X86/CMakeFiles/LLVMX86CodeGen.dir/X86IndirectThunks.cpp.o lib/Target/X86/CMakeFiles/LLVMX86CodeGen.dir/X86InterleavedAccess.cpp.o lib/Target/X86/CMakeFiles/LLVMX86CodeGen.dir/X86InsertPrefetch.cpp.o lib/Target/X86/CMakeFiles/LLVMX86CodeGen.dir/X86InstCombineIntrinsic.cpp.o lib/Target/X86/CMakeFiles/LLVMX86CodeGen.dir/X86InstrFMA3Info.cpp.o lib/Target/X86/CMakeFiles/LLVMX86CodeGen.dir/X86InstrFoldTables.cpp.o lib/Target/X86/CMakeFiles/LLVMX86CodeGen.dir/X86InstrInfo.cpp.o lib/Target/X86/CMakeFiles/LLVMX86CodeGen.dir/X86EvexToVex.cpp.o lib/Target/X86/CMakeFiles/LLVMX86CodeGen.dir/X86LegalizerInfo.cpp.o lib/Target/X86/CMakeFiles/LLVMX86CodeGen.dir/X86LoadValueInjectionLoadHardening.cpp.o lib/Target/X86/CMakeFiles/LLVMX86CodeGen.dir/X86LoadValueInjectionRetHardening.cpp.o lib/Target/X86/CMakeFiles/LLVMX86CodeGen.dir/X86MCInstLower.cpp.o lib/Target/X86/CMakeFiles/LLVMX86CodeGen.dir/X86MachineFunctionInfo.cpp.o lib/Target/X86/CMakeFiles/LLVMX86CodeGen.dir/X86MacroFusion.cpp.o lib/Target/X86/CMakeFiles/LLVMX86CodeGen.dir/X86OptimizeLEAs.cpp.o lib/Target/X86/CMakeFiles/LLVMX86CodeGen.dir/X86PadShortFunction.cpp.o lib/Target/X86/CMakeFiles/LLVMX86CodeGen.dir/X86PartialReduction.cpp.o lib/Target/X86/CMakeFiles/LLVMX86CodeGen.dir/X86RegisterBankInfo.cpp.o lib/Target/X86/CMakeFiles/LLVMX86CodeGen.dir/X86RegisterInfo.cpp.o lib/Target/X86/CMakeFiles/LLVMX86CodeGen.dir/X86SelectionDAGInfo.cpp.o lib/Target/X86/CMakeFiles/LLVMX86CodeGen.dir/X86ShuffleDecodeConstantPool.cpp.o lib/Target/X86/CMakeFiles/LLVMX86CodeGen.dir/X86SpeculativeLoadHardening.cpp.o lib/Target/X86/CMakeFiles/LLVMX86CodeGen.dir/X86SpeculativeExecutionSideEffectSuppression.cpp.o lib/Target/X86/CMakeFiles/LLVMX86CodeGen.dir/X86Subtarget.cpp.o lib/Target/X86/CMakeFiles/LLVMX86CodeGen.dir/X86TargetMachine.cpp.o lib/Target/X86/CMakeFiles/LLVMX86CodeGen.dir/X86TargetObjectFile.cpp.o lib/Target/X86/CMakeFiles/LLVMX86CodeGen.dir/X86TargetTransformInfo.cpp.o lib/Target/X86/CMakeFiles/LLVMX86CodeGen.dir/X86VZeroUpper.cpp.o lib/Target/X86/CMakeFiles/LLVMX86CodeGen.dir/X86WinAllocaExpander.cpp.o lib/Target/X86/CMakeFiles/LLVMX86CodeGen.dir/X86WinEHState.cpp.o lib/Target/X86/CMakeFiles/LLVMX86CodeGen.dir/X86InsertWait.cpp.o && :
[4108/4196] : && DYLD_LIBRARY_PATH=/Users/buildslave/jenkins/workspace/clang-stage2-Rthinlto/host-compiler/lib/ "/Applications/Xcode.app/Contents/Developer/Toolchains/XcodeDefault.xctoolchain/usr/bin/libtool" -static -no_warning_for_no_symbols -o lib/libLLVMARMCodeGen.a  lib/Target/ARM/CMakeFiles/LLVMARMCodeGen.dir/A15SDOptimizer.cpp.o lib/Target/ARM/CMakeFiles/LLVMARMCodeGen.dir/ARMAsmPrinter.cpp.o lib/Target/ARM/CMakeFiles/LLVMARMCodeGen.dir/ARMBaseInstrInfo.cpp.o lib/Target/ARM/CMakeFiles/LLVMARMCodeGen.dir/ARMBaseRegisterInfo.cpp.o lib/Target/ARM/CMakeFiles/LLVMARMCodeGen.dir/ARMBasicBlockInfo.cpp.o lib/Target/ARM/CMakeFiles/LLVMARMCodeGen.dir/ARMCallingConv.cpp.o lib/Target/ARM/CMakeFiles/LLVMARMCodeGen.dir/ARMCallLowering.cpp.o lib/Target/ARM/CMakeFiles/LLVMARMCodeGen.dir/ARMConstantIslandPass.cpp.o lib/Target/ARM/CMakeFiles/LLVMARMCodeGen.dir/ARMConstantPoolValue.cpp.o lib/Target/ARM/CMakeFiles/LLVMARMCodeGen.dir/ARMExpandPseudoInsts.cpp.o lib/Target/ARM/CMakeFiles/LLVMARMCodeGen.dir/ARMFastISel.cpp.o lib/Target/ARM/CMakeFiles/LLVMARMCodeGen.dir/ARMFrameLowering.cpp.o lib/Target/ARM/CMakeFiles/LLVMARMCodeGen.dir/ARMHazardRecognizer.cpp.o lib/Target/ARM/CMakeFiles/LLVMARMCodeGen.dir/ARMInstructionSelector.cpp.o lib/Target/ARM/CMakeFiles/LLVMARMCodeGen.dir/ARMISelDAGToDAG.cpp.o lib/Target/ARM/CMakeFiles/LLVMARMCodeGen.dir/ARMISelLowering.cpp.o lib/Target/ARM/CMakeFiles/LLVMARMCodeGen.dir/ARMInstrInfo.cpp.o lib/Target/ARM/CMakeFiles/LLVMARMCodeGen.dir/ARMLegalizerInfo.cpp.o lib/Target/ARM/CMakeFiles/LLVMARMCodeGen.dir/ARMParallelDSP.cpp.o lib/Target/ARM/CMakeFiles/LLVMARMCodeGen.dir/ARMLoadStoreOptimizer.cpp.o lib/Target/ARM/CMakeFiles/LLVMARMCodeGen.dir/ARMLowOverheadLoops.cpp.o lib/Target/ARM/CMakeFiles/LLVMARMCodeGen.dir/ARMBlockPlacement.cpp.o lib/Target/ARM/CMakeFiles/LLVMARMCodeGen.dir/ARMMCInstLower.cpp.o lib/Target/ARM/CMakeFiles/LLVMARMCodeGen.dir/ARMMachineFunctionInfo.cpp.o lib/Target/ARM/CMakeFiles/LLVMARMCodeGen.dir/ARMMacroFusion.cpp.o lib/Target/ARM/CMakeFiles/LLVMARMCodeGen.dir/ARMRegisterInfo.cpp.o lib/Target/ARM/CMakeFiles/LLVMARMCodeGen.dir/ARMOptimizeBarriersPass.cpp.o lib/Target/ARM/CMakeFiles/LLVMARMCodeGen.dir/ARMRegisterBankInfo.cpp.o lib/Target/ARM/CMakeFiles/LLVMARMCodeGen.dir/ARMSelectionDAGInfo.cpp.o lib/Target/ARM/CMakeFiles/LLVMARMCodeGen.dir/ARMSLSHardening.cpp.o lib/Target/ARM/CMakeFiles/LLVMARMCodeGen.dir/ARMSubtarget.cpp.o lib/Target/ARM/CMakeFiles/LLVMARMCodeGen.dir/ARMTargetMachine.cpp.o lib/Target/ARM/CMakeFiles/LLVMARMCodeGen.dir/ARMTargetObjectFile.cpp.o lib/Target/ARM/CMakeFiles/LLVMARMCodeGen.dir/ARMTargetTransformInfo.cpp.o lib/Target/ARM/CMakeFiles/LLVMARMCodeGen.dir/MLxExpansionPass.cpp.o lib/Target/ARM/CMakeFiles/LLVMARMCodeGen.dir/MVEGatherScatterLowering.cpp.o lib/Target/ARM/CMakeFiles/LLVMARMCodeGen.dir/MVETailPredication.cpp.o lib/Target/ARM/CMakeFiles/LLVMARMCodeGen.dir/MVEVPTBlockPass.cpp.o lib/Target/ARM/CMakeFiles/LLVMARMCodeGen.dir/MVEVPTOptimisationsPass.cpp.o lib/Target/ARM/CMakeFiles/LLVMARMCodeGen.dir/Thumb1FrameLowering.cpp.o lib/Target/ARM/CMakeFiles/LLVMARMCodeGen.dir/Thumb1InstrInfo.cpp.o lib/Target/ARM/CMakeFiles/LLVMARMCodeGen.dir/ThumbRegisterInfo.cpp.o lib/Target/ARM/CMakeFiles/LLVMARMCodeGen.dir/Thumb2ITBlockPass.cpp.o lib/Target/ARM/CMakeFiles/LLVMARMCodeGen.dir/Thumb2InstrInfo.cpp.o lib/Target/ARM/CMakeFiles/LLVMARMCodeGen.dir/Thumb2SizeReduction.cpp.o && :
[4109/4196] : && DYLD_LIBRARY_PATH=/Users/buildslave/jenkins/workspace/clang-stage2-Rthinlto/host-compiler/lib/ "/Applications/Xcode.app/Contents/Developer/Toolchains/XcodeDefault.xctoolchain/usr/bin/libtool" -static -no_warning_for_no_symbols -o lib/libLLVMAArch64CodeGen.a  lib/Target/AArch64/CMakeFiles/LLVMAArch64CodeGen.dir/GISel/AArch64CallLowering.cpp.o lib/Target/AArch64/CMakeFiles/LLVMAArch64CodeGen.dir/GISel/AArch64InstructionSelector.cpp.o lib/Target/AArch64/CMakeFiles/LLVMAArch64CodeGen.dir/GISel/AArch64LegalizerInfo.cpp.o lib/Target/AArch64/CMakeFiles/LLVMAArch64CodeGen.dir/GISel/AArch64PreLegalizerCombiner.cpp.o lib/Target/AArch64/CMakeFiles/LLVMAArch64CodeGen.dir/GISel/AArch64PostLegalizerCombiner.cpp.o lib/Target/AArch64/CMakeFiles/LLVMAArch64CodeGen.dir/GISel/AArch64PostLegalizerLowering.cpp.o lib/Target/AArch64/CMakeFiles/LLVMAArch64CodeGen.dir/GISel/AArch64PostSelectOptimize.cpp.o lib/Target/AArch64/CMakeFiles/LLVMAArch64CodeGen.dir/GISel/AArch64RegisterBankInfo.cpp.o lib/Target/AArch64/CMakeFiles/LLVMAArch64CodeGen.dir/AArch64A57FPLoadBalancing.cpp.o lib/Target/AArch64/CMakeFiles/LLVMAArch64CodeGen.dir/AArch64AdvSIMDScalarPass.cpp.o lib/Target/AArch64/CMakeFiles/LLVMAArch64CodeGen.dir/AArch64AsmPrinter.cpp.o lib/Target/AArch64/CMakeFiles/LLVMAArch64CodeGen.dir/AArch64BranchTargets.cpp.o lib/Target/AArch64/CMakeFiles/LLVMAArch64CodeGen.dir/AArch64CallingConvention.cpp.o lib/Target/AArch64/CMakeFiles/LLVMAArch64CodeGen.dir/AArch64CleanupLocalDynamicTLSPass.cpp.o lib/Target/AArch64/CMakeFiles/LLVMAArch64CodeGen.dir/AArch64CollectLOH.cpp.o lib/Target/AArch64/CMakeFiles/LLVMAArch64CodeGen.dir/AArch64CondBrTuning.cpp.o lib/Target/AArch64/CMakeFiles/LLVMAArch64CodeGen.dir/AArch64ConditionalCompares.cpp.o lib/Target/AArch64/CMakeFiles/LLVMAArch64CodeGen.dir/AArch64DeadRegisterDefinitionsPass.cpp.o lib/Target/AArch64/CMakeFiles/LLVMAArch64CodeGen.dir/AArch64ExpandImm.cpp.o lib/Target/AArch64/CMakeFiles/LLVMAArch64CodeGen.dir/AArch64ExpandPseudoInsts.cpp.o lib/Target/AArch64/CMakeFiles/LLVMAArch64CodeGen.dir/AArch64FalkorHWPFFix.cpp.o lib/Target/AArch64/CMakeFiles/LLVMAArch64CodeGen.dir/AArch64FastISel.cpp.o lib/Target/AArch64/CMakeFiles/LLVMAArch64CodeGen.dir/AArch64A53Fix835769.cpp.o lib/Target/AArch64/CMakeFiles/LLVMAArch64CodeGen.dir/AArch64FrameLowering.cpp.o lib/Target/AArch64/CMakeFiles/LLVMAArch64CodeGen.dir/AArch64CompressJumpTables.cpp.o lib/Target/AArch64/CMakeFiles/LLVMAArch64CodeGen.dir/AArch64ConditionOptimizer.cpp.o lib/Target/AArch64/CMakeFiles/LLVMAArch64CodeGen.dir/AArch64RedundantCopyElimination.cpp.o lib/Target/AArch64/CMakeFiles/LLVMAArch64CodeGen.dir/AArch64ISelDAGToDAG.cpp.o lib/Target/AArch64/CMakeFiles/LLVMAArch64CodeGen.dir/AArch64ISelLowering.cpp.o lib/Target/AArch64/CMakeFiles/LLVMAArch64CodeGen.dir/AArch64InstrInfo.cpp.o lib/Target/AArch64/CMakeFiles/LLVMAArch64CodeGen.dir/AArch64LoadStoreOptimizer.cpp.o lib/Target/AArch64/CMakeFiles/LLVMAArch64CodeGen.dir/AArch64LowerHomogeneousPrologEpilog.cpp.o lib/Target/AArch64/CMakeFiles/LLVMAArch64CodeGen.dir/AArch64MachineFunctionInfo.cpp.o lib/Target/AArch64/CMakeFiles/LLVMAArch64CodeGen.dir/AArch64MacroFusion.cpp.o lib/Target/AArch64/CMakeFiles/LLVMAArch64CodeGen.dir/AArch64MCInstLower.cpp.o lib/Target/AArch64/CMakeFiles/LLVMAArch64CodeGen.dir/AArch64PromoteConstant.cpp.o lib/Target/AArch64/CMakeFiles/LLVMAArch64CodeGen.dir/AArch64PBQPRegAlloc.cpp.o lib/Target/AArch64/CMakeFiles/LLVMAArch64CodeGen.dir/AArch64RegisterInfo.cpp.o lib/Target/AArch64/CMakeFiles/LLVMAArch64CodeGen.dir/AArch64SLSHardening.cpp.o lib/Target/AArch64/CMakeFiles/LLVMAArch64CodeGen.dir/AArch64SelectionDAGInfo.cpp.o lib/Target/AArch64/CMakeFiles/LLVMAArch64CodeGen.dir/AArch64SpeculationHardening.cpp.o lib/Target/AArch64/CMakeFiles/LLVMAArch64CodeGen.dir/AArch64StackTagging.cpp.o lib/Target/AArch64/CMakeFiles/LLVMAArch64CodeGen.dir/AArch64StackTaggingPreRA.cpp.o lib/Target/AArch64/CMakeFiles/LLVMAArch64CodeGen.dir/AArch64StorePairSuppress.cpp.o lib/Target/AArch64/CMakeFiles/LLVMAArch64CodeGen.dir/AArch64Subtarget.cpp.o lib/Target/AArch64/CMakeFiles/LLVMAArch64CodeGen.dir/AArch64TargetMachine.cpp.o lib/Target/AArch64/CMakeFiles/LLVMAArch64CodeGen.dir/AArch64TargetObjectFile.cpp.o lib/Target/AArch64/CMakeFiles/LLVMAArch64CodeGen.dir/AArch64TargetTransformInfo.cpp.o lib/Target/AArch64/CMakeFiles/LLVMAArch64CodeGen.dir/SVEIntrinsicOpts.cpp.o lib/Target/AArch64/CMakeFiles/LLVMAArch64CodeGen.dir/AArch64SIMDInstrOpt.cpp.o && :
[4110/4196] : && DYLD_LIBRARY_PATH=/Users/buildslave/jenkins/workspace/clang-stage2-Rthinlto/host-compiler/lib/ "/Applications/Xcode.app/Contents/Developer/Toolchains/XcodeDefault.xctoolchain/usr/bin/libtool" -static -no_warning_for_no_symbols -o lib/libLLVMExegesis.a  tools/llvm-exegesis/lib/CMakeFiles/LLVMExegesis.dir/Analysis.cpp.o tools/llvm-exegesis/lib/CMakeFiles/LLVMExegesis.dir/Assembler.cpp.o tools/llvm-exegesis/lib/CMakeFiles/LLVMExegesis.dir/BenchmarkResult.cpp.o tools/llvm-exegesis/lib/CMakeFiles/LLVMExegesis.dir/BenchmarkRunner.cpp.o tools/llvm-exegesis/lib/CMakeFiles/LLVMExegesis.dir/Clustering.cpp.o tools/llvm-exegesis/lib/CMakeFiles/LLVMExegesis.dir/CodeTemplate.cpp.o tools/llvm-exegesis/lib/CMakeFiles/LLVMExegesis.dir/Error.cpp.o tools/llvm-exegesis/lib/CMakeFiles/LLVMExegesis.dir/LatencyBenchmarkRunner.cpp.o tools/llvm-exegesis/lib/CMakeFiles/LLVMExegesis.dir/LlvmState.cpp.o tools/llvm-exegesis/lib/CMakeFiles/LLVMExegesis.dir/MCInstrDescView.cpp.o tools/llvm-exegesis/lib/CMakeFiles/LLVMExegesis.dir/ParallelSnippetGenerator.cpp.o tools/llvm-exegesis/lib/CMakeFiles/LLVMExegesis.dir/PerfHelper.cpp.o tools/llvm-exegesis/lib/CMakeFiles/LLVMExegesis.dir/RegisterAliasing.cpp.o tools/llvm-exegesis/lib/CMakeFiles/LLVMExegesis.dir/RegisterValue.cpp.o tools/llvm-exegesis/lib/CMakeFiles/LLVMExegesis.dir/SchedClassResolution.cpp.o tools/llvm-exegesis/lib/CMakeFiles/LLVMExegesis.dir/SerialSnippetGenerator.cpp.o tools/llvm-exegesis/lib/CMakeFiles/LLVMExegesis.dir/SnippetFile.cpp.o tools/llvm-exegesis/lib/CMakeFiles/LLVMExegesis.dir/SnippetGenerator.cpp.o tools/llvm-exegesis/lib/CMakeFiles/LLVMExegesis.dir/SnippetRepetitor.cpp.o tools/llvm-exegesis/lib/CMakeFiles/LLVMExegesis.dir/Target.cpp.o tools/llvm-exegesis/lib/CMakeFiles/LLVMExegesis.dir/UopsBenchmarkRunner.cpp.o && :
[4111/4196] : && /Users/buildslave/jenkins/workspace/clang-stage2-Rthinlto/host-compiler/bin/clang++  -fno-stack-protector -fno-common -Wno-profile-instr-unprofiled -fPIC -fvisibility-inlines-hidden -Werror=date-time -Werror=unguarded-availability-new -fmodules -fmodules-cache-path=/Users/buildslave/jenkins/workspace/clang-stage2-Rthinlto/clang-build/Build/module.cache -fcxx-modules -Xclang -fmodules-local-submodule-visibility -gmodules -Wall -Wextra -Wno-unused-parameter -Wwrite-strings -Wcast-qual -Wmissing-field-initializers -pedantic -Wno-long-long -Wimplicit-fallthrough -Wcovered-switch-default -Wno-noexcept-type -Wnon-virtual-dtor -Wdelete-non-virtual-dtor -Wsuggest-override -Wstring-conversion -fdiagnostics-color -flto=thin -fno-common -Woverloaded-virtual -Wno-nested-anon-types -O2 -g -DNDEBUG -isysroot /Applications/Xcode.app/Contents/Developer/Platforms/MacOSX.platform/Developer/SDKs/MacOSX10.15.sdk -Wl,-search_paths_first -Wl,-headerpad_max_install_names -flto=thin -Wl,-cache_path_lto,/Users/buildslave/jenkins/workspace/clang-stage2-Rthinlto/clang-build/Build/lto.cache    -Wl,-dead_strip -Wl,-object_path_lto,/Users/buildslave/jenkins/workspace/clang-stage2-Rthinlto/clang-build/Build/tools/clang/tools/clang-extdef-mapping/./clang-extdef-mapping-lto.o tools/clang/tools/clang-extdef-mapping/CMakeFiles/clang-extdef-mapping.dir/ClangExtDefMapGen.cpp.o  -o bin/clang-extdef-mapping  -Wl,-rpath,@loader_path/../lib  lib/libLLVMX86CodeGen.a  lib/libLLVMX86AsmParser.a  lib/libLLVMX86Desc.a  lib/libLLVMX86Disassembler.a  lib/libLLVMX86Info.a  lib/libLLVMARMCodeGen.a  lib/libLLVMARMAsmParser.a  lib/libLLVMARMDesc.a  lib/libLLVMARMDisassembler.a  lib/libLLVMARMInfo.a  lib/libLLVMARMUtils.a  lib/libLLVMAArch64CodeGen.a  lib/libLLVMAArch64AsmParser.a  lib/libLLVMAArch64Desc.a  lib/libLLVMAArch64Disassembler.a  lib/libLLVMAArch64Info.a  lib/libLLVMAArch64Utils.a  lib/libLLVMSupport.a  lib/libclangAST.a  lib/libclangBasic.a  lib/libclangCrossTU.a  lib/libclangFrontend.a  lib/libclangSerialization.a  lib/libclangTooling.a  lib/libLLVMARMDesc.a  lib/libLLVMARMInfo.a  lib/libLLVMARMUtils.a  lib/libLLVMAsmPrinter.a  lib/libLLVMDebugInfoDWARF.a  lib/libLLVMGlobalISel.a  lib/libLLVMSelectionDAG.a  lib/libLLVMCodeGen.a  lib/libLLVMBitWriter.a  lib/libLLVMTarget.a  lib/libLLVMCFGuard.a  lib/libLLVMScalarOpts.a  lib/libLLVMAggressiveInstCombine.a  lib/libLLVMInstCombine.a  lib/libLLVMAArch64Desc.a  lib/libLLVMAArch64Info.a  lib/libLLVMAArch64Utils.a  lib/libLLVMMCDisassembler.a  lib/libclangIndex.a  lib/libclangFrontend.a  lib/libclangParse.a  lib/libclangSerialization.a  lib/libclangSema.a  lib/libclangEdit.a  lib/libclangAnalysis.a  lib/libclangDriver.a  lib/libLLVMOption.a  lib/libclangASTMatchers.a  lib/libclangAST.a  lib/libLLVMFrontendOpenMP.a  lib/libLLVMTransformUtils.a  lib/libLLVMAnalysis.a  lib/libLLVMProfileData.a  lib/libLLVMObject.a  lib/libLLVMMCParser.a  lib/libLLVMBitReader.a  lib/libLLVMTextAPI.a  lib/libclangFormat.a  lib/libclangToolingInclusions.a  lib/libclangToolingCore.a  lib/libclangRewrite.a  lib/libclangLex.a  lib/libclangBasic.a  lib/libLLVMCore.a  lib/libLLVMRemarks.a  lib/libLLVMBitstreamReader.a  lib/libLLVMMC.a  lib/libLLVMBinaryFormat.a  lib/libLLVMDebugInfoCodeView.a  lib/libLLVMDebugInfoMSF.a  lib/libLLVMSupport.a  -lm  /usr/lib/libz.dylib  /usr/lib/libcurses.dylib  lib/libLLVMDemangle.a && cd /Users/buildslave/jenkins/workspace/clang-stage2-Rthinlto/clang-build/Build/tools/clang/tools/clang-extdef-mapping && /Users/buildslave/jenkins/workspace/clang-stage2-Rthinlto/host-compiler/bin/dsymutil -o=clang-extdef-mapping.dSYM /Users/buildslave/jenkins/workspace/clang-stage2-Rthinlto/clang-build/Build/bin/clang-extdef-mapping && /usr/bin/strip -Sxl /Users/buildslave/jenkins/workspace/clang-stage2-Rthinlto/clang-build/Build/bin/clang-extdef-mapping
[4112/4196] : && /Users/buildslave/jenkins/workspace/clang-stage2-Rthinlto/host-compiler/bin/clang++  -fno-stack-protector -fno-common -Wno-profile-instr-unprofiled -fPIC -fvisibility-inlines-hidden -Werror=date-time -Werror=unguarded-availability-new -fmodules -fmodules-cache-path=/Users/buildslave/jenkins/workspace/clang-stage2-Rthinlto/clang-build/Build/module.cache -fcxx-modules -Xclang -fmodules-local-submodule-visibility -gmodules -Wall -Wextra -Wno-unused-parameter -Wwrite-strings -Wcast-qual -Wmissing-field-initializers -pedantic -Wno-long-long -Wimplicit-fallthrough -Wcovered-switch-default -Wno-noexcept-type -Wnon-virtual-dtor -Wdelete-non-virtual-dtor -Wsuggest-override -Wstring-conversion -fdiagnostics-color -flto=thin -fno-common -Woverloaded-virtual -Wno-nested-anon-types -O2 -g -DNDEBUG -isysroot /Applications/Xcode.app/Contents/Developer/Platforms/MacOSX.platform/Developer/SDKs/MacOSX10.15.sdk -Wl,-search_paths_first -Wl,-headerpad_max_install_names -flto=thin -Wl,-cache_path_lto,/Users/buildslave/jenkins/workspace/clang-stage2-Rthinlto/clang-build/Build/lto.cache    -Wl,-dead_strip -Wl,-object_path_lto,/Users/buildslave/jenkins/workspace/clang-stage2-Rthinlto/clang-build/Build/tools/clang/tools/clang-check/./clang-check-lto.o tools/clang/tools/clang-check/CMakeFiles/clang-check.dir/ClangCheck.cpp.o  -o bin/clang-check  -Wl,-rpath,@loader_path/../lib  lib/libLLVMX86CodeGen.a  lib/libLLVMX86AsmParser.a  lib/libLLVMX86Desc.a  lib/libLLVMX86Disassembler.a  lib/libLLVMX86Info.a  lib/libLLVMARMCodeGen.a  lib/libLLVMARMAsmParser.a  lib/libLLVMARMDesc.a  lib/libLLVMARMDisassembler.a  lib/libLLVMARMInfo.a  lib/libLLVMARMUtils.a  lib/libLLVMAArch64CodeGen.a  lib/libLLVMAArch64AsmParser.a  lib/libLLVMAArch64Desc.a  lib/libLLVMAArch64Disassembler.a  lib/libLLVMAArch64Info.a  lib/libLLVMAArch64Utils.a  lib/libLLVMOption.a  lib/libLLVMSupport.a  lib/libclangAST.a  lib/libclangBasic.a  lib/libclangDriver.a  lib/libclangFrontend.a  lib/libclangRewriteFrontend.a  lib/libclangSerialization.a  lib/libclangStaticAnalyzerFrontend.a  lib/libclangTooling.a  lib/libclangToolingSyntax.a  lib/libLLVMARMDesc.a  lib/libLLVMARMInfo.a  lib/libLLVMARMUtils.a  lib/libLLVMAsmPrinter.a  lib/libLLVMDebugInfoDWARF.a  lib/libLLVMGlobalISel.a  lib/libLLVMSelectionDAG.a  lib/libLLVMCodeGen.a  lib/libLLVMBitWriter.a  lib/libLLVMTarget.a  lib/libLLVMCFGuard.a  lib/libLLVMScalarOpts.a  lib/libLLVMAggressiveInstCombine.a  lib/libLLVMInstCombine.a  lib/libLLVMAArch64Desc.a  lib/libLLVMAArch64Info.a  lib/libLLVMAArch64Utils.a  lib/libLLVMMCDisassembler.a  lib/libclangStaticAnalyzerCheckers.a  lib/libclangStaticAnalyzerCore.a  lib/libclangCrossTU.a  lib/libclangIndex.a  lib/libclangFormat.a  lib/libclangToolingInclusions.a  lib/libclangFrontend.a  lib/libclangDriver.a  lib/libLLVMOption.a  lib/libclangSerialization.a  lib/libclangParse.a  lib/libclangSema.a  lib/libclangEdit.a  lib/libclangAnalysis.a  lib/libclangASTMatchers.a  lib/libclangAST.a  lib/libLLVMFrontendOpenMP.a  lib/libLLVMTransformUtils.a  lib/libLLVMAnalysis.a  lib/libLLVMProfileData.a  lib/libLLVMObject.a  lib/libLLVMMCParser.a  lib/libLLVMTextAPI.a  lib/libLLVMBitReader.a  lib/libclangToolingCore.a  lib/libclangRewrite.a  lib/libclangLex.a  lib/libclangBasic.a  lib/libLLVMCore.a  lib/libLLVMRemarks.a  lib/libLLVMBitstreamReader.a  lib/libLLVMMC.a  lib/libLLVMBinaryFormat.a  lib/libLLVMDebugInfoCodeView.a  lib/libLLVMDebugInfoMSF.a  lib/libLLVMSupport.a  -lm  /usr/lib/libz.dylib  /usr/lib/libcurses.dylib  lib/libLLVMDemangle.a && cd /Users/buildslave/jenkins/workspace/clang-stage2-Rthinlto/clang-build/Build/tools/clang/tools/clang-check && /Users/buildslave/jenkins/workspace/clang-stage2-Rthinlto/host-compiler/bin/dsymutil -o=clang-check.dSYM /Users/buildslave/jenkins/workspace/clang-stage2-Rthinlto/clang-build/Build/bin/clang-check && /usr/bin/strip -Sxl /Users/buildslave/jenkins/workspace/clang-stage2-Rthinlto/clang-build/Build/bin/clang-check
[4113/4196] : && /Users/buildslave/jenkins/workspace/clang-stage2-Rthinlto/host-compiler/bin/clang++ -fno-stack-protector -fno-common -Wno-profile-instr-unprofiled -fPIC -fvisibility-inlines-hidden -Werror=date-time -Werror=unguarded-availability-new -fmodules -fmodules-cache-path=/Users/buildslave/jenkins/workspace/clang-stage2-Rthinlto/clang-build/Build/module.cache -fcxx-modules -Xclang -fmodules-local-submodule-visibility -gmodules -Wall -Wextra -Wno-unused-parameter -Wwrite-strings -Wcast-qual -Wmissing-field-initializers -pedantic -Wno-long-long -Wimplicit-fallthrough -Wcovered-switch-default -Wno-noexcept-type -Wnon-virtual-dtor -Wdelete-non-virtual-dtor -Wsuggest-override -Wstring-conversion -fdiagnostics-color -flto=thin -fno-common -Woverloaded-virtual -Wno-nested-anon-types -O2 -g -DNDEBUG -isysroot /Applications/Xcode.app/Contents/Developer/Platforms/MacOSX.platform/Developer/SDKs/MacOSX10.15.sdk -dynamiclib -Wl,-headerpad_max_install_names -flto=thin -Wl,-cache_path_lto,/Users/buildslave/jenkins/workspace/clang-stage2-Rthinlto/clang-build/Build/lto.cache   -Wl,-dead_strip -Wl,-exported_symbols_list,"/Users/buildslave/jenkins/workspace/clang-stage2-Rthinlto/clang-build/Build/tools/clang/tools/libclang/libclang.exports" -Wl,-object_path_lto,/Users/buildslave/jenkins/workspace/clang-stage2-Rthinlto/clang-build/Build/tools/clang/tools/libclang/./libclang-lto.o -Wl,-compatibility_version -Wl,1 -Wl,-current_version -Wl,13.0.99 -o lib/libclang.dylib -install_name @rpath/libclang.dylib tools/clang/tools/libclang/CMakeFiles/libclang.dir/ARCMigrate.cpp.o tools/clang/tools/libclang/CMakeFiles/libclang.dir/BuildSystem.cpp.o tools/clang/tools/libclang/CMakeFiles/libclang.dir/CIndex.cpp.o tools/clang/tools/libclang/CMakeFiles/libclang.dir/CIndexCXX.cpp.o tools/clang/tools/libclang/CMakeFiles/libclang.dir/CIndexCodeCompletion.cpp.o tools/clang/tools/libclang/CMakeFiles/libclang.dir/CIndexDiagnostic.cpp.o tools/clang/tools/libclang/CMakeFiles/libclang.dir/CIndexHigh.cpp.o tools/clang/tools/libclang/CMakeFiles/libclang.dir/CIndexInclusionStack.cpp.o tools/clang/tools/libclang/CMakeFiles/libclang.dir/CIndexUSRs.cpp.o tools/clang/tools/libclang/CMakeFiles/libclang.dir/CIndexer.cpp.o tools/clang/tools/libclang/CMakeFiles/libclang.dir/CXComment.cpp.o tools/clang/tools/libclang/CMakeFiles/libclang.dir/CXCursor.cpp.o tools/clang/tools/libclang/CMakeFiles/libclang.dir/CXIndexDataConsumer.cpp.o tools/clang/tools/libclang/CMakeFiles/libclang.dir/CXCompilationDatabase.cpp.o tools/clang/tools/libclang/CMakeFiles/libclang.dir/CXLoadedDiagnostic.cpp.o tools/clang/tools/libclang/CMakeFiles/libclang.dir/CXSourceLocation.cpp.o tools/clang/tools/libclang/CMakeFiles/libclang.dir/CXStoredDiagnostic.cpp.o tools/clang/tools/libclang/CMakeFiles/libclang.dir/CXString.cpp.o tools/clang/tools/libclang/CMakeFiles/libclang.dir/CXType.cpp.o tools/clang/tools/libclang/CMakeFiles/libclang.dir/Indexing.cpp.o tools/clang/tools/libclang/CMakeFiles/libclang.dir/FatalErrorHandler.cpp.o tools/clang/tools/libclang/CMakeFiles/libclang.dir/Rewrite.cpp.o  -Wl,-rpath,@loader_path/../lib  lib/libclangAST.a  lib/libclangBasic.a  lib/libclangDriver.a  lib/libclangFrontend.a  lib/libclangIndex.a  lib/libclangLex.a  lib/libclangRewrite.a  lib/libclangSema.a  lib/libclangSerialization.a  lib/libclangTooling.a  lib/libclangARCMigrate.a  lib/libLLVMX86CodeGen.a  lib/libLLVMX86AsmParser.a  lib/libLLVMX86Desc.a  lib/libLLVMX86Disassembler.a  lib/libLLVMX86Info.a  lib/libLLVMARMCodeGen.a  lib/libLLVMARMAsmParser.a  lib/libLLVMARMDesc.a  lib/libLLVMARMDisassembler.a  lib/libLLVMARMInfo.a  lib/libLLVMARMUtils.a  lib/libLLVMAArch64CodeGen.a  lib/libLLVMAArch64AsmParser.a  lib/libLLVMAArch64Desc.a  lib/libLLVMAArch64Disassembler.a  lib/libLLVMAArch64Info.a  lib/libLLVMAArch64Utils.a  lib/libLLVMCore.a  lib/libLLVMSupport.a  lib/libclangFormat.a  lib/libclangToolingInclusions.a  lib/libclangToolingCore.a  lib/libclangFrontend.a  lib/libclangDriver.a  lib/libLLVMOption.a  lib/libclangParse.a  lib/libclangRewrite.a  lib/libclangSerialization.a  lib/libclangSema.a  lib/libclangEdit.a  lib/libclangAnalysis.a  lib/libclangASTMatchers.a  lib/libclangAST.a  lib/libclangLex.a  lib/libclangBasic.a  lib/libLLVMFrontendOpenMP.a  lib/libLLVMARMDesc.a  lib/libLLVMARMInfo.a  lib/libLLVMARMUtils.a  lib/libLLVMAsmPrinter.a  lib/libLLVMDebugInfoDWARF.a  lib/libLLVMGlobalISel.a  lib/libLLVMSelectionDAG.a  lib/libLLVMCodeGen.a  lib/libLLVMBitWriter.a  lib/libLLVMTarget.a  lib/libLLVMCFGuard.a  lib/libLLVMScalarOpts.a  lib/libLLVMAggressiveInstCombine.a  lib/libLLVMInstCombine.a  lib/libLLVMTransformUtils.a  lib/libLLVMAnalysis.a  lib/libLLVMProfileData.a  lib/libLLVMObject.a  lib/libLLVMBitReader.a  lib/libLLVMCore.a  lib/libLLVMRemarks.a  lib/libLLVMBitstreamReader.a  lib/libLLVMTextAPI.a  lib/libLLVMMCParser.a  lib/libLLVMAArch64Desc.a  lib/libLLVMAArch64Info.a  lib/libLLVMAArch64Utils.a  lib/libLLVMMCDisassembler.a  lib/libLLVMMC.a  lib/libLLVMBinaryFormat.a  lib/libLLVMDebugInfoCodeView.a  lib/libLLVMDebugInfoMSF.a  lib/libLLVMSupport.a  -lm  /usr/lib/libz.dylib  /usr/lib/libcurses.dylib  lib/libLLVMDemangle.a && cd /Users/buildslave/jenkins/workspace/clang-stage2-Rthinlto/clang-build/Build/tools/clang/tools/libclang && /Users/buildslave/jenkins/workspace/clang-stage2-Rthinlto/host-compiler/bin/dsymutil -o=libclang.dylib.dSYM /Users/buildslave/jenkins/workspace/clang-stage2-Rthinlto/clang-build/Build/lib/libclang.dylib && /usr/bin/strip -Sxl /Users/buildslave/jenkins/workspace/clang-stage2-Rthinlto/clang-build/Build/lib/libclang.dylib
[4114/4196] : && /Users/buildslave/jenkins/workspace/clang-stage2-Rthinlto/host-compiler/bin/clang++  -fno-stack-protector -fno-common -Wno-profile-instr-unprofiled -fPIC -fvisibility-inlines-hidden -Werror=date-time -Werror=unguarded-availability-new -fmodules -fmodules-cache-path=/Users/buildslave/jenkins/workspace/clang-stage2-Rthinlto/clang-build/Build/module.cache -fcxx-modules -Xclang -fmodules-local-submodule-visibility -gmodules -Wall -Wextra -Wno-unused-parameter -Wwrite-strings -Wcast-qual -Wmissing-field-initializers -pedantic -Wno-long-long -Wimplicit-fallthrough -Wcovered-switch-default -Wno-noexcept-type -Wnon-virtual-dtor -Wdelete-non-virtual-dtor -Wsuggest-override -Wstring-conversion -fdiagnostics-color -flto=thin -fno-common -Woverloaded-virtual -Wno-nested-anon-types -O2 -g -DNDEBUG -isysroot /Applications/Xcode.app/Contents/Developer/Platforms/MacOSX.platform/Developer/SDKs/MacOSX10.15.sdk -Wl,-search_paths_first -Wl,-headerpad_max_install_names -flto=thin -Wl,-cache_path_lto,/Users/buildslave/jenkins/workspace/clang-stage2-Rthinlto/clang-build/Build/lto.cache    -Wl,-dead_strip tools/clang/unittests/Driver/CMakeFiles/ClangDriverTests.dir/DistroTest.cpp.o tools/clang/unittests/Driver/CMakeFiles/ClangDriverTests.dir/ToolChainTest.cpp.o tools/clang/unittests/Driver/CMakeFiles/ClangDriverTests.dir/ModuleCacheTest.cpp.o tools/clang/unittests/Driver/CMakeFiles/ClangDriverTests.dir/MultilibTest.cpp.o tools/clang/unittests/Driver/CMakeFiles/ClangDriverTests.dir/SanitizerArgsTest.cpp.o  -o tools/clang/unittests/Driver/ClangDriverTests  lib/libLLVMX86CodeGen.a  lib/libLLVMX86AsmParser.a  lib/libLLVMX86Desc.a  lib/libLLVMX86Disassembler.a  lib/libLLVMX86Info.a  lib/libLLVMARMCodeGen.a  lib/libLLVMARMAsmParser.a  lib/libLLVMARMDesc.a  lib/libLLVMARMDisassembler.a  lib/libLLVMARMInfo.a  lib/libLLVMARMUtils.a  lib/libLLVMAArch64CodeGen.a  lib/libLLVMAArch64AsmParser.a  lib/libLLVMAArch64Desc.a  lib/libLLVMAArch64Disassembler.a  lib/libLLVMAArch64Info.a  lib/libLLVMAArch64Utils.a  lib/libLLVMSupport.a  lib/libLLVMOption.a  lib/libLLVMSupport.a  lib/libgtest_main.a  lib/libgtest.a  lib/libclangDriver.a  lib/libclangBasic.a  lib/libclangFrontend.a  lib/libLLVMARMDesc.a  lib/libLLVMARMInfo.a  lib/libLLVMARMUtils.a  lib/libLLVMAsmPrinter.a  lib/libLLVMDebugInfoDWARF.a  lib/libLLVMGlobalISel.a  lib/libLLVMSelectionDAG.a  lib/libLLVMCodeGen.a  lib/libLLVMBitWriter.a  lib/libLLVMTarget.a  lib/libLLVMCFGuard.a  lib/libLLVMScalarOpts.a  lib/libLLVMAggressiveInstCombine.a  lib/libLLVMInstCombine.a  lib/libLLVMAArch64Desc.a  lib/libLLVMAArch64Info.a  lib/libLLVMAArch64Utils.a  lib/libLLVMMCDisassembler.a  -lpthread  lib/libclangDriver.a  lib/libLLVMOption.a  lib/libclangParse.a  lib/libclangSerialization.a  lib/libclangSema.a  lib/libclangEdit.a  lib/libclangAnalysis.a  lib/libclangASTMatchers.a  lib/libclangAST.a  lib/libclangLex.a  lib/libclangBasic.a  lib/libLLVMFrontendOpenMP.a  lib/libLLVMTransformUtils.a  lib/libLLVMAnalysis.a  lib/libLLVMProfileData.a  lib/libLLVMObject.a  lib/libLLVMMCParser.a  lib/libLLVMMC.a  lib/libLLVMDebugInfoCodeView.a  lib/libLLVMDebugInfoMSF.a  lib/libLLVMTextAPI.a  lib/libLLVMBitReader.a  lib/libLLVMCore.a  lib/libLLVMBinaryFormat.a  lib/libLLVMRemarks.a  lib/libLLVMBitstreamReader.a  lib/libLLVMSupport.a  -lm  /usr/lib/libz.dylib  /usr/lib/libcurses.dylib  lib/libLLVMDemangle.a && :
[4115/4196] : && /Users/buildslave/jenkins/workspace/clang-stage2-Rthinlto/host-compiler/bin/clang++  -fno-stack-protector -fno-common -Wno-profile-instr-unprofiled -fPIC -fvisibility-inlines-hidden -Werror=date-time -Werror=unguarded-availability-new -fmodules -fmodules-cache-path=/Users/buildslave/jenkins/workspace/clang-stage2-Rthinlto/clang-build/Build/module.cache -fcxx-modules -Xclang -fmodules-local-submodule-visibility -gmodules -Wall -Wextra -Wno-unused-parameter -Wwrite-strings -Wcast-qual -Wmissing-field-initializers -pedantic -Wno-long-long -Wimplicit-fallthrough -Wcovered-switch-default -Wno-noexcept-type -Wnon-virtual-dtor -Wdelete-non-virtual-dtor -Wsuggest-override -Wstring-conversion -fdiagnostics-color -flto=thin -fno-common -Woverloaded-virtual -Wno-nested-anon-types -O2 -g -DNDEBUG -isysroot /Applications/Xcode.app/Contents/Developer/Platforms/MacOSX.platform/Developer/SDKs/MacOSX10.15.sdk -Wl,-search_paths_first -Wl,-headerpad_max_install_names -flto=thin -Wl,-cache_path_lto,/Users/buildslave/jenkins/workspace/clang-stage2-Rthinlto/clang-build/Build/lto.cache    -Wl,-dead_strip -Wl,-object_path_lto,/Users/buildslave/jenkins/workspace/clang-stage2-Rthinlto/clang-build/Build/tools/clang/tools/c-arcmt-test/./c-arcmt-test-lto.o tools/clang/tools/c-arcmt-test/CMakeFiles/c-arcmt-test.dir/c-arcmt-test.c.o  -o bin/c-arcmt-test  -Wl,-rpath,@loader_path/../lib  lib/libclang.dylib && cd /Users/buildslave/jenkins/workspace/clang-stage2-Rthinlto/clang-build/Build/tools/clang/tools/c-arcmt-test && /Users/buildslave/jenkins/workspace/clang-stage2-Rthinlto/host-compiler/bin/dsymutil -o=c-arcmt-test.dSYM /Users/buildslave/jenkins/workspace/clang-stage2-Rthinlto/clang-build/Build/bin/c-arcmt-test && /usr/bin/strip -Sxl /Users/buildslave/jenkins/workspace/clang-stage2-Rthinlto/clang-build/Build/bin/c-arcmt-test
[4116/4196] : && /Users/buildslave/jenkins/workspace/clang-stage2-Rthinlto/host-compiler/bin/clang++  -fno-stack-protector -fno-common -Wno-profile-instr-unprofiled -fPIC -fvisibility-inlines-hidden -Werror=date-time -Werror=unguarded-availability-new -fmodules -fmodules-cache-path=/Users/buildslave/jenkins/workspace/clang-stage2-Rthinlto/clang-build/Build/module.cache -fcxx-modules -Xclang -fmodules-local-submodule-visibility -gmodules -Wall -Wextra -Wno-unused-parameter -Wwrite-strings -Wcast-qual -Wmissing-field-initializers -pedantic -Wno-long-long -Wimplicit-fallthrough -Wcovered-switch-default -Wno-noexcept-type -Wnon-virtual-dtor -Wdelete-non-virtual-dtor -Wsuggest-override -Wstring-conversion -fdiagnostics-color -flto=thin -fno-common -Woverloaded-virtual -Wno-nested-anon-types -O2 -g -DNDEBUG -isysroot /Applications/Xcode.app/Contents/Developer/Platforms/MacOSX.platform/Developer/SDKs/MacOSX10.15.sdk -Wl,-search_paths_first -Wl,-headerpad_max_install_names -flto=thin -Wl,-cache_path_lto,/Users/buildslave/jenkins/workspace/clang-stage2-Rthinlto/clang-build/Build/lto.cache    -Wl,-dead_strip tools/clang/unittests/CrossTU/CMakeFiles/CrossTUTests.dir/CrossTranslationUnitTest.cpp.o  -o tools/clang/unittests/CrossTU/CrossTUTests  lib/libLLVMX86CodeGen.a  lib/libLLVMX86AsmParser.a  lib/libLLVMX86Desc.a  lib/libLLVMX86Disassembler.a  lib/libLLVMX86Info.a  lib/libLLVMARMCodeGen.a  lib/libLLVMARMAsmParser.a  lib/libLLVMARMDesc.a  lib/libLLVMARMDisassembler.a  lib/libLLVMARMInfo.a  lib/libLLVMARMUtils.a  lib/libLLVMAArch64CodeGen.a  lib/libLLVMAArch64AsmParser.a  lib/libLLVMAArch64Desc.a  lib/libLLVMAArch64Disassembler.a  lib/libLLVMAArch64Info.a  lib/libLLVMAArch64Utils.a  lib/libLLVMSupport.a  lib/libLLVMSupport.a  lib/libgtest_main.a  lib/libgtest.a  lib/libclangAST.a  lib/libclangBasic.a  lib/libclangCrossTU.a  lib/libclangFrontend.a  lib/libclangSerialization.a  lib/libclangTooling.a  lib/libLLVMARMDesc.a  lib/libLLVMARMInfo.a  lib/libLLVMARMUtils.a  lib/libLLVMAsmPrinter.a  lib/libLLVMDebugInfoDWARF.a  lib/libLLVMGlobalISel.a  lib/libLLVMSelectionDAG.a  lib/libLLVMCodeGen.a  lib/libLLVMBitWriter.a  lib/libLLVMTarget.a  lib/libLLVMCFGuard.a  lib/libLLVMScalarOpts.a  lib/libLLVMAggressiveInstCombine.a  lib/libLLVMInstCombine.a  lib/libLLVMAArch64Desc.a  lib/libLLVMAArch64Info.a  lib/libLLVMAArch64Utils.a  lib/libLLVMMCDisassembler.a  -lpthread  lib/libclangIndex.a  lib/libclangFrontend.a  lib/libclangParse.a  lib/libclangSerialization.a  lib/libclangSema.a  lib/libclangEdit.a  lib/libclangAnalysis.a  lib/libclangDriver.a  lib/libLLVMOption.a  lib/libclangASTMatchers.a  lib/libclangAST.a  lib/libLLVMFrontendOpenMP.a  lib/libLLVMTransformUtils.a  lib/libLLVMAnalysis.a  lib/libLLVMProfileData.a  lib/libLLVMObject.a  lib/libLLVMMCParser.a  lib/libLLVMBitReader.a  lib/libLLVMTextAPI.a  lib/libclangFormat.a  lib/libclangToolingInclusions.a  lib/libclangToolingCore.a  lib/libclangRewrite.a  lib/libclangLex.a  lib/libclangBasic.a  lib/libLLVMCore.a  lib/libLLVMRemarks.a  lib/libLLVMBitstreamReader.a  lib/libLLVMMC.a  lib/libLLVMBinaryFormat.a  lib/libLLVMDebugInfoCodeView.a  lib/libLLVMDebugInfoMSF.a  lib/libLLVMSupport.a  -lm  /usr/lib/libz.dylib  /usr/lib/libcurses.dylib  lib/libLLVMDemangle.a && :
[4117/4196] : && /Users/buildslave/jenkins/workspace/clang-stage2-Rthinlto/host-compiler/bin/clang++  -fno-stack-protector -fno-common -Wno-profile-instr-unprofiled -fPIC -fvisibility-inlines-hidden -Werror=date-time -Werror=unguarded-availability-new -fmodules -fmodules-cache-path=/Users/buildslave/jenkins/workspace/clang-stage2-Rthinlto/clang-build/Build/module.cache -fcxx-modules -Xclang -fmodules-local-submodule-visibility -gmodules -Wall -Wextra -Wno-unused-parameter -Wwrite-strings -Wcast-qual -Wmissing-field-initializers -pedantic -Wno-long-long -Wimplicit-fallthrough -Wcovered-switch-default -Wno-noexcept-type -Wnon-virtual-dtor -Wdelete-non-virtual-dtor -Wsuggest-override -Wstring-conversion -fdiagnostics-color -flto=thin -fno-common -Woverloaded-virtual -Wno-nested-anon-types -O2 -g -DNDEBUG -isysroot /Applications/Xcode.app/Contents/Developer/Platforms/MacOSX.platform/Developer/SDKs/MacOSX10.15.sdk -Wl,-search_paths_first -Wl,-headerpad_max_install_names -flto=thin -Wl,-cache_path_lto,/Users/buildslave/jenkins/workspace/clang-stage2-Rthinlto/clang-build/Build/lto.cache    -Wl,-dead_strip tools/clang/unittests/Tooling/CMakeFiles/ToolingTests.dir/ASTSelectionTest.cpp.o tools/clang/unittests/Tooling/CMakeFiles/ToolingTests.dir/CastExprTest.cpp.o tools/clang/unittests/Tooling/CMakeFiles/ToolingTests.dir/CommentHandlerTest.cpp.o tools/clang/unittests/Tooling/CMakeFiles/ToolingTests.dir/CompilationDatabaseTest.cpp.o tools/clang/unittests/Tooling/CMakeFiles/ToolingTests.dir/DependencyScannerTest.cpp.o tools/clang/unittests/Tooling/CMakeFiles/ToolingTests.dir/DiagnosticsYamlTest.cpp.o tools/clang/unittests/Tooling/CMakeFiles/ToolingTests.dir/ExecutionTest.cpp.o tools/clang/unittests/Tooling/CMakeFiles/ToolingTests.dir/FixItTest.cpp.o tools/clang/unittests/Tooling/CMakeFiles/ToolingTests.dir/HeaderIncludesTest.cpp.o tools/clang/unittests/Tooling/CMakeFiles/ToolingTests.dir/LexicallyOrderedRecursiveASTVisitorTest.cpp.o tools/clang/unittests/Tooling/CMakeFiles/ToolingTests.dir/LookupTest.cpp.o tools/clang/unittests/Tooling/CMakeFiles/ToolingTests.dir/QualTypeNamesTest.cpp.o tools/clang/unittests/Tooling/CMakeFiles/ToolingTests.dir/RangeSelectorTest.cpp.o tools/clang/unittests/Tooling/CMakeFiles/ToolingTests.dir/RecursiveASTVisitorTests/Attr.cpp.o tools/clang/unittests/Tooling/CMakeFiles/ToolingTests.dir/RecursiveASTVisitorTests/CallbacksLeaf.cpp.o tools/clang/unittests/Tooling/CMakeFiles/ToolingTests.dir/RecursiveASTVisitorTests/CallbacksUnaryOperator.cpp.o tools/clang/unittests/Tooling/CMakeFiles/ToolingTests.dir/RecursiveASTVisitorTests/CallbacksBinaryOperator.cpp.o tools/clang/unittests/Tooling/CMakeFiles/ToolingTests.dir/RecursiveASTVisitorTests/CallbacksCompoundAssignOperator.cpp.o tools/clang/unittests/Tooling/CMakeFiles/ToolingTests.dir/RecursiveASTVisitorTests/CallbacksCallExpr.cpp.o tools/clang/unittests/Tooling/CMakeFiles/ToolingTests.dir/RecursiveASTVisitorTests/Class.cpp.o tools/clang/unittests/Tooling/CMakeFiles/ToolingTests.dir/RecursiveASTVisitorTests/Concept.cpp.o tools/clang/unittests/Tooling/CMakeFiles/ToolingTests.dir/RecursiveASTVisitorTests/ConstructExpr.cpp.o tools/clang/unittests/Tooling/CMakeFiles/ToolingTests.dir/RecursiveASTVisitorTests/CXXBoolLiteralExpr.cpp.o tools/clang/unittests/Tooling/CMakeFiles/ToolingTests.dir/RecursiveASTVisitorTests/CXXMemberCall.cpp.o tools/clang/unittests/Tooling/CMakeFiles/ToolingTests.dir/RecursiveASTVisitorTests/CXXMethodDecl.cpp.o tools/clang/unittests/Tooling/CMakeFiles/ToolingTests.dir/RecursiveASTVisitorTests/CXXOperatorCallExprTraverser.cpp.o tools/clang/unittests/Tooling/CMakeFiles/ToolingTests.dir/RecursiveASTVisitorTests/DeclRefExpr.cpp.o tools/clang/unittests/Tooling/CMakeFiles/ToolingTests.dir/RecursiveASTVisitorTests/ImplicitCtor.cpp.o tools/clang/unittests/Tooling/CMakeFiles/ToolingTests.dir/RecursiveASTVisitorTests/ImplicitCtorInitializer.cpp.o tools/clang/unittests/Tooling/CMakeFiles/ToolingTests.dir/RecursiveASTVisitorTests/InitListExprPostOrder.cpp.o tools/clang/unittests/Tooling/CMakeFiles/ToolingTests.dir/RecursiveASTVisitorTests/InitListExprPostOrderNoQueue.cpp.o tools/clang/unittests/Tooling/CMakeFiles/ToolingTests.dir/RecursiveASTVisitorTests/InitListExprPreOrder.cpp.o tools/clang/unittests/Tooling/CMakeFiles/ToolingTests.dir/RecursiveASTVisitorTests/InitListExprPreOrderNoQueue.cpp.o tools/clang/unittests/Tooling/CMakeFiles/ToolingTests.dir/RecursiveASTVisitorTests/IntegerLiteral.cpp.o tools/clang/unittests/Tooling/CMakeFiles/ToolingTests.dir/RecursiveASTVisitorTests/LambdaDefaultCapture.cpp.o tools/clang/unittests/Tooling/CMakeFiles/ToolingTests.dir/RecursiveASTVisitorTests/LambdaExpr.cpp.o tools/clang/unittests/Tooling/CMakeFiles/ToolingTests.dir/RecursiveASTVisitorTests/LambdaTemplateParams.cpp.o tools/clang/unittests/Tooling/CMakeFiles/ToolingTests.dir/RecursiveASTVisitorTests/MemberPointerTypeLoc.cpp.o tools/clang/unittests/Tooling/CMakeFiles/ToolingTests.dir/RecursiveASTVisitorTests/NestedNameSpecifiers.cpp.o tools/clang/unittests/Tooling/CMakeFiles/ToolingTests.dir/RecursiveASTVisitorTests/ParenExpr.cpp.o tools/clang/unittests/Tooling/CMakeFiles/ToolingTests.dir/RecursiveASTVisitorTests/TemplateArgumentLocTraverser.cpp.o tools/clang/unittests/Tooling/CMakeFiles/ToolingTests.dir/RecursiveASTVisitorTests/TraversalScope.cpp.o tools/clang/unittests/Tooling/CMakeFiles/ToolingTests.dir/RecursiveASTVisitorTestDeclVisitor.cpp.o tools/clang/unittests/Tooling/CMakeFiles/ToolingTests.dir/RecursiveASTVisitorTestPostOrderVisitor.cpp.o tools/clang/unittests/Tooling/CMakeFiles/ToolingTests.dir/RecursiveASTVisitorTestTypeLocVisitor.cpp.o tools/clang/unittests/Tooling/CMakeFiles/ToolingTests.dir/RefactoringActionRulesTest.cpp.o tools/clang/unittests/Tooling/CMakeFiles/ToolingTests.dir/RefactoringCallbacksTest.cpp.o tools/clang/unittests/Tooling/CMakeFiles/ToolingTests.dir/RefactoringTest.cpp.o tools/clang/unittests/Tooling/CMakeFiles/ToolingTests.dir/ReplacementsYamlTest.cpp.o tools/clang/unittests/Tooling/CMakeFiles/ToolingTests.dir/RewriterTest.cpp.o tools/clang/unittests/Tooling/CMakeFiles/ToolingTests.dir/SourceCodeBuildersTest.cpp.o tools/clang/unittests/Tooling/CMakeFiles/ToolingTests.dir/SourceCodeTest.cpp.o tools/clang/unittests/Tooling/CMakeFiles/ToolingTests.dir/StencilTest.cpp.o tools/clang/unittests/Tooling/CMakeFiles/ToolingTests.dir/ToolingTest.cpp.o tools/clang/unittests/Tooling/CMakeFiles/ToolingTests.dir/TransformerTest.cpp.o  -o tools/clang/unittests/Tooling/ToolingTests  lib/libLLVMX86CodeGen.a  lib/libLLVMX86AsmParser.a  lib/libLLVMX86Desc.a  lib/libLLVMX86Disassembler.a  lib/libLLVMX86Info.a  lib/libLLVMARMCodeGen.a  lib/libLLVMARMAsmParser.a  lib/libLLVMARMDesc.a  lib/libLLVMARMDisassembler.a  lib/libLLVMARMInfo.a  lib/libLLVMARMUtils.a  lib/libLLVMAArch64CodeGen.a  lib/libLLVMAArch64AsmParser.a  lib/libLLVMAArch64Desc.a  lib/libLLVMAArch64Disassembler.a  lib/libLLVMAArch64Info.a  lib/libLLVMAArch64Utils.a  lib/libLLVMFrontendOpenMP.a  lib/libLLVMSupport.a  lib/libLLVMSupport.a  lib/libgtest_main.a  lib/libgtest.a  lib/libclangAST.a  lib/libclangASTMatchers.a  lib/libclangBasic.a  lib/libclangFormat.a  lib/libclangFrontend.a  lib/libclangLex.a  lib/libclangRewrite.a  lib/libclangSerialization.a  lib/libclangTooling.a  lib/libclangToolingCore.a  lib/libclangToolingInclusions.a  lib/libclangToolingRefactoring.a  lib/libclangTransformer.a  lib/libLLVMTestingSupport.a  lib/libLLVMARMDesc.a  lib/libLLVMARMInfo.a  lib/libLLVMARMUtils.a  lib/libLLVMAsmPrinter.a  lib/libLLVMDebugInfoDWARF.a  lib/libLLVMGlobalISel.a  lib/libLLVMSelectionDAG.a  lib/libLLVMCodeGen.a  lib/libLLVMBitWriter.a  lib/libLLVMTarget.a  lib/libLLVMCFGuard.a  lib/libLLVMScalarOpts.a  lib/libLLVMAggressiveInstCombine.a  lib/libLLVMInstCombine.a  lib/libLLVMAArch64Desc.a  lib/libLLVMAArch64Info.a  lib/libLLVMAArch64Utils.a  lib/libLLVMMCDisassembler.a  lib/libclangToolingRefactoring.a  lib/libclangIndex.a  lib/libclangFormat.a  lib/libclangToolingInclusions.a  lib/libclangFrontend.a  lib/libclangDriver.a  lib/libclangParse.a  lib/libLLVMOption.a  lib/libclangSerialization.a  lib/libclangSema.a  lib/libclangEdit.a  lib/libclangAnalysis.a  lib/libclangASTMatchers.a  lib/libclangAST.a  lib/libLLVMFrontendOpenMP.a  lib/libLLVMTransformUtils.a  lib/libLLVMAnalysis.a  lib/libLLVMProfileData.a  lib/libLLVMObject.a  lib/libLLVMMCParser.a  lib/libLLVMTextAPI.a  lib/libLLVMBitReader.a  lib/libclangToolingCore.a  lib/libclangRewrite.a  lib/libclangLex.a  lib/libclangBasic.a  lib/libLLVMMC.a  lib/libLLVMDebugInfoCodeView.a  lib/libLLVMDebugInfoMSF.a  lib/libLLVMCore.a  lib/libLLVMBinaryFormat.a  lib/libLLVMRemarks.a  lib/libLLVMBitstreamReader.a  lib/libgtest.a  lib/libLLVMSupport.a  -lm  /usr/lib/libz.dylib  /usr/lib/libcurses.dylib  lib/libLLVMDemangle.a  -lpthread && :
[4118/4196] : && /Users/buildslave/jenkins/workspace/clang-stage2-Rthinlto/host-compiler/bin/clang++  -fno-stack-protector -fno-common -Wno-profile-instr-unprofiled -fPIC -fvisibility-inlines-hidden -Werror=date-time -Werror=unguarded-availability-new -fmodules -fmodules-cache-path=/Users/buildslave/jenkins/workspace/clang-stage2-Rthinlto/clang-build/Build/module.cache -fcxx-modules -Xclang -fmodules-local-submodule-visibility -gmodules -Wall -Wextra -Wno-unused-parameter -Wwrite-strings -Wcast-qual -Wmissing-field-initializers -pedantic -Wno-long-long -Wimplicit-fallthrough -Wcovered-switch-default -Wno-noexcept-type -Wnon-virtual-dtor -Wdelete-non-virtual-dtor -Wsuggest-override -Wstring-conversion -fdiagnostics-color -flto=thin -fno-common -Woverloaded-virtual -Wno-nested-anon-types -O2 -g -DNDEBUG -isysroot /Applications/Xcode.app/Contents/Developer/Platforms/MacOSX.platform/Developer/SDKs/MacOSX10.15.sdk -Wl,-search_paths_first -Wl,-headerpad_max_install_names -flto=thin -Wl,-cache_path_lto,/Users/buildslave/jenkins/workspace/clang-stage2-Rthinlto/clang-build/Build/lto.cache    -Wl,-dead_strip tools/clang/unittests/libclang/CMakeFiles/libclangTests.dir/LibclangTest.cpp.o  -o tools/clang/unittests/libclang/libclangTests  -Wl,-rpath,/Users/buildslave/jenkins/workspace/clang-stage2-Rthinlto/clang-build/Build/lib  lib/libLLVMSupport.a  lib/libgtest_main.a  lib/libgtest.a  lib/libclang.dylib  lib/libLLVMSupport.a  -lm  /usr/lib/libz.dylib  /usr/lib/libcurses.dylib  lib/libLLVMDemangle.a  -lpthread && :
[4119/4196] : && /Users/buildslave/jenkins/workspace/clang-stage2-Rthinlto/host-compiler/bin/clang++  -fno-stack-protector -fno-common -Wno-profile-instr-unprofiled -fPIC -fvisibility-inlines-hidden -Werror=date-time -Werror=unguarded-availability-new -fmodules -fmodules-cache-path=/Users/buildslave/jenkins/workspace/clang-stage2-Rthinlto/clang-build/Build/module.cache -fcxx-modules -Xclang -fmodules-local-submodule-visibility -gmodules -Wall -Wextra -Wno-unused-parameter -Wwrite-strings -Wcast-qual -Wmissing-field-initializers -pedantic -Wno-long-long -Wimplicit-fallthrough -Wcovered-switch-default -Wno-noexcept-type -Wnon-virtual-dtor -Wdelete-non-virtual-dtor -Wsuggest-override -Wstring-conversion -fdiagnostics-color -flto=thin -fno-common -Woverloaded-virtual -Wno-nested-anon-types -O2 -g -DNDEBUG -isysroot /Applications/Xcode.app/Contents/Developer/Platforms/MacOSX.platform/Developer/SDKs/MacOSX10.15.sdk -Wl,-search_paths_first -Wl,-headerpad_max_install_names -flto=thin -Wl,-cache_path_lto,/Users/buildslave/jenkins/workspace/clang-stage2-Rthinlto/clang-build/Build/lto.cache    -Wl,-dead_strip tools/clang/unittests/libclang/CrashTests/CMakeFiles/libclangCrashTests.dir/LibclangCrashTest.cpp.o  -o tools/clang/unittests/libclang/CrashTests/libclangCrashTests  -Wl,-rpath,/Users/buildslave/jenkins/workspace/clang-stage2-Rthinlto/clang-build/Build/lib  lib/libLLVMSupport.a  lib/libgtest_main.a  lib/libgtest.a  lib/libclang.dylib  lib/libLLVMSupport.a  -lm  /usr/lib/libz.dylib  /usr/lib/libcurses.dylib  lib/libLLVMDemangle.a  -lpthread && :
[4120/4196] : && /Users/buildslave/jenkins/workspace/clang-stage2-Rthinlto/host-compiler/bin/clang++  -fno-stack-protector -fno-common -Wno-profile-instr-unprofiled -fPIC -fvisibility-inlines-hidden -Werror=date-time -Werror=unguarded-availability-new -fmodules -fmodules-cache-path=/Users/buildslave/jenkins/workspace/clang-stage2-Rthinlto/clang-build/Build/module.cache -fcxx-modules -Xclang -fmodules-local-submodule-visibility -gmodules -Wall -Wextra -Wno-unused-parameter -Wwrite-strings -Wcast-qual -Wmissing-field-initializers -pedantic -Wno-long-long -Wimplicit-fallthrough -Wcovered-switch-default -Wno-noexcept-type -Wnon-virtual-dtor -Wdelete-non-virtual-dtor -Wsuggest-override -Wstring-conversion -fdiagnostics-color -flto=thin -fno-common -Woverloaded-virtual -Wno-nested-anon-types -O2 -g -DNDEBUG -isysroot /Applications/Xcode.app/Contents/Developer/Platforms/MacOSX.platform/Developer/SDKs/MacOSX10.15.sdk -Wl,-search_paths_first -Wl,-headerpad_max_install_names -flto=thin -Wl,-cache_path_lto,/Users/buildslave/jenkins/workspace/clang-stage2-Rthinlto/clang-build/Build/lto.cache    -Wl,-dead_strip tools/clang/unittests/Index/CMakeFiles/IndexTests.dir/IndexTests.cpp.o  -o tools/clang/unittests/Index/IndexTests  lib/libLLVMX86CodeGen.a  lib/libLLVMX86AsmParser.a  lib/libLLVMX86Desc.a  lib/libLLVMX86Disassembler.a  lib/libLLVMX86Info.a  lib/libLLVMARMCodeGen.a  lib/libLLVMARMAsmParser.a  lib/libLLVMARMDesc.a  lib/libLLVMARMDisassembler.a  lib/libLLVMARMInfo.a  lib/libLLVMARMUtils.a  lib/libLLVMAArch64CodeGen.a  lib/libLLVMAArch64AsmParser.a  lib/libLLVMAArch64Desc.a  lib/libLLVMAArch64Disassembler.a  lib/libLLVMAArch64Info.a  lib/libLLVMAArch64Utils.a  lib/libLLVMSupport.a  lib/libLLVMSupport.a  lib/libgtest_main.a  lib/libgtest.a  lib/libclangAST.a  lib/libclangBasic.a  lib/libclangFrontend.a  lib/libclangIndex.a  lib/libclangLex.a  lib/libclangSerialization.a  lib/libclangTooling.a  lib/libLLVMARMDesc.a  lib/libLLVMARMInfo.a  lib/libLLVMARMUtils.a  lib/libLLVMAsmPrinter.a  lib/libLLVMDebugInfoDWARF.a  lib/libLLVMGlobalISel.a  lib/libLLVMSelectionDAG.a  lib/libLLVMCodeGen.a  lib/libLLVMBitWriter.a  lib/libLLVMTarget.a  lib/libLLVMCFGuard.a  lib/libLLVMScalarOpts.a  lib/libLLVMAggressiveInstCombine.a  lib/libLLVMInstCombine.a  lib/libLLVMAArch64Desc.a  lib/libLLVMAArch64Info.a  lib/libLLVMAArch64Utils.a  lib/libLLVMMCDisassembler.a  -lpthread  lib/libclangFrontend.a  lib/libclangParse.a  lib/libclangSerialization.a  lib/libclangSema.a  lib/libclangEdit.a  lib/libclangAnalysis.a  lib/libclangDriver.a  lib/libLLVMOption.a  lib/libclangFormat.a  lib/libclangToolingInclusions.a  lib/libclangToolingCore.a  lib/libclangRewrite.a  lib/libclangASTMatchers.a  lib/libclangAST.a  lib/libclangLex.a  lib/libclangBasic.a  lib/libLLVMFrontendOpenMP.a  lib/libLLVMTransformUtils.a  lib/libLLVMAnalysis.a  lib/libLLVMProfileData.a  lib/libLLVMObject.a  lib/libLLVMMCParser.a  lib/libLLVMMC.a  lib/libLLVMDebugInfoCodeView.a  lib/libLLVMDebugInfoMSF.a  lib/libLLVMBitReader.a  lib/libLLVMTextAPI.a  lib/libLLVMCore.a  lib/libLLVMBinaryFormat.a  lib/libLLVMRemarks.a  lib/libLLVMBitstreamReader.a  lib/libLLVMSupport.a  -lm  /usr/lib/libz.dylib  /usr/lib/libcurses.dylib  lib/libLLVMDemangle.a && :
[4121/4196] : && /Users/buildslave/jenkins/workspace/clang-stage2-Rthinlto/host-compiler/bin/clang++  -fno-stack-protector -fno-common -Wno-profile-instr-unprofiled -fPIC -fvisibility-inlines-hidden -Werror=date-time -Werror=unguarded-availability-new -fmodules -fmodules-cache-path=/Users/buildslave/jenkins/workspace/clang-stage2-Rthinlto/clang-build/Build/module.cache -fcxx-modules -Xclang -fmodules-local-submodule-visibility -gmodules -Wall -Wextra -Wno-unused-parameter -Wwrite-strings -Wcast-qual -Wmissing-field-initializers -pedantic -Wno-long-long -Wimplicit-fallthrough -Wcovered-switch-default -Wno-noexcept-type -Wnon-virtual-dtor -Wdelete-non-virtual-dtor -Wsuggest-override -Wstring-conversion -fdiagnostics-color -flto=thin -O2 -g -DNDEBUG -isysroot /Applications/Xcode.app/Contents/Developer/Platforms/MacOSX.platform/Developer/SDKs/MacOSX10.15.sdk -Wl,-search_paths_first -Wl,-headerpad_max_install_names -flto=thin -Wl,-cache_path_lto,/Users/buildslave/jenkins/workspace/clang-stage2-Rthinlto/clang-build/Build/lto.cache    -Wl,-dead_strip -Wl,-object_path_lto,/Users/buildslave/jenkins/workspace/clang-stage2-Rthinlto/clang-build/Build/tools/dsymutil/./dsymutil-lto.o tools/dsymutil/CMakeFiles/dsymutil.dir/dsymutil.cpp.o tools/dsymutil/CMakeFiles/dsymutil.dir/BinaryHolder.cpp.o tools/dsymutil/CMakeFiles/dsymutil.dir/CFBundle.cpp.o tools/dsymutil/CMakeFiles/dsymutil.dir/DebugMap.cpp.o tools/dsymutil/CMakeFiles/dsymutil.dir/DwarfLinkerForBinary.cpp.o tools/dsymutil/CMakeFiles/dsymutil.dir/MachODebugMapParser.cpp.o tools/dsymutil/CMakeFiles/dsymutil.dir/MachOUtils.cpp.o tools/dsymutil/CMakeFiles/dsymutil.dir/Reproducer.cpp.o tools/dsymutil/CMakeFiles/dsymutil.dir/SymbolMap.cpp.o  -o bin/dsymutil  -Wl,-rpath,@loader_path/../lib  lib/libLLVMX86CodeGen.a  lib/libLLVMARMCodeGen.a  lib/libLLVMAArch64CodeGen.a  lib/libLLVMX86Desc.a  lib/libLLVMARMDesc.a  lib/libLLVMAArch64Desc.a  lib/libLLVMX86Info.a  lib/libLLVMARMInfo.a  lib/libLLVMAArch64Info.a  lib/libLLVMAsmPrinter.a  lib/libLLVMDebugInfoDWARF.a  lib/libLLVMDWARFLinker.a  lib/libLLVMMC.a  lib/libLLVMObject.a  lib/libLLVMCodeGen.a  lib/libLLVMOption.a  lib/libLLVMRemarks.a  lib/libLLVMSupport.a  lib/libLLVMTarget.a  -framework CoreFoundation  lib/libLLVMMCDisassembler.a  lib/libLLVMARMUtils.a  lib/libLLVMGlobalISel.a  lib/libLLVMSelectionDAG.a  lib/libLLVMCFGuard.a  lib/libLLVMAArch64Utils.a  lib/libLLVMAsmPrinter.a  lib/libLLVMDebugInfoDWARF.a  lib/libLLVMCodeGen.a  lib/libLLVMTarget.a  lib/libLLVMScalarOpts.a  lib/libLLVMAggressiveInstCombine.a  lib/libLLVMInstCombine.a  lib/libLLVMTransformUtils.a  lib/libLLVMBitWriter.a  lib/libLLVMAnalysis.a  lib/libLLVMObject.a  lib/libLLVMMCParser.a  lib/libLLVMMC.a  lib/libLLVMDebugInfoCodeView.a  lib/libLLVMDebugInfoMSF.a  lib/libLLVMBitReader.a  lib/libLLVMTextAPI.a  lib/libLLVMProfileData.a  lib/libLLVMCore.a  lib/libLLVMRemarks.a  lib/libLLVMBitstreamReader.a  lib/libLLVMBinaryFormat.a  lib/libLLVMSupport.a  -lm  /usr/lib/libz.dylib  /usr/lib/libcurses.dylib  lib/libLLVMDemangle.a && cd /Users/buildslave/jenkins/workspace/clang-stage2-Rthinlto/clang-build/Build/tools/dsymutil && /Users/buildslave/jenkins/workspace/clang-stage2-Rthinlto/host-compiler/bin/dsymutil -o=dsymutil.dSYM /Users/buildslave/jenkins/workspace/clang-stage2-Rthinlto/clang-build/Build/bin/dsymutil && /usr/bin/strip -Sxl /Users/buildslave/jenkins/workspace/clang-stage2-Rthinlto/clang-build/Build/bin/dsymutil
[4122/4196] : && /Users/buildslave/jenkins/workspace/clang-stage2-Rthinlto/host-compiler/bin/clang++  -fno-stack-protector -fno-common -Wno-profile-instr-unprofiled -fPIC -fvisibility-inlines-hidden -Werror=date-time -Werror=unguarded-availability-new -fmodules -fmodules-cache-path=/Users/buildslave/jenkins/workspace/clang-stage2-Rthinlto/clang-build/Build/module.cache -fcxx-modules -Xclang -fmodules-local-submodule-visibility -gmodules -Wall -Wextra -Wno-unused-parameter -Wwrite-strings -Wcast-qual -Wmissing-field-initializers -pedantic -Wno-long-long -Wimplicit-fallthrough -Wcovered-switch-default -Wno-noexcept-type -Wnon-virtual-dtor -Wdelete-non-virtual-dtor -Wsuggest-override -Wstring-conversion -fdiagnostics-color -flto=thin -O2 -g -DNDEBUG -isysroot /Applications/Xcode.app/Contents/Developer/Platforms/MacOSX.platform/Developer/SDKs/MacOSX10.15.sdk -Wl,-search_paths_first -Wl,-headerpad_max_install_names -flto=thin -Wl,-cache_path_lto,/Users/buildslave/jenkins/workspace/clang-stage2-Rthinlto/clang-build/Build/lto.cache     -Wl,-object_path_lto,/Users/buildslave/jenkins/workspace/clang-stage2-Rthinlto/clang-build/Build/tools/llc/./llc-lto.o -rdynamic tools/llc/CMakeFiles/llc.dir/llc.cpp.o  -o bin/llc  -Wl,-rpath,@loader_path/../lib  lib/libLLVMX86AsmParser.a  lib/libLLVMARMAsmParser.a  lib/libLLVMAArch64AsmParser.a  lib/libLLVMX86CodeGen.a  lib/libLLVMARMCodeGen.a  lib/libLLVMAArch64CodeGen.a  lib/libLLVMX86Desc.a  lib/libLLVMARMDesc.a  lib/libLLVMAArch64Desc.a  lib/libLLVMX86Info.a  lib/libLLVMARMInfo.a  lib/libLLVMAArch64Info.a  lib/libLLVMAnalysis.a  lib/libLLVMAsmParser.a  lib/libLLVMAsmPrinter.a  lib/libLLVMCodeGen.a  lib/libLLVMCore.a  lib/libLLVMIRReader.a  lib/libLLVMMC.a  lib/libLLVMMIRParser.a  lib/libLLVMRemarks.a  lib/libLLVMScalarOpts.a  lib/libLLVMSelectionDAG.a  lib/libLLVMSupport.a  lib/libLLVMTarget.a  lib/libLLVMTransformUtils.a  lib/libLLVMVectorize.a  lib/libLLVMMCDisassembler.a  lib/libLLVMARMUtils.a  lib/libLLVMDebugInfoDWARF.a  lib/libLLVMAArch64Utils.a  lib/libLLVMGlobalISel.a  lib/libLLVMSelectionDAG.a  lib/libLLVMCFGuard.a  lib/libLLVMAsmParser.a  lib/libLLVMCodeGen.a  lib/libLLVMScalarOpts.a  lib/libLLVMAggressiveInstCombine.a  lib/libLLVMInstCombine.a  lib/libLLVMBitWriter.a  lib/libLLVMTarget.a  lib/libLLVMTransformUtils.a  lib/libLLVMAnalysis.a  lib/libLLVMProfileData.a  lib/libLLVMObject.a  lib/libLLVMMCParser.a  lib/libLLVMMC.a  lib/libLLVMDebugInfoCodeView.a  lib/libLLVMDebugInfoMSF.a  lib/libLLVMBitReader.a  lib/libLLVMTextAPI.a  lib/libLLVMCore.a  lib/libLLVMRemarks.a  lib/libLLVMBitstreamReader.a  lib/libLLVMBinaryFormat.a  lib/libLLVMSupport.a  -lm  /usr/lib/libz.dylib  /usr/lib/libcurses.dylib  lib/libLLVMDemangle.a && cd /Users/buildslave/jenkins/workspace/clang-stage2-Rthinlto/clang-build/Build/tools/llc && /Users/buildslave/jenkins/workspace/clang-stage2-Rthinlto/host-compiler/bin/dsymutil -o=llc.dSYM /Users/buildslave/jenkins/workspace/clang-stage2-Rthinlto/clang-build/Build/bin/llc && /usr/bin/strip -Sxl /Users/buildslave/jenkins/workspace/clang-stage2-Rthinlto/clang-build/Build/bin/llc
FAILED: bin/llc 
: && /Users/buildslave/jenkins/workspace/clang-stage2-Rthinlto/host-compiler/bin/clang++  -fno-stack-protector -fno-common -Wno-profile-instr-unprofiled -fPIC -fvisibility-inlines-hidden -Werror=date-time -Werror=unguarded-availability-new -fmodules -fmodules-cache-path=/Users/buildslave/jenkins/workspace/clang-stage2-Rthinlto/clang-build/Build/module.cache -fcxx-modules -Xclang -fmodules-local-submodule-visibility -gmodules -Wall -Wextra -Wno-unused-parameter -Wwrite-strings -Wcast-qual -Wmissing-field-initializers -pedantic -Wno-long-long -Wimplicit-fallthrough -Wcovered-switch-default -Wno-noexcept-type -Wnon-virtual-dtor -Wdelete-non-virtual-dtor -Wsuggest-override -Wstring-conversion -fdiagnostics-color -flto=thin -O2 -g -DNDEBUG -isysroot /Applications/Xcode.app/Contents/Developer/Platforms/MacOSX.platform/Developer/SDKs/MacOSX10.15.sdk -Wl,-search_paths_first -Wl,-headerpad_max_install_names -flto=thin -Wl,-cache_path_lto,/Users/buildslave/jenkins/workspace/clang-stage2-Rthinlto/clang-build/Build/lto.cache     -Wl,-object_path_lto,/Users/buildslave/jenkins/workspace/clang-stage2-Rthinlto/clang-build/Build/tools/llc/./llc-lto.o -rdynamic tools/llc/CMakeFiles/llc.dir/llc.cpp.o  -o bin/llc  -Wl,-rpath,@loader_path/../lib  lib/libLLVMX86AsmParser.a  lib/libLLVMARMAsmParser.a  lib/libLLVMAArch64AsmParser.a  lib/libLLVMX86CodeGen.a  lib/libLLVMARMCodeGen.a  lib/libLLVMAArch64CodeGen.a  lib/libLLVMX86Desc.a  lib/libLLVMARMDesc.a  lib/libLLVMAArch64Desc.a  lib/libLLVMX86Info.a  lib/libLLVMARMInfo.a  lib/libLLVMAArch64Info.a  lib/libLLVMAnalysis.a  lib/libLLVMAsmParser.a  lib/libLLVMAsmPrinter.a  lib/libLLVMCodeGen.a  lib/libLLVMCore.a  lib/libLLVMIRReader.a  lib/libLLVMMC.a  lib/libLLVMMIRParser.a  lib/libLLVMRemarks.a  lib/libLLVMScalarOpts.a  lib/libLLVMSelectionDAG.a  lib/libLLVMSupport.a  lib/libLLVMTarget.a  lib/libLLVMTransformUtils.a  lib/libLLVMVectorize.a  lib/libLLVMMCDisassembler.a  lib/libLLVMARMUtils.a  lib/libLLVMDebugInfoDWARF.a  lib/libLLVMAArch64Utils.a  lib/libLLVMGlobalISel.a  lib/libLLVMSelectionDAG.a  lib/libLLVMCFGuard.a  lib/libLLVMAsmParser.a  lib/libLLVMCodeGen.a  lib/libLLVMScalarOpts.a  lib/libLLVMAggressiveInstCombine.a  lib/libLLVMInstCombine.a  lib/libLLVMBitWriter.a  lib/libLLVMTarget.a  lib/libLLVMTransformUtils.a  lib/libLLVMAnalysis.a  lib/libLLVMProfileData.a  lib/libLLVMObject.a  lib/libLLVMMCParser.a  lib/libLLVMMC.a  lib/libLLVMDebugInfoCodeView.a  lib/libLLVMDebugInfoMSF.a  lib/libLLVMBitReader.a  lib/libLLVMTextAPI.a  lib/libLLVMCore.a  lib/libLLVMRemarks.a  lib/libLLVMBitstreamReader.a  lib/libLLVMBinaryFormat.a  lib/libLLVMSupport.a  -lm  /usr/lib/libz.dylib  /usr/lib/libcurses.dylib  lib/libLLVMDemangle.a && cd /Users/buildslave/jenkins/workspace/clang-stage2-Rthinlto/clang-build/Build/tools/llc && /Users/buildslave/jenkins/workspace/clang-stage2-Rthinlto/host-compiler/bin/dsymutil -o=llc.dSYM /Users/buildslave/jenkins/workspace/clang-stage2-Rthinlto/clang-build/Build/bin/llc && /usr/bin/strip -Sxl /Users/buildslave/jenkins/workspace/clang-stage2-Rthinlto/clang-build/Build/bin/llc
Assertion failed: (MBB != &MF->front() && "Can't find reaching def for virtreg"), function MarkVirtRegAliveInBlock, file /Users/buildslave/jenkins/workspace/clang-stage1-RA/llvm-project/llvm/lib/CodeGen/LiveVariables.cpp, line 112.
clang-13: error: unable to execute command: Abort trap: 6
clang-13: error: linker command failed due to signal (use -v to see invocation)
ninja: build stopped: subcommand failed.
Command failed: Command '['/usr/local/bin/ninja', '-v', 'install']' returned non-zero exit status 1
Command: ['/usr/local/bin/ninja', '-v', 'install']
[Pipeline] }
[Pipeline] // timeout
[Pipeline] }
[Pipeline] // stage
[Pipeline] stage
[Pipeline] { (Test)
Stage "Test" skipped due to earlier failure(s)
[Pipeline] }
[Pipeline] // stage
[Pipeline] stage
[Pipeline] { (Declarative: Post Actions)
[Pipeline] scanForIssues
[Clang (LLVM based)] Sleeping for 5 seconds due to JENKINS-32191...
[Clang (LLVM based)] Parsing console log (workspace: '/Users/buildslave/jenkins/workspace/clang-stage2-Rthinlto')
[Clang (LLVM based)] Successfully parsed console log
[Clang (LLVM based)] -> found 0 issues (skipped 0 duplicates)
[Clang (LLVM based)] Skipping post processing
[Clang (LLVM based)] No filter has been set, publishing all 0 issues
[Pipeline] emailext
Warning: kazu@google.com is not a recognized user, but sending mail anyway
Warning: carl.ritson@amd.com is not a recognized user, but sending mail anyway
Warning: ajcbik@google.com is not a recognized user, but sending mail anyway
Warning: shivam98.tkg@gmail.com is not a recognized user, but sending mail anyway
Warning: hanchung@google.com is not a recognized user, but sending mail anyway
Warning: jianzhouzh@google.com is not a recognized user, but sending mail anyway
Warning: jrtc27@jrtc27.com is not a recognized user, but sending mail anyway
Warning: sanjoy@playingwithpointers.com is not a recognized user, but sending mail anyway
Warning: joker.eph@gmail.com is not a recognized user, but sending mail anyway
Warning: haowei@google.com is not a recognized user, but sending mail anyway
Warning: clementval@gmail.com is not a recognized user, but sending mail anyway
Warning: pklausler@nvidia.com is not a recognized user, but sending mail anyway
Warning: craig.topper@intel.com is not a recognized user, but sending mail anyway
Warning: aeubanks@google.com is not a recognized user, but sending mail anyway
Warning: llvm-project@meinersbur.de is not a recognized user, but sending mail anyway
Warning: mkazantsev@azul.com is not a recognized user, but sending mail anyway
Warning: nullptr.cpp@gmail.com is not a recognized user, but sending mail anyway
Warning: kazu@google.com is not a recognized user, but sending mail anyway
Warning: carl.ritson@amd.com is not a recognized user, but sending mail anyway
Warning: ajcbik@google.com is not a recognized user, but sending mail anyway
Warning: shivam98.tkg@gmail.com is not a recognized user, but sending mail anyway
Warning: hanchung@google.com is not a recognized user, but sending mail anyway
Warning: jianzhouzh@google.com is not a recognized user, but sending mail anyway
Warning: jrtc27@jrtc27.com is not a recognized user, but sending mail anyway
Warning: sanjoy@playingwithpointers.com is not a recognized user, but sending mail anyway
Warning: joker.eph@gmail.com is not a recognized user, but sending mail anyway
Warning: haowei@google.com is not a recognized user, but sending mail anyway
Warning: clementval@gmail.com is not a recognized user, but sending mail anyway
Warning: pklausler@nvidia.com is not a recognized user, but sending mail anyway
Warning: craig.topper@intel.com is not a recognized user, but sending mail anyway
Warning: aeubanks@google.com is not a recognized user, but sending mail anyway
Warning: llvm-project@meinersbur.de is not a recognized user, but sending mail anyway
Warning: mkazantsev@azul.com is not a recognized user, but sending mail anyway
Warning: nullptr.cpp@gmail.com is not a recognized user, but sending mail anyway

Hide Details

Begin Pre-Send Script... Sending email to: Zixu Wang <zixu_wang@apple.com> Zixu Wang <zixu_wang@apple.com> Azhar Mohammed <azhar@apple.com> [Pipeline] } [Pipeline] // stage [Pipeline] } [Pipeline] // withEnv [Pipeline] } [Pipeline] // node [Pipeline] End of Pipeline ERROR: script returned exit code 1 Finished: FAILURE