FailedConsole Output

Skipping 9,218 KB.. Full Log
te-assume_aligned-on-function-two-params.cpp (2545 of 3077)
PASS: UBSan-AddressSanitizer-x86_64 :: TestCases/Pointer/alignment-assumption-blacklist.cpp (2546 of 3077)
PASS: UBSan-AddressSanitizer-x86_64 :: TestCases/Pointer/alignment-assumption-attribute-assume_aligned-on-function.cpp (2547 of 3077)
PASS: UBSan-AddressSanitizer-x86_64 :: TestCases/Pointer/alignment-assumption-builtin_assume_aligned-three-params-variable.cpp (2548 of 3077)
PASS: UBSan-AddressSanitizer-x86_64 :: TestCases/Pointer/alignment-assumption-builtin_assume_aligned-three-params.cpp (2549 of 3077)
PASS: UBSan-AddressSanitizer-x86_64 :: TestCases/Pointer/alignment-assumption-summary.cpp (2550 of 3077)
PASS: UBSan-AddressSanitizer-x86_64 :: TestCases/Pointer/index-overflow.cpp (2551 of 3077)
PASS: UBSan-AddressSanitizer-x86_64 :: TestCases/Pointer/alignment-assumption-builtin_assume_aligned-two-params.cpp (2552 of 3077)
PASS: UBSan-AddressSanitizer-x86_64 :: TestCases/Pointer/alignment-assumption-openmp.cpp (2553 of 3077)
PASS: UBSan-AddressSanitizer-x86_64 :: TestCases/Pointer/nullptr-and-nonzero-offset-summary.cpp (2554 of 3077)
PASS: UBSan-Minimal-x86_64 :: TestCases/alignment-assumption.c (2555 of 3077)
PASS: UBSan-Minimal-x86_64 :: TestCases/implicit-integer-sign-change.c (2556 of 3077)
PASS: UBSan-AddressSanitizer-x86_64 :: TestCases/Pointer/unsigned-index-expression.cpp (2557 of 3077)
PASS: UBSan-Minimal-x86_64 :: TestCases/implicit-signed-integer-truncation-or-sign-change.c (2558 of 3077)
PASS: UBSan-Minimal-x86_64 :: TestCases/implicit-signed-integer-truncation.c (2559 of 3077)
PASS: UBSan-Minimal-x86_64 :: TestCases/implicit-unsigned-integer-truncation.c (2560 of 3077)
PASS: UBSan-Minimal-x86_64 :: TestCases/recover-dedup-limit.cpp (2561 of 3077)
PASS: UBSan-Minimal-x86_64 :: TestCases/test-darwin-interface.c (2562 of 3077)
PASS: UBSan-Minimal-x86_64 :: TestCases/recover-dedup.cpp (2563 of 3077)
PASS: UBSan-Minimal-x86_64 :: TestCases/nullptr-and-nonzero-offset.c (2564 of 3077)
PASS: UBSan-Standalone-x86_64 :: TestCases/Float/cast-overflow.cpp (2565 of 3077)
PASS: UBSan-Minimal-x86_64 :: TestCases/uadd-overflow.cpp (2566 of 3077)
UNSUPPORTED: UBSan-AddressSanitizer-x86_64 :: TestCases/TypeCheck/Linux/PR33221.cpp (2567 of 3077)
PASS: UBSan-AddressSanitizer-x86_64 :: TestCases/Pointer/nullptr-and-nonzero-offset-constants.cpp (2568 of 3077)
PASS: UBSan-AddressSanitizer-x86_64 :: TestCases/TypeCheck/PR33221.cpp (2569 of 3077)
UNSUPPORTED: UBSan-Standalone-x86_64 :: TestCases/ImplicitConversion/integer-sign-change-summary.cpp (2570 of 3077)
PASS: UBSan-AddressSanitizer-x86_64 :: TestCases/TypeCheck/Function/function.cpp (2571 of 3077)
PASS: UBSan-AddressSanitizer-x86_64 :: TestCases/TypeCheck/null.cpp (2572 of 3077)
PASS: UBSan-AddressSanitizer-x86_64 :: TestCases/TypeCheck/vptr-corrupted-vtable-itanium.cpp (2573 of 3077)
PASS: UBSan-AddressSanitizer-x86_64 :: TestCases/TypeCheck/misaligned.cpp (2574 of 3077)
UNSUPPORTED: UBSan-AddressSanitizer-x86_64 :: TestCases/TypeCheck/vptr-ptrauth-unauthenticated.cpp (2575 of 3077)
UNSUPPORTED: UBSan-Standalone-x86_64 :: TestCases/ImplicitConversion/signed-integer-truncation-or-sign-change-summary.cpp (2576 of 3077)
UNSUPPORTED: UBSan-Standalone-x86_64 :: TestCases/ImplicitConversion/signed-integer-truncation-summary.cpp (2577 of 3077)
PASS: UBSan-Standalone-x86_64 :: TestCases/ImplicitConversion/integer-conversion-incdec.c (2578 of 3077)
PASS: UBSan-AddressSanitizer-x86_64 :: TestCases/TypeCheck/vptr-virtual-base-construction.cpp (2579 of 3077)
UNSUPPORTED: UBSan-Standalone-x86_64 :: TestCases/ImplicitConversion/unsigned-integer-truncation-summary.cpp (2580 of 3077)
PASS: UBSan-AddressSanitizer-x86_64 :: TestCases/TypeCheck/vptr-non-unique-typeinfo.cpp (2581 of 3077)
PASS: UBSan-Standalone-x86_64 :: TestCases/ImplicitConversion/integer-sign-change-incdec.c (2582 of 3077)
PASS: UBSan-Standalone-x86_64 :: TestCases/ImplicitConversion/integer-sign-change-blacklist.c (2583 of 3077)
PASS: UBSan-AddressSanitizer-x86_64 :: TestCases/TypeCheck/vptr-virtual-base.cpp (2584 of 3077)
PASS: UBSan-Standalone-x86_64 :: TestCases/Integer/div-overflow.cpp (2585 of 3077)
PASS: UBSan-Standalone-x86_64 :: TestCases/Integer/mul-overflow.cpp (2586 of 3077)
PASS: UBSan-Standalone-x86_64 :: TestCases/Integer/add-overflow.cpp (2587 of 3077)
PASS: UBSan-AddressSanitizer-x86_64 :: TestCases/Pointer/nullptr-and-nonzero-offset-variable.cpp (2588 of 3077)
PASS: UBSan-Standalone-x86_64 :: TestCases/Integer/div-zero.cpp (2589 of 3077)
PASS: UBSan-Standalone-x86_64 :: TestCases/Integer/incdec-overflow.cpp (2590 of 3077)
UNSUPPORTED: UBSan-Standalone-x86_64 :: TestCases/Integer/summary.cpp (2591 of 3077)
PASS: UBSan-Standalone-x86_64 :: TestCases/Integer/negate-overflow.cpp (2592 of 3077)
PASS: UBSan-Standalone-x86_64 :: TestCases/ImplicitConversion/signed-integer-truncation-incdec.c (2593 of 3077)
PASS: UBSan-Standalone-x86_64 :: TestCases/Integer/no-recover.cpp (2594 of 3077)
PASS: UBSan-Standalone-x86_64 :: TestCases/Integer/umul-overflow.cpp (2595 of 3077)
PASS: UBSan-Standalone-x86_64 :: TestCases/ImplicitConversion/integer-arithmetic-value-change.c (2596 of 3077)
PASS: UBSan-Standalone-x86_64 :: TestCases/Integer/suppressions.cpp (2597 of 3077)
UNSUPPORTED: UBSan-Standalone-x86_64 :: TestCases/Misc/Linux/print_stack_trace.cpp (2598 of 3077)
UNSUPPORTED: UBSan-Standalone-x86_64 :: TestCases/Misc/Linux/ubsan_options.cpp (2599 of 3077)
PASS: UBSan-AddressSanitizer-x86_64 :: TestCases/TypeCheck/vptr.cpp (2600 of 3077)
PASS: UBSan-Standalone-x86_64 :: TestCases/Integer/sub-overflow.cpp (2601 of 3077)
PASS: UBSan-Standalone-x86_64 :: TestCases/ImplicitConversion/integer-sign-change.c (2602 of 3077)
PASS: UBSan-Standalone-x86_64 :: TestCases/Misc/bool.cpp (2603 of 3077)
PASS: UBSan-Standalone-x86_64 :: TestCases/Misc/bool.m (2604 of 3077)
PASS: UBSan-Standalone-x86_64 :: TestCases/ImplicitConversion/integer-conversion.c (2605 of 3077)
PASS: UBSan-Standalone-x86_64 :: TestCases/Misc/bounds.cpp (2606 of 3077)
PASS: UBSan-Standalone-x86_64 :: TestCases/Integer/uadd-overflow.cpp (2607 of 3077)
PASS: UBSan-Standalone-x86_64 :: TestCases/Integer/unsigned-shift.cpp (2608 of 3077)
PASS: UBSan-Standalone-x86_64 :: TestCases/Misc/deduplication.cpp (2609 of 3077)
UNSUPPORTED: UBSan-Standalone-x86_64 :: TestCases/Misc/no-interception.cpp (2610 of 3077)
PASS: UBSan-Standalone-x86_64 :: TestCases/Misc/log-path_test.cpp (2611 of 3077)
PASS: UBSan-Standalone-x86_64 :: TestCases/Integer/uincdec-overflow.cpp (2612 of 3077)
PASS: UBSan-Standalone-x86_64 :: TestCases/Misc/monitor.cpp (2613 of 3077)
PASS: UBSan-Standalone-x86_64 :: TestCases/Misc/builtins.cpp (2614 of 3077)
PASS: UBSan-Standalone-x86_64 :: TestCases/Misc/missing_return.cpp (2615 of 3077)
PASS: UBSan-Standalone-x86_64 :: TestCases/Integer/usub-overflow.cpp (2616 of 3077)
PASS: UBSan-Standalone-x86_64 :: TestCases/ImplicitConversion/integer-truncation.c (2617 of 3077)
PASS: UBSan-Standalone-x86_64 :: TestCases/Misc/nonnull-arg.cpp (2618 of 3077)
PASS: UBSan-Standalone-x86_64 :: TestCases/Misc/nullability.c (2619 of 3077)
PASS: UBSan-Standalone-x86_64 :: TestCases/Misc/print_summary.c (2620 of 3077)
PASS: UBSan-Standalone-x86_64 :: TestCases/Misc/unreachable.cpp (2621 of 3077)
PASS: UBSan-Standalone-x86_64 :: TestCases/Misc/vla.c (2622 of 3077)
PASS: UBSan-Standalone-x86_64 :: TestCases/Misc/enum.cpp (2623 of 3077)
PASS: UBSan-Standalone-x86_64 :: TestCases/Misc/nonnull.cpp (2624 of 3077)
PASS: UBSan-Standalone-x86_64 :: TestCases/Misc/objc-cast.m (2625 of 3077)
PASS: UBSan-Standalone-x86_64 :: TestCases/Pointer/alignment-assumption-blacklist.cpp (2626 of 3077)
PASS: UBSan-Standalone-x86_64 :: TestCases/Misc/coverage-levels.cpp (2627 of 3077)
PASS: UBSan-Standalone-x86_64 :: TestCases/ImplicitConversion/signed-integer-truncation.c (2628 of 3077)
UNSUPPORTED: UBSan-Standalone-x86_64 :: TestCases/Pointer/alignment-assumption-summary.cpp (2629 of 3077)
PASS: UBSan-Standalone-x86_64 :: TestCases/ImplicitConversion/unsigned-integer-truncation.c (2630 of 3077)
PASS: UBSan-Standalone-x86_64 :: TestCases/Pointer/index-overflow.cpp (2631 of 3077)
UNSUPPORTED: UBSan-Standalone-x86_64 :: TestCases/Pointer/nullptr-and-nonzero-offset-summary.cpp (2632 of 3077)
PASS: UBSan-Standalone-x86_64 :: TestCases/Pointer/alignment-assumption-attribute-align_value-on-lvalue.cpp (2633 of 3077)
PASS: UBSan-Standalone-x86_64 :: TestCases/Pointer/alignment-assumption-attribute-align_value-on-paramvar.cpp (2634 of 3077)
PASS: UBSan-Standalone-x86_64 :: TestCases/Pointer/alignment-assumption-attribute-alloc_align-on-function-variable.cpp (2635 of 3077)
UNSUPPORTED: UBSan-Standalone-x86_64 :: TestCases/TypeCheck/Linux/PR33221.cpp (2636 of 3077)
PASS: UBSan-Standalone-x86_64 :: TestCases/ImplicitConversion/signed-integer-truncation-or-sign-change-blacklist.c (2637 of 3077)
PASS: UBSan-Standalone-x86_64 :: TestCases/Pointer/alignment-assumption-attribute-alloc_align-on-function.cpp (2638 of 3077)
PASS: UBSan-Standalone-x86_64 :: TestCases/Pointer/alignment-assumption-attribute-assume_aligned-on-function-two-params.cpp (2639 of 3077)
PASS: UBSan-Standalone-x86_64 :: TestCases/Pointer/alignment-assumption-attribute-assume_aligned-on-function.cpp (2640 of 3077)
PASS: UBSan-Standalone-x86_64 :: TestCases/Pointer/unsigned-index-expression.cpp (2641 of 3077)
UNSUPPORTED: UBSan-Standalone-x86_64 :: TestCases/TypeCheck/vptr-ptrauth-unauthenticated.cpp (2642 of 3077)
PASS: UBSan-Standalone-x86_64 :: TestCases/Integer/shift.cpp (2643 of 3077)
PASS: UBSan-Standalone-x86_64 :: TestCases/Pointer/alignment-assumption-builtin_assume_aligned-three-params-variable.cpp (2644 of 3077)
PASS: UBSan-Standalone-x86_64 :: TestCases/TypeCheck/PR33221.cpp (2645 of 3077)
PASS: UBSan-Standalone-x86_64 :: TestCases/TypeCheck/null.cpp (2646 of 3077)
PASS: UBSan-Standalone-x86_64 :: TestCases/TypeCheck/vptr-corrupted-vtable-itanium.cpp (2647 of 3077)
PASS: UBSan-Standalone-x86_64 :: TestCases/TypeCheck/vptr-virtual-base-construction.cpp (2648 of 3077)
PASS: UBSan-Standalone-x86_64 :: TestCases/TypeCheck/vptr-virtual-base.cpp (2649 of 3077)
PASS: UBSan-Standalone-x86_64 :: TestCases/ImplicitConversion/signed-integer-truncation-blacklist.c (2650 of 3077)
PASS: UBSan-StandaloneStatic-x86_64 :: TestCases/Float/cast-overflow.cpp (2651 of 3077)
UNSUPPORTED: UBSan-StandaloneStatic-x86_64 :: TestCases/ImplicitConversion/integer-sign-change-summary.cpp (2652 of 3077)
PASS: UBSan-Standalone-x86_64 :: TestCases/TypeCheck/vptr-non-unique-typeinfo.cpp (2653 of 3077)
PASS: UBSan-Standalone-x86_64 :: TestCases/Pointer/alignment-assumption-builtin_assume_aligned-three-params.cpp (2654 of 3077)
PASS: UBSan-Standalone-x86_64 :: TestCases/Pointer/alignment-assumption-builtin_assume_aligned-two-params.cpp (2655 of 3077)
PASS: UBSan-Standalone-x86_64 :: TestCases/TypeCheck/misaligned.cpp (2656 of 3077)
PASS: UBSan-Standalone-x86_64 :: TestCases/Pointer/alignment-assumption-openmp.cpp (2657 of 3077)
UNSUPPORTED: UBSan-StandaloneStatic-x86_64 :: TestCases/ImplicitConversion/signed-integer-truncation-or-sign-change-summary.cpp (2658 of 3077)
UNSUPPORTED: UBSan-StandaloneStatic-x86_64 :: TestCases/ImplicitConversion/signed-integer-truncation-summary.cpp (2659 of 3077)
PASS: UBSan-Standalone-x86_64 :: TestCases/TypeCheck/Function/function.cpp (2660 of 3077)
PASS: UBSan-Standalone-x86_64 :: TestCases/ImplicitConversion/unsigned-integer-truncation-blacklist.c (2661 of 3077)
UNSUPPORTED: UBSan-StandaloneStatic-x86_64 :: TestCases/ImplicitConversion/unsigned-integer-truncation-summary.cpp (2662 of 3077)
PASS: UBSan-Standalone-x86_64 :: TestCases/Pointer/nullptr-and-nonzero-offset-constants.cpp (2663 of 3077)
PASS: UBSan-Standalone-x86_64 :: TestCases/TypeCheck/vptr.cpp (2664 of 3077)
PASS: UBSan-StandaloneStatic-x86_64 :: TestCases/Integer/div-overflow.cpp (2665 of 3077)
PASS: UBSan-StandaloneStatic-x86_64 :: TestCases/Integer/add-overflow.cpp (2666 of 3077)
PASS: UBSan-StandaloneStatic-x86_64 :: TestCases/ImplicitConversion/integer-conversion-incdec.c (2667 of 3077)
PASS: UBSan-StandaloneStatic-x86_64 :: TestCases/ImplicitConversion/integer-sign-change-blacklist.c (2668 of 3077)
PASS: UBSan-StandaloneStatic-x86_64 :: TestCases/ImplicitConversion/integer-sign-change-incdec.c (2669 of 3077)
PASS: UBSan-StandaloneStatic-x86_64 :: TestCases/Integer/mul-overflow.cpp (2670 of 3077)
PASS: UBSan-StandaloneStatic-x86_64 :: TestCases/ImplicitConversion/signed-integer-truncation-incdec.c (2671 of 3077)
PASS: UBSan-StandaloneStatic-x86_64 :: TestCases/Integer/div-zero.cpp (2672 of 3077)
UNSUPPORTED: UBSan-StandaloneStatic-x86_64 :: TestCases/Integer/summary.cpp (2673 of 3077)
PASS: UBSan-StandaloneStatic-x86_64 :: TestCases/Integer/incdec-overflow.cpp (2674 of 3077)
PASS: UBSan-StandaloneStatic-x86_64 :: TestCases/Integer/negate-overflow.cpp (2675 of 3077)
PASS: UBSan-StandaloneStatic-x86_64 :: TestCases/Integer/no-recover.cpp (2676 of 3077)
PASS: UBSan-Standalone-x86_64 :: TestCases/Pointer/nullptr-and-nonzero-offset-variable.cpp (2677 of 3077)
PASS: UBSan-StandaloneStatic-x86_64 :: TestCases/Integer/sub-overflow.cpp (2678 of 3077)
PASS: UBSan-StandaloneStatic-x86_64 :: TestCases/Integer/umul-overflow.cpp (2679 of 3077)
UNSUPPORTED: UBSan-StandaloneStatic-x86_64 :: TestCases/Misc/Linux/print_stack_trace.cpp (2680 of 3077)
UNSUPPORTED: UBSan-StandaloneStatic-x86_64 :: TestCases/Misc/Linux/ubsan_options.cpp (2681 of 3077)
PASS: UBSan-StandaloneStatic-x86_64 :: TestCases/Integer/suppressions.cpp (2682 of 3077)
PASS: UBSan-StandaloneStatic-x86_64 :: TestCases/Misc/bool.cpp (2683 of 3077)
PASS: UBSan-StandaloneStatic-x86_64 :: TestCases/Integer/uadd-overflow.cpp (2684 of 3077)
PASS: UBSan-StandaloneStatic-x86_64 :: TestCases/Integer/unsigned-shift.cpp (2685 of 3077)
UNSUPPORTED: UBSan-StandaloneStatic-x86_64 :: TestCases/Misc/coverage-levels.cpp (2686 of 3077)
PASS: UBSan-StandaloneStatic-x86_64 :: TestCases/Misc/bool.m (2687 of 3077)
PASS: UBSan-StandaloneStatic-x86_64 :: TestCases/Misc/bounds.cpp (2688 of 3077)
PASS: UBSan-StandaloneStatic-x86_64 :: TestCases/Misc/deduplication.cpp (2689 of 3077)
PASS: UBSan-StandaloneStatic-x86_64 :: TestCases/ImplicitConversion/integer-sign-change.c (2690 of 3077)
PASS: UBSan-StandaloneStatic-x86_64 :: TestCases/Integer/uincdec-overflow.cpp (2691 of 3077)
UNSUPPORTED: UBSan-StandaloneStatic-x86_64 :: TestCases/Misc/no-interception.cpp (2692 of 3077)
PASS: UBSan-StandaloneStatic-x86_64 :: TestCases/Integer/usub-overflow.cpp (2693 of 3077)
PASS: UBSan-StandaloneStatic-x86_64 :: TestCases/Misc/log-path_test.cpp (2694 of 3077)
PASS: UBSan-StandaloneStatic-x86_64 :: TestCases/Misc/builtins.cpp (2695 of 3077)
PASS: UBSan-StandaloneStatic-x86_64 :: TestCases/Misc/monitor.cpp (2696 of 3077)
PASS: UBSan-StandaloneStatic-x86_64 :: TestCases/ImplicitConversion/integer-arithmetic-value-change.c (2697 of 3077)
PASS: UBSan-StandaloneStatic-x86_64 :: TestCases/Misc/missing_return.cpp (2698 of 3077)
PASS: UBSan-StandaloneStatic-x86_64 :: TestCases/Misc/nonnull-arg.cpp (2699 of 3077)
PASS: UBSan-StandaloneStatic-x86_64 :: TestCases/ImplicitConversion/integer-conversion.c (2700 of 3077)
PASS: UBSan-StandaloneStatic-x86_64 :: TestCases/Misc/nullability.c (2701 of 3077)
PASS: UBSan-StandaloneStatic-x86_64 :: TestCases/Misc/print_summary.c (2702 of 3077)
PASS: UBSan-StandaloneStatic-x86_64 :: TestCases/Misc/unreachable.cpp (2703 of 3077)
PASS: UBSan-StandaloneStatic-x86_64 :: TestCases/Misc/enum.cpp (2704 of 3077)
PASS: UBSan-StandaloneStatic-x86_64 :: TestCases/Misc/vla.c (2705 of 3077)
PASS: UBSan-StandaloneStatic-x86_64 :: TestCases/ImplicitConversion/integer-truncation.c (2706 of 3077)
PASS: UBSan-StandaloneStatic-x86_64 :: TestCases/Misc/nonnull.cpp (2707 of 3077)
PASS: UBSan-StandaloneStatic-x86_64 :: TestCases/ImplicitConversion/signed-integer-truncation.c (2708 of 3077)
PASS: UBSan-StandaloneStatic-x86_64 :: TestCases/Pointer/alignment-assumption-blacklist.cpp (2709 of 3077)
PASS: UBSan-StandaloneStatic-x86_64 :: TestCases/Misc/objc-cast.m (2710 of 3077)
UNSUPPORTED: UBSan-StandaloneStatic-x86_64 :: TestCases/Pointer/alignment-assumption-summary.cpp (2711 of 3077)
PASS: UBSan-StandaloneStatic-x86_64 :: TestCases/ImplicitConversion/unsigned-integer-truncation.c (2712 of 3077)
PASS: UBSan-StandaloneStatic-x86_64 :: TestCases/Pointer/index-overflow.cpp (2713 of 3077)
UNSUPPORTED: UBSan-StandaloneStatic-x86_64 :: TestCases/Pointer/nullptr-and-nonzero-offset-summary.cpp (2714 of 3077)
PASS: UBSan-StandaloneStatic-x86_64 :: TestCases/ImplicitConversion/signed-integer-truncation-or-sign-change-blacklist.c (2715 of 3077)
PASS: UBSan-StandaloneStatic-x86_64 :: TestCases/Pointer/unsigned-index-expression.cpp (2716 of 3077)
PASS: UBSan-StandaloneStatic-x86_64 :: TestCases/Pointer/alignment-assumption-attribute-align_value-on-lvalue.cpp (2717 of 3077)
UNSUPPORTED: UBSan-StandaloneStatic-x86_64 :: TestCases/TypeCheck/Linux/PR33221.cpp (2718 of 3077)
PASS: UBSan-StandaloneStatic-x86_64 :: TestCases/Pointer/alignment-assumption-attribute-align_value-on-paramvar.cpp (2719 of 3077)
PASS: UBSan-StandaloneStatic-x86_64 :: TestCases/Pointer/alignment-assumption-attribute-alloc_align-on-function-variable.cpp (2720 of 3077)
PASS: UBSan-StandaloneStatic-x86_64 :: TestCases/Pointer/alignment-assumption-attribute-alloc_align-on-function.cpp (2721 of 3077)
PASS: UBSan-StandaloneStatic-x86_64 :: TestCases/Pointer/alignment-assumption-attribute-assume_aligned-on-function-two-params.cpp (2722 of 3077)
PASS: UBSan-StandaloneStatic-x86_64 :: TestCases/Integer/shift.cpp (2723 of 3077)
UNSUPPORTED: UBSan-StandaloneStatic-x86_64 :: TestCases/TypeCheck/vptr-ptrauth-unauthenticated.cpp (2724 of 3077)
PASS: UBSan-StandaloneStatic-x86_64 :: TestCases/ImplicitConversion/signed-integer-truncation-blacklist.c (2725 of 3077)
PASS: UBSan-StandaloneStatic-x86_64 :: TestCases/Pointer/alignment-assumption-attribute-assume_aligned-on-function.cpp (2726 of 3077)
PASS: UBSan-StandaloneStatic-x86_64 :: TestCases/Pointer/alignment-assumption-builtin_assume_aligned-three-params-variable.cpp (2727 of 3077)
PASS: UBSan-StandaloneStatic-x86_64 :: TestCases/TypeCheck/PR33221.cpp (2728 of 3077)
PASS: UBSan-StandaloneStatic-x86_64 :: TestCases/Pointer/alignment-assumption-builtin_assume_aligned-three-params.cpp (2729 of 3077)
PASS: UBSan-StandaloneStatic-x86_64 :: TestCases/TypeCheck/null.cpp (2730 of 3077)
PASS: UBSan-StandaloneStatic-x86_64 :: TestCases/TypeCheck/vptr-virtual-base-construction.cpp (2731 of 3077)
PASS: UBSan-StandaloneStatic-x86_64 :: TestCases/TypeCheck/vptr-corrupted-vtable-itanium.cpp (2732 of 3077)
PASS: UBSan-StandaloneStatic-x86_64 :: TestCases/TypeCheck/vptr-virtual-base.cpp (2733 of 3077)
PASS: UBSan-StandaloneStatic-x86_64 :: TestCases/ImplicitConversion/unsigned-integer-truncation-blacklist.c (2734 of 3077)
PASS: UBSan-StandaloneStatic-x86_64 :: TestCases/TypeCheck/Function/function.cpp (2735 of 3077)
PASS: UBSan-StandaloneStatic-x86_64 :: TestCases/Pointer/alignment-assumption-builtin_assume_aligned-two-params.cpp (2736 of 3077)
PASS: UBSan-StandaloneStatic-x86_64 :: TestCases/TypeCheck/vptr-non-unique-typeinfo.cpp (2737 of 3077)
PASS: UBSan-StandaloneStatic-x86_64 :: TestCases/Pointer/alignment-assumption-openmp.cpp (2738 of 3077)
PASS: UBSan-StandaloneStatic-x86_64 :: TestCases/TypeCheck/misaligned.cpp (2739 of 3077)
PASS: UBSan-StandaloneStatic-x86_64 :: TestCases/Pointer/nullptr-and-nonzero-offset-constants.cpp (2740 of 3077)
PASS: UBSan-StandaloneStatic-x86_64 :: TestCases/Pointer/nullptr-and-nonzero-offset-variable.cpp (2741 of 3077)
PASS: UBSan-StandaloneStatic-x86_64 :: TestCases/TypeCheck/vptr.cpp (2742 of 3077)
PASS: UBSan-ThreadSanitizer-x86_64 :: TestCases/Float/cast-overflow.cpp (2743 of 3077)
PASS: UBSan-ThreadSanitizer-x86_64 :: TestCases/ImplicitConversion/integer-conversion-incdec.c (2744 of 3077)
PASS: UBSan-ThreadSanitizer-x86_64 :: TestCases/ImplicitConversion/integer-sign-change-blacklist.c (2745 of 3077)
PASS: UBSan-ThreadSanitizer-x86_64 :: TestCases/ImplicitConversion/integer-arithmetic-value-change.c (2746 of 3077)
PASS: UBSan-ThreadSanitizer-x86_64 :: TestCases/ImplicitConversion/integer-sign-change-summary.cpp (2747 of 3077)
PASS: UBSan-ThreadSanitizer-x86_64 :: TestCases/ImplicitConversion/integer-conversion.c (2748 of 3077)
PASS: UBSan-ThreadSanitizer-x86_64 :: TestCases/ImplicitConversion/integer-sign-change-incdec.c (2749 of 3077)
PASS: UBSan-ThreadSanitizer-x86_64 :: TestCases/ImplicitConversion/integer-sign-change.c (2750 of 3077)
PASS: UBSan-ThreadSanitizer-x86_64 :: TestCases/ImplicitConversion/integer-truncation.c (2751 of 3077)
PASS: UBSan-ThreadSanitizer-x86_64 :: TestCases/ImplicitConversion/signed-integer-truncation-incdec.c (2752 of 3077)
PASS: UBSan-ThreadSanitizer-x86_64 :: TestCases/ImplicitConversion/signed-integer-truncation-or-sign-change-summary.cpp (2753 of 3077)
PASS: UBSan-ThreadSanitizer-x86_64 :: TestCases/ImplicitConversion/signed-integer-truncation-summary.cpp (2754 of 3077)
PASS: UBSan-ThreadSanitizer-x86_64 :: TestCases/ImplicitConversion/signed-integer-truncation-blacklist.c (2755 of 3077)
PASS: UBSan-ThreadSanitizer-x86_64 :: TestCases/ImplicitConversion/signed-integer-truncation-or-sign-change-blacklist.c (2756 of 3077)
PASS: UBSan-ThreadSanitizer-x86_64 :: TestCases/ImplicitConversion/unsigned-integer-truncation-summary.cpp (2757 of 3077)
PASS: UBSan-ThreadSanitizer-x86_64 :: TestCases/ImplicitConversion/signed-integer-truncation.c (2758 of 3077)
PASS: UBSan-ThreadSanitizer-x86_64 :: TestCases/Integer/add-overflow.cpp (2759 of 3077)
PASS: UBSan-ThreadSanitizer-x86_64 :: TestCases/Integer/div-overflow.cpp (2760 of 3077)
PASS: UBSan-ThreadSanitizer-x86_64 :: TestCases/Integer/div-zero.cpp (2761 of 3077)
PASS: UBSan-ThreadSanitizer-x86_64 :: TestCases/Integer/incdec-overflow.cpp (2762 of 3077)
PASS: UBSan-ThreadSanitizer-x86_64 :: TestCases/ImplicitConversion/unsigned-integer-truncation-blacklist.c (2763 of 3077)
PASS: UBSan-ThreadSanitizer-x86_64 :: TestCases/Integer/mul-overflow.cpp (2764 of 3077)
PASS: UBSan-ThreadSanitizer-x86_64 :: TestCases/Integer/negate-overflow.cpp (2765 of 3077)
PASS: UBSan-ThreadSanitizer-x86_64 :: TestCases/ImplicitConversion/unsigned-integer-truncation.c (2766 of 3077)
PASS: UBSan-ThreadSanitizer-x86_64 :: TestCases/Integer/no-recover.cpp (2767 of 3077)
UNSUPPORTED: UBSan-ThreadSanitizer-x86_64 :: TestCases/Integer/summary.cpp (2768 of 3077)
PASS: UBSan-ThreadSanitizer-x86_64 :: TestCases/Integer/sub-overflow.cpp (2769 of 3077)
PASS: UBSan-ThreadSanitizer-x86_64 :: TestCases/Integer/uadd-overflow.cpp (2770 of 3077)
PASS: UBSan-ThreadSanitizer-x86_64 :: TestCases/Integer/suppressions.cpp (2771 of 3077)
PASS: UBSan-ThreadSanitizer-x86_64 :: TestCases/Integer/umul-overflow.cpp (2772 of 3077)
PASS: UBSan-ThreadSanitizer-x86_64 :: TestCases/Integer/uincdec-overflow.cpp (2773 of 3077)
UNSUPPORTED: UBSan-ThreadSanitizer-x86_64 :: TestCases/Misc/Linux/print_stack_trace.cpp (2774 of 3077)
PASS: UBSan-ThreadSanitizer-x86_64 :: TestCases/Integer/unsigned-shift.cpp (2775 of 3077)
UNSUPPORTED: UBSan-ThreadSanitizer-x86_64 :: TestCases/Misc/Linux/ubsan_options.cpp (2776 of 3077)
PASS: UBSan-ThreadSanitizer-x86_64 :: TestCases/Misc/bool.cpp (2777 of 3077)
PASS: UBSan-ThreadSanitizer-x86_64 :: TestCases/Integer/usub-overflow.cpp (2778 of 3077)
PASS: UBSan-ThreadSanitizer-x86_64 :: TestCases/Misc/bool.m (2779 of 3077)
PASS: UBSan-ThreadSanitizer-x86_64 :: TestCases/Integer/shift.cpp (2780 of 3077)
PASS: UBSan-ThreadSanitizer-x86_64 :: TestCases/Misc/builtins.cpp (2781 of 3077)
XFAIL: UBSan-ThreadSanitizer-x86_64 :: TestCases/Misc/coverage-levels.cpp (2782 of 3077)
PASS: UBSan-ThreadSanitizer-x86_64 :: TestCases/Misc/bounds.cpp (2783 of 3077)
PASS: UBSan-ThreadSanitizer-x86_64 :: TestCases/Misc/deduplication.cpp (2784 of 3077)
PASS: UBSan-ThreadSanitizer-x86_64 :: TestCases/Misc/log-path_test.cpp (2785 of 3077)
PASS: UBSan-ThreadSanitizer-x86_64 :: TestCases/Misc/enum.cpp (2786 of 3077)
UNSUPPORTED: UBSan-ThreadSanitizer-x86_64 :: TestCases/Misc/no-interception.cpp (2787 of 3077)
PASS: UBSan-ThreadSanitizer-x86_64 :: TestCases/Misc/missing_return.cpp (2788 of 3077)
PASS: UBSan-ThreadSanitizer-x86_64 :: TestCases/Misc/monitor.cpp (2789 of 3077)
PASS: UBSan-ThreadSanitizer-x86_64 :: TestCases/Misc/nonnull.cpp (2790 of 3077)
PASS: UBSan-ThreadSanitizer-x86_64 :: TestCases/Misc/nullability.c (2791 of 3077)
PASS: UBSan-ThreadSanitizer-x86_64 :: TestCases/Misc/print_summary.c (2792 of 3077)
PASS: UBSan-ThreadSanitizer-x86_64 :: TestCases/Misc/nonnull-arg.cpp (2793 of 3077)
PASS: UBSan-ThreadSanitizer-x86_64 :: TestCases/Misc/objc-cast.m (2794 of 3077)
PASS: UBSan-ThreadSanitizer-x86_64 :: TestCases/Misc/unreachable.cpp (2795 of 3077)
PASS: UBSan-ThreadSanitizer-x86_64 :: TestCases/Misc/vla.c (2796 of 3077)
PASS: UBSan-ThreadSanitizer-x86_64 :: TestCases/Pointer/alignment-assumption-attribute-align_value-on-lvalue.cpp (2797 of 3077)
PASS: UBSan-ThreadSanitizer-x86_64 :: TestCases/Pointer/alignment-assumption-attribute-align_value-on-paramvar.cpp (2798 of 3077)
PASS: UBSan-ThreadSanitizer-x86_64 :: TestCases/Pointer/alignment-assumption-attribute-alloc_align-on-function-variable.cpp (2799 of 3077)
PASS: UBSan-ThreadSanitizer-x86_64 :: TestCases/Pointer/alignment-assumption-attribute-alloc_align-on-function.cpp (2800 of 3077)
PASS: UBSan-ThreadSanitizer-x86_64 :: TestCases/Pointer/alignment-assumption-attribute-assume_aligned-on-function-two-params.cpp (2801 of 3077)
PASS: UBSan-ThreadSanitizer-x86_64 :: TestCases/Pointer/alignment-assumption-attribute-assume_aligned-on-function.cpp (2802 of 3077)
PASS: UBSan-ThreadSanitizer-x86_64 :: TestCases/Pointer/alignment-assumption-blacklist.cpp (2803 of 3077)
PASS: UBSan-ThreadSanitizer-x86_64 :: TestCases/Pointer/alignment-assumption-builtin_assume_aligned-three-params-variable.cpp (2804 of 3077)
PASS: UBSan-ThreadSanitizer-x86_64 :: TestCases/Pointer/alignment-assumption-builtin_assume_aligned-three-params.cpp (2805 of 3077)
PASS: UBSan-ThreadSanitizer-x86_64 :: TestCases/Pointer/alignment-assumption-builtin_assume_aligned-two-params.cpp (2806 of 3077)
PASS: UBSan-ThreadSanitizer-x86_64 :: TestCases/Pointer/alignment-assumption-summary.cpp (2807 of 3077)
PASS: UBSan-ThreadSanitizer-x86_64 :: TestCases/Pointer/index-overflow.cpp (2808 of 3077)
PASS: UBSan-ThreadSanitizer-x86_64 :: TestCases/Pointer/alignment-assumption-openmp.cpp (2809 of 3077)
UNSUPPORTED: XRay-x86_64-darwin :: TestCases/Posix/always-never-instrument.cpp (2810 of 3077)
UNSUPPORTED: XRay-x86_64-darwin :: TestCases/Posix/arg1-arg0-logging.cpp (2811 of 3077)
UNSUPPORTED: XRay-x86_64-darwin :: TestCases/Posix/arg1-logger.cpp (2812 of 3077)
UNSUPPORTED: XRay-x86_64-darwin :: TestCases/Posix/arg1-logging-implicit-this.cpp (2813 of 3077)
UNSUPPORTED: XRay-x86_64-darwin :: TestCases/Posix/argv0-log-file-name.cpp (2814 of 3077)
UNSUPPORTED: XRay-x86_64-darwin :: TestCases/Posix/basic-filtering.cpp (2815 of 3077)
UNSUPPORTED: XRay-x86_64-darwin :: TestCases/Posix/c-test.cpp (2816 of 3077)
UNSUPPORTED: XRay-x86_64-darwin :: TestCases/Posix/clang-no-xray-instrument.cpp (2817 of 3077)
UNSUPPORTED: XRay-x86_64-darwin :: TestCases/Posix/common-trampoline-alignment.cpp (2818 of 3077)
UNSUPPORTED: XRay-x86_64-darwin :: TestCases/Posix/coverage-sample.cpp (2819 of 3077)
UNSUPPORTED: XRay-x86_64-darwin :: TestCases/Posix/custom-event-handler-alignment.cpp (2820 of 3077)
UNSUPPORTED: XRay-x86_64-darwin :: TestCases/Posix/custom-event-logging.cpp (2821 of 3077)
UNSUPPORTED: XRay-x86_64-darwin :: TestCases/Posix/fdr-mode-inmemory.cpp (2822 of 3077)
UNSUPPORTED: XRay-x86_64-darwin :: TestCases/Posix/fdr-mode-multiple.cpp (2823 of 3077)
UNSUPPORTED: XRay-x86_64-darwin :: TestCases/Posix/fdr-mode.cpp (2824 of 3077)
UNSUPPORTED: XRay-x86_64-darwin :: TestCases/Posix/fdr-reinit.cpp (2825 of 3077)
UNSUPPORTED: XRay-x86_64-darwin :: TestCases/Posix/fdr-single-thread.cpp (2826 of 3077)
UNSUPPORTED: XRay-x86_64-darwin :: TestCases/Posix/fdr-thread-order.cpp (2827 of 3077)
UNSUPPORTED: XRay-x86_64-darwin :: TestCases/Posix/fixedsize-logging.cpp (2828 of 3077)
UNSUPPORTED: XRay-x86_64-darwin :: TestCases/Posix/fork_basic_logging.cpp (2829 of 3077)
UNSUPPORTED: XRay-x86_64-darwin :: TestCases/Posix/func-id-utils.cpp (2830 of 3077)
UNSUPPORTED: XRay-x86_64-darwin :: TestCases/Posix/logging-modes.cpp (2831 of 3077)
UNSUPPORTED: XRay-x86_64-darwin :: TestCases/Posix/optional-inmemory-log.cpp (2832 of 3077)
UNSUPPORTED: XRay-x86_64-darwin :: TestCases/Posix/patching-unpatching.cpp (2833 of 3077)
UNSUPPORTED: XRay-x86_64-darwin :: TestCases/Posix/pic_test.cpp (2834 of 3077)
UNSUPPORTED: XRay-x86_64-darwin :: TestCases/Posix/profiling-multi-threaded.cpp (2835 of 3077)
UNSUPPORTED: XRay-x86_64-darwin :: TestCases/Posix/profiling-single-threaded.cpp (2836 of 3077)
UNSUPPORTED: XRay-x86_64-darwin :: TestCases/Posix/quiet-start.cpp (2837 of 3077)
UNSUPPORTED: XRay-x86_64h-darwin :: TestCases/Posix/always-never-instrument.cpp (2838 of 3077)
UNSUPPORTED: XRay-x86_64h-darwin :: TestCases/Posix/arg1-arg0-logging.cpp (2839 of 3077)
UNSUPPORTED: XRay-x86_64h-darwin :: TestCases/Posix/arg1-logger.cpp (2840 of 3077)
UNSUPPORTED: XRay-x86_64h-darwin :: TestCases/Posix/arg1-logging-implicit-this.cpp (2841 of 3077)
UNSUPPORTED: XRay-x86_64h-darwin :: TestCases/Posix/argv0-log-file-name.cpp (2842 of 3077)
UNSUPPORTED: XRay-x86_64h-darwin :: TestCases/Posix/basic-filtering.cpp (2843 of 3077)
UNSUPPORTED: XRay-x86_64h-darwin :: TestCases/Posix/c-test.cpp (2844 of 3077)
UNSUPPORTED: XRay-x86_64h-darwin :: TestCases/Posix/clang-no-xray-instrument.cpp (2845 of 3077)
UNSUPPORTED: XRay-x86_64h-darwin :: TestCases/Posix/common-trampoline-alignment.cpp (2846 of 3077)
UNSUPPORTED: XRay-x86_64h-darwin :: TestCases/Posix/coverage-sample.cpp (2847 of 3077)
UNSUPPORTED: XRay-x86_64h-darwin :: TestCases/Posix/custom-event-handler-alignment.cpp (2848 of 3077)
UNSUPPORTED: XRay-x86_64h-darwin :: TestCases/Posix/custom-event-logging.cpp (2849 of 3077)
UNSUPPORTED: XRay-x86_64h-darwin :: TestCases/Posix/fdr-mode-inmemory.cpp (2850 of 3077)
UNSUPPORTED: XRay-x86_64h-darwin :: TestCases/Posix/fdr-mode-multiple.cpp (2851 of 3077)
UNSUPPORTED: XRay-x86_64h-darwin :: TestCases/Posix/fdr-mode.cpp (2852 of 3077)
UNSUPPORTED: XRay-x86_64h-darwin :: TestCases/Posix/fdr-reinit.cpp (2853 of 3077)
UNSUPPORTED: XRay-x86_64h-darwin :: TestCases/Posix/fdr-single-thread.cpp (2854 of 3077)
UNSUPPORTED: XRay-x86_64h-darwin :: TestCases/Posix/fdr-thread-order.cpp (2855 of 3077)
UNSUPPORTED: XRay-x86_64h-darwin :: TestCases/Posix/fixedsize-logging.cpp (2856 of 3077)
UNSUPPORTED: XRay-x86_64h-darwin :: TestCases/Posix/fork_basic_logging.cpp (2857 of 3077)
UNSUPPORTED: XRay-x86_64h-darwin :: TestCases/Posix/func-id-utils.cpp (2858 of 3077)
UNSUPPORTED: XRay-x86_64h-darwin :: TestCases/Posix/logging-modes.cpp (2859 of 3077)
UNSUPPORTED: XRay-x86_64h-darwin :: TestCases/Posix/optional-inmemory-log.cpp (2860 of 3077)
UNSUPPORTED: XRay-x86_64h-darwin :: TestCases/Posix/patching-unpatching.cpp (2861 of 3077)
UNSUPPORTED: XRay-x86_64h-darwin :: TestCases/Posix/pic_test.cpp (2862 of 3077)
UNSUPPORTED: XRay-x86_64h-darwin :: TestCases/Posix/profiling-multi-threaded.cpp (2863 of 3077)
UNSUPPORTED: XRay-x86_64h-darwin :: TestCases/Posix/profiling-single-threaded.cpp (2864 of 3077)
UNSUPPORTED: XRay-x86_64h-darwin :: TestCases/Posix/quiet-start.cpp (2865 of 3077)
PASS: UBSan-ThreadSanitizer-x86_64 :: TestCases/Pointer/nullptr-and-nonzero-offset-summary.cpp (2866 of 3077)
PASS: UBSan-ThreadSanitizer-x86_64 :: TestCases/Pointer/unsigned-index-expression.cpp (2867 of 3077)
PASS: cfi-devirt-x86_64 :: bad-split.cpp (2868 of 3077)
PASS: UBSan-ThreadSanitizer-x86_64 :: TestCases/Pointer/nullptr-and-nonzero-offset-constants.cpp (2869 of 3077)
UNSUPPORTED: UBSan-ThreadSanitizer-x86_64 :: TestCases/TypeCheck/Linux/PR33221.cpp (2870 of 3077)
PASS: cfi-devirt-x86_64 :: anon-namespace.cpp (2871 of 3077)
UNSUPPORTED: cfi-devirt-x86_64 :: cross-dso/icall/diag.cpp (2872 of 3077)
UNSUPPORTED: cfi-devirt-x86_64 :: cross-dso/icall/dlopen.cpp (2873 of 3077)
UNSUPPORTED: cfi-devirt-x86_64 :: cross-dso/icall/icall-from-dso.cpp (2874 of 3077)
UNSUPPORTED: cfi-devirt-x86_64 :: cross-dso/icall/icall.cpp (2875 of 3077)
UNSUPPORTED: cfi-devirt-x86_64 :: cross-dso/shadow_is_read_only.cpp (2876 of 3077)
UNSUPPORTED: cfi-devirt-x86_64 :: cross-dso/simple-fail.cpp (2877 of 3077)
UNSUPPORTED: cfi-devirt-x86_64 :: cross-dso/simple-pass.cpp (2878 of 3077)
UNSUPPORTED: cfi-devirt-x86_64 :: cross-dso/stats.cpp (2879 of 3077)
UNSUPPORTED: cfi-devirt-x86_64 :: cross-dso/target_out_of_bounds.cpp (2880 of 3077)
PASS: cfi-devirt-x86_64 :: create-derivers.test (2881 of 3077)
UNSUPPORTED: cfi-devirt-x86_64 :: icall/external-call.c (2882 of 3077)
XFAIL: cfi-devirt-x86_64 :: icall/weak.c (2883 of 3077)
UNSUPPORTED: cfi-devirt-x86_64 :: icall/wrong-signature-mixed-lto.c (2884 of 3077)
PASS: UBSan-ThreadSanitizer-x86_64 :: TestCases/TypeCheck/PR33221.cpp (2885 of 3077)
PASS: cfi-devirt-x86_64 :: bad-cast.cpp (2886 of 3077)
PASS: cfi-devirt-x86_64 :: cross-dso-diagnostic.cpp (2887 of 3077)
PASS: cfi-devirt-x86_64 :: multiple-inheritance2.cpp (2888 of 3077)
PASS: cfi-devirt-x86_64 :: icall/bad-signature.c (2889 of 3077)
XFAIL: cfi-devirt-x86_64 :: sibling.cpp (2890 of 3077)
PASS: cfi-devirt-x86_64 :: mfcall.cpp (2891 of 3077)
XFAIL: cfi-devirt-x86_64 :: simple-pass.cpp (2892 of 3077)
UNSUPPORTED: cfi-devirt-x86_64 :: stats.cpp (2893 of 3077)
PASS: cfi-devirt-x86_64 :: nvcall.cpp (2894 of 3077)
PASS: UBSan-ThreadSanitizer-x86_64 :: TestCases/TypeCheck/Function/function.cpp (2895 of 3077)
PASS: cfi-devirt-x86_64 :: target_uninstrumented.cpp (2896 of 3077)
PASS: cfi-devirt-x86_64 :: overwrite.cpp (2897 of 3077)
PASS: cfi-devirt-x86_64 :: multiple-inheritance.cpp (2898 of 3077)
PASS: cfi-devirt-x86_64 :: vtable-may-alias.cpp (2899 of 3077)
XFAIL: cfi-devirt-x86_64 :: two-vcalls.cpp (2900 of 3077)
PASS: cfi-standalone-x86_64 :: bad-split.cpp (2901 of 3077)
PASS: cfi-devirt-x86_64 :: base-derived-destructor.cpp (2902 of 3077)
PASS: cfi-standalone-x86_64 :: create-derivers.test (2903 of 3077)
UNSUPPORTED: cfi-standalone-x86_64 :: cross-dso/icall/diag.cpp (2904 of 3077)
UNSUPPORTED: cfi-standalone-x86_64 :: cross-dso/icall/dlopen.cpp (2905 of 3077)
UNSUPPORTED: cfi-standalone-x86_64 :: cross-dso/icall/icall-from-dso.cpp (2906 of 3077)
UNSUPPORTED: cfi-standalone-x86_64 :: cross-dso/icall/icall.cpp (2907 of 3077)
UNSUPPORTED: cfi-standalone-x86_64 :: cross-dso/shadow_is_read_only.cpp (2908 of 3077)
UNSUPPORTED: cfi-standalone-x86_64 :: cross-dso/simple-fail.cpp (2909 of 3077)
UNSUPPORTED: cfi-standalone-x86_64 :: cross-dso/simple-pass.cpp (2910 of 3077)
UNSUPPORTED: cfi-standalone-x86_64 :: cross-dso/stats.cpp (2911 of 3077)
UNSUPPORTED: cfi-standalone-x86_64 :: cross-dso/target_out_of_bounds.cpp (2912 of 3077)
PASS: cfi-standalone-x86_64 :: cross-dso-diagnostic.cpp (2913 of 3077)
UNSUPPORTED: cfi-standalone-x86_64 :: icall/external-call.c (2914 of 3077)
XFAIL: cfi-standalone-x86_64 :: icall/weak.c (2915 of 3077)
UNSUPPORTED: cfi-standalone-x86_64 :: icall/wrong-signature-mixed-lto.c (2916 of 3077)
PASS: cfi-devirt-x86_64 :: vdtor.cpp (2917 of 3077)
PASS: cfi-standalone-x86_64 :: anon-namespace.cpp (2918 of 3077)
PASS: cfi-standalone-x86_64 :: icall/bad-signature.c (2919 of 3077)
PASS: cfi-standalone-x86_64 :: multiple-inheritance2.cpp (2920 of 3077)
PASS: cfi-standalone-x86_64 :: bad-cast.cpp (2921 of 3077)
XFAIL: cfi-standalone-x86_64 :: sibling.cpp (2922 of 3077)
PASS: cfi-standalone-x86_64 :: mfcall.cpp (2923 of 3077)
PASS: cfi-standalone-x86_64 :: nvcall.cpp (2924 of 3077)
XFAIL: cfi-standalone-x86_64 :: simple-pass.cpp (2925 of 3077)
PASS: cfi-standalone-x86_64 :: overwrite.cpp (2926 of 3077)
PASS: cfi-standalone-x86_64 :: multiple-inheritance.cpp (2927 of 3077)
PASS: cfi-standalone-x86_64 :: stats.cpp (2928 of 3077)
PASS: cfi-standalone-x86_64 :: target_uninstrumented.cpp (2929 of 3077)
PASS: cfi-standalone-x86_64 :: base-derived-destructor.cpp (2930 of 3077)
PASS: cfi-standalone-x86_64 :: vtable-may-alias.cpp (2931 of 3077)
XFAIL: cfi-standalone-x86_64 :: two-vcalls.cpp (2932 of 3077)
PASS: UBSan-ThreadSanitizer-x86_64 :: TestCases/TypeCheck/null.cpp (2933 of 3077)
PASS: cfi-devirt-x86_64 :: simple-fail.cpp (2934 of 3077)
PASS: cfi-standalone-x86_64 :: vdtor.cpp (2935 of 3077)
PASS: UBSan-ThreadSanitizer-x86_64 :: TestCases/TypeCheck/vptr-corrupted-vtable-itanium.cpp (2936 of 3077)
PASS: UBSan-ThreadSanitizer-x86_64 :: TestCases/TypeCheck/vptr-non-unique-typeinfo.cpp (2937 of 3077)
UNSUPPORTED: UBSan-ThreadSanitizer-x86_64 :: TestCases/TypeCheck/vptr-ptrauth-unauthenticated.cpp (2938 of 3077)
PASS: UBSan-ThreadSanitizer-x86_64 :: TestCases/TypeCheck/vptr-virtual-base-construction.cpp (2939 of 3077)
PASS: cfi-standalone-x86_64 :: simple-fail.cpp (2940 of 3077)
PASS: UBSan-ThreadSanitizer-x86_64 :: TestCases/TypeCheck/vptr-virtual-base.cpp (2941 of 3077)
PASS: UBSan-ThreadSanitizer-x86_64 :: TestCases/Pointer/nullptr-and-nonzero-offset-variable.cpp (2942 of 3077)
PASS: UBSan-ThreadSanitizer-x86_64 :: TestCases/TypeCheck/misaligned.cpp (2943 of 3077)
UNSUPPORTED: libFuzzer :: afl-driver-close-fd-mask.test (2944 of 3077)
PASS: libFuzzer :: acquire-crash-state.test (2945 of 3077)
UNSUPPORTED: libFuzzer :: afl-driver.test (2946 of 3077)
PASS: libFuzzer :: bad-strcmp.test (2947 of 3077)
UNSUPPORTED: libFuzzer :: bcmp.test (2948 of 3077)
PASS: libFuzzer :: bogus-initialize.test (2949 of 3077)
PASS: libFuzzer :: afl-driver-stderr.test (2950 of 3077)
PASS: libFuzzer :: buffer-overflow-on-input.test (2951 of 3077)
FAIL: libFuzzer :: cleanse.test (2952 of 3077)
******************** TEST 'libFuzzer :: cleanse.test' FAILED ********************
Script:
--
: 'RUN: at line 1';     /Users/buildslave/jenkins/workspace/clang-stage1-RA/clang-build/./bin/clang  --driver-mode=g++ -O2 -gline-tables-only -fsanitize=address,fuzzer -I/Users/buildslave/jenkins/workspace/clang-stage1-RA/llvm-project/compiler-rt/lib/fuzzer -arch x86_64 -stdlib=libc++ -mmacosx-version-min=10.9 -isysroot /Applications/Xcode.app/Contents/Developer/Platforms/MacOSX.platform/Developer/SDKs/MacOSX10.15.sdk /Users/buildslave/jenkins/workspace/clang-stage1-RA/llvm-project/compiler-rt/test/fuzzer/CleanseTest.cpp -o /Users/buildslave/jenkins/workspace/clang-stage1-RA/clang-build/tools/clang/runtime/compiler-rt-bins/test/fuzzer/X86_64DefaultDarwinConfig/Output/cleanse.test.tmp-CleanseTest
: 'RUN: at line 2';   echo -n 0123456789ABCDEFGHIZ > /Users/buildslave/jenkins/workspace/clang-stage1-RA/clang-build/tools/clang/runtime/compiler-rt-bins/test/fuzzer/X86_64DefaultDarwinConfig/Output/cleanse.test.tmp-in
: 'RUN: at line 3';    /Users/buildslave/jenkins/workspace/clang-stage1-RA/clang-build/tools/clang/runtime/compiler-rt-bins/test/fuzzer/X86_64DefaultDarwinConfig/Output/cleanse.test.tmp-CleanseTest -cleanse_crash=1 /Users/buildslave/jenkins/workspace/clang-stage1-RA/clang-build/tools/clang/runtime/compiler-rt-bins/test/fuzzer/X86_64DefaultDarwinConfig/Output/cleanse.test.tmp-in -exact_artifact_path=/Users/buildslave/jenkins/workspace/clang-stage1-RA/clang-build/tools/clang/runtime/compiler-rt-bins/test/fuzzer/X86_64DefaultDarwinConfig/Output/cleanse.test.tmp-out
: 'RUN: at line 4';   echo -n ' 1   5    A        Z' | diff - /Users/buildslave/jenkins/workspace/clang-stage1-RA/clang-build/tools/clang/runtime/compiler-rt-bins/test/fuzzer/X86_64DefaultDarwinConfig/Output/cleanse.test.tmp-out
--
Exit Code: 1

Hide Details

Command Output (stderr): -- + : 'RUN: at line 1' + /Users/buildslave/jenkins/workspace/clang-stage1-RA/clang-build/./bin/clang --driver-mode=g++ -O2 -gline-tables-only -fsanitize=address,fuzzer -I/Users/buildslave/jenkins/workspace/clang-stage1-RA/llvm-project/compiler-rt/lib/fuzzer -arch x86_64 -stdlib=libc++ -mmacosx-version-min=10.9 -isysroot /Applications/Xcode.app/Contents/Developer/Platforms/MacOSX.platform/Developer/SDKs/MacOSX10.15.sdk /Users/buildslave/jenkins/workspace/clang-stage1-RA/llvm-project/compiler-rt/test/fuzzer/CleanseTest.cpp -o /Users/buildslave/jenkins/workspace/clang-stage1-RA/clang-build/tools/clang/runtime/compiler-rt-bins/test/fuzzer/X86_64DefaultDarwinConfig/Output/cleanse.test.tmp-CleanseTest + : 'RUN: at line 2' + echo -n 0123456789ABCDEFGHIZ + : 'RUN: at line 3' + /Users/buildslave/jenkins/workspace/clang-stage1-RA/clang-build/tools/clang/runtime/compiler-rt-bins/test/fuzzer/X86_64DefaultDarwinConfig/Output/cleanse.test.tmp-CleanseTest -cleanse_crash=1 /Users/buildslave/jenkins/workspace/clang-stage1-RA/clang-build/tools/clang/runtime/compiler-rt-bins/test/fuzzer/X86_64DefaultDarwinConfig/Output/cleanse.test.tmp-in -exact_artifact_path=/Users/buildslave/jenkins/workspace/clang-stage1-RA/clang-build/tools/clang/runtime/compiler-rt-bins/test/fuzzer/X86_64DefaultDarwinConfig/Output/cleanse.test.tmp-out INFO: Running with entropic power schedule (0xFF, 100). INFO: Seed: 1377034212 INFO: Loaded 1 modules (7 inline 8-bit counters): 7 [0x100e12bd8, 0x100e12bdf), INFO: Loaded 1 PC tables (7 PCs): 7 [0x100e12be0,0x100e12c50), AddressSanitizer:DEADLYSIGNAL ================================================================= ==45432==ERROR: AddressSanitizer: BUS on unknown address (pc 0x000100ddc030 bp 0x7ffeeee2f8c0 sp 0x7ffeeee2f8a0 T0) ==45432==The signal is caused by a READ memory access. ==45432==Hint: this fault was caused by a dereference of a high value address (see register values below). Dissassemble the provided pc to learn which register was used. #0 0x100ddc030 in std::__1::__wrap_iter<std::__1::basic_string<char, std::__1::char_traits<char>, std::__1::allocator<char> >*> std::__1::remove_if<std::__1::__wrap_iter<std::__1::basic_string<char, std::__1::char_traits<char>, std::__1::allocator<char> >*>, fuzzer::Command::removeFlag(std::__1::basic_string<char, std::__1::char_traits<char>, std::__1::allocator<char> > const&)::'lambda'(std::__1::basic_string<char, std::__1::char_traits<char>, std::__1::allocator<char> > const&)>(std::__1::__wrap_iter<std::__1::basic_string<char, std::__1::char_traits<char>, std::__1::allocator<char> >*>, std::__1::__wrap_iter<std::__1::basic_string<char, std::__1::char_traits<char>, std::__1::allocator<char> >*>, fuzzer::Command::removeFlag(std::__1::basic_string<char, std::__1::char_traits<char>, std::__1::allocator<char> > const&)::'lambda'(std::__1::basic_string<char, std::__1::char_traits<char>, std::__1::allocator<char> > const&)) algorithm:2152 #1 0x100dd63c1 in fuzzer::Command::removeFlag(std::__1::basic_string<char, std::__1::char_traits<char>, std::__1::allocator<char> > const&) FuzzerCommand.h:120 #2 0x100dd5a35 in fuzzer::CleanseCrashInput(std::__1::vector<std::__1::basic_string<char, std::__1::char_traits<char>, std::__1::allocator<char> >, fuzzer::fuzzer_allocator<std::__1::basic_string<char, std::__1::char_traits<char>, std::__1::allocator<char> > > > const&, fuzzer::FuzzingOptions const&) FuzzerDriver.cpp:361 #3 0x100ddb593 in fuzzer::FuzzerDriver(int*, char***, int (*)(unsigned char const*, unsigned long)) FuzzerDriver.cpp:845 #4 0x100e0b392 in main FuzzerMain.cpp:20 #5 0x7fff6b236cc8 in start+0x0 (libdyld.dylib:x86_64+0x1acc8)

Hide Details

==45432==Register values: rax = 0x0000000000000001 rbx = 0x000060800000fff8 rcx = 0x000060800000fff9 rdx = 0x0000000000000000 rdi = 0x00007ffeeee2f880 rsi = 0x000060800000fff9 rbp = 0x00007ffeeee2f8c0 rsp = 0x00007ffeeee2f8a0 r8 = 0x0000000000000000 r9 = 0x0000000000000000 r10 = 0x0000000000000000 r11 = 0x000000000000000f r12 = 0x000060800000ffb0 r13 = 0x00000000000000a6 r14 = 0x0000608000000200 r15 = 0x00007ffeeee2f8f0 AddressSanitizer can not provide additional info. SUMMARY: AddressSanitizer: BUS algorithm:2152 in std::__1::__wrap_iter<std::__1::basic_string<char, std::__1::char_traits<char>, std::__1::allocator<char> >*> std::__1::remove_if<std::__1::__wrap_iter<std::__1::basic_string<char, std::__1::char_traits<char>, std::__1::allocator<char> >*>, fuzzer::Command::removeFlag(std::__1::basic_string<char, std::__1::char_traits<char>, std::__1::allocator<char> > const&)::'lambda'(std::__1::basic_string<char, std::__1::char_traits<char>, std::__1::allocator<char> > const&)>(std::__1::__wrap_iter<std::__1::basic_string<char, std::__1::char_traits<char>, std::__1::allocator<char> >*>, std::__1::__wrap_iter<std::__1::basic_string<char, std::__1::char_traits<char>, std::__1::allocator<char> >*>, fuzzer::Command::removeFlag(std::__1::basic_string<char, std::__1::char_traits<char>, std::__1::allocator<char> > const&)::'lambda'(std::__1::basic_string<char, std::__1::char_traits<char>, std::__1::allocator<char> > const&)) ==45432==ABORTING

Hide Details

--

Hide Details

******************** UNSUPPORTED: libFuzzer :: compressed.test (2953 of 3077) PASS: libFuzzer :: caller-callee.test (2954 of 3077) PASS: libFuzzer :: counters.test (2955 of 3077) PASS: libFuzzer :: coverage.test (2956 of 3077) PASS: libFuzzer :: cross_over.test (2957 of 3077) PASS: libFuzzer :: cross_over_copy.test (2958 of 3077) UNSUPPORTED: libFuzzer :: cross_over_uniform_dist.test (2959 of 3077) UNSUPPORTED: libFuzzer :: custom-allocator.test (2960 of 3077) PASS: libFuzzer :: cross_over_insert.test (2961 of 3077) UNSUPPORTED: libFuzzer :: dataflow.test (2962 of 3077) PASS: libFuzzer :: cxxstring.test (2963 of 3077) UNSUPPORTED: libFuzzer :: deep-recursion.test (2964 of 3077) PASS: libFuzzer :: dead-stripping.test (2965 of 3077) UNSUPPORTED: libFuzzer :: disable-leaks.test (2966 of 3077) PASS: libFuzzer :: dso.test (2967 of 3077) UNSUPPORTED: libFuzzer :: entropic-scale-per-exec-time.test (2968 of 3077) UNSUPPORTED: libFuzzer :: equivalence-signals.test (2969 of 3077) UNSUPPORTED: libFuzzer :: equivalence.test (2970 of 3077) PASS: libFuzzer :: deprecated-instrumentation.test (2971 of 3077) PASS: libFuzzer :: exit-report.test (2972 of 3077) UNSUPPORTED: libFuzzer :: extra-counters.test (2973 of 3077) UNSUPPORTED: libFuzzer :: features_dir.test (2974 of 3077) UNSUPPORTED: libFuzzer :: focus-function.test (2975 of 3077) UNSUPPORTED: libFuzzer :: fork-sigusr.test (2976 of 3077) UNSUPPORTED: libFuzzer :: fork-ubsan.test (2977 of 3077) UNSUPPORTED: libFuzzer :: fork.test (2978 of 3077) PASS: libFuzzer :: exit_on_src_pos.test (2979 of 3077) PASS: libFuzzer :: full-coverage-set.test (2980 of 3077) PASS: UBSan-ThreadSanitizer-x86_64 :: TestCases/TypeCheck/vptr.cpp (2981 of 3077) PASS: libFuzzer :: fuzzer-alignment-assumption.test (2982 of 3077) PASS: libFuzzer :: full-coverage.test (2983 of 3077) PASS: libFuzzer :: fuzzer-customcrossoverandmutate.test (2984 of 3077) PASS: libFuzzer :: fuzzer-customcrossover.test (2985 of 3077) PASS: libFuzzer :: fuzzer-dict.test (2986 of 3077) PASS: libFuzzer :: fuzzer-custommutator.test (2987 of 3077) PASS: libFuzzer :: fuzzer-fdmask.test (2988 of 3077) PASS: libFuzzer :: fuzzer-finalstats.test (2989 of 3077) PASS: libFuzzer :: fuzzer-dirs.test (2990 of 3077) FAIL: libFuzzer :: fuzzer-flags.test (2991 of 3077) ******************** TEST 'libFuzzer :: fuzzer-flags.test' FAILED ******************** Script: -- : 'RUN: at line 1'; /Users/buildslave/jenkins/workspace/clang-stage1-RA/clang-build/./bin/clang --driver-mode=g++ -O2 -gline-tables-only -fsanitize=address,fuzzer -I/Users/buildslave/jenkins/workspace/clang-stage1-RA/llvm-project/compiler-rt/lib/fuzzer -arch x86_64 -stdlib=libc++ -mmacosx-version-min=10.9 -isysroot /Applications/Xcode.app/Contents/Developer/Platforms/MacOSX.platform/Developer/SDKs/MacOSX10.15.sdk /Users/buildslave/jenkins/workspace/clang-stage1-RA/llvm-project/compiler-rt/test/fuzzer/FlagsTest.cpp -o /Users/buildslave/jenkins/workspace/clang-stage1-RA/clang-build/tools/clang/runtime/compiler-rt-bins/test/fuzzer/X86_64DefaultDarwinConfig/Output/fuzzer-flags.test.tmp-FlagsTest : 'RUN: at line 2'; /Users/buildslave/jenkins/workspace/clang-stage1-RA/clang-build/tools/clang/runtime/compiler-rt-bins/test/fuzzer/X86_64DefaultDarwinConfig/Output/fuzzer-flags.test.tmp-FlagsTest -runs=10 -foo_bar=1 2>&1 | FileCheck /Users/buildslave/jenkins/workspace/clang-stage1-RA/llvm-project/compiler-rt/test/fuzzer/fuzzer-flags.test --check-prefix=FOO_BAR : 'RUN: at line 6'; /Users/buildslave/jenkins/workspace/clang-stage1-RA/clang-build/tools/clang/runtime/compiler-rt-bins/test/fuzzer/X86_64DefaultDarwinConfig/Output/fuzzer-flags.test.tmp-FlagsTest -runs=10 --max_len=100 2>&1 | FileCheck /Users/buildslave/jenkins/workspace/clang-stage1-RA/llvm-project/compiler-rt/test/fuzzer/fuzzer-flags.test --check-prefix=DASH_DASH : 'RUN: at line 10'; /Users/buildslave/jenkins/workspace/clang-stage1-RA/clang-build/tools/clang/runtime/compiler-rt-bins/test/fuzzer/X86_64DefaultDarwinConfig/Output/fuzzer-flags.test.tmp-FlagsTest -help=1 2>&1 | FileCheck /Users/buildslave/jenkins/workspace/clang-stage1-RA/llvm-project/compiler-rt/test/fuzzer/fuzzer-flags.test --check-prefix=NO_INTERNAL : 'RUN: at line 13'; /Users/buildslave/jenkins/workspace/clang-stage1-RA/clang-build/tools/clang/runtime/compiler-rt-bins/test/fuzzer/X86_64DefaultDarwinConfig/Output/fuzzer-flags.test.tmp-FlagsTest --foo-bar -runs=10 -ignore_remaining_args=1 --baz -help=1 test 2>&1 | FileCheck /Users/buildslave/jenkins/workspace/clang-stage1-RA/llvm-project/compiler-rt/test/fuzzer/fuzzer-flags.test --check-prefix=PASSTHRU : 'RUN: at line 16'; mkdir -p /Users/buildslave/jenkins/workspace/clang-stage1-RA/clang-build/tools/clang/runtime/compiler-rt-bins/test/fuzzer/X86_64DefaultDarwinConfig/Output/fuzzer-flags.test.tmp/T0 /Users/buildslave/jenkins/workspace/clang-stage1-RA/clang-build/tools/clang/runtime/compiler-rt-bins/test/fuzzer/X86_64DefaultDarwinConfig/Output/fuzzer-flags.test.tmp/T1 : 'RUN: at line 17'; echo z > /Users/buildslave/jenkins/workspace/clang-stage1-RA/clang-build/tools/clang/runtime/compiler-rt-bins/test/fuzzer/X86_64DefaultDarwinConfig/Output/fuzzer-flags.test.tmp/T1/z : 'RUN: at line 18'; /Users/buildslave/jenkins/workspace/clang-stage1-RA/clang-build/tools/clang/runtime/compiler-rt-bins/test/fuzzer/X86_64DefaultDarwinConfig/Output/fuzzer-flags.test.tmp-FlagsTest -runs=10 --foo-bar -merge=1 /Users/buildslave/jenkins/workspace/clang-stage1-RA/clang-build/tools/clang/runtime/compiler-rt-bins/test/fuzzer/X86_64DefaultDarwinConfig/Output/fuzzer-flags.test.tmp/T0 /Users/buildslave/jenkins/workspace/clang-stage1-RA/clang-build/tools/clang/runtime/compiler-rt-bins/test/fuzzer/X86_64DefaultDarwinConfig/Output/fuzzer-flags.test.tmp/T1 -ignore_remaining_args=1 --baz -help=1 test 2>&1 | FileCheck /Users/buildslave/jenkins/workspace/clang-stage1-RA/llvm-project/compiler-rt/test/fuzzer/fuzzer-flags.test --check-prefix=PASSTHRU-MERGE -- Exit Code: 1

Hide Details

Command Output (stderr): -- + : 'RUN: at line 1' + /Users/buildslave/jenkins/workspace/clang-stage1-RA/clang-build/./bin/clang --driver-mode=g++ -O2 -gline-tables-only -fsanitize=address,fuzzer -I/Users/buildslave/jenkins/workspace/clang-stage1-RA/llvm-project/compiler-rt/lib/fuzzer -arch x86_64 -stdlib=libc++ -mmacosx-version-min=10.9 -isysroot /Applications/Xcode.app/Contents/Developer/Platforms/MacOSX.platform/Developer/SDKs/MacOSX10.15.sdk /Users/buildslave/jenkins/workspace/clang-stage1-RA/llvm-project/compiler-rt/test/fuzzer/FlagsTest.cpp -o /Users/buildslave/jenkins/workspace/clang-stage1-RA/clang-build/tools/clang/runtime/compiler-rt-bins/test/fuzzer/X86_64DefaultDarwinConfig/Output/fuzzer-flags.test.tmp-FlagsTest + : 'RUN: at line 2' + /Users/buildslave/jenkins/workspace/clang-stage1-RA/clang-build/tools/clang/runtime/compiler-rt-bins/test/fuzzer/X86_64DefaultDarwinConfig/Output/fuzzer-flags.test.tmp-FlagsTest -runs=10 -foo_bar=1 + FileCheck /Users/buildslave/jenkins/workspace/clang-stage1-RA/llvm-project/compiler-rt/test/fuzzer/fuzzer-flags.test --check-prefix=FOO_BAR + : 'RUN: at line 6' + /Users/buildslave/jenkins/workspace/clang-stage1-RA/clang-build/tools/clang/runtime/compiler-rt-bins/test/fuzzer/X86_64DefaultDarwinConfig/Output/fuzzer-flags.test.tmp-FlagsTest -runs=10 --max_len=100 + FileCheck /Users/buildslave/jenkins/workspace/clang-stage1-RA/llvm-project/compiler-rt/test/fuzzer/fuzzer-flags.test --check-prefix=DASH_DASH + : 'RUN: at line 10' + /Users/buildslave/jenkins/workspace/clang-stage1-RA/clang-build/tools/clang/runtime/compiler-rt-bins/test/fuzzer/X86_64DefaultDarwinConfig/Output/fuzzer-flags.test.tmp-FlagsTest -help=1 + FileCheck /Users/buildslave/jenkins/workspace/clang-stage1-RA/llvm-project/compiler-rt/test/fuzzer/fuzzer-flags.test --check-prefix=NO_INTERNAL + : 'RUN: at line 13' + /Users/buildslave/jenkins/workspace/clang-stage1-RA/clang-build/tools/clang/runtime/compiler-rt-bins/test/fuzzer/X86_64DefaultDarwinConfig/Output/fuzzer-flags.test.tmp-FlagsTest --foo-bar -runs=10 -ignore_remaining_args=1 --baz -help=1 test + FileCheck /Users/buildslave/jenkins/workspace/clang-stage1-RA/llvm-project/compiler-rt/test/fuzzer/fuzzer-flags.test --check-prefix=PASSTHRU + : 'RUN: at line 16' + mkdir -p /Users/buildslave/jenkins/workspace/clang-stage1-RA/clang-build/tools/clang/runtime/compiler-rt-bins/test/fuzzer/X86_64DefaultDarwinConfig/Output/fuzzer-flags.test.tmp/T0 /Users/buildslave/jenkins/workspace/clang-stage1-RA/clang-build/tools/clang/runtime/compiler-rt-bins/test/fuzzer/X86_64DefaultDarwinConfig/Output/fuzzer-flags.test.tmp/T1 + : 'RUN: at line 17' + echo z + : 'RUN: at line 18' + /Users/buildslave/jenkins/workspace/clang-stage1-RA/clang-build/tools/clang/runtime/compiler-rt-bins/test/fuzzer/X86_64DefaultDarwinConfig/Output/fuzzer-flags.test.tmp-FlagsTest -runs=10 --foo-bar -merge=1 /Users/buildslave/jenkins/workspace/clang-stage1-RA/clang-build/tools/clang/runtime/compiler-rt-bins/test/fuzzer/X86_64DefaultDarwinConfig/Output/fuzzer-flags.test.tmp/T0 /Users/buildslave/jenkins/workspace/clang-stage1-RA/clang-build/tools/clang/runtime/compiler-rt-bins/test/fuzzer/X86_64DefaultDarwinConfig/Output/fuzzer-flags.test.tmp/T1 -ignore_remaining_args=1 --baz -help=1 test + FileCheck /Users/buildslave/jenkins/workspace/clang-stage1-RA/llvm-project/compiler-rt/test/fuzzer/fuzzer-flags.test --check-prefix=PASSTHRU-MERGE /Users/buildslave/jenkins/workspace/clang-stage1-RA/llvm-project/compiler-rt/test/fuzzer/fuzzer-flags.test:19:17: error: PASSTHRU-MERGE: expected string not found in input PASSTHRU-MERGE: BINGO --foo-bar --baz -help=1 test ^ <stdin>:1:1: note: scanning from here INFO: libFuzzer ignores flags that start with '--' ^

Hide Details

Input file: <stdin> Check file: /Users/buildslave/jenkins/workspace/clang-stage1-RA/llvm-project/compiler-rt/test/fuzzer/fuzzer-flags.test

Hide Details

-dump-input=help explains the following input dump.

Hide Details

Input was: <<<<<< 1: INFO: libFuzzer ignores flags that start with '--' check:19 X~~~~~~~~~~~~~~~~~~~~~~~~~~~~~~~~~~~~~~~~~~~~~~~~~ error: no match found 2: INFO: Running with entropic power schedule (0xFF, 100). check:19 ~~~~~~~~~~~~~~~~~~~~~~~~~~~~~~~~~~~~~~~~~~~~~~~~~~~~~~~ 3: INFO: Seed: 1401735107 check:19 ~~~~~~~~~~~~~~~~~~~~~~ 4: INFO: Loaded 1 modules (126 inline 8-bit counters): 126 [0x102cb6cf8, 0x102cb6d76), check:19 ~~~~~~~~~~~~~~~~~~~~~~~~~~~~~~~~~~~~~~~~~~~~~~~~~~~~~~~~~~~~~~~~~~~~~~~~~~~~~~~~~~~~ 5: INFO: Loaded 1 PC tables (126 PCs): 126 [0x102cb6d78,0x102cb7558), check:19 ~~~~~~~~~~~~~~~~~~~~~~~~~~~~~~~~~~~~~~~~~~~~~~~~~~~~~~~~~~~~~~~~~~~ 6: MERGE-OUTER: 1 files, 0 in the initial corpus, 0 processed earlier check:19 ~~~~~~~~~~~~~~~~~~~~~~~~~~~~~~~~~~~~~~~~~~~~~~~~~~~~~~~~~~~~~~~~~~ . . . >>>>>>

Hide Details

--

Hide Details

******************** PASS: libFuzzer :: fuzzer-implicit-integer-sign-change.test (2992 of 3077) PASS: libFuzzer :: fuzzer-implicit-signed-integer-truncation-or-sign-change.test (2993 of 3077) UNSUPPORTED: libFuzzer :: fuzzer-leak.test (2994 of 3077) UNSUPPORTED: libFuzzer :: fuzzer-oom-with-profile.test (2995 of 3077) PASS: libFuzzer :: fuzzer-implicit-signed-integer-truncation.test (2996 of 3077) PASS: libFuzzer :: fuzzer-implicit-unsigned-integer-truncation.test (2997 of 3077) PASS: libFuzzer :: fuzzer-printcovpcs.test (2998 of 3077) PASS: libFuzzer :: fuzzer-runs.test (2999 of 3077) PASS: libFuzzer :: fuzzer-seed.test (3000 of 3077) PASS: libFuzzer :: fuzzer-segv.test (3001 of 3077) PASS: libFuzzer :: fuzzer-singleinputs.test (3002 of 3077) PASS: libFuzzer :: fuzzer-oom.test (3003 of 3077) PASS: libFuzzer :: fuzzer-ubsan.test (3004 of 3077) UNSUPPORTED: libFuzzer :: gc-sections.test (3005 of 3077) PASS: libFuzzer :: initialize.test (3006 of 3077) UNSUPPORTED: libFuzzer :: keep-seed.test (3007 of 3077) PASS: libFuzzer :: fuzzer-threaded.test (3008 of 3077) PASS: libFuzzer :: len_control.test (3009 of 3077) UNSUPPORTED: libFuzzer :: libcxx.test (3010 of 3077) UNSUPPORTED: libFuzzer :: magic-separator.test (3011 of 3077) PASS: libFuzzer :: max-number-of-runs.test (3012 of 3077) PASS: libFuzzer :: memcmp.test (3013 of 3077) PASS: libFuzzer :: memcmp64.test (3014 of 3077) FAIL: libFuzzer :: merge-control-file.test (3015 of 3077) ******************** TEST 'libFuzzer :: merge-control-file.test' FAILED ******************** Script: -- : 'RUN: at line 2'; mkdir -p /Users/buildslave/jenkins/workspace/clang-stage1-RA/clang-build/tools/clang/runtime/compiler-rt-bins/test/fuzzer/X86_64DefaultDarwinConfig/Output/merge-control-file.test.tmp : 'RUN: at line 5'; /Users/buildslave/jenkins/workspace/clang-stage1-RA/clang-build/./bin/clang --driver-mode=g++ -O2 -gline-tables-only -fsanitize=address,fuzzer -I/Users/buildslave/jenkins/workspace/clang-stage1-RA/llvm-project/compiler-rt/lib/fuzzer -arch x86_64 -stdlib=libc++ -mmacosx-version-min=10.9 -isysroot /Applications/Xcode.app/Contents/Developer/Platforms/MacOSX.platform/Developer/SDKs/MacOSX10.15.sdk /Users/buildslave/jenkins/workspace/clang-stage1-RA/llvm-project/compiler-rt/test/fuzzer/FullCoverageSetTest.cpp -o /Users/buildslave/jenkins/workspace/clang-stage1-RA/clang-build/tools/clang/runtime/compiler-rt-bins/test/fuzzer/X86_64DefaultDarwinConfig/Output/merge-control-file.test.tmp/T.exe : 'RUN: at line 7'; rm -rf /Users/buildslave/jenkins/workspace/clang-stage1-RA/clang-build/tools/clang/runtime/compiler-rt-bins/test/fuzzer/X86_64DefaultDarwinConfig/Output/merge-control-file.test.tmp/T0 /Users/buildslave/jenkins/workspace/clang-stage1-RA/clang-build/tools/clang/runtime/compiler-rt-bins/test/fuzzer/X86_64DefaultDarwinConfig/Output/merge-control-file.test.tmp/T1 /Users/buildslave/jenkins/workspace/clang-stage1-RA/clang-build/tools/clang/runtime/compiler-rt-bins/test/fuzzer/X86_64DefaultDarwinConfig/Output/merge-control-file.test.tmp/T2 : 'RUN: at line 8'; mkdir -p /Users/buildslave/jenkins/workspace/clang-stage1-RA/clang-build/tools/clang/runtime/compiler-rt-bins/test/fuzzer/X86_64DefaultDarwinConfig/Output/merge-control-file.test.tmp/T0 /Users/buildslave/jenkins/workspace/clang-stage1-RA/clang-build/tools/clang/runtime/compiler-rt-bins/test/fuzzer/X86_64DefaultDarwinConfig/Output/merge-control-file.test.tmp/T1 /Users/buildslave/jenkins/workspace/clang-stage1-RA/clang-build/tools/clang/runtime/compiler-rt-bins/test/fuzzer/X86_64DefaultDarwinConfig/Output/merge-control-file.test.tmp/T2 : 'RUN: at line 9'; echo F..... > /Users/buildslave/jenkins/workspace/clang-stage1-RA/clang-build/tools/clang/runtime/compiler-rt-bins/test/fuzzer/X86_64DefaultDarwinConfig/Output/merge-control-file.test.tmp/T0/1 : 'RUN: at line 10'; echo .U.... > /Users/buildslave/jenkins/workspace/clang-stage1-RA/clang-build/tools/clang/runtime/compiler-rt-bins/test/fuzzer/X86_64DefaultDarwinConfig/Output/merge-control-file.test.tmp/T0/2 : 'RUN: at line 11'; echo ..Z... > /Users/buildslave/jenkins/workspace/clang-stage1-RA/clang-build/tools/clang/runtime/compiler-rt-bins/test/fuzzer/X86_64DefaultDarwinConfig/Output/merge-control-file.test.tmp/T0/3 : 'RUN: at line 15'; rm -f /Users/buildslave/jenkins/workspace/clang-stage1-RA/clang-build/tools/clang/runtime/compiler-rt-bins/test/fuzzer/X86_64DefaultDarwinConfig/Output/merge-control-file.test.tmp/T1/*; cp /Users/buildslave/jenkins/workspace/clang-stage1-RA/clang-build/tools/clang/runtime/compiler-rt-bins/test/fuzzer/X86_64DefaultDarwinConfig/Output/merge-control-file.test.tmp/T0/* /Users/buildslave/jenkins/workspace/clang-stage1-RA/clang-build/tools/clang/runtime/compiler-rt-bins/test/fuzzer/X86_64DefaultDarwinConfig/Output/merge-control-file.test.tmp/T1 : 'RUN: at line 16'; echo JUNK > /Users/buildslave/jenkins/workspace/clang-stage1-RA/clang-build/tools/clang/runtime/compiler-rt-bins/test/fuzzer/X86_64DefaultDarwinConfig/Output/merge-control-file.test.tmp/MCF : 'RUN: at line 17'; /Users/buildslave/jenkins/workspace/clang-stage1-RA/clang-build/tools/clang/runtime/compiler-rt-bins/test/fuzzer/X86_64DefaultDarwinConfig/Output/merge-control-file.test.tmp/T.exe -merge=1 /Users/buildslave/jenkins/workspace/clang-stage1-RA/clang-build/tools/clang/runtime/compiler-rt-bins/test/fuzzer/X86_64DefaultDarwinConfig/Output/merge-control-file.test.tmp/T1 /Users/buildslave/jenkins/workspace/clang-stage1-RA/clang-build/tools/clang/runtime/compiler-rt-bins/test/fuzzer/X86_64DefaultDarwinConfig/Output/merge-control-file.test.tmp/T2 -merge_control_file=/Users/buildslave/jenkins/workspace/clang-stage1-RA/clang-build/tools/clang/runtime/compiler-rt-bins/test/fuzzer/X86_64DefaultDarwinConfig/Output/merge-control-file.test.tmp/MCF 2>&1 | FileCheck /Users/buildslave/jenkins/workspace/clang-stage1-RA/llvm-project/compiler-rt/test/fuzzer/merge-control-file.test --check-prefix=JUNK : 'RUN: at line 18'; echo 3 > /Users/buildslave/jenkins/workspace/clang-stage1-RA/clang-build/tools/clang/runtime/compiler-rt-bins/test/fuzzer/X86_64DefaultDarwinConfig/Output/merge-control-file.test.tmp/MCF; echo 0 >> /Users/buildslave/jenkins/workspace/clang-stage1-RA/clang-build/tools/clang/runtime/compiler-rt-bins/test/fuzzer/X86_64DefaultDarwinConfig/Output/merge-control-file.test.tmp/MCF; echo /Users/buildslave/jenkins/workspace/clang-stage1-RA/clang-build/tools/clang/runtime/compiler-rt-bins/test/fuzzer/X86_64DefaultDarwinConfig/Output/merge-control-file.test.tmp/T1/1 >> /Users/buildslave/jenkins/workspace/clang-stage1-RA/clang-build/tools/clang/runtime/compiler-rt-bins/test/fuzzer/X86_64DefaultDarwinConfig/Output/merge-control-file.test.tmp/MCF : 'RUN: at line 19'; /Users/buildslave/jenkins/workspace/clang-stage1-RA/clang-build/tools/clang/runtime/compiler-rt-bins/test/fuzzer/X86_64DefaultDarwinConfig/Output/merge-control-file.test.tmp/T.exe -merge=1 /Users/buildslave/jenkins/workspace/clang-stage1-RA/clang-build/tools/clang/runtime/compiler-rt-bins/test/fuzzer/X86_64DefaultDarwinConfig/Output/merge-control-file.test.tmp/T1 /Users/buildslave/jenkins/workspace/clang-stage1-RA/clang-build/tools/clang/runtime/compiler-rt-bins/test/fuzzer/X86_64DefaultDarwinConfig/Output/merge-control-file.test.tmp/T2 -merge_control_file=/Users/buildslave/jenkins/workspace/clang-stage1-RA/clang-build/tools/clang/runtime/compiler-rt-bins/test/fuzzer/X86_64DefaultDarwinConfig/Output/merge-control-file.test.tmp/MCF 2>&1 | FileCheck /Users/buildslave/jenkins/workspace/clang-stage1-RA/llvm-project/compiler-rt/test/fuzzer/merge-control-file.test --check-prefix=JUNK : 'RUN: at line 26'; rm -f /Users/buildslave/jenkins/workspace/clang-stage1-RA/clang-build/tools/clang/runtime/compiler-rt-bins/test/fuzzer/X86_64DefaultDarwinConfig/Output/merge-control-file.test.tmp/T1/*; cp /Users/buildslave/jenkins/workspace/clang-stage1-RA/clang-build/tools/clang/runtime/compiler-rt-bins/test/fuzzer/X86_64DefaultDarwinConfig/Output/merge-control-file.test.tmp/T0/* /Users/buildslave/jenkins/workspace/clang-stage1-RA/clang-build/tools/clang/runtime/compiler-rt-bins/test/fuzzer/X86_64DefaultDarwinConfig/Output/merge-control-file.test.tmp/T1 : 'RUN: at line 27'; echo 3 > /Users/buildslave/jenkins/workspace/clang-stage1-RA/clang-build/tools/clang/runtime/compiler-rt-bins/test/fuzzer/X86_64DefaultDarwinConfig/Output/merge-control-file.test.tmp/MCF; echo 0 >> /Users/buildslave/jenkins/workspace/clang-stage1-RA/clang-build/tools/clang/runtime/compiler-rt-bins/test/fuzzer/X86_64DefaultDarwinConfig/Output/merge-control-file.test.tmp/MCF; echo /Users/buildslave/jenkins/workspace/clang-stage1-RA/clang-build/tools/clang/runtime/compiler-rt-bins/test/fuzzer/X86_64DefaultDarwinConfig/Output/merge-control-file.test.tmp/T1/1 >> /Users/buildslave/jenkins/workspace/clang-stage1-RA/clang-build/tools/clang/runtime/compiler-rt-bins/test/fuzzer/X86_64DefaultDarwinConfig/Output/merge-control-file.test.tmp/MCF; echo /Users/buildslave/jenkins/workspace/clang-stage1-RA/clang-build/tools/clang/runtime/compiler-rt-bins/test/fuzzer/X86_64DefaultDarwinConfig/Output/merge-control-file.test.tmp/T1/2 >> /Users/buildslave/jenkins/workspace/clang-stage1-RA/clang-build/tools/clang/runtime/compiler-rt-bins/test/fuzzer/X86_64DefaultDarwinConfig/Output/merge-control-file.test.tmp/MCF; echo /Users/buildslave/jenkins/workspace/clang-stage1-RA/clang-build/tools/clang/runtime/compiler-rt-bins/test/fuzzer/X86_64DefaultDarwinConfig/Output/merge-control-file.test.tmp/T1/3 >> /Users/buildslave/jenkins/workspace/clang-stage1-RA/clang-build/tools/clang/runtime/compiler-rt-bins/test/fuzzer/X86_64DefaultDarwinConfig/Output/merge-control-file.test.tmp/MCF : 'RUN: at line 28'; /Users/buildslave/jenkins/workspace/clang-stage1-RA/clang-build/tools/clang/runtime/compiler-rt-bins/test/fuzzer/X86_64DefaultDarwinConfig/Output/merge-control-file.test.tmp/T.exe -merge=1 /Users/buildslave/jenkins/workspace/clang-stage1-RA/clang-build/tools/clang/runtime/compiler-rt-bins/test/fuzzer/X86_64DefaultDarwinConfig/Output/merge-control-file.test.tmp/T1 /Users/buildslave/jenkins/workspace/clang-stage1-RA/clang-build/tools/clang/runtime/compiler-rt-bins/test/fuzzer/X86_64DefaultDarwinConfig/Output/merge-control-file.test.tmp/T2 -merge_control_file=/Users/buildslave/jenkins/workspace/clang-stage1-RA/clang-build/tools/clang/runtime/compiler-rt-bins/test/fuzzer/X86_64DefaultDarwinConfig/Output/merge-control-file.test.tmp/MCF 2>&1 | FileCheck /Users/buildslave/jenkins/workspace/clang-stage1-RA/llvm-project/compiler-rt/test/fuzzer/merge-control-file.test --check-prefix=OK_0 : 'RUN: at line 32'; rm -f /Users/buildslave/jenkins/workspace/clang-stage1-RA/clang-build/tools/clang/runtime/compiler-rt-bins/test/fuzzer/X86_64DefaultDarwinConfig/Output/merge-control-file.test.tmp/T1/*; cp /Users/buildslave/jenkins/workspace/clang-stage1-RA/clang-build/tools/clang/runtime/compiler-rt-bins/test/fuzzer/X86_64DefaultDarwinConfig/Output/merge-control-file.test.tmp/T0/* /Users/buildslave/jenkins/workspace/clang-stage1-RA/clang-build/tools/clang/runtime/compiler-rt-bins/test/fuzzer/X86_64DefaultDarwinConfig/Output/merge-control-file.test.tmp/T1 : 'RUN: at line 33'; echo 3 > /Users/buildslave/jenkins/workspace/clang-stage1-RA/clang-build/tools/clang/runtime/compiler-rt-bins/test/fuzzer/X86_64DefaultDarwinConfig/Output/merge-control-file.test.tmp/MCF; echo 0 >> /Users/buildslave/jenkins/workspace/clang-stage1-RA/clang-build/tools/clang/runtime/compiler-rt-bins/test/fuzzer/X86_64DefaultDarwinConfig/Output/merge-control-file.test.tmp/MCF; echo /Users/buildslave/jenkins/workspace/clang-stage1-RA/clang-build/tools/clang/runtime/compiler-rt-bins/test/fuzzer/X86_64DefaultDarwinConfig/Output/merge-control-file.test.tmp/T1/1 >> /Users/buildslave/jenkins/workspace/clang-stage1-RA/clang-build/tools/clang/runtime/compiler-rt-bins/test/fuzzer/X86_64DefaultDarwinConfig/Output/merge-control-file.test.tmp/MCF; echo /Users/buildslave/jenkins/workspace/clang-stage1-RA/clang-build/tools/clang/runtime/compiler-rt-bins/test/fuzzer/X86_64DefaultDarwinConfig/Output/merge-control-file.test.tmp/T1/2 >> /Users/buildslave/jenkins/workspace/clang-stage1-RA/clang-build/tools/clang/runtime/compiler-rt-bins/test/fuzzer/X86_64DefaultDarwinConfig/Output/merge-control-file.test.tmp/MCF; echo /Users/buildslave/jenkins/workspace/clang-stage1-RA/clang-build/tools/clang/runtime/compiler-rt-bins/test/fuzzer/X86_64DefaultDarwinConfig/Output/merge-control-file.test.tmp/T1/3 >> /Users/buildslave/jenkins/workspace/clang-stage1-RA/clang-build/tools/clang/runtime/compiler-rt-bins/test/fuzzer/X86_64DefaultDarwinConfig/Output/merge-control-file.test.tmp/MCF : 'RUN: at line 34'; echo STARTED 0 1 >> /Users/buildslave/jenkins/workspace/clang-stage1-RA/clang-build/tools/clang/runtime/compiler-rt-bins/test/fuzzer/X86_64DefaultDarwinConfig/Output/merge-control-file.test.tmp/MCF : 'RUN: at line 35'; echo FT 0 11 >> /Users/buildslave/jenkins/workspace/clang-stage1-RA/clang-build/tools/clang/runtime/compiler-rt-bins/test/fuzzer/X86_64DefaultDarwinConfig/Output/merge-control-file.test.tmp/MCF : 'RUN: at line 36'; echo STARTED 1 2 >> /Users/buildslave/jenkins/workspace/clang-stage1-RA/clang-build/tools/clang/runtime/compiler-rt-bins/test/fuzzer/X86_64DefaultDarwinConfig/Output/merge-control-file.test.tmp/MCF : 'RUN: at line 37'; echo FT 1 12 >> /Users/buildslave/jenkins/workspace/clang-stage1-RA/clang-build/tools/clang/runtime/compiler-rt-bins/test/fuzzer/X86_64DefaultDarwinConfig/Output/merge-control-file.test.tmp/MCF : 'RUN: at line 38'; /Users/buildslave/jenkins/workspace/clang-stage1-RA/clang-build/tools/clang/runtime/compiler-rt-bins/test/fuzzer/X86_64DefaultDarwinConfig/Output/merge-control-file.test.tmp/T.exe -merge=1 /Users/buildslave/jenkins/workspace/clang-stage1-RA/clang-build/tools/clang/runtime/compiler-rt-bins/test/fuzzer/X86_64DefaultDarwinConfig/Output/merge-control-file.test.tmp/T1 /Users/buildslave/jenkins/workspace/clang-stage1-RA/clang-build/tools/clang/runtime/compiler-rt-bins/test/fuzzer/X86_64DefaultDarwinConfig/Output/merge-control-file.test.tmp/T2 -merge_control_file=/Users/buildslave/jenkins/workspace/clang-stage1-RA/clang-build/tools/clang/runtime/compiler-rt-bins/test/fuzzer/X86_64DefaultDarwinConfig/Output/merge-control-file.test.tmp/MCF 2>&1 | FileCheck /Users/buildslave/jenkins/workspace/clang-stage1-RA/llvm-project/compiler-rt/test/fuzzer/merge-control-file.test --check-prefix=OK_2 : 'RUN: at line 42'; rm -f /Users/buildslave/jenkins/workspace/clang-stage1-RA/clang-build/tools/clang/runtime/compiler-rt-bins/test/fuzzer/X86_64DefaultDarwinConfig/Output/merge-control-file.test.tmp/T1/*; cp /Users/buildslave/jenkins/workspace/clang-stage1-RA/clang-build/tools/clang/runtime/compiler-rt-bins/test/fuzzer/X86_64DefaultDarwinConfig/Output/merge-control-file.test.tmp/T0/* /Users/buildslave/jenkins/workspace/clang-stage1-RA/clang-build/tools/clang/runtime/compiler-rt-bins/test/fuzzer/X86_64DefaultDarwinConfig/Output/merge-control-file.test.tmp/T1 : 'RUN: at line 43'; echo 3 > /Users/buildslave/jenkins/workspace/clang-stage1-RA/clang-build/tools/clang/runtime/compiler-rt-bins/test/fuzzer/X86_64DefaultDarwinConfig/Output/merge-control-file.test.tmp/MCF; echo 0 >> /Users/buildslave/jenkins/workspace/clang-stage1-RA/clang-build/tools/clang/runtime/compiler-rt-bins/test/fuzzer/X86_64DefaultDarwinConfig/Output/merge-control-file.test.tmp/MCF; echo /Users/buildslave/jenkins/workspace/clang-stage1-RA/clang-build/tools/clang/runtime/compiler-rt-bins/test/fuzzer/X86_64DefaultDarwinConfig/Output/merge-control-file.test.tmp/T1/1 >> /Users/buildslave/jenkins/workspace/clang-stage1-RA/clang-build/tools/clang/runtime/compiler-rt-bins/test/fuzzer/X86_64DefaultDarwinConfig/Output/merge-control-file.test.tmp/MCF; echo /Users/buildslave/jenkins/workspace/clang-stage1-RA/clang-build/tools/clang/runtime/compiler-rt-bins/test/fuzzer/X86_64DefaultDarwinConfig/Output/merge-control-file.test.tmp/T1/2 >> /Users/buildslave/jenkins/workspace/clang-stage1-RA/clang-build/tools/clang/runtime/compiler-rt-bins/test/fuzzer/X86_64DefaultDarwinConfig/Output/merge-control-file.test.tmp/MCF; echo /Users/buildslave/jenkins/workspace/clang-stage1-RA/clang-build/tools/clang/runtime/compiler-rt-bins/test/fuzzer/X86_64DefaultDarwinConfig/Output/merge-control-file.test.tmp/T1/3 >> /Users/buildslave/jenkins/workspace/clang-stage1-RA/clang-build/tools/clang/runtime/compiler-rt-bins/test/fuzzer/X86_64DefaultDarwinConfig/Output/merge-control-file.test.tmp/MCF : 'RUN: at line 44'; echo STARTED 0 1 >> /Users/buildslave/jenkins/workspace/clang-stage1-RA/clang-build/tools/clang/runtime/compiler-rt-bins/test/fuzzer/X86_64DefaultDarwinConfig/Output/merge-control-file.test.tmp/MCF : 'RUN: at line 45'; echo FT 0 11 >> /Users/buildslave/jenkins/workspace/clang-stage1-RA/clang-build/tools/clang/runtime/compiler-rt-bins/test/fuzzer/X86_64DefaultDarwinConfig/Output/merge-control-file.test.tmp/MCF : 'RUN: at line 46'; echo STARTED 1 2 >> /Users/buildslave/jenkins/workspace/clang-stage1-RA/clang-build/tools/clang/runtime/compiler-rt-bins/test/fuzzer/X86_64DefaultDarwinConfig/Output/merge-control-file.test.tmp/MCF : 'RUN: at line 47'; echo FT 1 12 >> /Users/buildslave/jenkins/workspace/clang-stage1-RA/clang-build/tools/clang/runtime/compiler-rt-bins/test/fuzzer/X86_64DefaultDarwinConfig/Output/merge-control-file.test.tmp/MCF : 'RUN: at line 48'; echo STARTED 2 2 >> /Users/buildslave/jenkins/workspace/clang-stage1-RA/clang-build/tools/clang/runtime/compiler-rt-bins/test/fuzzer/X86_64DefaultDarwinConfig/Output/merge-control-file.test.tmp/MCF : 'RUN: at line 49'; echo FT 2 13 >> /Users/buildslave/jenkins/workspace/clang-stage1-RA/clang-build/tools/clang/runtime/compiler-rt-bins/test/fuzzer/X86_64DefaultDarwinConfig/Output/merge-control-file.test.tmp/MCF : 'RUN: at line 50'; /Users/buildslave/jenkins/workspace/clang-stage1-RA/clang-build/tools/clang/runtime/compiler-rt-bins/test/fuzzer/X86_64DefaultDarwinConfig/Output/merge-control-file.test.tmp/T.exe -merge=1 /Users/buildslave/jenkins/workspace/clang-stage1-RA/clang-build/tools/clang/runtime/compiler-rt-bins/test/fuzzer/X86_64DefaultDarwinConfig/Output/merge-control-file.test.tmp/T1 /Users/buildslave/jenkins/workspace/clang-stage1-RA/clang-build/tools/clang/runtime/compiler-rt-bins/test/fuzzer/X86_64DefaultDarwinConfig/Output/merge-control-file.test.tmp/T2 -merge_control_file=/Users/buildslave/jenkins/workspace/clang-stage1-RA/clang-build/tools/clang/runtime/compiler-rt-bins/test/fuzzer/X86_64DefaultDarwinConfig/Output/merge-control-file.test.tmp/MCF 2>&1 | FileCheck /Users/buildslave/jenkins/workspace/clang-stage1-RA/llvm-project/compiler-rt/test/fuzzer/merge-control-file.test --check-prefix=OK_3 -- Exit Code: 1

Hide Details

Command Output (stderr): -- + : 'RUN: at line 2' + mkdir -p /Users/buildslave/jenkins/workspace/clang-stage1-RA/clang-build/tools/clang/runtime/compiler-rt-bins/test/fuzzer/X86_64DefaultDarwinConfig/Output/merge-control-file.test.tmp + : 'RUN: at line 5' + /Users/buildslave/jenkins/workspace/clang-stage1-RA/clang-build/./bin/clang --driver-mode=g++ -O2 -gline-tables-only -fsanitize=address,fuzzer -I/Users/buildslave/jenkins/workspace/clang-stage1-RA/llvm-project/compiler-rt/lib/fuzzer -arch x86_64 -stdlib=libc++ -mmacosx-version-min=10.9 -isysroot /Applications/Xcode.app/Contents/Developer/Platforms/MacOSX.platform/Developer/SDKs/MacOSX10.15.sdk /Users/buildslave/jenkins/workspace/clang-stage1-RA/llvm-project/compiler-rt/test/fuzzer/FullCoverageSetTest.cpp -o /Users/buildslave/jenkins/workspace/clang-stage1-RA/clang-build/tools/clang/runtime/compiler-rt-bins/test/fuzzer/X86_64DefaultDarwinConfig/Output/merge-control-file.test.tmp/T.exe + : 'RUN: at line 7' + rm -rf /Users/buildslave/jenkins/workspace/clang-stage1-RA/clang-build/tools/clang/runtime/compiler-rt-bins/test/fuzzer/X86_64DefaultDarwinConfig/Output/merge-control-file.test.tmp/T0 /Users/buildslave/jenkins/workspace/clang-stage1-RA/clang-build/tools/clang/runtime/compiler-rt-bins/test/fuzzer/X86_64DefaultDarwinConfig/Output/merge-control-file.test.tmp/T1 /Users/buildslave/jenkins/workspace/clang-stage1-RA/clang-build/tools/clang/runtime/compiler-rt-bins/test/fuzzer/X86_64DefaultDarwinConfig/Output/merge-control-file.test.tmp/T2 + : 'RUN: at line 8' + mkdir -p /Users/buildslave/jenkins/workspace/clang-stage1-RA/clang-build/tools/clang/runtime/compiler-rt-bins/test/fuzzer/X86_64DefaultDarwinConfig/Output/merge-control-file.test.tmp/T0 /Users/buildslave/jenkins/workspace/clang-stage1-RA/clang-build/tools/clang/runtime/compiler-rt-bins/test/fuzzer/X86_64DefaultDarwinConfig/Output/merge-control-file.test.tmp/T1 /Users/buildslave/jenkins/workspace/clang-stage1-RA/clang-build/tools/clang/runtime/compiler-rt-bins/test/fuzzer/X86_64DefaultDarwinConfig/Output/merge-control-file.test.tmp/T2 + : 'RUN: at line 9' + echo F..... + : 'RUN: at line 10' + echo .U.... + : 'RUN: at line 11' + echo ..Z... + : 'RUN: at line 15' + rm -f '/Users/buildslave/jenkins/workspace/clang-stage1-RA/clang-build/tools/clang/runtime/compiler-rt-bins/test/fuzzer/X86_64DefaultDarwinConfig/Output/merge-control-file.test.tmp/T1/*' + cp /Users/buildslave/jenkins/workspace/clang-stage1-RA/clang-build/tools/clang/runtime/compiler-rt-bins/test/fuzzer/X86_64DefaultDarwinConfig/Output/merge-control-file.test.tmp/T0/1 /Users/buildslave/jenkins/workspace/clang-stage1-RA/clang-build/tools/clang/runtime/compiler-rt-bins/test/fuzzer/X86_64DefaultDarwinConfig/Output/merge-control-file.test.tmp/T0/2 /Users/buildslave/jenkins/workspace/clang-stage1-RA/clang-build/tools/clang/runtime/compiler-rt-bins/test/fuzzer/X86_64DefaultDarwinConfig/Output/merge-control-file.test.tmp/T0/3 /Users/buildslave/jenkins/workspace/clang-stage1-RA/clang-build/tools/clang/runtime/compiler-rt-bins/test/fuzzer/X86_64DefaultDarwinConfig/Output/merge-control-file.test.tmp/T1 + : 'RUN: at line 16' + echo JUNK + : 'RUN: at line 17' + /Users/buildslave/jenkins/workspace/clang-stage1-RA/clang-build/tools/clang/runtime/compiler-rt-bins/test/fuzzer/X86_64DefaultDarwinConfig/Output/merge-control-file.test.tmp/T.exe -merge=1 /Users/buildslave/jenkins/workspace/clang-stage1-RA/clang-build/tools/clang/runtime/compiler-rt-bins/test/fuzzer/X86_64DefaultDarwinConfig/Output/merge-control-file.test.tmp/T1 /Users/buildslave/jenkins/workspace/clang-stage1-RA/clang-build/tools/clang/runtime/compiler-rt-bins/test/fuzzer/X86_64DefaultDarwinConfig/Output/merge-control-file.test.tmp/T2 -merge_control_file=/Users/buildslave/jenkins/workspace/clang-stage1-RA/clang-build/tools/clang/runtime/compiler-rt-bins/test/fuzzer/X86_64DefaultDarwinConfig/Output/merge-control-file.test.tmp/MCF + FileCheck /Users/buildslave/jenkins/workspace/clang-stage1-RA/llvm-project/compiler-rt/test/fuzzer/merge-control-file.test --check-prefix=JUNK

Hide Details

--

Hide Details

******************** PASS: libFuzzer :: fuzzer-timeout.test (3016 of 3077) UNSUPPORTED: libFuzzer :: merge-sigusr.test (3017 of 3077) PASS: libFuzzer :: merge-posix.test (3018 of 3077) FAIL: libFuzzer :: merge.test (3019 of 3077) ******************** TEST 'libFuzzer :: merge.test' FAILED ******************** Script: -- : 'RUN: at line 1'; /Users/buildslave/jenkins/workspace/clang-stage1-RA/clang-build/./bin/clang --driver-mode=g++ -O2 -gline-tables-only -fsanitize=address,fuzzer -I/Users/buildslave/jenkins/workspace/clang-stage1-RA/llvm-project/compiler-rt/lib/fuzzer -arch x86_64 -stdlib=libc++ -mmacosx-version-min=10.9 -isysroot /Applications/Xcode.app/Contents/Developer/Platforms/MacOSX.platform/Developer/SDKs/MacOSX10.15.sdk /Users/buildslave/jenkins/workspace/clang-stage1-RA/llvm-project/compiler-rt/test/fuzzer/FullCoverageSetTest.cpp -o /Users/buildslave/jenkins/workspace/clang-stage1-RA/clang-build/tools/clang/runtime/compiler-rt-bins/test/fuzzer/X86_64DefaultDarwinConfig/Output/merge.test.tmp-FullCoverageSetTest : 'RUN: at line 3'; rm -rf /Users/buildslave/jenkins/workspace/clang-stage1-RA/clang-build/tools/clang/runtime/compiler-rt-bins/test/fuzzer/X86_64DefaultDarwinConfig/Output/merge.test.tmp/T0 /Users/buildslave/jenkins/workspace/clang-stage1-RA/clang-build/tools/clang/runtime/compiler-rt-bins/test/fuzzer/X86_64DefaultDarwinConfig/Output/merge.test.tmp/T1 /Users/buildslave/jenkins/workspace/clang-stage1-RA/clang-build/tools/clang/runtime/compiler-rt-bins/test/fuzzer/X86_64DefaultDarwinConfig/Output/merge.test.tmp/T2 : 'RUN: at line 4'; mkdir -p /Users/buildslave/jenkins/workspace/clang-stage1-RA/clang-build/tools/clang/runtime/compiler-rt-bins/test/fuzzer/X86_64DefaultDarwinConfig/Output/merge.test.tmp/T0 /Users/buildslave/jenkins/workspace/clang-stage1-RA/clang-build/tools/clang/runtime/compiler-rt-bins/test/fuzzer/X86_64DefaultDarwinConfig/Output/merge.test.tmp/T1 /Users/buildslave/jenkins/workspace/clang-stage1-RA/clang-build/tools/clang/runtime/compiler-rt-bins/test/fuzzer/X86_64DefaultDarwinConfig/Output/merge.test.tmp/T2 : 'RUN: at line 5'; echo F..... > /Users/buildslave/jenkins/workspace/clang-stage1-RA/clang-build/tools/clang/runtime/compiler-rt-bins/test/fuzzer/X86_64DefaultDarwinConfig/Output/merge.test.tmp/T0/1 : 'RUN: at line 6'; echo .U.... > /Users/buildslave/jenkins/workspace/clang-stage1-RA/clang-build/tools/clang/runtime/compiler-rt-bins/test/fuzzer/X86_64DefaultDarwinConfig/Output/merge.test.tmp/T0/2 : 'RUN: at line 7'; echo ..Z... > /Users/buildslave/jenkins/workspace/clang-stage1-RA/clang-build/tools/clang/runtime/compiler-rt-bins/test/fuzzer/X86_64DefaultDarwinConfig/Output/merge.test.tmp/T0/3 : 'RUN: at line 10'; cp /Users/buildslave/jenkins/workspace/clang-stage1-RA/clang-build/tools/clang/runtime/compiler-rt-bins/test/fuzzer/X86_64DefaultDarwinConfig/Output/merge.test.tmp/T0/* /Users/buildslave/jenkins/workspace/clang-stage1-RA/clang-build/tools/clang/runtime/compiler-rt-bins/test/fuzzer/X86_64DefaultDarwinConfig/Output/merge.test.tmp/T1/ : 'RUN: at line 11'; /Users/buildslave/jenkins/workspace/clang-stage1-RA/clang-build/tools/clang/runtime/compiler-rt-bins/test/fuzzer/X86_64DefaultDarwinConfig/Output/merge.test.tmp-FullCoverageSetTest -merge=1 /Users/buildslave/jenkins/workspace/clang-stage1-RA/clang-build/tools/clang/runtime/compiler-rt-bins/test/fuzzer/X86_64DefaultDarwinConfig/Output/merge.test.tmp/T1 /Users/buildslave/jenkins/workspace/clang-stage1-RA/clang-build/tools/clang/runtime/compiler-rt-bins/test/fuzzer/X86_64DefaultDarwinConfig/Output/merge.test.tmp/T2 2>&1 | FileCheck /Users/buildslave/jenkins/workspace/clang-stage1-RA/llvm-project/compiler-rt/test/fuzzer/merge.test --check-prefix=CHECK1 : 'RUN: at line 15'; echo ...Z.. > /Users/buildslave/jenkins/workspace/clang-stage1-RA/clang-build/tools/clang/runtime/compiler-rt-bins/test/fuzzer/X86_64DefaultDarwinConfig/Output/merge.test.tmp/T2/1 : 'RUN: at line 16'; echo ....E. > /Users/buildslave/jenkins/workspace/clang-stage1-RA/clang-build/tools/clang/runtime/compiler-rt-bins/test/fuzzer/X86_64DefaultDarwinConfig/Output/merge.test.tmp/T2/2 : 'RUN: at line 17'; echo .....R > /Users/buildslave/jenkins/workspace/clang-stage1-RA/clang-build/tools/clang/runtime/compiler-rt-bins/test/fuzzer/X86_64DefaultDarwinConfig/Output/merge.test.tmp/T2/3 : 'RUN: at line 18'; echo F..... > /Users/buildslave/jenkins/workspace/clang-stage1-RA/clang-build/tools/clang/runtime/compiler-rt-bins/test/fuzzer/X86_64DefaultDarwinConfig/Output/merge.test.tmp/T2/a : 'RUN: at line 19'; echo .U.... > /Users/buildslave/jenkins/workspace/clang-stage1-RA/clang-build/tools/clang/runtime/compiler-rt-bins/test/fuzzer/X86_64DefaultDarwinConfig/Output/merge.test.tmp/T2/b : 'RUN: at line 20'; echo ..Z... > /Users/buildslave/jenkins/workspace/clang-stage1-RA/clang-build/tools/clang/runtime/compiler-rt-bins/test/fuzzer/X86_64DefaultDarwinConfig/Output/merge.test.tmp/T2/c : 'RUN: at line 23'; /Users/buildslave/jenkins/workspace/clang-stage1-RA/clang-build/tools/clang/runtime/compiler-rt-bins/test/fuzzer/X86_64DefaultDarwinConfig/Output/merge.test.tmp-FullCoverageSetTest -merge=1 /Users/buildslave/jenkins/workspace/clang-stage1-RA/clang-build/tools/clang/runtime/compiler-rt-bins/test/fuzzer/X86_64DefaultDarwinConfig/Output/merge.test.tmp/T1 /Users/buildslave/jenkins/workspace/clang-stage1-RA/clang-build/tools/clang/runtime/compiler-rt-bins/test/fuzzer/X86_64DefaultDarwinConfig/Output/merge.test.tmp/T2 2>&1 | FileCheck /Users/buildslave/jenkins/workspace/clang-stage1-RA/llvm-project/compiler-rt/test/fuzzer/merge.test --check-prefix=CHECK2 : 'RUN: at line 28'; /Users/buildslave/jenkins/workspace/clang-stage1-RA/clang-build/tools/clang/runtime/compiler-rt-bins/test/fuzzer/X86_64DefaultDarwinConfig/Output/merge.test.tmp-FullCoverageSetTest -merge=1 /Users/buildslave/jenkins/workspace/clang-stage1-RA/clang-build/tools/clang/runtime/compiler-rt-bins/test/fuzzer/X86_64DefaultDarwinConfig/Output/merge.test.tmp/T1 /Users/buildslave/jenkins/workspace/clang-stage1-RA/clang-build/tools/clang/runtime/compiler-rt-bins/test/fuzzer/X86_64DefaultDarwinConfig/Output/merge.test.tmp/T2 2>&1 | FileCheck /Users/buildslave/jenkins/workspace/clang-stage1-RA/llvm-project/compiler-rt/test/fuzzer/merge.test --check-prefix=CHECK3 : 'RUN: at line 33'; rm /Users/buildslave/jenkins/workspace/clang-stage1-RA/clang-build/tools/clang/runtime/compiler-rt-bins/test/fuzzer/X86_64DefaultDarwinConfig/Output/merge.test.tmp/T1/* : 'RUN: at line 34'; cp /Users/buildslave/jenkins/workspace/clang-stage1-RA/clang-build/tools/clang/runtime/compiler-rt-bins/test/fuzzer/X86_64DefaultDarwinConfig/Output/merge.test.tmp/T0/* /Users/buildslave/jenkins/workspace/clang-stage1-RA/clang-build/tools/clang/runtime/compiler-rt-bins/test/fuzzer/X86_64DefaultDarwinConfig/Output/merge.test.tmp/T1/ : 'RUN: at line 35'; echo looooooooong > /Users/buildslave/jenkins/workspace/clang-stage1-RA/clang-build/tools/clang/runtime/compiler-rt-bins/test/fuzzer/X86_64DefaultDarwinConfig/Output/merge.test.tmp/T2/looooooooong : 'RUN: at line 36'; /Users/buildslave/jenkins/workspace/clang-stage1-RA/clang-build/tools/clang/runtime/compiler-rt-bins/test/fuzzer/X86_64DefaultDarwinConfig/Output/merge.test.tmp-FullCoverageSetTest -merge=1 /Users/buildslave/jenkins/workspace/clang-stage1-RA/clang-build/tools/clang/runtime/compiler-rt-bins/test/fuzzer/X86_64DefaultDarwinConfig/Output/merge.test.tmp/T1 /Users/buildslave/jenkins/workspace/clang-stage1-RA/clang-build/tools/clang/runtime/compiler-rt-bins/test/fuzzer/X86_64DefaultDarwinConfig/Output/merge.test.tmp/T2 -max_len=6 2>&1 | FileCheck /Users/buildslave/jenkins/workspace/clang-stage1-RA/llvm-project/compiler-rt/test/fuzzer/merge.test --check-prefix=MAX_LEN : 'RUN: at line 40'; rm /Users/buildslave/jenkins/workspace/clang-stage1-RA/clang-build/tools/clang/runtime/compiler-rt-bins/test/fuzzer/X86_64DefaultDarwinConfig/Output/merge.test.tmp/T1/* : 'RUN: at line 41'; cp /Users/buildslave/jenkins/workspace/clang-stage1-RA/clang-build/tools/clang/runtime/compiler-rt-bins/test/fuzzer/X86_64DefaultDarwinConfig/Output/merge.test.tmp/T0/* /Users/buildslave/jenkins/workspace/clang-stage1-RA/clang-build/tools/clang/runtime/compiler-rt-bins/test/fuzzer/X86_64DefaultDarwinConfig/Output/merge.test.tmp/T1/ : 'RUN: at line 42'; rm -f /Users/buildslave/jenkins/workspace/clang-stage1-RA/clang-build/tools/clang/runtime/compiler-rt-bins/test/fuzzer/X86_64DefaultDarwinConfig/Output/merge.test.tmp/MCF : 'RUN: at line 43'; /Users/buildslave/jenkins/workspace/clang-stage1-RA/clang-build/tools/clang/runtime/compiler-rt-bins/test/fuzzer/X86_64DefaultDarwinConfig/Output/merge.test.tmp-FullCoverageSetTest -merge=1 -merge_control_file=/Users/buildslave/jenkins/workspace/clang-stage1-RA/clang-build/tools/clang/runtime/compiler-rt-bins/test/fuzzer/X86_64DefaultDarwinConfig/Output/merge.test.tmp/MCF /Users/buildslave/jenkins/workspace/clang-stage1-RA/clang-build/tools/clang/runtime/compiler-rt-bins/test/fuzzer/X86_64DefaultDarwinConfig/Output/merge.test.tmp/T1 /Users/buildslave/jenkins/workspace/clang-stage1-RA/clang-build/tools/clang/runtime/compiler-rt-bins/test/fuzzer/X86_64DefaultDarwinConfig/Output/merge.test.tmp/T2 2>&1 | FileCheck /Users/buildslave/jenkins/workspace/clang-stage1-RA/llvm-project/compiler-rt/test/fuzzer/merge.test --check-prefix=MCF : 'RUN: at line 44'; grep STARTED /Users/buildslave/jenkins/workspace/clang-stage1-RA/clang-build/tools/clang/runtime/compiler-rt-bins/test/fuzzer/X86_64DefaultDarwinConfig/Output/merge.test.tmp/MCF : 'RUN: at line 45'; grep FT /Users/buildslave/jenkins/workspace/clang-stage1-RA/clang-build/tools/clang/runtime/compiler-rt-bins/test/fuzzer/X86_64DefaultDarwinConfig/Output/merge.test.tmp/MCF : 'RUN: at line 51'; rm /Users/buildslave/jenkins/workspace/clang-stage1-RA/clang-build/tools/clang/runtime/compiler-rt-bins/test/fuzzer/X86_64DefaultDarwinConfig/Output/merge.test.tmp/T1/* : 'RUN: at line 52'; cp /Users/buildslave/jenkins/workspace/clang-stage1-RA/clang-build/tools/clang/runtime/compiler-rt-bins/test/fuzzer/X86_64DefaultDarwinConfig/Output/merge.test.tmp/T0/* /Users/buildslave/jenkins/workspace/clang-stage1-RA/clang-build/tools/clang/runtime/compiler-rt-bins/test/fuzzer/X86_64DefaultDarwinConfig/Output/merge.test.tmp/T1/ : 'RUN: at line 53'; echo 'FUZZER' > /Users/buildslave/jenkins/workspace/clang-stage1-RA/clang-build/tools/clang/runtime/compiler-rt-bins/test/fuzzer/X86_64DefaultDarwinConfig/Output/merge.test.tmp/T2/FUZZER : 'RUN: at line 54'; /Users/buildslave/jenkins/workspace/clang-stage1-RA/clang-build/tools/clang/runtime/compiler-rt-bins/test/fuzzer/X86_64DefaultDarwinConfig/Output/merge.test.tmp-FullCoverageSetTest -merge=1 /Users/buildslave/jenkins/workspace/clang-stage1-RA/clang-build/tools/clang/runtime/compiler-rt-bins/test/fuzzer/X86_64DefaultDarwinConfig/Output/merge.test.tmp/T1 /Users/buildslave/jenkins/workspace/clang-stage1-RA/clang-build/tools/clang/runtime/compiler-rt-bins/test/fuzzer/X86_64DefaultDarwinConfig/Output/merge.test.tmp/T2 2>&1 | FileCheck /Users/buildslave/jenkins/workspace/clang-stage1-RA/llvm-project/compiler-rt/test/fuzzer/merge.test --check-prefix=MERGE_WITH_CRASH : 'RUN: at line 59'; rm /Users/buildslave/jenkins/workspace/clang-stage1-RA/clang-build/tools/clang/runtime/compiler-rt-bins/test/fuzzer/X86_64DefaultDarwinConfig/Output/merge.test.tmp/T1/* /Users/buildslave/jenkins/workspace/clang-stage1-RA/clang-build/tools/clang/runtime/compiler-rt-bins/test/fuzzer/X86_64DefaultDarwinConfig/Output/merge.test.tmp/T2/* : 'RUN: at line 60'; echo 'FUZZER' > /Users/buildslave/jenkins/workspace/clang-stage1-RA/clang-build/tools/clang/runtime/compiler-rt-bins/test/fuzzer/X86_64DefaultDarwinConfig/Output/merge.test.tmp/T2/FUZZER : 'RUN: at line 61'; /Users/buildslave/jenkins/workspace/clang-stage1-RA/clang-build/tools/clang/runtime/compiler-rt-bins/test/fuzzer/X86_64DefaultDarwinConfig/Output/merge.test.tmp-FullCoverageSetTest -merge=1 /Users/buildslave/jenkins/workspace/clang-stage1-RA/clang-build/tools/clang/runtime/compiler-rt-bins/test/fuzzer/X86_64DefaultDarwinConfig/Output/merge.test.tmp/T1 /Users/buildslave/jenkins/workspace/clang-stage1-RA/clang-build/tools/clang/runtime/compiler-rt-bins/test/fuzzer/X86_64DefaultDarwinConfig/Output/merge.test.tmp/T2 -max_len=5 2>&1 | FileCheck /Users/buildslave/jenkins/workspace/clang-stage1-RA/llvm-project/compiler-rt/test/fuzzer/merge.test --check-prefix=MERGE_LEN5 : 'RUN: at line 62'; not grep FUZZER /Users/buildslave/jenkins/workspace/clang-stage1-RA/clang-build/tools/clang/runtime/compiler-rt-bins/test/fuzzer/X86_64DefaultDarwinConfig/Output/merge.test.tmp/T1/* : 'RUN: at line 63'; grep FUZZE /Users/buildslave/jenkins/workspace/clang-stage1-RA/clang-build/tools/clang/runtime/compiler-rt-bins/test/fuzzer/X86_64DefaultDarwinConfig/Output/merge.test.tmp/T1/* -- Exit Code: 1

Hide Details

Command Output (stderr): -- + : 'RUN: at line 1' + /Users/buildslave/jenkins/workspace/clang-stage1-RA/clang-build/./bin/clang --driver-mode=g++ -O2 -gline-tables-only -fsanitize=address,fuzzer -I/Users/buildslave/jenkins/workspace/clang-stage1-RA/llvm-project/compiler-rt/lib/fuzzer -arch x86_64 -stdlib=libc++ -mmacosx-version-min=10.9 -isysroot /Applications/Xcode.app/Contents/Developer/Platforms/MacOSX.platform/Developer/SDKs/MacOSX10.15.sdk /Users/buildslave/jenkins/workspace/clang-stage1-RA/llvm-project/compiler-rt/test/fuzzer/FullCoverageSetTest.cpp -o /Users/buildslave/jenkins/workspace/clang-stage1-RA/clang-build/tools/clang/runtime/compiler-rt-bins/test/fuzzer/X86_64DefaultDarwinConfig/Output/merge.test.tmp-FullCoverageSetTest + : 'RUN: at line 3' + rm -rf /Users/buildslave/jenkins/workspace/clang-stage1-RA/clang-build/tools/clang/runtime/compiler-rt-bins/test/fuzzer/X86_64DefaultDarwinConfig/Output/merge.test.tmp/T0 /Users/buildslave/jenkins/workspace/clang-stage1-RA/clang-build/tools/clang/runtime/compiler-rt-bins/test/fuzzer/X86_64DefaultDarwinConfig/Output/merge.test.tmp/T1 /Users/buildslave/jenkins/workspace/clang-stage1-RA/clang-build/tools/clang/runtime/compiler-rt-bins/test/fuzzer/X86_64DefaultDarwinConfig/Output/merge.test.tmp/T2 + : 'RUN: at line 4' + mkdir -p /Users/buildslave/jenkins/workspace/clang-stage1-RA/clang-build/tools/clang/runtime/compiler-rt-bins/test/fuzzer/X86_64DefaultDarwinConfig/Output/merge.test.tmp/T0 /Users/buildslave/jenkins/workspace/clang-stage1-RA/clang-build/tools/clang/runtime/compiler-rt-bins/test/fuzzer/X86_64DefaultDarwinConfig/Output/merge.test.tmp/T1 /Users/buildslave/jenkins/workspace/clang-stage1-RA/clang-build/tools/clang/runtime/compiler-rt-bins/test/fuzzer/X86_64DefaultDarwinConfig/Output/merge.test.tmp/T2 + : 'RUN: at line 5' + echo F..... + : 'RUN: at line 6' + echo .U.... + : 'RUN: at line 7' + echo ..Z... + : 'RUN: at line 10' + cp /Users/buildslave/jenkins/workspace/clang-stage1-RA/clang-build/tools/clang/runtime/compiler-rt-bins/test/fuzzer/X86_64DefaultDarwinConfig/Output/merge.test.tmp/T0/1 /Users/buildslave/jenkins/workspace/clang-stage1-RA/clang-build/tools/clang/runtime/compiler-rt-bins/test/fuzzer/X86_64DefaultDarwinConfig/Output/merge.test.tmp/T0/2 /Users/buildslave/jenkins/workspace/clang-stage1-RA/clang-build/tools/clang/runtime/compiler-rt-bins/test/fuzzer/X86_64DefaultDarwinConfig/Output/merge.test.tmp/T0/3 /Users/buildslave/jenkins/workspace/clang-stage1-RA/clang-build/tools/clang/runtime/compiler-rt-bins/test/fuzzer/X86_64DefaultDarwinConfig/Output/merge.test.tmp/T1/ + : 'RUN: at line 11' + /Users/buildslave/jenkins/workspace/clang-stage1-RA/clang-build/tools/clang/runtime/compiler-rt-bins/test/fuzzer/X86_64DefaultDarwinConfig/Output/merge.test.tmp-FullCoverageSetTest -merge=1 /Users/buildslave/jenkins/workspace/clang-stage1-RA/clang-build/tools/clang/runtime/compiler-rt-bins/test/fuzzer/X86_64DefaultDarwinConfig/Output/merge.test.tmp/T1 /Users/buildslave/jenkins/workspace/clang-stage1-RA/clang-build/tools/clang/runtime/compiler-rt-bins/test/fuzzer/X86_64DefaultDarwinConfig/Output/merge.test.tmp/T2 + FileCheck /Users/buildslave/jenkins/workspace/clang-stage1-RA/llvm-project/compiler-rt/test/fuzzer/merge.test --check-prefix=CHECK1 /Users/buildslave/jenkins/workspace/clang-stage1-RA/llvm-project/compiler-rt/test/fuzzer/merge.test:13:9: error: CHECK1: expected string not found in input CHECK1: MERGE-OUTER: 0 new files with 0 new features added ^ <stdin>:5:46: note: scanning from here MERGE-OUTER: 3 files, 3 in the initial corpus, 0 processed earlier ^ <stdin>:10:27: note: possible intended match here ==46194==Hint: this fault was caused by a dereference of a high value address (see register values below). Dissassemble the provided pc to learn which register was used. ^

Hide Details

Input file: <stdin> Check file: /Users/buildslave/jenkins/workspace/clang-stage1-RA/llvm-project/compiler-rt/test/fuzzer/merge.test

Hide Details

-dump-input=help explains the following input dump.

Hide Details

Input was: <<<<<< 1: INFO: Running with entropic power schedule (0xFF, 100). 2: INFO: Seed: 1420833972 3: INFO: Loaded 1 modules (62 inline 8-bit counters): 62 [0x1063cac68, 0x1063caca6), 4: INFO: Loaded 1 PC tables (62 PCs): 62 [0x1063caca8,0x1063cb088), 5: MERGE-OUTER: 3 files, 3 in the initial corpus, 0 processed earlier check:13'0 X~~~~~~~~~~~~~~~~~~~~ error: no match found 6: AddressSanitizer:DEADLYSIGNAL check:13'0 ~~~~~~~~~~~~~~~~~~~~~~~~~~~~~ 7: ================================================================= check:13'0 ~~~~~~~~~~~~~~~~~~~~~~~~~~~~~~~~~~~~~~~~~~~~~~~~~~~~~~~~~~~~~~~~~ 8: ==46194==ERROR: AddressSanitizer: BUS on unknown address (pc 0x000106393ef0 bp 0x7ffee9878470 sp 0x7ffee9878450 T0) check:13'0 ~~~~~~~~~~~~~~~~~~~~~~~~~~~~~~~~~~~~~~~~~~~~~~~~~~~~~~~~~~~~~~~~~~~~~~~~~~~~~~~~~~~~~~~~~~~~~~~~~~~~~~~~~~~~~~~~~~~ 9: ==46194==The signal is caused by a READ memory access. check:13'0 ~~~~~~~~~~~~~~~~~~~~~~~~~~~~~~~~~~~~~~~~~~~~~~~~~~~~~~ 10: ==46194==Hint: this fault was caused by a dereference of a high value address (see register values below). Dissassemble the provided pc to learn which register was used. check:13'0 ~~~~~~~~~~~~~~~~~~~~~~~~~~~~~~~~~~~~~~~~~~~~~~~~~~~~~~~~~~~~~~~~~~~~~~~~~~~~~~~~~~~~~~~~~~~~~~~~~~~~~~~~~~~~~~~~~~~~~~~~~~~~~~~~~~~~~~~~~~~~~~~~~~~~~~~~~~~~~~~~~~~~~~~~~ check:13'1 ? possible intended match 11: #0 0x106393ef0 in std::__1::__wrap_iter<std::__1::basic_string<char, std::__1::char_traits<char>, std::__1::allocator<char> >*> std::__1::remove_if<std::__1::__wrap_iter<std::__1::basic_string<char, std::__1::char_traits<char>, std::__1::allocator<char> >*>, fuzzer::Command::removeFlag(std::__1::basic_string<char, std::__1::char_traits<char>, std::__1::allocator<char> > const&)::'lambda'(std::__1::basic_string<char, std::__1::char_traits<char>, std::__1::allocator<char> > const&)>(std::__1::__wrap_iter<std::__1::basic_string<char, std::__1::char_traits<char>, std::__1::allocator<char> >*>, std::__1::__wrap_iter<std::__1::basic_string<char, std::__1::char_traits<char>, std::__1::allocator<char> >*>, fuzzer::Command::removeFlag(std::__1::basic_string<char, std::__1::char_traits<char>, std::__1::allocator<char> > const&)::'lambda'(std::__1::basic_string<char, std::__1::char_traits<char>, std::__1::allocator<char> > const&)) algorithm:2152 check:13'0 ~~~~~~~~~~~~~~~~~~~~~~~~~~~~~~~~~~~~~~~~~~~~~~~~~~~~~~~~~~~~~~~~~~~~~~~~~~~~~~~~~~~~~~~~~~~~~~~~~~~~~~~~~~~~~~~~~~~~~~~~~~~~~~~~~~~~~~~~~~~~~~~~~~~~~~~~~~~~~~~~~~~~~~~~~~~~~~~~~~~~~~~~~~~~~~~~~~~~~~~~~~~~~~~~~~~~~~~~~~~~~~~~~~~~~~~~~~~~~~~~~~~~~~~~~~~~~~~~~~~~~~~~~~~~~~~~~~~~~~~~~~~~~~~~~~~~~~~~~~~~~~~~~~~~~~~~~~~~~~~~~~~~~~~~~~~~~~~~~~~~~~~~~~~~~~~~~~~~~~~~~~~~~~~~~~~~~~~~~~~~~~~~~~~~~~~~~~~~~~~~~~~~~~~~~~~~~~~~~~~~~~~~~~~~~~~~~~~~~~~~~~~~~~~~~~~~~~~~~~~~~~~~~~~~~~~~~~~~~~~~~~~~~~~~~~~~~~~~~~~~~~~~~~~~~~~~~~~~~~~~~~~~~~~~~~~~~~~~~~~~~~~~~~~~~~~~~~~~~~~~~~~~~~~~~~~~~~~~~~~~~~~~~~~~~~~~~~~~~~~~~~~~~~~~~~~~~~~~~~~~~~~~~~~~~~~~~~~~~~~~~~~~~~~~~~~~~~~~~~~~~~~~~~~~~~~~~~~~~~~~~~~~~~~~~~~~~~~~~~~~~~~~~~~~~~~~~~~~~~~~~~~~~~~~~~~~~~~~~~~~~~~~~~~~~~~~~~~~~~~~~~~~~~~~~~~~~~~~~~~~~~~~~~~~~~~~~~~~~~~~~~~~~~~~~~~~~~~~~~~~~~~~~~~~~~~~~~~~~~~~~~~~~~~~~~~~~~~~~~~~~~~~~~~~~~~~~~~~~~~~~~~~~~~~~~~~~~~~~~~~~~~~~~~~~~~~~~~~~~~~~~~~~~~~~~~~~~~~~~~~~~~~~~~~~~ 12: #1 0x10638e281 in fuzzer::Command::removeFlag(std::__1::basic_string<char, std::__1::char_traits<char>, std::__1::allocator<char> > const&) FuzzerCommand.h:120 check:13'0 ~~~~~~~~~~~~~~~~~~~~~~~~~~~~~~~~~~~~~~~~~~~~~~~~~~~~~~~~~~~~~~~~~~~~~~~~~~~~~~~~~~~~~~~~~~~~~~~~~~~~~~~~~~~~~~~~~~~~~~~~~~~~~~~~~~~~~~~~~~~~~~~~~~~~~~~~~~~~~~~~ 13: #2 0x1063b2fcd in fuzzer::CrashResistantMerge(std::__1::vector<std::__1::basic_string<char, std::__1::char_traits<char>, std::__1::allocator<char> >, fuzzer::fuzzer_allocator<std::__1::basic_string<char, std::__1::char_traits<char>, std::__1::allocator<char> > > > const&, std::__1::vector<fuzzer::SizedFile, fuzzer::fuzzer_allocator<fuzzer::SizedFile> > const&, std::__1::vector<fuzzer::SizedFile, fuzzer::fuzzer_allocator<fuzzer::SizedFile> > const&, std::__1::vector<std::__1::basic_string<char, std::__1::char_traits<char>, std::__1::allocator<char> >, fuzzer::fuzzer_allocator<std::__1::basic_string<char, std::__1::char_traits<char>, std::__1::allocator<char> > > >*, std::__1::set<unsigned int, std::__1::less<unsigned int>, fuzzer::fuzzer_allocator<unsigned int> > const&, std::__1::set<unsigned int, std::__1::less<unsigned int>, fuzzer::fuzzer_allocator<unsigned int> >*, std::__1::set<unsigned int, std::__1::less<unsigned int>, fuzzer::fuzzer_allocator<unsigned int> > const&, std::__1::set<unsigned int, std::__1::less<unsigned int>, fuzzer::fuzzer_allocator<unsigned int> >*, std::__1::basic_string<char, std::__1::char_traits<char>, std::__1::allocator<char> > const&, bool) FuzzerMerge.cpp:363 check:13'0 ~~~~~~~~~~~~~~~~~~~~~~~~~~~~~~~~~~~~~~~~~~~~~~~~~~~~~~~~~~~~~~~~~~~~~~~~~~~~~~~~~~~~~~~~~~~~~~~~~~~~~~~~~~~~~~~~~~~~~~~~~~~~~~~~~~~~~~~~~~~~~~~~~~~~~~~~~~~~~~~~~~~~~~~~~~~~~~~~~~~~~~~~~~~~~~~~~~~~~~~~~~~~~~~~~~~~~~~~~~~~~~~~~~~~~~~~~~~~~~~~~~~~~~~~~~~~~~~~~~~~~~~~~~~~~~~~~~~~~~~~~~~~~~~~~~~~~~~~~~~~~~~~~~~~~~~~~~~~~~~~~~~~~~~~~~~~~~~~~~~~~~~~~~~~~~~~~~~~~~~~~~~~~~~~~~~~~~~~~~~~~~~~~~~~~~~~~~~~~~~~~~~~~~~~~~~~~~~~~~~~~~~~~~~~~~~~~~~~~~~~~~~~~~~~~~~~~~~~~~~~~~~~~~~~~~~~~~~~~~~~~~~~~~~~~~~~~~~~~~~~~~~~~~~~~~~~~~~~~~~~~~~~~~~~~~~~~~~~~~~~~~~~~~~~~~~~~~~~~~~~~~~~~~~~~~~~~~~~~~~~~~~~~~~~~~~~~~~~~~~~~~~~~~~~~~~~~~~~~~~~~~~~~~~~~~~~~~~~~~~~~~~~~~~~~~~~~~~~~~~~~~~~~~~~~~~~~~~~~~~~~~~~~~~~~~~~~~~~~~~~~~~~~~~~~~~~~~~~~~~~~~~~~~~~~~~~~~~~~~~~~~~~~~~~~~~~~~~~~~~~~~~~~~~~~~~~~~~~~~~~~~~~~~~~~~~~~~~~~~~~~~~~~~~~~~~~~~~~~~~~~~~~~~~~~~~~~~~~~~~~~~~~~~~~~~~~~~~~~~~~~~~~~~~~~~~~~~~~~~~~~~~~~~~~~~~~~~~~~~~~~~~~~~~~~~~~~~~~~~~~~~~~~~~~~~~~~~~~~~~~~~~~~~~~~~~~~~~~~~~~~~~~~~~~~~~~~~~~~~~~~~~~~~~~~~~~~~~~~~~~~~~~~~~~~~~~~~~~~~~~~~~~~~~~~~~~~~~~~~~~~~~~~~~~~~~~~~~~~~~~~~~~~~~~~~~~~~~~~~~~~~~~~~~~~~~~~~~~~~~~~~~~~~~~~~~~~~~~~~~~~~~~~~~~~~~~~~~~~~~~~~~~~~~~~~~~~~~~~~~~~~~~~~~~~~~~~~~~~~~~~~~~~~~~~~~~~~~~~~~~~~~~~~~~~~ 14: #3 0x10638ffc6 in fuzzer::Merge(fuzzer::Fuzzer*, fuzzer::FuzzingOptions&, std::__1::vector<std::__1::basic_string<char, std::__1::char_traits<char>, std::__1::allocator<char> >, fuzzer::fuzzer_allocator<std::__1::basic_string<char, std::__1::char_traits<char>, std::__1::allocator<char> > > > const&, std::__1::vector<std::__1::basic_string<char, std::__1::char_traits<char>, std::__1::allocator<char> >, fuzzer::fuzzer_allocator<std::__1::basic_string<char, std::__1::char_traits<char>, std::__1::allocator<char> > > > const&, char const*) FuzzerDriver.cpp:523 check:13'0 ~~~~~~~~~~~~~~~~~~~~~~~~~~~~~~~~~~~~~~~~~~~~~~~~~~~~~~~~~~~~~~~~~~~~~~~~~~~~~~~~~~~~~~~~~~~~~~~~~~~~~~~~~~~~~~~~~~~~~~~~~~~~~~~~~~~~~~~~~~~~~~~~~~~~~~~~~~~~~~~~~~~~~~~~~~~~~~~~~~~~~~~~~~~~~~~~~~~~~~~~~~~~~~~~~~~~~~~~~~~~~~~~~~~~~~~~~~~~~~~~~~~~~~~~~~~~~~~~~~~~~~~~~~~~~~~~~~~~~~~~~~~~~~~~~~~~~~~~~~~~~~~~~~~~~~~~~~~~~~~~~~~~~~~~~~~~~~~~~~~~~~~~~~~~~~~~~~~~~~~~~~~~~~~~~~~~~~~~~~~~~~~~~~~~~~~~~~~~~~~~~~~~~~~~~~~~~~~~~~~~~~~~~~~~~~~~~~~~~~~~~~~~~~~~~~~~~~~~~~~~~~~~~~~~~~~~~~~~~~~~~~~~~~~~~~~~~~~~~~~~~~~~~~~~~~~~~~~~~~~~~~~~~~~~~~~~~~~~~~~~~~~~~~~~~~~~~~~~~~~~~~ 15: #4 0x106393b09 in fuzzer::FuzzerDriver(int*, char***, int (*)(unsigned char const*, unsigned long)) FuzzerDriver.cpp:873 check:13'0 ~~~~~~~~~~~~~~~~~~~~~~~~~~~~~~~~~~~~~~~~~~~~~~~~~~~~~~~~~~~~~~~~~~~~~~~~~~~~~~~~~~~~~~~~~~~~~~~~~~~~~~~~~~~~~~~~~~~~~~~~~ . . . >>>>>>

Hide Details

--

Hide Details

******************** FAIL: libFuzzer :: minimize_crash.test (3020 of 3077) ******************** TEST 'libFuzzer :: minimize_crash.test' FAILED ******************** Script: -- : 'RUN: at line 1'; /Users/buildslave/jenkins/workspace/clang-stage1-RA/clang-build/./bin/clang --driver-mode=g++ -O2 -gline-tables-only -fsanitize=address,fuzzer -I/Users/buildslave/jenkins/workspace/clang-stage1-RA/llvm-project/compiler-rt/lib/fuzzer -arch x86_64 -stdlib=libc++ -mmacosx-version-min=10.9 -isysroot /Applications/Xcode.app/Contents/Developer/Platforms/MacOSX.platform/Developer/SDKs/MacOSX10.15.sdk /Users/buildslave/jenkins/workspace/clang-stage1-RA/llvm-project/compiler-rt/test/fuzzer/NullDerefTest.cpp -o /Users/buildslave/jenkins/workspace/clang-stage1-RA/clang-build/tools/clang/runtime/compiler-rt-bins/test/fuzzer/X86_64DefaultDarwinConfig/Output/minimize_crash.test.tmp-NullDerefTest : 'RUN: at line 2'; /Users/buildslave/jenkins/workspace/clang-stage1-RA/clang-build/./bin/clang --driver-mode=g++ -O2 -gline-tables-only -fsanitize=address,fuzzer -I/Users/buildslave/jenkins/workspace/clang-stage1-RA/llvm-project/compiler-rt/lib/fuzzer -arch x86_64 -stdlib=libc++ -mmacosx-version-min=10.9 -isysroot /Applications/Xcode.app/Contents/Developer/Platforms/MacOSX.platform/Developer/SDKs/MacOSX10.15.sdk /Users/buildslave/jenkins/workspace/clang-stage1-RA/llvm-project/compiler-rt/test/fuzzer/SingleByteInputTest.cpp -o /Users/buildslave/jenkins/workspace/clang-stage1-RA/clang-build/tools/clang/runtime/compiler-rt-bins/test/fuzzer/X86_64DefaultDarwinConfig/Output/minimize_crash.test.tmp-SingleByteInputTest : 'RUN: at line 3'; mkdir -p /Users/buildslave/jenkins/workspace/clang-stage1-RA/clang-build/tools/clang/runtime/compiler-rt-bins/test/fuzzer/X86_64DefaultDarwinConfig/Output/minimize_crash.test.tmp.dir : 'RUN: at line 5'; echo 'Hi!rv349f34t3gg' > /Users/buildslave/jenkins/workspace/clang-stage1-RA/clang-build/tools/clang/runtime/compiler-rt-bins/test/fuzzer/X86_64DefaultDarwinConfig/Output/minimize_crash.test.tmp.dir/not_minimal_crash : 'RUN: at line 6'; /Users/buildslave/jenkins/workspace/clang-stage1-RA/clang-build/tools/clang/runtime/compiler-rt-bins/test/fuzzer/X86_64DefaultDarwinConfig/Output/minimize_crash.test.tmp-NullDerefTest -minimize_crash=1 /Users/buildslave/jenkins/workspace/clang-stage1-RA/clang-build/tools/clang/runtime/compiler-rt-bins/test/fuzzer/X86_64DefaultDarwinConfig/Output/minimize_crash.test.tmp.dir/not_minimal_crash -max_total_time=2 2>&1 | FileCheck /Users/buildslave/jenkins/workspace/clang-stage1-RA/llvm-project/compiler-rt/test/fuzzer/minimize_crash.test : 'RUN: at line 8'; /Users/buildslave/jenkins/workspace/clang-stage1-RA/clang-build/tools/clang/runtime/compiler-rt-bins/test/fuzzer/X86_64DefaultDarwinConfig/Output/minimize_crash.test.tmp-NullDerefTest -minimize_crash=1 /Users/buildslave/jenkins/workspace/clang-stage1-RA/clang-build/tools/clang/runtime/compiler-rt-bins/test/fuzzer/X86_64DefaultDarwinConfig/Output/minimize_crash.test.tmp.dir/not_minimal_crash -max_total_time=2 -exact_artifact_path=/Users/buildslave/jenkins/workspace/clang-stage1-RA/clang-build/tools/clang/runtime/compiler-rt-bins/test/fuzzer/X86_64DefaultDarwinConfig/Output/minimize_crash.test.tmp.exact_minimized_path 2>&1 | FileCheck /Users/buildslave/jenkins/workspace/clang-stage1-RA/llvm-project/compiler-rt/test/fuzzer/minimize_crash.test --check-prefix=CHECK_EXACT : 'RUN: at line 10'; rm /Users/buildslave/jenkins/workspace/clang-stage1-RA/clang-build/tools/clang/runtime/compiler-rt-bins/test/fuzzer/X86_64DefaultDarwinConfig/Output/minimize_crash.test.tmp.dir/not_minimal_crash /Users/buildslave/jenkins/workspace/clang-stage1-RA/clang-build/tools/clang/runtime/compiler-rt-bins/test/fuzzer/X86_64DefaultDarwinConfig/Output/minimize_crash.test.tmp.exact_minimized_path : 'RUN: at line 12'; echo -n 'abcd*xyz' > /Users/buildslave/jenkins/workspace/clang-stage1-RA/clang-build/tools/clang/runtime/compiler-rt-bins/test/fuzzer/X86_64DefaultDarwinConfig/Output/minimize_crash.test.tmp.dir/not_minimal_crash : 'RUN: at line 13'; /Users/buildslave/jenkins/workspace/clang-stage1-RA/clang-build/tools/clang/runtime/compiler-rt-bins/test/fuzzer/X86_64DefaultDarwinConfig/Output/minimize_crash.test.tmp-SingleByteInputTest -minimize_crash=1 /Users/buildslave/jenkins/workspace/clang-stage1-RA/clang-build/tools/clang/runtime/compiler-rt-bins/test/fuzzer/X86_64DefaultDarwinConfig/Output/minimize_crash.test.tmp.dir/not_minimal_crash -exact_artifact_path=/Users/buildslave/jenkins/workspace/clang-stage1-RA/clang-build/tools/clang/runtime/compiler-rt-bins/test/fuzzer/X86_64DefaultDarwinConfig/Output/minimize_crash.test.tmp.exact_minimized_path 2>&1 | FileCheck /Users/buildslave/jenkins/workspace/clang-stage1-RA/llvm-project/compiler-rt/test/fuzzer/minimize_crash.test --check-prefix=MIN1 -- Exit Code: 1

Hide Details

Command Output (stderr): -- + : 'RUN: at line 1' + /Users/buildslave/jenkins/workspace/clang-stage1-RA/clang-build/./bin/clang --driver-mode=g++ -O2 -gline-tables-only -fsanitize=address,fuzzer -I/Users/buildslave/jenkins/workspace/clang-stage1-RA/llvm-project/compiler-rt/lib/fuzzer -arch x86_64 -stdlib=libc++ -mmacosx-version-min=10.9 -isysroot /Applications/Xcode.app/Contents/Developer/Platforms/MacOSX.platform/Developer/SDKs/MacOSX10.15.sdk /Users/buildslave/jenkins/workspace/clang-stage1-RA/llvm-project/compiler-rt/test/fuzzer/NullDerefTest.cpp -o /Users/buildslave/jenkins/workspace/clang-stage1-RA/clang-build/tools/clang/runtime/compiler-rt-bins/test/fuzzer/X86_64DefaultDarwinConfig/Output/minimize_crash.test.tmp-NullDerefTest + : 'RUN: at line 2' + /Users/buildslave/jenkins/workspace/clang-stage1-RA/clang-build/./bin/clang --driver-mode=g++ -O2 -gline-tables-only -fsanitize=address,fuzzer -I/Users/buildslave/jenkins/workspace/clang-stage1-RA/llvm-project/compiler-rt/lib/fuzzer -arch x86_64 -stdlib=libc++ -mmacosx-version-min=10.9 -isysroot /Applications/Xcode.app/Contents/Developer/Platforms/MacOSX.platform/Developer/SDKs/MacOSX10.15.sdk /Users/buildslave/jenkins/workspace/clang-stage1-RA/llvm-project/compiler-rt/test/fuzzer/SingleByteInputTest.cpp -o /Users/buildslave/jenkins/workspace/clang-stage1-RA/clang-build/tools/clang/runtime/compiler-rt-bins/test/fuzzer/X86_64DefaultDarwinConfig/Output/minimize_crash.test.tmp-SingleByteInputTest + : 'RUN: at line 3' + mkdir -p /Users/buildslave/jenkins/workspace/clang-stage1-RA/clang-build/tools/clang/runtime/compiler-rt-bins/test/fuzzer/X86_64DefaultDarwinConfig/Output/minimize_crash.test.tmp.dir + : 'RUN: at line 5' + echo 'Hi!rv349f34t3gg' + : 'RUN: at line 6' + /Users/buildslave/jenkins/workspace/clang-stage1-RA/clang-build/tools/clang/runtime/compiler-rt-bins/test/fuzzer/X86_64DefaultDarwinConfig/Output/minimize_crash.test.tmp-NullDerefTest -minimize_crash=1 /Users/buildslave/jenkins/workspace/clang-stage1-RA/clang-build/tools/clang/runtime/compiler-rt-bins/test/fuzzer/X86_64DefaultDarwinConfig/Output/minimize_crash.test.tmp.dir/not_minimal_crash -max_total_time=2 + FileCheck /Users/buildslave/jenkins/workspace/clang-stage1-RA/llvm-project/compiler-rt/test/fuzzer/minimize_crash.test /Users/buildslave/jenkins/workspace/clang-stage1-RA/llvm-project/compiler-rt/test/fuzzer/minimize_crash.test:7:8: error: CHECK: expected string not found in input CHECK: CRASH_MIN: failed to minimize beyond {{.*}}minimized-from{{.*}} (3 bytes), exiting ^ <stdin>:1:1: note: scanning from here INFO: Running with entropic power schedule (0xFF, 100). ^

Hide Details

Input file: <stdin> Check file: /Users/buildslave/jenkins/workspace/clang-stage1-RA/llvm-project/compiler-rt/test/fuzzer/minimize_crash.test

Hide Details

-dump-input=help explains the following input dump.

Hide Details

Input was: <<<<<< 1: INFO: Running with entropic power schedule (0xFF, 100). check:7 X~~~~~~~~~~~~~~~~~~~~~~~~~~~~~~~~~~~~~~~~~~~~~~~~~~~~~~ error: no match found 2: INFO: Seed: 1422049300 check:7 ~~~~~~~~~~~~~~~~~~~~~~ 3: INFO: Loaded 1 modules (8 inline 8-bit counters): 8 [0x102d00c08, 0x102d00c10), check:7 ~~~~~~~~~~~~~~~~~~~~~~~~~~~~~~~~~~~~~~~~~~~~~~~~~~~~~~~~~~~~~~~~~~~~~~~~~~~~~~~~ 4: INFO: Loaded 1 PC tables (8 PCs): 8 [0x102d00c10,0x102d00c90), check:7 ~~~~~~~~~~~~~~~~~~~~~~~~~~~~~~~~~~~~~~~~~~~~~~~~~~~~~~~~~~~~~~~ 5: AddressSanitizer:DEADLYSIGNAL check:7 ~~~~~~~~~~~~~~~~~~~~~~~~~~~~~ 6: ================================================================= check:7 ~~~~~~~~~~~~~~~~~~~~~~~~~~~~~~~~~~~~~~~~~~~~~~~~~~~~~~~~~~~~~~~~~ . . . >>>>>>

Hide Details

--

Hide Details

******************** FAIL: libFuzzer :: merge_two_step.test (3021 of 3077) ******************** TEST 'libFuzzer :: merge_two_step.test' FAILED ******************** Script: -- : 'RUN: at line 1'; /Users/buildslave/jenkins/workspace/clang-stage1-RA/clang-build/./bin/clang --driver-mode=g++ -O2 -gline-tables-only -fsanitize=address,fuzzer -I/Users/buildslave/jenkins/workspace/clang-stage1-RA/llvm-project/compiler-rt/lib/fuzzer -arch x86_64 -stdlib=libc++ -mmacosx-version-min=10.9 -isysroot /Applications/Xcode.app/Contents/Developer/Platforms/MacOSX.platform/Developer/SDKs/MacOSX10.15.sdk /Users/buildslave/jenkins/workspace/clang-stage1-RA/llvm-project/compiler-rt/test/fuzzer/FullCoverageSetTest.cpp -o /Users/buildslave/jenkins/workspace/clang-stage1-RA/clang-build/tools/clang/runtime/compiler-rt-bins/test/fuzzer/X86_64DefaultDarwinConfig/Output/merge_two_step.test.tmp-FullCoverageSetTest : 'RUN: at line 3'; rm -rf /Users/buildslave/jenkins/workspace/clang-stage1-RA/clang-build/tools/clang/runtime/compiler-rt-bins/test/fuzzer/X86_64DefaultDarwinConfig/Output/merge_two_step.test.tmp/T0 /Users/buildslave/jenkins/workspace/clang-stage1-RA/clang-build/tools/clang/runtime/compiler-rt-bins/test/fuzzer/X86_64DefaultDarwinConfig/Output/merge_two_step.test.tmp/T1 /Users/buildslave/jenkins/workspace/clang-stage1-RA/clang-build/tools/clang/runtime/compiler-rt-bins/test/fuzzer/X86_64DefaultDarwinConfig/Output/merge_two_step.test.tmp/T2 : 'RUN: at line 4'; mkdir -p /Users/buildslave/jenkins/workspace/clang-stage1-RA/clang-build/tools/clang/runtime/compiler-rt-bins/test/fuzzer/X86_64DefaultDarwinConfig/Output/merge_two_step.test.tmp/T0 /Users/buildslave/jenkins/workspace/clang-stage1-RA/clang-build/tools/clang/runtime/compiler-rt-bins/test/fuzzer/X86_64DefaultDarwinConfig/Output/merge_two_step.test.tmp/T1 /Users/buildslave/jenkins/workspace/clang-stage1-RA/clang-build/tools/clang/runtime/compiler-rt-bins/test/fuzzer/X86_64DefaultDarwinConfig/Output/merge_two_step.test.tmp/T2 : 'RUN: at line 5'; echo F..... > /Users/buildslave/jenkins/workspace/clang-stage1-RA/clang-build/tools/clang/runtime/compiler-rt-bins/test/fuzzer/X86_64DefaultDarwinConfig/Output/merge_two_step.test.tmp/T1/1 : 'RUN: at line 6'; echo .U.... > /Users/buildslave/jenkins/workspace/clang-stage1-RA/clang-build/tools/clang/runtime/compiler-rt-bins/test/fuzzer/X86_64DefaultDarwinConfig/Output/merge_two_step.test.tmp/T1/2 : 'RUN: at line 7'; echo ..Z... > /Users/buildslave/jenkins/workspace/clang-stage1-RA/clang-build/tools/clang/runtime/compiler-rt-bins/test/fuzzer/X86_64DefaultDarwinConfig/Output/merge_two_step.test.tmp/T1/3 : 'RUN: at line 10'; rm -f /Users/buildslave/jenkins/workspace/clang-stage1-RA/clang-build/tools/clang/runtime/compiler-rt-bins/test/fuzzer/X86_64DefaultDarwinConfig/Output/merge_two_step.test.tmp/MCF : 'RUN: at line 11'; /Users/buildslave/jenkins/workspace/clang-stage1-RA/clang-build/tools/clang/runtime/compiler-rt-bins/test/fuzzer/X86_64DefaultDarwinConfig/Output/merge_two_step.test.tmp-FullCoverageSetTest -merge=1 -merge_control_file=/Users/buildslave/jenkins/workspace/clang-stage1-RA/clang-build/tools/clang/runtime/compiler-rt-bins/test/fuzzer/X86_64DefaultDarwinConfig/Output/merge_two_step.test.tmp/MCF /Users/buildslave/jenkins/workspace/clang-stage1-RA/clang-build/tools/clang/runtime/compiler-rt-bins/test/fuzzer/X86_64DefaultDarwinConfig/Output/merge_two_step.test.tmp/T0 /Users/buildslave/jenkins/workspace/clang-stage1-RA/clang-build/tools/clang/runtime/compiler-rt-bins/test/fuzzer/X86_64DefaultDarwinConfig/Output/merge_two_step.test.tmp/T1 2>&1 | FileCheck /Users/buildslave/jenkins/workspace/clang-stage1-RA/llvm-project/compiler-rt/test/fuzzer/merge_two_step.test --check-prefix=CHECK1 : 'RUN: at line 15'; echo ...Z.. > /Users/buildslave/jenkins/workspace/clang-stage1-RA/clang-build/tools/clang/runtime/compiler-rt-bins/test/fuzzer/X86_64DefaultDarwinConfig/Output/merge_two_step.test.tmp/T2/1 : 'RUN: at line 16'; echo ....E. > /Users/buildslave/jenkins/workspace/clang-stage1-RA/clang-build/tools/clang/runtime/compiler-rt-bins/test/fuzzer/X86_64DefaultDarwinConfig/Output/merge_two_step.test.tmp/T2/2 : 'RUN: at line 17'; echo .....R > /Users/buildslave/jenkins/workspace/clang-stage1-RA/clang-build/tools/clang/runtime/compiler-rt-bins/test/fuzzer/X86_64DefaultDarwinConfig/Output/merge_two_step.test.tmp/T2/3 : 'RUN: at line 18'; echo F..... > /Users/buildslave/jenkins/workspace/clang-stage1-RA/clang-build/tools/clang/runtime/compiler-rt-bins/test/fuzzer/X86_64DefaultDarwinConfig/Output/merge_two_step.test.tmp/T2/a : 'RUN: at line 20'; rm -rf /Users/buildslave/jenkins/workspace/clang-stage1-RA/clang-build/tools/clang/runtime/compiler-rt-bins/test/fuzzer/X86_64DefaultDarwinConfig/Output/merge_two_step.test.tmp/T0 : 'RUN: at line 21'; mkdir -p /Users/buildslave/jenkins/workspace/clang-stage1-RA/clang-build/tools/clang/runtime/compiler-rt-bins/test/fuzzer/X86_64DefaultDarwinConfig/Output/merge_two_step.test.tmp/T0 : 'RUN: at line 24'; /Users/buildslave/jenkins/workspace/clang-stage1-RA/clang-build/tools/clang/runtime/compiler-rt-bins/test/fuzzer/X86_64DefaultDarwinConfig/Output/merge_two_step.test.tmp-FullCoverageSetTest -merge=1 -merge_control_file=/Users/buildslave/jenkins/workspace/clang-stage1-RA/clang-build/tools/clang/runtime/compiler-rt-bins/test/fuzzer/X86_64DefaultDarwinConfig/Output/merge_two_step.test.tmp/MCF /Users/buildslave/jenkins/workspace/clang-stage1-RA/clang-build/tools/clang/runtime/compiler-rt-bins/test/fuzzer/X86_64DefaultDarwinConfig/Output/merge_two_step.test.tmp/T0 /Users/buildslave/jenkins/workspace/clang-stage1-RA/clang-build/tools/clang/runtime/compiler-rt-bins/test/fuzzer/X86_64DefaultDarwinConfig/Output/merge_two_step.test.tmp/T1 /Users/buildslave/jenkins/workspace/clang-stage1-RA/clang-build/tools/clang/runtime/compiler-rt-bins/test/fuzzer/X86_64DefaultDarwinConfig/Output/merge_two_step.test.tmp/T2 2>&1 | FileCheck /Users/buildslave/jenkins/workspace/clang-stage1-RA/llvm-project/compiler-rt/test/fuzzer/merge_two_step.test --check-prefix=CHECK2 -- Exit Code: 1

Hide Details

Command Output (stderr): -- + : 'RUN: at line 1' + /Users/buildslave/jenkins/workspace/clang-stage1-RA/clang-build/./bin/clang --driver-mode=g++ -O2 -gline-tables-only -fsanitize=address,fuzzer -I/Users/buildslave/jenkins/workspace/clang-stage1-RA/llvm-project/compiler-rt/lib/fuzzer -arch x86_64 -stdlib=libc++ -mmacosx-version-min=10.9 -isysroot /Applications/Xcode.app/Contents/Developer/Platforms/MacOSX.platform/Developer/SDKs/MacOSX10.15.sdk /Users/buildslave/jenkins/workspace/clang-stage1-RA/llvm-project/compiler-rt/test/fuzzer/FullCoverageSetTest.cpp -o /Users/buildslave/jenkins/workspace/clang-stage1-RA/clang-build/tools/clang/runtime/compiler-rt-bins/test/fuzzer/X86_64DefaultDarwinConfig/Output/merge_two_step.test.tmp-FullCoverageSetTest + : 'RUN: at line 3' + rm -rf /Users/buildslave/jenkins/workspace/clang-stage1-RA/clang-build/tools/clang/runtime/compiler-rt-bins/test/fuzzer/X86_64DefaultDarwinConfig/Output/merge_two_step.test.tmp/T0 /Users/buildslave/jenkins/workspace/clang-stage1-RA/clang-build/tools/clang/runtime/compiler-rt-bins/test/fuzzer/X86_64DefaultDarwinConfig/Output/merge_two_step.test.tmp/T1 /Users/buildslave/jenkins/workspace/clang-stage1-RA/clang-build/tools/clang/runtime/compiler-rt-bins/test/fuzzer/X86_64DefaultDarwinConfig/Output/merge_two_step.test.tmp/T2 + : 'RUN: at line 4' + mkdir -p /Users/buildslave/jenkins/workspace/clang-stage1-RA/clang-build/tools/clang/runtime/compiler-rt-bins/test/fuzzer/X86_64DefaultDarwinConfig/Output/merge_two_step.test.tmp/T0 /Users/buildslave/jenkins/workspace/clang-stage1-RA/clang-build/tools/clang/runtime/compiler-rt-bins/test/fuzzer/X86_64DefaultDarwinConfig/Output/merge_two_step.test.tmp/T1 /Users/buildslave/jenkins/workspace/clang-stage1-RA/clang-build/tools/clang/runtime/compiler-rt-bins/test/fuzzer/X86_64DefaultDarwinConfig/Output/merge_two_step.test.tmp/T2 + : 'RUN: at line 5' + echo F..... + : 'RUN: at line 6' + echo .U.... + : 'RUN: at line 7' + echo ..Z... + : 'RUN: at line 10' + rm -f /Users/buildslave/jenkins/workspace/clang-stage1-RA/clang-build/tools/clang/runtime/compiler-rt-bins/test/fuzzer/X86_64DefaultDarwinConfig/Output/merge_two_step.test.tmp/MCF + : 'RUN: at line 11' + /Users/buildslave/jenkins/workspace/clang-stage1-RA/clang-build/tools/clang/runtime/compiler-rt-bins/test/fuzzer/X86_64DefaultDarwinConfig/Output/merge_two_step.test.tmp-FullCoverageSetTest -merge=1 -merge_control_file=/Users/buildslave/jenkins/workspace/clang-stage1-RA/clang-build/tools/clang/runtime/compiler-rt-bins/test/fuzzer/X86_64DefaultDarwinConfig/Output/merge_two_step.test.tmp/MCF /Users/buildslave/jenkins/workspace/clang-stage1-RA/clang-build/tools/clang/runtime/compiler-rt-bins/test/fuzzer/X86_64DefaultDarwinConfig/Output/merge_two_step.test.tmp/T0 /Users/buildslave/jenkins/workspace/clang-stage1-RA/clang-build/tools/clang/runtime/compiler-rt-bins/test/fuzzer/X86_64DefaultDarwinConfig/Output/merge_two_step.test.tmp/T1 + FileCheck /Users/buildslave/jenkins/workspace/clang-stage1-RA/llvm-project/compiler-rt/test/fuzzer/merge_two_step.test --check-prefix=CHECK1 /Users/buildslave/jenkins/workspace/clang-stage1-RA/llvm-project/compiler-rt/test/fuzzer/merge_two_step.test:13:9: error: CHECK1: expected string not found in input CHECK1: MERGE-OUTER: 3 new files with {{.*}} new features added; 11 new coverage edges ^ <stdin>:5:46: note: scanning from here MERGE-OUTER: 3 files, 0 in the initial corpus, 0 processed earlier ^

Hide Details

Input file: <stdin> Check file: /Users/buildslave/jenkins/workspace/clang-stage1-RA/llvm-project/compiler-rt/test/fuzzer/merge_two_step.test

Hide Details

-dump-input=help explains the following input dump.

Hide Details

Input was: <<<<<< 1: INFO: Running with entropic power schedule (0xFF, 100). 2: INFO: Seed: 1422266243 3: INFO: Loaded 1 modules (62 inline 8-bit counters): 62 [0x102a80c68, 0x102a80ca6), 4: INFO: Loaded 1 PC tables (62 PCs): 62 [0x102a80ca8,0x102a81088), 5: MERGE-OUTER: 3 files, 0 in the initial corpus, 0 processed earlier check:13 X~~~~~~~~~~~~~~~~~~~~ error: no match found 6: AddressSanitizer:DEADLYSIGNAL check:13 ~~~~~~~~~~~~~~~~~~~~~~~~~~~~~ 7: ================================================================= check:13 ~~~~~~~~~~~~~~~~~~~~~~~~~~~~~~~~~~~~~~~~~~~~~~~~~~~~~~~~~~~~~~~~~ 8: ==46222==ERROR: AddressSanitizer: BUS on unknown address (pc 0x7fff68543288 bp 0x7ffeed1c2350 sp 0x7ffeed1c2340 T0) check:13 ~~~~~~~~~~~~~~~~~~~~~~~~~~~~~~~~~~~~~~~~~~~~~~~~~~~~~~~~~~~~~~~~~~~~~~~~~~~~~~~~~~~~~~~~~~~~~~~~~~~~~~~~~~~~~~~~~~~ 9: ==46222==The signal is caused by a READ memory access. check:13 ~~~~~~~~~~~~~~~~~~~~~~~~~~~~~~~~~~~~~~~~~~~~~~~~~~~~~~ 10: ==46222==Hint: this fault was caused by a dereference of a high value address (see register values below). Dissassemble the provided pc to learn which register was used. check:13 ~~~~~~~~~~~~~~~~~~~~~~~~~~~~~~~~~~~~~~~~~~~~~~~~~~~~~~~~~~~~~~~~~~~~~~~~~~~~~~~~~~~~~~~~~~~~~~~~~~~~~~~~~~~~~~~~~~~~~~~~~~~~~~~~~~~~~~~~~~~~~~~~~~~~~~~~~~~~~~~~~~~~~~~~~ . . . >>>>>>

Hide Details

--

Hide Details

******************** FAIL: libFuzzer :: minimize_timeout.test (3022 of 3077) ******************** TEST 'libFuzzer :: minimize_timeout.test' FAILED ******************** Script: -- : 'RUN: at line 1'; /Users/buildslave/jenkins/workspace/clang-stage1-RA/clang-build/./bin/clang --driver-mode=g++ -O2 -gline-tables-only -fsanitize=address,fuzzer -I/Users/buildslave/jenkins/workspace/clang-stage1-RA/llvm-project/compiler-rt/lib/fuzzer -arch x86_64 -stdlib=libc++ -mmacosx-version-min=10.9 -isysroot /Applications/Xcode.app/Contents/Developer/Platforms/MacOSX.platform/Developer/SDKs/MacOSX10.15.sdk /Users/buildslave/jenkins/workspace/clang-stage1-RA/llvm-project/compiler-rt/test/fuzzer/TimeoutTest.cpp -o /Users/buildslave/jenkins/workspace/clang-stage1-RA/clang-build/tools/clang/runtime/compiler-rt-bins/test/fuzzer/X86_64DefaultDarwinConfig/Output/minimize_timeout.test.tmp-TimeoutTest : 'RUN: at line 2'; mkdir -p /Users/buildslave/jenkins/workspace/clang-stage1-RA/clang-build/tools/clang/runtime/compiler-rt-bins/test/fuzzer/X86_64DefaultDarwinConfig/Output/minimize_timeout.test.tmp.dir : 'RUN: at line 4'; echo 'Hi!?' > /Users/buildslave/jenkins/workspace/clang-stage1-RA/clang-build/tools/clang/runtime/compiler-rt-bins/test/fuzzer/X86_64DefaultDarwinConfig/Output/minimize_timeout.test.tmp.dir/not_minimal_timeout : 'RUN: at line 5'; /Users/buildslave/jenkins/workspace/clang-stage1-RA/clang-build/tools/clang/runtime/compiler-rt-bins/test/fuzzer/X86_64DefaultDarwinConfig/Output/minimize_timeout.test.tmp-TimeoutTest -minimize_crash=1 /Users/buildslave/jenkins/workspace/clang-stage1-RA/clang-build/tools/clang/runtime/compiler-rt-bins/test/fuzzer/X86_64DefaultDarwinConfig/Output/minimize_timeout.test.tmp.dir/not_minimal_timeout -timeout=1 -max_total_time=3 2>&1 | FileCheck /Users/buildslave/jenkins/workspace/clang-stage1-RA/llvm-project/compiler-rt/test/fuzzer/minimize_timeout.test -- Exit Code: 1

Hide Details

Command Output (stderr): -- + : 'RUN: at line 1' + /Users/buildslave/jenkins/workspace/clang-stage1-RA/clang-build/./bin/clang --driver-mode=g++ -O2 -gline-tables-only -fsanitize=address,fuzzer -I/Users/buildslave/jenkins/workspace/clang-stage1-RA/llvm-project/compiler-rt/lib/fuzzer -arch x86_64 -stdlib=libc++ -mmacosx-version-min=10.9 -isysroot /Applications/Xcode.app/Contents/Developer/Platforms/MacOSX.platform/Developer/SDKs/MacOSX10.15.sdk /Users/buildslave/jenkins/workspace/clang-stage1-RA/llvm-project/compiler-rt/test/fuzzer/TimeoutTest.cpp -o /Users/buildslave/jenkins/workspace/clang-stage1-RA/clang-build/tools/clang/runtime/compiler-rt-bins/test/fuzzer/X86_64DefaultDarwinConfig/Output/minimize_timeout.test.tmp-TimeoutTest + : 'RUN: at line 2' + mkdir -p /Users/buildslave/jenkins/workspace/clang-stage1-RA/clang-build/tools/clang/runtime/compiler-rt-bins/test/fuzzer/X86_64DefaultDarwinConfig/Output/minimize_timeout.test.tmp.dir + : 'RUN: at line 4' + echo 'Hi!?' + : 'RUN: at line 5' + /Users/buildslave/jenkins/workspace/clang-stage1-RA/clang-build/tools/clang/runtime/compiler-rt-bins/test/fuzzer/X86_64DefaultDarwinConfig/Output/minimize_timeout.test.tmp-TimeoutTest -minimize_crash=1 /Users/buildslave/jenkins/workspace/clang-stage1-RA/clang-build/tools/clang/runtime/compiler-rt-bins/test/fuzzer/X86_64DefaultDarwinConfig/Output/minimize_timeout.test.tmp.dir/not_minimal_timeout -timeout=1 -max_total_time=3 + FileCheck /Users/buildslave/jenkins/workspace/clang-stage1-RA/llvm-project/compiler-rt/test/fuzzer/minimize_timeout.test /Users/buildslave/jenkins/workspace/clang-stage1-RA/llvm-project/compiler-rt/test/fuzzer/minimize_timeout.test:6:8: error: CHECK: expected string not found in input CHECK: CRASH_MIN: failed to minimize beyond {{.*}}minimized-from{{.*}} (3 bytes), exiting ^ <stdin>:1:1: note: scanning from here INFO: Running with entropic power schedule (0xFF, 100). ^

Hide Details

Input file: <stdin> Check file: /Users/buildslave/jenkins/workspace/clang-stage1-RA/llvm-project/compiler-rt/test/fuzzer/minimize_timeout.test

Hide Details

-dump-input=help explains the following input dump.

Hide Details

Input was: <<<<<< 1: INFO: Running with entropic power schedule (0xFF, 100). check:6 X~~~~~~~~~~~~~~~~~~~~~~~~~~~~~~~~~~~~~~~~~~~~~~~~~~~~~~ error: no match found 2: INFO: Seed: 1424024953 check:6 ~~~~~~~~~~~~~~~~~~~~~~ 3: INFO: Loaded 1 modules (9 inline 8-bit counters): 9 [0x107b9fbf8, 0x107b9fc01), check:6 ~~~~~~~~~~~~~~~~~~~~~~~~~~~~~~~~~~~~~~~~~~~~~~~~~~~~~~~~~~~~~~~~~~~~~~~~~~~~~~~~ 4: INFO: Loaded 1 PC tables (9 PCs): 9 [0x107b9fc08,0x107b9fc98), check:6 ~~~~~~~~~~~~~~~~~~~~~~~~~~~~~~~~~~~~~~~~~~~~~~~~~~~~~~~~~~~~~~~ 5: AddressSanitizer:DEADLYSIGNAL check:6 ~~~~~~~~~~~~~~~~~~~~~~~~~~~~~ 6: ================================================================= check:6 ~~~~~~~~~~~~~~~~~~~~~~~~~~~~~~~~~~~~~~~~~~~~~~~~~~~~~~~~~~~~~~~~~ . . . >>>>>>

Hide Details

--

Hide Details

******************** UNSUPPORTED: libFuzzer :: msan-param-unpoison.test (3023 of 3077) UNSUPPORTED: libFuzzer :: msan.test (3024 of 3077) UNSUPPORTED: libFuzzer :: mutation-graph.test (3025 of 3077) UNSUPPORTED: libFuzzer :: noasan-bcmp.test (3026 of 3077) UNSUPPORTED: libFuzzer :: noasan-memcmp.test (3027 of 3077) UNSUPPORTED: libFuzzer :: noasan-memcmp64.test (3028 of 3077) UNSUPPORTED: libFuzzer :: noasan-strcmp.test (3029 of 3077) UNSUPPORTED: libFuzzer :: noasan-strncmp.test (3030 of 3077) UNSUPPORTED: libFuzzer :: noasan-strstr.test (3031 of 3077) FAIL: libFuzzer :: minimize_two_crashes.test (3032 of 3077) ******************** TEST 'libFuzzer :: minimize_two_crashes.test' FAILED ******************** Script: -- : 'RUN: at line 5'; /Users/buildslave/jenkins/workspace/clang-stage1-RA/clang-build/./bin/clang --driver-mode=g++ -O2 -gline-tables-only -fsanitize=address,fuzzer -I/Users/buildslave/jenkins/workspace/clang-stage1-RA/llvm-project/compiler-rt/lib/fuzzer -arch x86_64 -stdlib=libc++ -mmacosx-version-min=10.9 -isysroot /Applications/Xcode.app/Contents/Developer/Platforms/MacOSX.platform/Developer/SDKs/MacOSX10.15.sdk -O0 /Users/buildslave/jenkins/workspace/clang-stage1-RA/llvm-project/compiler-rt/test/fuzzer/TwoDifferentBugsTest.cpp -o /Users/buildslave/jenkins/workspace/clang-stage1-RA/clang-build/tools/clang/runtime/compiler-rt-bins/test/fuzzer/X86_64DefaultDarwinConfig/Output/minimize_two_crashes.test.tmp-TwoDifferentBugsTest : 'RUN: at line 7'; rm -rf /Users/buildslave/jenkins/workspace/clang-stage1-RA/clang-build/tools/clang/runtime/compiler-rt-bins/test/fuzzer/X86_64DefaultDarwinConfig/Output/minimize_two_crashes.test.tmp && mkdir /Users/buildslave/jenkins/workspace/clang-stage1-RA/clang-build/tools/clang/runtime/compiler-rt-bins/test/fuzzer/X86_64DefaultDarwinConfig/Output/minimize_two_crashes.test.tmp : 'RUN: at line 8'; echo H12345678901234667888090 > /Users/buildslave/jenkins/workspace/clang-stage1-RA/clang-build/tools/clang/runtime/compiler-rt-bins/test/fuzzer/X86_64DefaultDarwinConfig/Output/minimize_two_crashes.test.tmp/long_crash : 'RUN: at line 9'; env ASAN_OPTIONS=abort_on_error=0:log_to_syslog=0:dedup_token_length=3 /Users/buildslave/jenkins/workspace/clang-stage1-RA/clang-build/tools/clang/runtime/compiler-rt-bins/test/fuzzer/X86_64DefaultDarwinConfig/Output/minimize_two_crashes.test.tmp-TwoDifferentBugsTest -seed=1 -minimize_crash=1 /Users/buildslave/jenkins/workspace/clang-stage1-RA/clang-build/tools/clang/runtime/compiler-rt-bins/test/fuzzer/X86_64DefaultDarwinConfig/Output/minimize_two_crashes.test.tmp/long_crash -exact_artifact_path=/Users/buildslave/jenkins/workspace/clang-stage1-RA/clang-build/tools/clang/runtime/compiler-rt-bins/test/fuzzer/X86_64DefaultDarwinConfig/Output/minimize_two_crashes.test.tmp/result 2>&1 | FileCheck /Users/buildslave/jenkins/workspace/clang-stage1-RA/llvm-project/compiler-rt/test/fuzzer/minimize_two_crashes.test : 'RUN: at line 17'; not /Users/buildslave/jenkins/workspace/clang-stage1-RA/clang-build/tools/clang/runtime/compiler-rt-bins/test/fuzzer/X86_64DefaultDarwinConfig/Output/minimize_two_crashes.test.tmp-TwoDifferentBugsTest /Users/buildslave/jenkins/workspace/clang-stage1-RA/clang-build/tools/clang/runtime/compiler-rt-bins/test/fuzzer/X86_64DefaultDarwinConfig/Output/minimize_two_crashes.test.tmp/result 2>&1 | FileCheck /Users/buildslave/jenkins/workspace/clang-stage1-RA/llvm-project/compiler-rt/test/fuzzer/minimize_two_crashes.test --check-prefix=VERIFY -- Exit Code: 1

Hide Details

Command Output (stderr): -- + : 'RUN: at line 5' + /Users/buildslave/jenkins/workspace/clang-stage1-RA/clang-build/./bin/clang --driver-mode=g++ -O2 -gline-tables-only -fsanitize=address,fuzzer -I/Users/buildslave/jenkins/workspace/clang-stage1-RA/llvm-project/compiler-rt/lib/fuzzer -arch x86_64 -stdlib=libc++ -mmacosx-version-min=10.9 -isysroot /Applications/Xcode.app/Contents/Developer/Platforms/MacOSX.platform/Developer/SDKs/MacOSX10.15.sdk -O0 /Users/buildslave/jenkins/workspace/clang-stage1-RA/llvm-project/compiler-rt/test/fuzzer/TwoDifferentBugsTest.cpp -o /Users/buildslave/jenkins/workspace/clang-stage1-RA/clang-build/tools/clang/runtime/compiler-rt-bins/test/fuzzer/X86_64DefaultDarwinConfig/Output/minimize_two_crashes.test.tmp-TwoDifferentBugsTest + : 'RUN: at line 7' + rm -rf /Users/buildslave/jenkins/workspace/clang-stage1-RA/clang-build/tools/clang/runtime/compiler-rt-bins/test/fuzzer/X86_64DefaultDarwinConfig/Output/minimize_two_crashes.test.tmp + mkdir /Users/buildslave/jenkins/workspace/clang-stage1-RA/clang-build/tools/clang/runtime/compiler-rt-bins/test/fuzzer/X86_64DefaultDarwinConfig/Output/minimize_two_crashes.test.tmp + : 'RUN: at line 8' + echo H12345678901234667888090 + : 'RUN: at line 9' + env ASAN_OPTIONS=abort_on_error=0:log_to_syslog=0:dedup_token_length=3 /Users/buildslave/jenkins/workspace/clang-stage1-RA/clang-build/tools/clang/runtime/compiler-rt-bins/test/fuzzer/X86_64DefaultDarwinConfig/Output/minimize_two_crashes.test.tmp-TwoDifferentBugsTest -seed=1 -minimize_crash=1 /Users/buildslave/jenkins/workspace/clang-stage1-RA/clang-build/tools/clang/runtime/compiler-rt-bins/test/fuzzer/X86_64DefaultDarwinConfig/Output/minimize_two_crashes.test.tmp/long_crash -exact_artifact_path=/Users/buildslave/jenkins/workspace/clang-stage1-RA/clang-build/tools/clang/runtime/compiler-rt-bins/test/fuzzer/X86_64DefaultDarwinConfig/Output/minimize_two_crashes.test.tmp/result + FileCheck /Users/buildslave/jenkins/workspace/clang-stage1-RA/llvm-project/compiler-rt/test/fuzzer/minimize_two_crashes.test /Users/buildslave/jenkins/workspace/clang-stage1-RA/llvm-project/compiler-rt/test/fuzzer/minimize_two_crashes.test:11:8: error: CHECK: expected string not found in input CHECK: DedupToken1: DEDUP_TOKEN: Bar ^ <stdin>:1:1: note: scanning from here INFO: Running with entropic power schedule (0xFF, 100). ^ <stdin>:1:37: note: possible intended match here INFO: Running with entropic power schedule (0xFF, 100). ^

Hide Details

Input file: <stdin> Check file: /Users/buildslave/jenkins/workspace/clang-stage1-RA/llvm-project/compiler-rt/test/fuzzer/minimize_two_crashes.test

Hide Details

-dump-input=help explains the following input dump.

Hide Details

Input was: <<<<<< 1: INFO: Running with entropic power schedule (0xFF, 100). check:11'0 X~~~~~~~~~~~~~~~~~~~~~~~~~~~~~~~~~~~~~~~~~~~~~~~~~~~~~~ error: no match found check:11'1 ? possible intended match 2: INFO: Seed: 1 check:11'0 ~~~~~~~~~~~~~ 3: INFO: Loaded 1 modules (9 inline 8-bit counters): 9 [0x106baac08, 0x106baac11), check:11'0 ~~~~~~~~~~~~~~~~~~~~~~~~~~~~~~~~~~~~~~~~~~~~~~~~~~~~~~~~~~~~~~~~~~~~~~~~~~~~~~~~ 4: INFO: Loaded 1 PC tables (9 PCs): 9 [0x106baac18,0x106baaca8), check:11'0 ~~~~~~~~~~~~~~~~~~~~~~~~~~~~~~~~~~~~~~~~~~~~~~~~~~~~~~~~~~~~~~~ 5: AddressSanitizer:DEADLYSIGNAL check:11'0 ~~~~~~~~~~~~~~~~~~~~~~~~~~~~~ 6: ================================================================= check:11'0 ~~~~~~~~~~~~~~~~~~~~~~~~~~~~~~~~~~~~~~~~~~~~~~~~~~~~~~~~~~~~~~~~~ . . . >>>>>>

Hide Details

--

Hide Details

******************** PASS: libFuzzer :: not-instrumented.test (3033 of 3077) PASS: libFuzzer :: null-deref-on-empty.test (3034 of 3077) UNSUPPORTED: libFuzzer :: only-some-bytes-fork.test (3035 of 3077) UNSUPPORTED: libFuzzer :: only-some-bytes.test (3036 of 3077) PASS: libFuzzer :: null-deref.test (3037 of 3077) UNSUPPORTED: libFuzzer :: print-func.test (3038 of 3077) PASS: libFuzzer :: overwrite-input.test (3039 of 3077) PASS: libFuzzer :: recommended-dictionary.test (3040 of 3077) PASS: libFuzzer :: read-binary.test (3041 of 3077) PASS: libFuzzer :: reduce_inputs.test (3042 of 3077) PASS: libFuzzer :: repeated-bytes.test (3043 of 3077) PASS: libFuzzer :: reload.test (3044 of 3077) PASS: libFuzzer :: seed_inputs.test (3045 of 3077) UNSUPPORTED: libFuzzer :: sigint.test (3046 of 3077) UNSUPPORTED: libFuzzer :: sigusr.test (3047 of 3077) UNSUPPORTED: libFuzzer :: simple-cmp.test (3048 of 3077) PASS: libFuzzer :: shrink.test (3049 of 3077) PASS: libFuzzer :: standalone.test (3050 of 3077) PASS: libFuzzer :: strcmp.test (3051 of 3077) PASS: libFuzzer :: simple.test (3052 of 3077) PASS: libFuzzer :: strncmp-oob.test (3053 of 3077) PASS: libFuzzer :: strstr.test (3054 of 3077) PASS: libFuzzer :: strncmp.test (3055 of 3077) PASS: libFuzzer :: symbolize-deadlock.test (3056 of 3077) PASS: libFuzzer :: large.test (3057 of 3077) UNSUPPORTED: libFuzzer :: trace-malloc-2.test (3058 of 3077) UNSUPPORTED: libFuzzer :: trace-malloc-threaded.test (3059 of 3077) UNSUPPORTED: libFuzzer :: trace-malloc-unbalanced.test (3060 of 3077) PASS: libFuzzer :: swap-cmp.test (3061 of 3077) PASS: libFuzzer :: three-bytes.test (3062 of 3077) UNSUPPORTED: libFuzzer :: uncaught-exception.test (3063 of 3077) PASS: libFuzzer :: trace-malloc.test (3064 of 3077) PASS: libFuzzer :: ulimit.test (3065 of 3077) PASS: libFuzzer :: value-profile-cmp2.test (3066 of 3077) PASS: libFuzzer :: value-profile-cmp3.test (3067 of 3077) PASS: libFuzzer :: value-profile-div.test (3068 of 3077) PASS: libFuzzer :: value-profile-cmp4.test (3069 of 3077) PASS: libFuzzer :: value-profile-cmp.test (3070 of 3077) PASS: libFuzzer :: value-profile-load.test (3071 of 3077) PASS: libFuzzer :: value-profile-strcmp.test (3072 of 3077) PASS: libFuzzer :: value-profile-set.test (3073 of 3077) PASS: libFuzzer :: value-profile-strncmp.test (3074 of 3077) UNSUPPORTED: libFuzzer :: windows-opt-ref.test (3075 of 3077) PASS: libFuzzer :: value-profile-mem.test (3076 of 3077) PASS: libFuzzer :: value-profile-switch.test (3077 of 3077)

Hide Details

22 warning(s) in tests ******************** Failed Tests (11): SanitizerCommon-Unit :: ./Sanitizer-x86_64-Test/DeadlockDetector.BasicTest SanitizerCommon-Unit :: ./Sanitizer-x86_64-Test/DeadlockDetector.LockContextTest SanitizerCommon-Unit :: ./Sanitizer-x86_64-Test/DeadlockDetector.RemoveNodeTest libFuzzer :: cleanse.test libFuzzer :: fuzzer-flags.test libFuzzer :: merge-control-file.test libFuzzer :: merge.test libFuzzer :: merge_two_step.test libFuzzer :: minimize_crash.test libFuzzer :: minimize_timeout.test libFuzzer :: minimize_two_crashes.test

Hide Details

Hide Details

Testing Time: 962.18s Unsupported : 920 Passed : 2117 Expectedly Failed: 29 Failed : 11 FAILED: test/CMakeFiles/check-compiler-rt cd /Users/buildslave/jenkins/workspace/clang-stage1-RA/clang-build/tools/clang/runtime/compiler-rt-bins/test && /usr/local/Frameworks/Python.framework/Versions/3.7/bin/python3.7 /Users/buildslave/jenkins/workspace/clang-stage1-RA/clang-build/./bin/llvm-lit --xunit-xml-output=testresults.xunit.xml -v -vv --timeout=600 /Users/buildslave/jenkins/workspace/clang-stage1-RA/clang-build/tools/clang/runtime/compiler-rt-bins/test/builtins/TestCases /Users/buildslave/jenkins/workspace/clang-stage1-RA/clang-build/tools/clang/runtime/compiler-rt-bins/test/builtins/Unit/X86_64DarwinConfig /Users/buildslave/jenkins/workspace/clang-stage1-RA/clang-build/tools/clang/runtime/compiler-rt-bins/test/lsan/X86_64LsanConfig /Users/buildslave/jenkins/workspace/clang-stage1-RA/clang-build/tools/clang/runtime/compiler-rt-bins/test/lsan/X86_64AsanConfig /Users/buildslave/jenkins/workspace/clang-stage1-RA/clang-build/tools/clang/runtime/compiler-rt-bins/test/ubsan/Standalone-x86_64 /Users/buildslave/jenkins/workspace/clang-stage1-RA/clang-build/tools/clang/runtime/compiler-rt-bins/test/ubsan/AddressSanitizer-x86_64 /Users/buildslave/jenkins/workspace/clang-stage1-RA/clang-build/tools/clang/runtime/compiler-rt-bins/test/ubsan/ThreadSanitizer-x86_64 /Users/buildslave/jenkins/workspace/clang-stage1-RA/clang-build/tools/clang/runtime/compiler-rt-bins/test/ubsan/StandaloneStatic-x86_64 /Users/buildslave/jenkins/workspace/clang-stage1-RA/clang-build/tools/clang/runtime/compiler-rt-bins/test/cfi/Standalone-x86_64 /Users/buildslave/jenkins/workspace/clang-stage1-RA/clang-build/tools/clang/runtime/compiler-rt-bins/test/cfi/Devirt-x86_64 /Users/buildslave/jenkins/workspace/clang-stage1-RA/clang-build/tools/clang/runtime/compiler-rt-bins/test/sanitizer_common/asan-x86_64-Darwin /Users/buildslave/jenkins/workspace/clang-stage1-RA/clang-build/tools/clang/runtime/compiler-rt-bins/test/sanitizer_common/lsan-x86_64-Darwin /Users/buildslave/jenkins/workspace/clang-stage1-RA/clang-build/tools/clang/runtime/compiler-rt-bins/test/sanitizer_common/tsan-x86_64-Darwin /Users/buildslave/jenkins/workspace/clang-stage1-RA/clang-build/tools/clang/runtime/compiler-rt-bins/test/sanitizer_common/ubsan-x86_64-Darwin /Users/buildslave/jenkins/workspace/clang-stage1-RA/clang-build/tools/clang/runtime/compiler-rt-bins/test/sanitizer_common/Unit /Users/buildslave/jenkins/workspace/clang-stage1-RA/clang-build/tools/clang/runtime/compiler-rt-bins/test/fuzzer/unit /Users/buildslave/jenkins/workspace/clang-stage1-RA/clang-build/tools/clang/runtime/compiler-rt-bins/test/fuzzer/X86_64DefaultDarwinConfig/ /Users/buildslave/jenkins/workspace/clang-stage1-RA/clang-build/tools/clang/runtime/compiler-rt-bins/test/asan/X86_64DarwinConfig /Users/buildslave/jenkins/workspace/clang-stage1-RA/clang-build/tools/clang/runtime/compiler-rt-bins/test/asan/Unit /Users/buildslave/jenkins/workspace/clang-stage1-RA/clang-build/tools/clang/runtime/compiler-rt-bins/test/tsan/X86_64Config /Users/buildslave/jenkins/workspace/clang-stage1-RA/clang-build/tools/clang/runtime/compiler-rt-bins/test/tsan/Unit /Users/buildslave/jenkins/workspace/clang-stage1-RA/clang-build/tools/clang/runtime/compiler-rt-bins/test/ubsan_minimal/x86_64 /Users/buildslave/jenkins/workspace/clang-stage1-RA/clang-build/tools/clang/runtime/compiler-rt-bins/test/profile/Profile-x86_64 /Users/buildslave/jenkins/workspace/clang-stage1-RA/clang-build/tools/clang/runtime/compiler-rt-bins/test/xray/X86_64DarwinConfig /Users/buildslave/jenkins/workspace/clang-stage1-RA/clang-build/tools/clang/runtime/compiler-rt-bins/test/xray/X86_64HDarwinConfig /Users/buildslave/jenkins/workspace/clang-stage1-RA/clang-build/tools/clang/runtime/compiler-rt-bins/test/shadowcallstack/arm64 ninja: build stopped: subcommand failed. [813/815] : && /Applications/Xcode.app/Contents/Developer/Toolchains/XcodeDefault.xctoolchain/usr/bin/c++ -fPIC -fvisibility-inlines-hidden -Werror=date-time -Werror=unguarded-availability-new -Wall -Wextra -Wno-unused-parameter -Wwrite-strings -Wcast-qual -Wmissing-field-initializers -pedantic -Wno-long-long -Wimplicit-fallthrough -Wcovered-switch-default -Wno-noexcept-type -Wnon-virtual-dtor -Wdelete-non-virtual-dtor -Wstring-conversion -fdiagnostics-color -O2 -g -isysroot /Applications/Xcode.app/Contents/Developer/Platforms/MacOSX.platform/Developer/SDKs/MacOSX10.15.sdk -mmacosx-version-min=10.9 -Wl,-search_paths_first -Wl,-headerpad_max_install_names -Wl,-dead_strip unittests/tools/llvm-exegesis/X86/CMakeFiles/LLVMExegesisX86Tests.dir/AssemblerTest.cpp.o unittests/tools/llvm-exegesis/X86/CMakeFiles/LLVMExegesisX86Tests.dir/BenchmarkResultTest.cpp.o unittests/tools/llvm-exegesis/X86/CMakeFiles/LLVMExegesisX86Tests.dir/RegisterAliasingTest.cpp.o unittests/tools/llvm-exegesis/X86/CMakeFiles/LLVMExegesisX86Tests.dir/SchedClassResolutionTest.cpp.o unittests/tools/llvm-exegesis/X86/CMakeFiles/LLVMExegesisX86Tests.dir/SnippetFileTest.cpp.o unittests/tools/llvm-exegesis/X86/CMakeFiles/LLVMExegesisX86Tests.dir/SnippetGeneratorTest.cpp.o unittests/tools/llvm-exegesis/X86/CMakeFiles/LLVMExegesisX86Tests.dir/SnippetRepetitorTest.cpp.o unittests/tools/llvm-exegesis/X86/CMakeFiles/LLVMExegesisX86Tests.dir/TargetTest.cpp.o -o unittests/tools/llvm-exegesis/X86/LLVMExegesisX86Tests lib/libLLVMMC.a lib/libLLVMMCParser.a lib/libLLVMObject.a lib/libLLVMSupport.a lib/libLLVMSymbolize.a lib/libLLVMX86CodeGen.a lib/libLLVMX86AsmParser.a lib/libLLVMX86Desc.a lib/libLLVMX86Disassembler.a lib/libLLVMX86Info.a lib/libLLVMSupport.a lib/libgtest_main.a lib/libgtest.a lib/libLLVMExegesis.a lib/libLLVMExegesisX86.a lib/libLLVMDebugInfoPDB.a -lpthread lib/libLLVMX86CodeGen.a lib/libLLVMAsmPrinter.a lib/libLLVMDebugInfoDWARF.a lib/libLLVMCFGuard.a lib/libLLVMX86AsmParser.a lib/libLLVMX86Desc.a lib/libLLVMX86Disassembler.a lib/libLLVMX86Info.a lib/libLLVMExegesis.a lib/libLLVMGlobalISel.a lib/libLLVMSelectionDAG.a lib/libLLVMCodeGen.a lib/libLLVMBitWriter.a lib/libLLVMScalarOpts.a lib/libLLVMAggressiveInstCombine.a lib/libLLVMInstCombine.a lib/libLLVMTransformUtils.a lib/libLLVMMCDisassembler.a lib/libLLVMMCJIT.a lib/libLLVMExecutionEngine.a lib/libLLVMTarget.a lib/libLLVMAnalysis.a lib/libLLVMProfileData.a lib/libLLVMObjectYAML.a lib/libLLVMRuntimeDyld.a lib/libLLVMObject.a lib/libLLVMMCParser.a lib/libLLVMMC.a lib/libLLVMDebugInfoCodeView.a lib/libLLVMDebugInfoMSF.a lib/libLLVMBitReader.a lib/libLLVMTextAPI.a lib/libLLVMCore.a lib/libLLVMBinaryFormat.a lib/libLLVMRemarks.a lib/libLLVMBitstreamReader.a lib/libLLVMSupport.a -lm /usr/lib/libz.dylib /usr/lib/libcurses.dylib lib/libLLVMDemangle.a && : FAILED: tools/clang/runtime/CMakeFiles/check-compiler-rt cd /Users/buildslave/jenkins/workspace/clang-stage1-RA/clang-build/tools/clang/runtime/compiler-rt-bins && /usr/local/Cellar/cmake/3.17.2/bin/cmake --build . --target check-all --config RelWithDebInfo ninja: build stopped: cannot make progress due to previous errors. Command failed: Command '['/usr/local/bin/ninja', '-v', '-k', '0', 'check-all']' returned non-zero exit status 1 Command: ['/usr/local/bin/ninja', '-v', '-k', '0', 'check-all'] [Pipeline] } [Pipeline] // timeout [Pipeline] } [Pipeline] // stage [Pipeline] stage [Pipeline] { (Declarative: Post Actions) [Pipeline] scanForIssues [Clang (LLVM based)] Sleeping for 5 seconds due to JENKINS-32191... [Clang (LLVM based)] Parsing console log (workspace: '/Users/buildslave/jenkins/workspace/clang-stage1-RA') [Clang (LLVM based)] Successfully parsed console log [Clang (LLVM based)] -> found 15 issues (skipped 29 duplicates) [Clang (LLVM based)] [-ERROR-] Can't create fingerprints for some files: [Clang (LLVM based)] [-ERROR-] - '/tmp/gotsan.OdxhTv5qVz/gotsan.cpp', IO exception has been thrown: java.nio.file.NoSuchFileException: /tmp/gotsan.OdxhTv5qVz/gotsan.cpp [Clang (LLVM based)] [-ERROR-] - '/tmp/gotsan.OdxhTv5qVz/gotsan.cpp', IO exception has been thrown: java.nio.file.NoSuchFileException: /tmp/gotsan.OdxhTv5qVz/gotsan.cpp [Clang (LLVM based)] [-ERROR-] - '/tmp/gotsan.OdxhTv5qVz/gotsan.cpp', IO exception has been thrown: java.nio.file.NoSuchFileException: /tmp/gotsan.OdxhTv5qVz/gotsan.cpp [Clang (LLVM based)] [-ERROR-] - '/tmp/gotsan.OdxhTv5qVz/gotsan.cpp', IO exception has been thrown: java.nio.file.NoSuchFileException: /tmp/gotsan.OdxhTv5qVz/gotsan.cpp [Clang (LLVM based)] [-ERROR-] - '/tmp/gotsan.OdxhTv5qVz/gotsan.cpp', IO exception has been thrown: java.nio.file.NoSuchFileException: /tmp/gotsan.OdxhTv5qVz/gotsan.cpp [Clang (LLVM based)] [-ERROR-] - '/tmp/gotsan.OdxhTv5qVz/gotsan.cpp', IO exception has been thrown: java.nio.file.NoSuchFileException: /tmp/gotsan.OdxhTv5qVz/gotsan.cpp [Clang (LLVM based)] [-ERROR-] - '/tmp/gotsan.OdxhTv5qVz/gotsan.cpp', IO exception has been thrown: java.nio.file.NoSuchFileException: /tmp/gotsan.OdxhTv5qVz/gotsan.cpp [Clang (LLVM based)] [-ERROR-] - '/tmp/gotsan.OdxhTv5qVz/gotsan.cpp', IO exception has been thrown: java.nio.file.NoSuchFileException: /tmp/gotsan.OdxhTv5qVz/gotsan.cpp [Clang (LLVM based)] [-ERROR-] - '/Users/buildslave/jenkins/workspace/clang-stage1-RA/clang-build/tools/clang/runtime/compiler-rt-bins/llvm-lit: /Users/buildslave/jenkins/workspace/clang-stage1-RA/llvm-project/compiler-rt/test/lit.common.cfg.py', IO exception has been thrown: java.nio.file.NoSuchFileException: /Users/buildslave/jenkins/workspace/clang-stage1-RA/clang-build/tools/clang/runtime/compiler-rt-bins/llvm-lit: /Users/buildslave/jenkins/workspace/clang-stage1-RA/llvm-project/compiler-rt/test/lit.common.cfg.py [Clang (LLVM based)] Post processing issues on 'green-dragon-20' with source code encoding 'UTF-8' [Clang (LLVM based)] Creating SCM blamer to obtain author and commit information for affected files [Clang (LLVM based)] Creating SCM miner to obtain statistics for affected repository files [Clang (LLVM based)] Resolving file names for all issues in source directory '/Users/buildslave/jenkins/workspace/clang-stage1-RA' [Clang (LLVM based)] -> resolved paths in source directory (6 found, 2 not found) [Clang (LLVM based)] Resolving module names from module definitions (build.xml, pom.xml, or Manifest.mf files) [Clang (LLVM based)] -> resolved module names for 15 issues [Clang (LLVM based)] Resolving package names (or namespaces) by parsing the affected files [Clang (LLVM based)] -> resolved package names of 8 affected files [Clang (LLVM based)] No filter has been set, publishing all 15 issues [Clang (LLVM based)] Creating fingerprints for all affected code blocks to track issues over different builds [Clang (LLVM based)] -> created fingerprints for 6 issues (skipped 9 issues) [Clang (LLVM based)] Copying affected files to Jenkins' build folder '/Users/Shared/Jenkins/Home/jobs/clang-stage1-RA/builds/16556/files-with-issues' [Clang (LLVM based)] -> 6 copied, 0 not in workspace, 9 not-found, 0 with I/O error [Pipeline] emailext Warning: lebedev.ri@gmail.com is not a recognized user, but sending mail anyway Warning: lebedev.ri@gmail.com is not a recognized user, but sending mail anyway

Hide Details

Begin Pre-Send Script... Sending email to: lebedev.ri@gmail.com ldionne@apple.com Tim Northover <tnorthover@apple.com> Azhar Mohammed <azhar@apple.com>
[Pipeline] } [Pipeline] // stage [Pipeline] } [Pipeline] // node [Pipeline] End of Pipeline [Checks API] No suitable checks publisher found. ERROR: script returned exit code 1 Finished: FAILURE