FailedConsole Output

Skipping 169 KB.. Full Log
rt.dir/MemoryBuffer.cpp.o -c /Users/buildslave/jenkins/workspace/clang-stage2-Rthinlto/llvm-project/llvm/lib/Support/MemoryBuffer.cpp
[91/3809] /Users/buildslave/jenkins/workspace/clang-stage2-Rthinlto/host-compiler/bin/clang++  -DGTEST_HAS_RTTI=0 -D__STDC_CONSTANT_MACROS -D__STDC_FORMAT_MACROS -D__STDC_LIMIT_MACROS -Ilib/Support -I/Users/buildslave/jenkins/workspace/clang-stage2-Rthinlto/llvm-project/llvm/lib/Support -I/Applications/Xcode.app/Contents/Developer/Platforms/MacOSX.platform/Developer/SDKs/MacOSX10.14.sdk/usr/include/libxml2 -Iinclude -I/Users/buildslave/jenkins/workspace/clang-stage2-Rthinlto/llvm-project/llvm/include -fno-stack-protector -fno-common -Wno-profile-instr-unprofiled -fPIC -fvisibility-inlines-hidden -Werror=date-time -Werror=unguarded-availability-new -fmodules -fmodules-cache-path=/Users/buildslave/jenkins/workspace/clang-stage2-Rthinlto/clang-build/Build/module.cache -fcxx-modules -gmodules -Wall -Wextra -Wno-unused-parameter -Wwrite-strings -Wcast-qual -Wmissing-field-initializers -pedantic -Wno-long-long -Wimplicit-fallthrough -Wcovered-switch-default -Wno-noexcept-type -Wnon-virtual-dtor -Wdelete-non-virtual-dtor -Wstring-conversion -fdiagnostics-color -flto=thin -O2 -g -DNDEBUG -isysroot /Applications/Xcode.app/Contents/Developer/Platforms/MacOSX.platform/Developer/SDKs/MacOSX10.14.sdk   -std=c++14  -fno-exceptions -fno-rtti -MD -MT lib/Support/CMakeFiles/LLVMSupport.dir/RandomNumberGenerator.cpp.o -MF lib/Support/CMakeFiles/LLVMSupport.dir/RandomNumberGenerator.cpp.o.d -o lib/Support/CMakeFiles/LLVMSupport.dir/RandomNumberGenerator.cpp.o -c /Users/buildslave/jenkins/workspace/clang-stage2-Rthinlto/llvm-project/llvm/lib/Support/RandomNumberGenerator.cpp
[92/3809] /Users/buildslave/jenkins/workspace/clang-stage2-Rthinlto/host-compiler/bin/clang++  -DGTEST_HAS_RTTI=0 -D__STDC_CONSTANT_MACROS -D__STDC_FORMAT_MACROS -D__STDC_LIMIT_MACROS -Ilib/Support -I/Users/buildslave/jenkins/workspace/clang-stage2-Rthinlto/llvm-project/llvm/lib/Support -I/Applications/Xcode.app/Contents/Developer/Platforms/MacOSX.platform/Developer/SDKs/MacOSX10.14.sdk/usr/include/libxml2 -Iinclude -I/Users/buildslave/jenkins/workspace/clang-stage2-Rthinlto/llvm-project/llvm/include -fno-stack-protector -fno-common -Wno-profile-instr-unprofiled -fPIC -fvisibility-inlines-hidden -Werror=date-time -Werror=unguarded-availability-new -fmodules -fmodules-cache-path=/Users/buildslave/jenkins/workspace/clang-stage2-Rthinlto/clang-build/Build/module.cache -fcxx-modules -gmodules -Wall -Wextra -Wno-unused-parameter -Wwrite-strings -Wcast-qual -Wmissing-field-initializers -pedantic -Wno-long-long -Wimplicit-fallthrough -Wcovered-switch-default -Wno-noexcept-type -Wnon-virtual-dtor -Wdelete-non-virtual-dtor -Wstring-conversion -fdiagnostics-color -flto=thin -O2 -g -DNDEBUG -isysroot /Applications/Xcode.app/Contents/Developer/Platforms/MacOSX.platform/Developer/SDKs/MacOSX10.14.sdk   -std=c++14  -fno-exceptions -fno-rtti -MD -MT lib/Support/CMakeFiles/LLVMSupport.dir/Parallel.cpp.o -MF lib/Support/CMakeFiles/LLVMSupport.dir/Parallel.cpp.o.d -o lib/Support/CMakeFiles/LLVMSupport.dir/Parallel.cpp.o -c /Users/buildslave/jenkins/workspace/clang-stage2-Rthinlto/llvm-project/llvm/lib/Support/Parallel.cpp
[93/3809] /Users/buildslave/jenkins/workspace/clang-stage2-Rthinlto/host-compiler/bin/clang++  -DGTEST_HAS_RTTI=0 -D__STDC_CONSTANT_MACROS -D__STDC_FORMAT_MACROS -D__STDC_LIMIT_MACROS -Ilib/Support -I/Users/buildslave/jenkins/workspace/clang-stage2-Rthinlto/llvm-project/llvm/lib/Support -I/Applications/Xcode.app/Contents/Developer/Platforms/MacOSX.platform/Developer/SDKs/MacOSX10.14.sdk/usr/include/libxml2 -Iinclude -I/Users/buildslave/jenkins/workspace/clang-stage2-Rthinlto/llvm-project/llvm/include -fno-stack-protector -fno-common -Wno-profile-instr-unprofiled -fPIC -fvisibility-inlines-hidden -Werror=date-time -Werror=unguarded-availability-new -fmodules -fmodules-cache-path=/Users/buildslave/jenkins/workspace/clang-stage2-Rthinlto/clang-build/Build/module.cache -fcxx-modules -gmodules -Wall -Wextra -Wno-unused-parameter -Wwrite-strings -Wcast-qual -Wmissing-field-initializers -pedantic -Wno-long-long -Wimplicit-fallthrough -Wcovered-switch-default -Wno-noexcept-type -Wnon-virtual-dtor -Wdelete-non-virtual-dtor -Wstring-conversion -fdiagnostics-color -flto=thin -O2 -g -DNDEBUG -isysroot /Applications/Xcode.app/Contents/Developer/Platforms/MacOSX.platform/Developer/SDKs/MacOSX10.14.sdk   -std=c++14  -fno-exceptions -fno-rtti -MD -MT lib/Support/CMakeFiles/LLVMSupport.dir/StringPool.cpp.o -MF lib/Support/CMakeFiles/LLVMSupport.dir/StringPool.cpp.o.d -o lib/Support/CMakeFiles/LLVMSupport.dir/StringPool.cpp.o -c /Users/buildslave/jenkins/workspace/clang-stage2-Rthinlto/llvm-project/llvm/lib/Support/StringPool.cpp
[94/3809] /Users/buildslave/jenkins/workspace/clang-stage2-Rthinlto/host-compiler/bin/clang++  -DGTEST_HAS_RTTI=0 -D__STDC_CONSTANT_MACROS -D__STDC_FORMAT_MACROS -D__STDC_LIMIT_MACROS -Ilib/Support -I/Users/buildslave/jenkins/workspace/clang-stage2-Rthinlto/llvm-project/llvm/lib/Support -I/Applications/Xcode.app/Contents/Developer/Platforms/MacOSX.platform/Developer/SDKs/MacOSX10.14.sdk/usr/include/libxml2 -Iinclude -I/Users/buildslave/jenkins/workspace/clang-stage2-Rthinlto/llvm-project/llvm/include -fno-stack-protector -fno-common -Wno-profile-instr-unprofiled -fPIC -fvisibility-inlines-hidden -Werror=date-time -Werror=unguarded-availability-new -fmodules -fmodules-cache-path=/Users/buildslave/jenkins/workspace/clang-stage2-Rthinlto/clang-build/Build/module.cache -fcxx-modules -gmodules -Wall -Wextra -Wno-unused-parameter -Wwrite-strings -Wcast-qual -Wmissing-field-initializers -pedantic -Wno-long-long -Wimplicit-fallthrough -Wcovered-switch-default -Wno-noexcept-type -Wnon-virtual-dtor -Wdelete-non-virtual-dtor -Wstring-conversion -fdiagnostics-color -flto=thin -O2 -g -DNDEBUG -isysroot /Applications/Xcode.app/Contents/Developer/Platforms/MacOSX.platform/Developer/SDKs/MacOSX10.14.sdk   -std=c++14  -fno-exceptions -fno-rtti -MD -MT lib/Support/CMakeFiles/LLVMSupport.dir/SystemUtils.cpp.o -MF lib/Support/CMakeFiles/LLVMSupport.dir/SystemUtils.cpp.o.d -o lib/Support/CMakeFiles/LLVMSupport.dir/SystemUtils.cpp.o -c /Users/buildslave/jenkins/workspace/clang-stage2-Rthinlto/llvm-project/llvm/lib/Support/SystemUtils.cpp
[95/3809] /Users/buildslave/jenkins/workspace/clang-stage2-Rthinlto/host-compiler/bin/clang++  -DGTEST_HAS_RTTI=0 -D__STDC_CONSTANT_MACROS -D__STDC_FORMAT_MACROS -D__STDC_LIMIT_MACROS -Ilib/Support -I/Users/buildslave/jenkins/workspace/clang-stage2-Rthinlto/llvm-project/llvm/lib/Support -I/Applications/Xcode.app/Contents/Developer/Platforms/MacOSX.platform/Developer/SDKs/MacOSX10.14.sdk/usr/include/libxml2 -Iinclude -I/Users/buildslave/jenkins/workspace/clang-stage2-Rthinlto/llvm-project/llvm/include -fno-stack-protector -fno-common -Wno-profile-instr-unprofiled -fPIC -fvisibility-inlines-hidden -Werror=date-time -Werror=unguarded-availability-new -fmodules -fmodules-cache-path=/Users/buildslave/jenkins/workspace/clang-stage2-Rthinlto/clang-build/Build/module.cache -fcxx-modules -gmodules -Wall -Wextra -Wno-unused-parameter -Wwrite-strings -Wcast-qual -Wmissing-field-initializers -pedantic -Wno-long-long -Wimplicit-fallthrough -Wcovered-switch-default -Wno-noexcept-type -Wnon-virtual-dtor -Wdelete-non-virtual-dtor -Wstring-conversion -fdiagnostics-color -flto=thin -O2 -g -DNDEBUG -isysroot /Applications/Xcode.app/Contents/Developer/Platforms/MacOSX.platform/Developer/SDKs/MacOSX10.14.sdk   -std=c++14  -fno-exceptions -fno-rtti -MD -MT lib/Support/CMakeFiles/LLVMSupport.dir/TargetParser.cpp.o -MF lib/Support/CMakeFiles/LLVMSupport.dir/TargetParser.cpp.o.d -o lib/Support/CMakeFiles/LLVMSupport.dir/TargetParser.cpp.o -c /Users/buildslave/jenkins/workspace/clang-stage2-Rthinlto/llvm-project/llvm/lib/Support/TargetParser.cpp
[96/3809] /Users/buildslave/jenkins/workspace/clang-stage2-Rthinlto/host-compiler/bin/clang++  -DGTEST_HAS_RTTI=0 -D__STDC_CONSTANT_MACROS -D__STDC_FORMAT_MACROS -D__STDC_LIMIT_MACROS -Ilib/Support -I/Users/buildslave/jenkins/workspace/clang-stage2-Rthinlto/llvm-project/llvm/lib/Support -I/Applications/Xcode.app/Contents/Developer/Platforms/MacOSX.platform/Developer/SDKs/MacOSX10.14.sdk/usr/include/libxml2 -Iinclude -I/Users/buildslave/jenkins/workspace/clang-stage2-Rthinlto/llvm-project/llvm/include -fno-stack-protector -fno-common -Wno-profile-instr-unprofiled -fPIC -fvisibility-inlines-hidden -Werror=date-time -Werror=unguarded-availability-new -fmodules -fmodules-cache-path=/Users/buildslave/jenkins/workspace/clang-stage2-Rthinlto/clang-build/Build/module.cache -fcxx-modules -gmodules -Wall -Wextra -Wno-unused-parameter -Wwrite-strings -Wcast-qual -Wmissing-field-initializers -pedantic -Wno-long-long -Wimplicit-fallthrough -Wcovered-switch-default -Wno-noexcept-type -Wnon-virtual-dtor -Wdelete-non-virtual-dtor -Wstring-conversion -fdiagnostics-color -flto=thin -O2 -g -DNDEBUG -isysroot /Applications/Xcode.app/Contents/Developer/Platforms/MacOSX.platform/Developer/SDKs/MacOSX10.14.sdk   -std=c++14  -fno-exceptions -fno-rtti -MD -MT lib/Support/CMakeFiles/LLVMSupport.dir/StringSaver.cpp.o -MF lib/Support/CMakeFiles/LLVMSupport.dir/StringSaver.cpp.o.d -o lib/Support/CMakeFiles/LLVMSupport.dir/StringSaver.cpp.o -c /Users/buildslave/jenkins/workspace/clang-stage2-Rthinlto/llvm-project/llvm/lib/Support/StringSaver.cpp
[97/3809] /Users/buildslave/jenkins/workspace/clang-stage2-Rthinlto/host-compiler/bin/clang++  -DGTEST_HAS_RTTI=0 -D__STDC_CONSTANT_MACROS -D__STDC_FORMAT_MACROS -D__STDC_LIMIT_MACROS -Ilib/Support -I/Users/buildslave/jenkins/workspace/clang-stage2-Rthinlto/llvm-project/llvm/lib/Support -I/Applications/Xcode.app/Contents/Developer/Platforms/MacOSX.platform/Developer/SDKs/MacOSX10.14.sdk/usr/include/libxml2 -Iinclude -I/Users/buildslave/jenkins/workspace/clang-stage2-Rthinlto/llvm-project/llvm/include -fno-stack-protector -fno-common -Wno-profile-instr-unprofiled -fPIC -fvisibility-inlines-hidden -Werror=date-time -Werror=unguarded-availability-new -fmodules -fmodules-cache-path=/Users/buildslave/jenkins/workspace/clang-stage2-Rthinlto/clang-build/Build/module.cache -fcxx-modules -gmodules -Wall -Wextra -Wno-unused-parameter -Wwrite-strings -Wcast-qual -Wmissing-field-initializers -pedantic -Wno-long-long -Wimplicit-fallthrough -Wcovered-switch-default -Wno-noexcept-type -Wnon-virtual-dtor -Wdelete-non-virtual-dtor -Wstring-conversion -fdiagnostics-color -flto=thin -O2 -g -DNDEBUG -isysroot /Applications/Xcode.app/Contents/Developer/Platforms/MacOSX.platform/Developer/SDKs/MacOSX10.14.sdk   -std=c++14  -fno-exceptions -fno-rtti -MD -MT lib/Support/CMakeFiles/LLVMSupport.dir/SymbolRemappingReader.cpp.o -MF lib/Support/CMakeFiles/LLVMSupport.dir/SymbolRemappingReader.cpp.o.d -o lib/Support/CMakeFiles/LLVMSupport.dir/SymbolRemappingReader.cpp.o -c /Users/buildslave/jenkins/workspace/clang-stage2-Rthinlto/llvm-project/llvm/lib/Support/SymbolRemappingReader.cpp
[98/3809] /Users/buildslave/jenkins/workspace/clang-stage2-Rthinlto/host-compiler/bin/clang++  -DGTEST_HAS_RTTI=0 -D__STDC_CONSTANT_MACROS -D__STDC_FORMAT_MACROS -D__STDC_LIMIT_MACROS -Ilib/Support -I/Users/buildslave/jenkins/workspace/clang-stage2-Rthinlto/llvm-project/llvm/lib/Support -I/Applications/Xcode.app/Contents/Developer/Platforms/MacOSX.platform/Developer/SDKs/MacOSX10.14.sdk/usr/include/libxml2 -Iinclude -I/Users/buildslave/jenkins/workspace/clang-stage2-Rthinlto/llvm-project/llvm/include -fno-stack-protector -fno-common -Wno-profile-instr-unprofiled -fPIC -fvisibility-inlines-hidden -Werror=date-time -Werror=unguarded-availability-new -fmodules -fmodules-cache-path=/Users/buildslave/jenkins/workspace/clang-stage2-Rthinlto/clang-build/Build/module.cache -fcxx-modules -gmodules -Wall -Wextra -Wno-unused-parameter -Wwrite-strings -Wcast-qual -Wmissing-field-initializers -pedantic -Wno-long-long -Wimplicit-fallthrough -Wcovered-switch-default -Wno-noexcept-type -Wnon-virtual-dtor -Wdelete-non-virtual-dtor -Wstring-conversion -fdiagnostics-color -flto=thin -O2 -g -DNDEBUG -isysroot /Applications/Xcode.app/Contents/Developer/Platforms/MacOSX.platform/Developer/SDKs/MacOSX10.14.sdk   -std=c++14  -fno-exceptions -fno-rtti -MD -MT lib/Support/CMakeFiles/LLVMSupport.dir/StringRef.cpp.o -MF lib/Support/CMakeFiles/LLVMSupport.dir/StringRef.cpp.o.d -o lib/Support/CMakeFiles/LLVMSupport.dir/StringRef.cpp.o -c /Users/buildslave/jenkins/workspace/clang-stage2-Rthinlto/llvm-project/llvm/lib/Support/StringRef.cpp
[99/3809] /Users/buildslave/jenkins/workspace/clang-stage2-Rthinlto/host-compiler/bin/clang++  -DGTEST_HAS_RTTI=0 -D__STDC_CONSTANT_MACROS -D__STDC_FORMAT_MACROS -D__STDC_LIMIT_MACROS -Ilib/Support -I/Users/buildslave/jenkins/workspace/clang-stage2-Rthinlto/llvm-project/llvm/lib/Support -I/Applications/Xcode.app/Contents/Developer/Platforms/MacOSX.platform/Developer/SDKs/MacOSX10.14.sdk/usr/include/libxml2 -Iinclude -I/Users/buildslave/jenkins/workspace/clang-stage2-Rthinlto/llvm-project/llvm/include -fno-stack-protector -fno-common -Wno-profile-instr-unprofiled -fPIC -fvisibility-inlines-hidden -Werror=date-time -Werror=unguarded-availability-new -fmodules -fmodules-cache-path=/Users/buildslave/jenkins/workspace/clang-stage2-Rthinlto/clang-build/Build/module.cache -fcxx-modules -gmodules -Wall -Wextra -Wno-unused-parameter -Wwrite-strings -Wcast-qual -Wmissing-field-initializers -pedantic -Wno-long-long -Wimplicit-fallthrough -Wcovered-switch-default -Wno-noexcept-type -Wnon-virtual-dtor -Wdelete-non-virtual-dtor -Wstring-conversion -fdiagnostics-color -flto=thin -O2 -g -DNDEBUG -isysroot /Applications/Xcode.app/Contents/Developer/Platforms/MacOSX.platform/Developer/SDKs/MacOSX10.14.sdk   -std=c++14  -fno-exceptions -fno-rtti -MD -MT lib/Support/CMakeFiles/LLVMSupport.dir/JSON.cpp.o -MF lib/Support/CMakeFiles/LLVMSupport.dir/JSON.cpp.o.d -o lib/Support/CMakeFiles/LLVMSupport.dir/JSON.cpp.o -c /Users/buildslave/jenkins/workspace/clang-stage2-Rthinlto/llvm-project/llvm/lib/Support/JSON.cpp
[100/3809] /Users/buildslave/jenkins/workspace/clang-stage2-Rthinlto/host-compiler/bin/clang++  -DGTEST_HAS_RTTI=0 -D__STDC_CONSTANT_MACROS -D__STDC_FORMAT_MACROS -D__STDC_LIMIT_MACROS -Ilib/Support -I/Users/buildslave/jenkins/workspace/clang-stage2-Rthinlto/llvm-project/llvm/lib/Support -I/Applications/Xcode.app/Contents/Developer/Platforms/MacOSX.platform/Developer/SDKs/MacOSX10.14.sdk/usr/include/libxml2 -Iinclude -I/Users/buildslave/jenkins/workspace/clang-stage2-Rthinlto/llvm-project/llvm/include -fno-stack-protector -fno-common -Wno-profile-instr-unprofiled -fPIC -fvisibility-inlines-hidden -Werror=date-time -Werror=unguarded-availability-new -fmodules -fmodules-cache-path=/Users/buildslave/jenkins/workspace/clang-stage2-Rthinlto/clang-build/Build/module.cache -fcxx-modules -gmodules -Wall -Wextra -Wno-unused-parameter -Wwrite-strings -Wcast-qual -Wmissing-field-initializers -pedantic -Wno-long-long -Wimplicit-fallthrough -Wcovered-switch-default -Wno-noexcept-type -Wnon-virtual-dtor -Wdelete-non-virtual-dtor -Wstring-conversion -fdiagnostics-color -flto=thin -O2 -g -DNDEBUG -isysroot /Applications/Xcode.app/Contents/Developer/Platforms/MacOSX.platform/Developer/SDKs/MacOSX10.14.sdk   -std=c++14  -fno-exceptions -fno-rtti -MD -MT lib/Support/CMakeFiles/LLVMSupport.dir/ToolOutputFile.cpp.o -MF lib/Support/CMakeFiles/LLVMSupport.dir/ToolOutputFile.cpp.o.d -o lib/Support/CMakeFiles/LLVMSupport.dir/ToolOutputFile.cpp.o -c /Users/buildslave/jenkins/workspace/clang-stage2-Rthinlto/llvm-project/llvm/lib/Support/ToolOutputFile.cpp
[101/3809] /Users/buildslave/jenkins/workspace/clang-stage2-Rthinlto/host-compiler/bin/clang++  -DGTEST_HAS_RTTI=0 -D__STDC_CONSTANT_MACROS -D__STDC_FORMAT_MACROS -D__STDC_LIMIT_MACROS -Ilib/Support -I/Users/buildslave/jenkins/workspace/clang-stage2-Rthinlto/llvm-project/llvm/lib/Support -I/Applications/Xcode.app/Contents/Developer/Platforms/MacOSX.platform/Developer/SDKs/MacOSX10.14.sdk/usr/include/libxml2 -Iinclude -I/Users/buildslave/jenkins/workspace/clang-stage2-Rthinlto/llvm-project/llvm/include -fno-stack-protector -fno-common -Wno-profile-instr-unprofiled -fPIC -fvisibility-inlines-hidden -Werror=date-time -Werror=unguarded-availability-new -fmodules -fmodules-cache-path=/Users/buildslave/jenkins/workspace/clang-stage2-Rthinlto/clang-build/Build/module.cache -fcxx-modules -gmodules -Wall -Wextra -Wno-unused-parameter -Wwrite-strings -Wcast-qual -Wmissing-field-initializers -pedantic -Wno-long-long -Wimplicit-fallthrough -Wcovered-switch-default -Wno-noexcept-type -Wnon-virtual-dtor -Wdelete-non-virtual-dtor -Wstring-conversion -fdiagnostics-color -flto=thin -O2 -g -DNDEBUG -isysroot /Applications/Xcode.app/Contents/Developer/Platforms/MacOSX.platform/Developer/SDKs/MacOSX10.14.sdk   -std=c++14  -fno-exceptions -fno-rtti -MD -MT lib/Support/CMakeFiles/LLVMSupport.dir/TarWriter.cpp.o -MF lib/Support/CMakeFiles/LLVMSupport.dir/TarWriter.cpp.o.d -o lib/Support/CMakeFiles/LLVMSupport.dir/TarWriter.cpp.o -c /Users/buildslave/jenkins/workspace/clang-stage2-Rthinlto/llvm-project/llvm/lib/Support/TarWriter.cpp
[102/3809] /Users/buildslave/jenkins/workspace/clang-stage2-Rthinlto/host-compiler/bin/clang++  -DGTEST_HAS_RTTI=0 -D__STDC_CONSTANT_MACROS -D__STDC_FORMAT_MACROS -D__STDC_LIMIT_MACROS -Ilib/Support -I/Users/buildslave/jenkins/workspace/clang-stage2-Rthinlto/llvm-project/llvm/lib/Support -I/Applications/Xcode.app/Contents/Developer/Platforms/MacOSX.platform/Developer/SDKs/MacOSX10.14.sdk/usr/include/libxml2 -Iinclude -I/Users/buildslave/jenkins/workspace/clang-stage2-Rthinlto/llvm-project/llvm/include -fno-stack-protector -fno-common -Wno-profile-instr-unprofiled -fPIC -fvisibility-inlines-hidden -Werror=date-time -Werror=unguarded-availability-new -fmodules -fmodules-cache-path=/Users/buildslave/jenkins/workspace/clang-stage2-Rthinlto/clang-build/Build/module.cache -fcxx-modules -gmodules -Wall -Wextra -Wno-unused-parameter -Wwrite-strings -Wcast-qual -Wmissing-field-initializers -pedantic -Wno-long-long -Wimplicit-fallthrough -Wcovered-switch-default -Wno-noexcept-type -Wnon-virtual-dtor -Wdelete-non-virtual-dtor -Wstring-conversion -fdiagnostics-color -flto=thin -O2 -g -DNDEBUG -isysroot /Applications/Xcode.app/Contents/Developer/Platforms/MacOSX.platform/Developer/SDKs/MacOSX10.14.sdk   -std=c++14  -fno-exceptions -fno-rtti -MD -MT lib/Support/CMakeFiles/LLVMSupport.dir/Unicode.cpp.o -MF lib/Support/CMakeFiles/LLVMSupport.dir/Unicode.cpp.o.d -o lib/Support/CMakeFiles/LLVMSupport.dir/Unicode.cpp.o -c /Users/buildslave/jenkins/workspace/clang-stage2-Rthinlto/llvm-project/llvm/lib/Support/Unicode.cpp
[103/3809] /Users/buildslave/jenkins/workspace/clang-stage2-Rthinlto/host-compiler/bin/clang++  -DGTEST_HAS_RTTI=0 -D__STDC_CONSTANT_MACROS -D__STDC_FORMAT_MACROS -D__STDC_LIMIT_MACROS -Ilib/Support -I/Users/buildslave/jenkins/workspace/clang-stage2-Rthinlto/llvm-project/llvm/lib/Support -I/Applications/Xcode.app/Contents/Developer/Platforms/MacOSX.platform/Developer/SDKs/MacOSX10.14.sdk/usr/include/libxml2 -Iinclude -I/Users/buildslave/jenkins/workspace/clang-stage2-Rthinlto/llvm-project/llvm/include -fno-stack-protector -fno-common -Wno-profile-instr-unprofiled -fPIC -fvisibility-inlines-hidden -Werror=date-time -Werror=unguarded-availability-new -fmodules -fmodules-cache-path=/Users/buildslave/jenkins/workspace/clang-stage2-Rthinlto/clang-build/Build/module.cache -fcxx-modules -gmodules -Wall -Wextra -Wno-unused-parameter -Wwrite-strings -Wcast-qual -Wmissing-field-initializers -pedantic -Wno-long-long -Wimplicit-fallthrough -Wcovered-switch-default -Wno-noexcept-type -Wnon-virtual-dtor -Wdelete-non-virtual-dtor -Wstring-conversion -fdiagnostics-color -flto=thin -O2 -g -DNDEBUG -isysroot /Applications/Xcode.app/Contents/Developer/Platforms/MacOSX.platform/Developer/SDKs/MacOSX10.14.sdk   -std=c++14  -fno-exceptions -fno-rtti -MD -MT lib/Support/CMakeFiles/LLVMSupport.dir/Twine.cpp.o -MF lib/Support/CMakeFiles/LLVMSupport.dir/Twine.cpp.o.d -o lib/Support/CMakeFiles/LLVMSupport.dir/Twine.cpp.o -c /Users/buildslave/jenkins/workspace/clang-stage2-Rthinlto/llvm-project/llvm/lib/Support/Twine.cpp
[104/3809] /Users/buildslave/jenkins/workspace/clang-stage2-Rthinlto/host-compiler/bin/clang++  -DGTEST_HAS_RTTI=0 -D__STDC_CONSTANT_MACROS -D__STDC_FORMAT_MACROS -D__STDC_LIMIT_MACROS -Ilib/Support -I/Users/buildslave/jenkins/workspace/clang-stage2-Rthinlto/llvm-project/llvm/lib/Support -I/Applications/Xcode.app/Contents/Developer/Platforms/MacOSX.platform/Developer/SDKs/MacOSX10.14.sdk/usr/include/libxml2 -Iinclude -I/Users/buildslave/jenkins/workspace/clang-stage2-Rthinlto/llvm-project/llvm/include -fno-stack-protector -fno-common -Wno-profile-instr-unprofiled -fPIC -fvisibility-inlines-hidden -Werror=date-time -Werror=unguarded-availability-new -fmodules -fmodules-cache-path=/Users/buildslave/jenkins/workspace/clang-stage2-Rthinlto/clang-build/Build/module.cache -fcxx-modules -gmodules -Wall -Wextra -Wno-unused-parameter -Wwrite-strings -Wcast-qual -Wmissing-field-initializers -pedantic -Wno-long-long -Wimplicit-fallthrough -Wcovered-switch-default -Wno-noexcept-type -Wnon-virtual-dtor -Wdelete-non-virtual-dtor -Wstring-conversion -fdiagnostics-color -flto=thin -O2 -g -DNDEBUG -isysroot /Applications/Xcode.app/Contents/Developer/Platforms/MacOSX.platform/Developer/SDKs/MacOSX10.14.sdk   -std=c++14  -fno-exceptions -fno-rtti -MD -MT lib/Support/CMakeFiles/LLVMSupport.dir/UnicodeCaseFold.cpp.o -MF lib/Support/CMakeFiles/LLVMSupport.dir/UnicodeCaseFold.cpp.o.d -o lib/Support/CMakeFiles/LLVMSupport.dir/UnicodeCaseFold.cpp.o -c /Users/buildslave/jenkins/workspace/clang-stage2-Rthinlto/llvm-project/llvm/lib/Support/UnicodeCaseFold.cpp
[105/3809] /Users/buildslave/jenkins/workspace/clang-stage2-Rthinlto/host-compiler/bin/clang++  -DGTEST_HAS_RTTI=0 -D__STDC_CONSTANT_MACROS -D__STDC_FORMAT_MACROS -D__STDC_LIMIT_MACROS -Ilib/Support -I/Users/buildslave/jenkins/workspace/clang-stage2-Rthinlto/llvm-project/llvm/lib/Support -I/Applications/Xcode.app/Contents/Developer/Platforms/MacOSX.platform/Developer/SDKs/MacOSX10.14.sdk/usr/include/libxml2 -Iinclude -I/Users/buildslave/jenkins/workspace/clang-stage2-Rthinlto/llvm-project/llvm/include -fno-stack-protector -fno-common -Wno-profile-instr-unprofiled -fPIC -fvisibility-inlines-hidden -Werror=date-time -Werror=unguarded-availability-new -fmodules -fmodules-cache-path=/Users/buildslave/jenkins/workspace/clang-stage2-Rthinlto/clang-build/Build/module.cache -fcxx-modules -gmodules -Wall -Wextra -Wno-unused-parameter -Wwrite-strings -Wcast-qual -Wmissing-field-initializers -pedantic -Wno-long-long -Wimplicit-fallthrough -Wcovered-switch-default -Wno-noexcept-type -Wnon-virtual-dtor -Wdelete-non-virtual-dtor -Wstring-conversion -fdiagnostics-color -flto=thin -O2 -g -DNDEBUG -isysroot /Applications/Xcode.app/Contents/Developer/Platforms/MacOSX.platform/Developer/SDKs/MacOSX10.14.sdk   -std=c++14  -fno-exceptions -fno-rtti -MD -MT lib/Support/CMakeFiles/LLVMSupport.dir/SpecialCaseList.cpp.o -MF lib/Support/CMakeFiles/LLVMSupport.dir/SpecialCaseList.cpp.o.d -o lib/Support/CMakeFiles/LLVMSupport.dir/SpecialCaseList.cpp.o -c /Users/buildslave/jenkins/workspace/clang-stage2-Rthinlto/llvm-project/llvm/lib/Support/SpecialCaseList.cpp
[106/3809] /Users/buildslave/jenkins/workspace/clang-stage2-Rthinlto/host-compiler/bin/clang++  -DGTEST_HAS_RTTI=0 -D__STDC_CONSTANT_MACROS -D__STDC_FORMAT_MACROS -D__STDC_LIMIT_MACROS -Ilib/Support -I/Users/buildslave/jenkins/workspace/clang-stage2-Rthinlto/llvm-project/llvm/lib/Support -I/Applications/Xcode.app/Contents/Developer/Platforms/MacOSX.platform/Developer/SDKs/MacOSX10.14.sdk/usr/include/libxml2 -Iinclude -I/Users/buildslave/jenkins/workspace/clang-stage2-Rthinlto/llvm-project/llvm/include -fno-stack-protector -fno-common -Wno-profile-instr-unprofiled -fPIC -fvisibility-inlines-hidden -Werror=date-time -Werror=unguarded-availability-new -fmodules -fmodules-cache-path=/Users/buildslave/jenkins/workspace/clang-stage2-Rthinlto/clang-build/Build/module.cache -fcxx-modules -gmodules -Wall -Wextra -Wno-unused-parameter -Wwrite-strings -Wcast-qual -Wmissing-field-initializers -pedantic -Wno-long-long -Wimplicit-fallthrough -Wcovered-switch-default -Wno-noexcept-type -Wnon-virtual-dtor -Wdelete-non-virtual-dtor -Wstring-conversion -fdiagnostics-color -flto=thin -O2 -g -DNDEBUG -isysroot /Applications/Xcode.app/Contents/Developer/Platforms/MacOSX.platform/Developer/SDKs/MacOSX10.14.sdk   -std=c++14  -fno-exceptions -fno-rtti -MD -MT lib/Support/CMakeFiles/LLVMSupport.dir/Statistic.cpp.o -MF lib/Support/CMakeFiles/LLVMSupport.dir/Statistic.cpp.o.d -o lib/Support/CMakeFiles/LLVMSupport.dir/Statistic.cpp.o -c /Users/buildslave/jenkins/workspace/clang-stage2-Rthinlto/llvm-project/llvm/lib/Support/Statistic.cpp
[107/3809] /Users/buildslave/jenkins/workspace/clang-stage2-Rthinlto/host-compiler/bin/clang++  -DGTEST_HAS_RTTI=0 -D__STDC_CONSTANT_MACROS -D__STDC_FORMAT_MACROS -D__STDC_LIMIT_MACROS -Ilib/Support -I/Users/buildslave/jenkins/workspace/clang-stage2-Rthinlto/llvm-project/llvm/lib/Support -I/Applications/Xcode.app/Contents/Developer/Platforms/MacOSX.platform/Developer/SDKs/MacOSX10.14.sdk/usr/include/libxml2 -Iinclude -I/Users/buildslave/jenkins/workspace/clang-stage2-Rthinlto/llvm-project/llvm/include -fno-stack-protector -fno-common -Wno-profile-instr-unprofiled -fPIC -fvisibility-inlines-hidden -Werror=date-time -Werror=unguarded-availability-new -fmodules -fmodules-cache-path=/Users/buildslave/jenkins/workspace/clang-stage2-Rthinlto/clang-build/Build/module.cache -fcxx-modules -gmodules -Wall -Wextra -Wno-unused-parameter -Wwrite-strings -Wcast-qual -Wmissing-field-initializers -pedantic -Wno-long-long -Wimplicit-fallthrough -Wcovered-switch-default -Wno-noexcept-type -Wnon-virtual-dtor -Wdelete-non-virtual-dtor -Wstring-conversion -fdiagnostics-color -flto=thin -O2 -g -DNDEBUG -isysroot /Applications/Xcode.app/Contents/Developer/Platforms/MacOSX.platform/Developer/SDKs/MacOSX10.14.sdk   -std=c++14  -fno-exceptions -fno-rtti -MD -MT lib/Support/CMakeFiles/LLVMSupport.dir/VersionTuple.cpp.o -MF lib/Support/CMakeFiles/LLVMSupport.dir/VersionTuple.cpp.o.d -o lib/Support/CMakeFiles/LLVMSupport.dir/VersionTuple.cpp.o -c /Users/buildslave/jenkins/workspace/clang-stage2-Rthinlto/llvm-project/llvm/lib/Support/VersionTuple.cpp
[108/3809] /Users/buildslave/jenkins/workspace/clang-stage2-Rthinlto/host-compiler/bin/clang++  -DGTEST_HAS_RTTI=0 -D__STDC_CONSTANT_MACROS -D__STDC_FORMAT_MACROS -D__STDC_LIMIT_MACROS -Ilib/Support -I/Users/buildslave/jenkins/workspace/clang-stage2-Rthinlto/llvm-project/llvm/lib/Support -I/Applications/Xcode.app/Contents/Developer/Platforms/MacOSX.platform/Developer/SDKs/MacOSX10.14.sdk/usr/include/libxml2 -Iinclude -I/Users/buildslave/jenkins/workspace/clang-stage2-Rthinlto/llvm-project/llvm/include -fno-stack-protector -fno-common -Wno-profile-instr-unprofiled -fPIC -fvisibility-inlines-hidden -Werror=date-time -Werror=unguarded-availability-new -fmodules -fmodules-cache-path=/Users/buildslave/jenkins/workspace/clang-stage2-Rthinlto/clang-build/Build/module.cache -fcxx-modules -gmodules -Wall -Wextra -Wno-unused-parameter -Wwrite-strings -Wcast-qual -Wmissing-field-initializers -pedantic -Wno-long-long -Wimplicit-fallthrough -Wcovered-switch-default -Wno-noexcept-type -Wnon-virtual-dtor -Wdelete-non-virtual-dtor -Wstring-conversion -fdiagnostics-color -flto=thin -O2 -g -DNDEBUG -isysroot /Applications/Xcode.app/Contents/Developer/Platforms/MacOSX.platform/Developer/SDKs/MacOSX10.14.sdk   -std=c++14  -fno-exceptions -fno-rtti -MD -MT lib/Support/CMakeFiles/LLVMSupport.dir/ThreadPool.cpp.o -MF lib/Support/CMakeFiles/LLVMSupport.dir/ThreadPool.cpp.o.d -o lib/Support/CMakeFiles/LLVMSupport.dir/ThreadPool.cpp.o -c /Users/buildslave/jenkins/workspace/clang-stage2-Rthinlto/llvm-project/llvm/lib/Support/ThreadPool.cpp
[109/3809] /Users/buildslave/jenkins/workspace/clang-stage2-Rthinlto/host-compiler/bin/clang++  -DGTEST_HAS_RTTI=0 -D__STDC_CONSTANT_MACROS -D__STDC_FORMAT_MACROS -D__STDC_LIMIT_MACROS -Ilib/Support -I/Users/buildslave/jenkins/workspace/clang-stage2-Rthinlto/llvm-project/llvm/lib/Support -I/Applications/Xcode.app/Contents/Developer/Platforms/MacOSX.platform/Developer/SDKs/MacOSX10.14.sdk/usr/include/libxml2 -Iinclude -I/Users/buildslave/jenkins/workspace/clang-stage2-Rthinlto/llvm-project/llvm/include -fno-stack-protector -fno-common -Wno-profile-instr-unprofiled -fPIC -fvisibility-inlines-hidden -Werror=date-time -Werror=unguarded-availability-new -fmodules -fmodules-cache-path=/Users/buildslave/jenkins/workspace/clang-stage2-Rthinlto/clang-build/Build/module.cache -fcxx-modules -gmodules -Wall -Wextra -Wno-unused-parameter -Wwrite-strings -Wcast-qual -Wmissing-field-initializers -pedantic -Wno-long-long -Wimplicit-fallthrough -Wcovered-switch-default -Wno-noexcept-type -Wnon-virtual-dtor -Wdelete-non-virtual-dtor -Wstring-conversion -fdiagnostics-color -flto=thin -O2 -g -DNDEBUG -isysroot /Applications/Xcode.app/Contents/Developer/Platforms/MacOSX.platform/Developer/SDKs/MacOSX10.14.sdk   -std=c++14  -fno-exceptions -fno-rtti -MD -MT lib/Support/CMakeFiles/LLVMSupport.dir/raw_os_ostream.cpp.o -MF lib/Support/CMakeFiles/LLVMSupport.dir/raw_os_ostream.cpp.o.d -o lib/Support/CMakeFiles/LLVMSupport.dir/raw_os_ostream.cpp.o -c /Users/buildslave/jenkins/workspace/clang-stage2-Rthinlto/llvm-project/llvm/lib/Support/raw_os_ostream.cpp
[110/3809] /Users/buildslave/jenkins/workspace/clang-stage2-Rthinlto/host-compiler/bin/clang++  -DGTEST_HAS_RTTI=0 -D__STDC_CONSTANT_MACROS -D__STDC_FORMAT_MACROS -D__STDC_LIMIT_MACROS -Ilib/Support -I/Users/buildslave/jenkins/workspace/clang-stage2-Rthinlto/llvm-project/llvm/lib/Support -I/Applications/Xcode.app/Contents/Developer/Platforms/MacOSX.platform/Developer/SDKs/MacOSX10.14.sdk/usr/include/libxml2 -Iinclude -I/Users/buildslave/jenkins/workspace/clang-stage2-Rthinlto/llvm-project/llvm/include -fno-stack-protector -fno-common -Wno-profile-instr-unprofiled -fPIC -fvisibility-inlines-hidden -Werror=date-time -Werror=unguarded-availability-new -fmodules -fmodules-cache-path=/Users/buildslave/jenkins/workspace/clang-stage2-Rthinlto/clang-build/Build/module.cache -fcxx-modules -gmodules -Wall -Wextra -Wno-unused-parameter -Wwrite-strings -Wcast-qual -Wmissing-field-initializers -pedantic -Wno-long-long -Wimplicit-fallthrough -Wcovered-switch-default -Wno-noexcept-type -Wnon-virtual-dtor -Wdelete-non-virtual-dtor -Wstring-conversion -fdiagnostics-color -flto=thin -O2 -g -DNDEBUG -isysroot /Applications/Xcode.app/Contents/Developer/Platforms/MacOSX.platform/Developer/SDKs/MacOSX10.14.sdk   -std=c++14  -fno-exceptions -fno-rtti -MD -MT lib/Support/CMakeFiles/LLVMSupport.dir/SourceMgr.cpp.o -MF lib/Support/CMakeFiles/LLVMSupport.dir/SourceMgr.cpp.o.d -o lib/Support/CMakeFiles/LLVMSupport.dir/SourceMgr.cpp.o -c /Users/buildslave/jenkins/workspace/clang-stage2-Rthinlto/llvm-project/llvm/lib/Support/SourceMgr.cpp
[111/3809] /Users/buildslave/jenkins/workspace/clang-stage2-Rthinlto/host-compiler/bin/clang++  -DGTEST_HAS_RTTI=0 -D__STDC_CONSTANT_MACROS -D__STDC_FORMAT_MACROS -D__STDC_LIMIT_MACROS -Ilib/Support -I/Users/buildslave/jenkins/workspace/clang-stage2-Rthinlto/llvm-project/llvm/lib/Support -I/Applications/Xcode.app/Contents/Developer/Platforms/MacOSX.platform/Developer/SDKs/MacOSX10.14.sdk/usr/include/libxml2 -Iinclude -I/Users/buildslave/jenkins/workspace/clang-stage2-Rthinlto/llvm-project/llvm/include -fno-stack-protector -fno-common -Wno-profile-instr-unprofiled -fPIC -fvisibility-inlines-hidden -Werror=date-time -Werror=unguarded-availability-new -fmodules -fmodules-cache-path=/Users/buildslave/jenkins/workspace/clang-stage2-Rthinlto/clang-build/Build/module.cache -fcxx-modules -gmodules -Wall -Wextra -Wno-unused-parameter -Wwrite-strings -Wcast-qual -Wmissing-field-initializers -pedantic -Wno-long-long -Wimplicit-fallthrough -Wcovered-switch-default -Wno-noexcept-type -Wnon-virtual-dtor -Wdelete-non-virtual-dtor -Wstring-conversion -fdiagnostics-color -flto=thin -O2 -g -DNDEBUG -isysroot /Applications/Xcode.app/Contents/Developer/Platforms/MacOSX.platform/Developer/SDKs/MacOSX10.14.sdk   -std=c++14  -fno-exceptions -fno-rtti -MD -MT lib/Support/CMakeFiles/LLVMSupport.dir/TrigramIndex.cpp.o -MF lib/Support/CMakeFiles/LLVMSupport.dir/TrigramIndex.cpp.o.d -o lib/Support/CMakeFiles/LLVMSupport.dir/TrigramIndex.cpp.o -c /Users/buildslave/jenkins/workspace/clang-stage2-Rthinlto/llvm-project/llvm/lib/Support/TrigramIndex.cpp
[112/3809] /Users/buildslave/jenkins/workspace/clang-stage2-Rthinlto/host-compiler/bin/clang++  -DGTEST_HAS_RTTI=0 -D__STDC_CONSTANT_MACROS -D__STDC_FORMAT_MACROS -D__STDC_LIMIT_MACROS -Ilib/Support -I/Users/buildslave/jenkins/workspace/clang-stage2-Rthinlto/llvm-project/llvm/lib/Support -I/Applications/Xcode.app/Contents/Developer/Platforms/MacOSX.platform/Developer/SDKs/MacOSX10.14.sdk/usr/include/libxml2 -Iinclude -I/Users/buildslave/jenkins/workspace/clang-stage2-Rthinlto/llvm-project/llvm/include -fno-stack-protector -fno-common -Wno-profile-instr-unprofiled -fPIC -fvisibility-inlines-hidden -Werror=date-time -Werror=unguarded-availability-new -fmodules -fmodules-cache-path=/Users/buildslave/jenkins/workspace/clang-stage2-Rthinlto/clang-build/Build/module.cache -fcxx-modules -gmodules -Wall -Wextra -Wno-unused-parameter -Wwrite-strings -Wcast-qual -Wmissing-field-initializers -pedantic -Wno-long-long -Wimplicit-fallthrough -Wcovered-switch-default -Wno-noexcept-type -Wnon-virtual-dtor -Wdelete-non-virtual-dtor -Wstring-conversion -fdiagnostics-color -flto=thin -O2 -g -DNDEBUG -isysroot /Applications/Xcode.app/Contents/Developer/Platforms/MacOSX.platform/Developer/SDKs/MacOSX10.14.sdk   -std=c++14  -fno-exceptions -fno-rtti -MD -MT lib/Support/CMakeFiles/LLVMSupport.dir/TimeProfiler.cpp.o -MF lib/Support/CMakeFiles/LLVMSupport.dir/TimeProfiler.cpp.o.d -o lib/Support/CMakeFiles/LLVMSupport.dir/TimeProfiler.cpp.o -c /Users/buildslave/jenkins/workspace/clang-stage2-Rthinlto/llvm-project/llvm/lib/Support/TimeProfiler.cpp
[113/3809] /Users/buildslave/jenkins/workspace/clang-stage2-Rthinlto/host-compiler/bin/clang -DGTEST_HAS_RTTI=0 -D__STDC_CONSTANT_MACROS -D__STDC_FORMAT_MACROS -D__STDC_LIMIT_MACROS -Ilib/Support -I/Users/buildslave/jenkins/workspace/clang-stage2-Rthinlto/llvm-project/llvm/lib/Support -I/Applications/Xcode.app/Contents/Developer/Platforms/MacOSX.platform/Developer/SDKs/MacOSX10.14.sdk/usr/include/libxml2 -Iinclude -I/Users/buildslave/jenkins/workspace/clang-stage2-Rthinlto/llvm-project/llvm/include -fno-stack-protector -fno-common -Wno-profile-instr-unprofiled -fPIC -Werror=date-time -Werror=unguarded-availability-new -Wall -Wextra -Wno-unused-parameter -Wwrite-strings -Wmissing-field-initializers -pedantic -Wno-long-long -Wimplicit-fallthrough -Wcovered-switch-default -Wdelete-non-virtual-dtor -Wstring-conversion -fdiagnostics-color -flto=thin -O2 -g -DNDEBUG -isysroot /Applications/Xcode.app/Contents/Developer/Platforms/MacOSX.platform/Developer/SDKs/MacOSX10.14.sdk -MD -MT lib/Support/CMakeFiles/LLVMSupport.dir/regerror.c.o -MF lib/Support/CMakeFiles/LLVMSupport.dir/regerror.c.o.d -o lib/Support/CMakeFiles/LLVMSupport.dir/regerror.c.o   -c /Users/buildslave/jenkins/workspace/clang-stage2-Rthinlto/llvm-project/llvm/lib/Support/regerror.c
[114/3809] /Users/buildslave/jenkins/workspace/clang-stage2-Rthinlto/host-compiler/bin/clang -DGTEST_HAS_RTTI=0 -D__STDC_CONSTANT_MACROS -D__STDC_FORMAT_MACROS -D__STDC_LIMIT_MACROS -Ilib/Support -I/Users/buildslave/jenkins/workspace/clang-stage2-Rthinlto/llvm-project/llvm/lib/Support -I/Applications/Xcode.app/Contents/Developer/Platforms/MacOSX.platform/Developer/SDKs/MacOSX10.14.sdk/usr/include/libxml2 -Iinclude -I/Users/buildslave/jenkins/workspace/clang-stage2-Rthinlto/llvm-project/llvm/include -fno-stack-protector -fno-common -Wno-profile-instr-unprofiled -fPIC -Werror=date-time -Werror=unguarded-availability-new -Wall -Wextra -Wno-unused-parameter -Wwrite-strings -Wmissing-field-initializers -pedantic -Wno-long-long -Wimplicit-fallthrough -Wcovered-switch-default -Wdelete-non-virtual-dtor -Wstring-conversion -fdiagnostics-color -flto=thin -O2 -g -DNDEBUG -isysroot /Applications/Xcode.app/Contents/Developer/Platforms/MacOSX.platform/Developer/SDKs/MacOSX10.14.sdk -MD -MT lib/Support/CMakeFiles/LLVMSupport.dir/regfree.c.o -MF lib/Support/CMakeFiles/LLVMSupport.dir/regfree.c.o.d -o lib/Support/CMakeFiles/LLVMSupport.dir/regfree.c.o   -c /Users/buildslave/jenkins/workspace/clang-stage2-Rthinlto/llvm-project/llvm/lib/Support/regfree.c
[115/3809] /Users/buildslave/jenkins/workspace/clang-stage2-Rthinlto/host-compiler/bin/clang -DGTEST_HAS_RTTI=0 -D__STDC_CONSTANT_MACROS -D__STDC_FORMAT_MACROS -D__STDC_LIMIT_MACROS -Ilib/Support -I/Users/buildslave/jenkins/workspace/clang-stage2-Rthinlto/llvm-project/llvm/lib/Support -I/Applications/Xcode.app/Contents/Developer/Platforms/MacOSX.platform/Developer/SDKs/MacOSX10.14.sdk/usr/include/libxml2 -Iinclude -I/Users/buildslave/jenkins/workspace/clang-stage2-Rthinlto/llvm-project/llvm/include -fno-stack-protector -fno-common -Wno-profile-instr-unprofiled -fPIC -Werror=date-time -Werror=unguarded-availability-new -Wall -Wextra -Wno-unused-parameter -Wwrite-strings -Wmissing-field-initializers -pedantic -Wno-long-long -Wimplicit-fallthrough -Wcovered-switch-default -Wdelete-non-virtual-dtor -Wstring-conversion -fdiagnostics-color -flto=thin -O2 -g -DNDEBUG -isysroot /Applications/Xcode.app/Contents/Developer/Platforms/MacOSX.platform/Developer/SDKs/MacOSX10.14.sdk -MD -MT lib/Support/CMakeFiles/LLVMSupport.dir/regstrlcpy.c.o -MF lib/Support/CMakeFiles/LLVMSupport.dir/regstrlcpy.c.o.d -o lib/Support/CMakeFiles/LLVMSupport.dir/regstrlcpy.c.o   -c /Users/buildslave/jenkins/workspace/clang-stage2-Rthinlto/llvm-project/llvm/lib/Support/regstrlcpy.c
[116/3809] /Users/buildslave/jenkins/workspace/clang-stage2-Rthinlto/host-compiler/bin/clang++  -DGTEST_HAS_RTTI=0 -D__STDC_CONSTANT_MACROS -D__STDC_FORMAT_MACROS -D__STDC_LIMIT_MACROS -Ilib/Support -I/Users/buildslave/jenkins/workspace/clang-stage2-Rthinlto/llvm-project/llvm/lib/Support -I/Applications/Xcode.app/Contents/Developer/Platforms/MacOSX.platform/Developer/SDKs/MacOSX10.14.sdk/usr/include/libxml2 -Iinclude -I/Users/buildslave/jenkins/workspace/clang-stage2-Rthinlto/llvm-project/llvm/include -fno-stack-protector -fno-common -Wno-profile-instr-unprofiled -fPIC -fvisibility-inlines-hidden -Werror=date-time -Werror=unguarded-availability-new -fmodules -fmodules-cache-path=/Users/buildslave/jenkins/workspace/clang-stage2-Rthinlto/clang-build/Build/module.cache -fcxx-modules -gmodules -Wall -Wextra -Wno-unused-parameter -Wwrite-strings -Wcast-qual -Wmissing-field-initializers -pedantic -Wno-long-long -Wimplicit-fallthrough -Wcovered-switch-default -Wno-noexcept-type -Wnon-virtual-dtor -Wdelete-non-virtual-dtor -Wstring-conversion -fdiagnostics-color -flto=thin -O2 -g -DNDEBUG -isysroot /Applications/Xcode.app/Contents/Developer/Platforms/MacOSX.platform/Developer/SDKs/MacOSX10.14.sdk   -std=c++14  -fno-exceptions -fno-rtti -MD -MT lib/Support/CMakeFiles/LLVMSupport.dir/Triple.cpp.o -MF lib/Support/CMakeFiles/LLVMSupport.dir/Triple.cpp.o.d -o lib/Support/CMakeFiles/LLVMSupport.dir/Triple.cpp.o -c /Users/buildslave/jenkins/workspace/clang-stage2-Rthinlto/llvm-project/llvm/lib/Support/Triple.cpp
[117/3809] /Users/buildslave/jenkins/workspace/clang-stage2-Rthinlto/host-compiler/bin/clang++  -DGTEST_HAS_RTTI=0 -D__STDC_CONSTANT_MACROS -D__STDC_FORMAT_MACROS -D__STDC_LIMIT_MACROS -Ilib/Support -I/Users/buildslave/jenkins/workspace/clang-stage2-Rthinlto/llvm-project/llvm/lib/Support -I/Applications/Xcode.app/Contents/Developer/Platforms/MacOSX.platform/Developer/SDKs/MacOSX10.14.sdk/usr/include/libxml2 -Iinclude -I/Users/buildslave/jenkins/workspace/clang-stage2-Rthinlto/llvm-project/llvm/include -fno-stack-protector -fno-common -Wno-profile-instr-unprofiled -fPIC -fvisibility-inlines-hidden -Werror=date-time -Werror=unguarded-availability-new -fmodules -fmodules-cache-path=/Users/buildslave/jenkins/workspace/clang-stage2-Rthinlto/clang-build/Build/module.cache -fcxx-modules -gmodules -Wall -Wextra -Wno-unused-parameter -Wwrite-strings -Wcast-qual -Wmissing-field-initializers -pedantic -Wno-long-long -Wimplicit-fallthrough -Wcovered-switch-default -Wno-noexcept-type -Wnon-virtual-dtor -Wdelete-non-virtual-dtor -Wstring-conversion -fdiagnostics-color -flto=thin -O2 -g -DNDEBUG -isysroot /Applications/Xcode.app/Contents/Developer/Platforms/MacOSX.platform/Developer/SDKs/MacOSX10.14.sdk   -std=c++14  -fno-exceptions -fno-rtti -MD -MT lib/Support/CMakeFiles/LLVMSupport.dir/WithColor.cpp.o -MF lib/Support/CMakeFiles/LLVMSupport.dir/WithColor.cpp.o.d -o lib/Support/CMakeFiles/LLVMSupport.dir/WithColor.cpp.o -c /Users/buildslave/jenkins/workspace/clang-stage2-Rthinlto/llvm-project/llvm/lib/Support/WithColor.cpp
[118/3809] /Users/buildslave/jenkins/workspace/clang-stage2-Rthinlto/host-compiler/bin/clang++  -DGTEST_HAS_RTTI=0 -D__STDC_CONSTANT_MACROS -D__STDC_FORMAT_MACROS -D__STDC_LIMIT_MACROS -Ilib/Support -I/Users/buildslave/jenkins/workspace/clang-stage2-Rthinlto/llvm-project/llvm/lib/Support -I/Applications/Xcode.app/Contents/Developer/Platforms/MacOSX.platform/Developer/SDKs/MacOSX10.14.sdk/usr/include/libxml2 -Iinclude -I/Users/buildslave/jenkins/workspace/clang-stage2-Rthinlto/llvm-project/llvm/include -fno-stack-protector -fno-common -Wno-profile-instr-unprofiled -fPIC -fvisibility-inlines-hidden -Werror=date-time -Werror=unguarded-availability-new -fmodules -fmodules-cache-path=/Users/buildslave/jenkins/workspace/clang-stage2-Rthinlto/clang-build/Build/module.cache -fcxx-modules -gmodules -Wall -Wextra -Wno-unused-parameter -Wwrite-strings -Wcast-qual -Wmissing-field-initializers -pedantic -Wno-long-long -Wimplicit-fallthrough -Wcovered-switch-default -Wno-noexcept-type -Wnon-virtual-dtor -Wdelete-non-virtual-dtor -Wstring-conversion -fdiagnostics-color -flto=thin -O2 -g -DNDEBUG -isysroot /Applications/Xcode.app/Contents/Developer/Platforms/MacOSX.platform/Developer/SDKs/MacOSX10.14.sdk   -std=c++14  -fno-exceptions -fno-rtti -MD -MT lib/Support/CMakeFiles/LLVMSupport.dir/Atomic.cpp.o -MF lib/Support/CMakeFiles/LLVMSupport.dir/Atomic.cpp.o.d -o lib/Support/CMakeFiles/LLVMSupport.dir/Atomic.cpp.o -c /Users/buildslave/jenkins/workspace/clang-stage2-Rthinlto/llvm-project/llvm/lib/Support/Atomic.cpp
[119/3809] /Users/buildslave/jenkins/workspace/clang-stage2-Rthinlto/host-compiler/bin/clang++  -DGTEST_HAS_RTTI=0 -D__STDC_CONSTANT_MACROS -D__STDC_FORMAT_MACROS -D__STDC_LIMIT_MACROS -Ilib/Support -I/Users/buildslave/jenkins/workspace/clang-stage2-Rthinlto/llvm-project/llvm/lib/Support -I/Applications/Xcode.app/Contents/Developer/Platforms/MacOSX.platform/Developer/SDKs/MacOSX10.14.sdk/usr/include/libxml2 -Iinclude -I/Users/buildslave/jenkins/workspace/clang-stage2-Rthinlto/llvm-project/llvm/include -fno-stack-protector -fno-common -Wno-profile-instr-unprofiled -fPIC -fvisibility-inlines-hidden -Werror=date-time -Werror=unguarded-availability-new -fmodules -fmodules-cache-path=/Users/buildslave/jenkins/workspace/clang-stage2-Rthinlto/clang-build/Build/module.cache -fcxx-modules -gmodules -Wall -Wextra -Wno-unused-parameter -Wwrite-strings -Wcast-qual -Wmissing-field-initializers -pedantic -Wno-long-long -Wimplicit-fallthrough -Wcovered-switch-default -Wno-noexcept-type -Wnon-virtual-dtor -Wdelete-non-virtual-dtor -Wstring-conversion -fdiagnostics-color -flto=thin -O2 -g -DNDEBUG -isysroot /Applications/Xcode.app/Contents/Developer/Platforms/MacOSX.platform/Developer/SDKs/MacOSX10.14.sdk   -std=c++14  -fno-exceptions -fno-rtti -MD -MT lib/Support/CMakeFiles/LLVMSupport.dir/xxhash.cpp.o -MF lib/Support/CMakeFiles/LLVMSupport.dir/xxhash.cpp.o.d -o lib/Support/CMakeFiles/LLVMSupport.dir/xxhash.cpp.o -c /Users/buildslave/jenkins/workspace/clang-stage2-Rthinlto/llvm-project/llvm/lib/Support/xxhash.cpp
[120/3809] /Users/buildslave/jenkins/workspace/clang-stage2-Rthinlto/host-compiler/bin/clang++  -DGTEST_HAS_RTTI=0 -D__STDC_CONSTANT_MACROS -D__STDC_FORMAT_MACROS -D__STDC_LIMIT_MACROS -Ilib/Support -I/Users/buildslave/jenkins/workspace/clang-stage2-Rthinlto/llvm-project/llvm/lib/Support -I/Applications/Xcode.app/Contents/Developer/Platforms/MacOSX.platform/Developer/SDKs/MacOSX10.14.sdk/usr/include/libxml2 -Iinclude -I/Users/buildslave/jenkins/workspace/clang-stage2-Rthinlto/llvm-project/llvm/include -fno-stack-protector -fno-common -Wno-profile-instr-unprofiled -fPIC -fvisibility-inlines-hidden -Werror=date-time -Werror=unguarded-availability-new -fmodules -fmodules-cache-path=/Users/buildslave/jenkins/workspace/clang-stage2-Rthinlto/clang-build/Build/module.cache -fcxx-modules -gmodules -Wall -Wextra -Wno-unused-parameter -Wwrite-strings -Wcast-qual -Wmissing-field-initializers -pedantic -Wno-long-long -Wimplicit-fallthrough -Wcovered-switch-default -Wno-noexcept-type -Wnon-virtual-dtor -Wdelete-non-virtual-dtor -Wstring-conversion -fdiagnostics-color -flto=thin -O2 -g -DNDEBUG -isysroot /Applications/Xcode.app/Contents/Developer/Platforms/MacOSX.platform/Developer/SDKs/MacOSX10.14.sdk   -std=c++14  -fno-exceptions -fno-rtti -MD -MT lib/Support/CMakeFiles/LLVMSupport.dir/Z3Solver.cpp.o -MF lib/Support/CMakeFiles/LLVMSupport.dir/Z3Solver.cpp.o.d -o lib/Support/CMakeFiles/LLVMSupport.dir/Z3Solver.cpp.o -c /Users/buildslave/jenkins/workspace/clang-stage2-Rthinlto/llvm-project/llvm/lib/Support/Z3Solver.cpp
[121/3809] /Users/buildslave/jenkins/workspace/clang-stage2-Rthinlto/host-compiler/bin/clang -DGTEST_HAS_RTTI=0 -D__STDC_CONSTANT_MACROS -D__STDC_FORMAT_MACROS -D__STDC_LIMIT_MACROS -Ilib/Support -I/Users/buildslave/jenkins/workspace/clang-stage2-Rthinlto/llvm-project/llvm/lib/Support -I/Applications/Xcode.app/Contents/Developer/Platforms/MacOSX.platform/Developer/SDKs/MacOSX10.14.sdk/usr/include/libxml2 -Iinclude -I/Users/buildslave/jenkins/workspace/clang-stage2-Rthinlto/llvm-project/llvm/include -fno-stack-protector -fno-common -Wno-profile-instr-unprofiled -fPIC -Werror=date-time -Werror=unguarded-availability-new -Wall -Wextra -Wno-unused-parameter -Wwrite-strings -Wmissing-field-initializers -pedantic -Wno-long-long -Wimplicit-fallthrough -Wcovered-switch-default -Wdelete-non-virtual-dtor -Wstring-conversion -fdiagnostics-color -flto=thin -O2 -g -DNDEBUG -isysroot /Applications/Xcode.app/Contents/Developer/Platforms/MacOSX.platform/Developer/SDKs/MacOSX10.14.sdk -MD -MT lib/Support/CMakeFiles/LLVMSupport.dir/regexec.c.o -MF lib/Support/CMakeFiles/LLVMSupport.dir/regexec.c.o.d -o lib/Support/CMakeFiles/LLVMSupport.dir/regexec.c.o   -c /Users/buildslave/jenkins/workspace/clang-stage2-Rthinlto/llvm-project/llvm/lib/Support/regexec.c
[122/3809] /Users/buildslave/jenkins/workspace/clang-stage2-Rthinlto/host-compiler/bin/clang++  -DCLANG_REPOSITORY_STRING=\"bf68bcb920ffdac5da8b82cd06535cec5dc5a56b\" -DCLANG_VENDOR="\"Apple \"" -DGTEST_HAS_RTTI=0 -D_GNU_SOURCE -D__STDC_CONSTANT_MACROS -D__STDC_FORMAT_MACROS -D__STDC_LIMIT_MACROS -Itools/clang/utils/TableGen -I/Users/buildslave/jenkins/workspace/clang-stage2-Rthinlto/llvm-project/clang/utils/TableGen -I/Users/buildslave/jenkins/workspace/clang-stage2-Rthinlto/llvm-project/clang/include -Itools/clang/include -I/Applications/Xcode.app/Contents/Developer/Platforms/MacOSX.platform/Developer/SDKs/MacOSX10.14.sdk/usr/include/libxml2 -Iinclude -I/Users/buildslave/jenkins/workspace/clang-stage2-Rthinlto/llvm-project/llvm/include -fno-stack-protector -fno-common -Wno-profile-instr-unprofiled -fPIC -fvisibility-inlines-hidden -Werror=date-time -Werror=unguarded-availability-new -fmodules -fmodules-cache-path=/Users/buildslave/jenkins/workspace/clang-stage2-Rthinlto/clang-build/Build/module.cache -fcxx-modules -gmodules -Wall -Wextra -Wno-unused-parameter -Wwrite-strings -Wcast-qual -Wmissing-field-initializers -pedantic -Wno-long-long -Wimplicit-fallthrough -Wcovered-switch-default -Wno-noexcept-type -Wnon-virtual-dtor -Wdelete-non-virtual-dtor -Wstring-conversion -fdiagnostics-color -flto=thin -fno-common -Woverloaded-virtual -Wno-nested-anon-types -O2 -g -DNDEBUG -isysroot /Applications/Xcode.app/Contents/Developer/Platforms/MacOSX.platform/Developer/SDKs/MacOSX10.14.sdk    -fno-exceptions -fno-rtti -std=c++14 -MD -MT tools/clang/utils/TableGen/CMakeFiles/clang-tblgen.dir/ClangTypeNodesEmitter.cpp.o -MF tools/clang/utils/TableGen/CMakeFiles/clang-tblgen.dir/ClangTypeNodesEmitter.cpp.o.d -o tools/clang/utils/TableGen/CMakeFiles/clang-tblgen.dir/ClangTypeNodesEmitter.cpp.o -c /Users/buildslave/jenkins/workspace/clang-stage2-Rthinlto/llvm-project/clang/utils/TableGen/ClangTypeNodesEmitter.cpp
[123/3809] /Users/buildslave/jenkins/workspace/clang-stage2-Rthinlto/host-compiler/bin/clang++  -DGTEST_HAS_RTTI=0 -D__STDC_CONSTANT_MACROS -D__STDC_FORMAT_MACROS -D__STDC_LIMIT_MACROS -Ilib/Support -I/Users/buildslave/jenkins/workspace/clang-stage2-Rthinlto/llvm-project/llvm/lib/Support -I/Applications/Xcode.app/Contents/Developer/Platforms/MacOSX.platform/Developer/SDKs/MacOSX10.14.sdk/usr/include/libxml2 -Iinclude -I/Users/buildslave/jenkins/workspace/clang-stage2-Rthinlto/llvm-project/llvm/include -fno-stack-protector -fno-common -Wno-profile-instr-unprofiled -fPIC -fvisibility-inlines-hidden -Werror=date-time -Werror=unguarded-availability-new -fmodules -fmodules-cache-path=/Users/buildslave/jenkins/workspace/clang-stage2-Rthinlto/clang-build/Build/module.cache -fcxx-modules -gmodules -Wall -Wextra -Wno-unused-parameter -Wwrite-strings -Wcast-qual -Wmissing-field-initializers -pedantic -Wno-long-long -Wimplicit-fallthrough -Wcovered-switch-default -Wno-noexcept-type -Wnon-virtual-dtor -Wdelete-non-virtual-dtor -Wstring-conversion -fdiagnostics-color -flto=thin -O2 -g -DNDEBUG -isysroot /Applications/Xcode.app/Contents/Developer/Platforms/MacOSX.platform/Developer/SDKs/MacOSX10.14.sdk   -std=c++14  -fno-exceptions -fno-rtti -MD -MT lib/Support/CMakeFiles/LLVMSupport.dir/Errno.cpp.o -MF lib/Support/CMakeFiles/LLVMSupport.dir/Errno.cpp.o.d -o lib/Support/CMakeFiles/LLVMSupport.dir/Errno.cpp.o -c /Users/buildslave/jenkins/workspace/clang-stage2-Rthinlto/llvm-project/llvm/lib/Support/Errno.cpp
[124/3809] /Users/buildslave/jenkins/workspace/clang-stage2-Rthinlto/host-compiler/bin/clang++  -DGTEST_HAS_RTTI=0 -D__STDC_CONSTANT_MACROS -D__STDC_FORMAT_MACROS -D__STDC_LIMIT_MACROS -Ilib/Support -I/Users/buildslave/jenkins/workspace/clang-stage2-Rthinlto/llvm-project/llvm/lib/Support -I/Applications/Xcode.app/Contents/Developer/Platforms/MacOSX.platform/Developer/SDKs/MacOSX10.14.sdk/usr/include/libxml2 -Iinclude -I/Users/buildslave/jenkins/workspace/clang-stage2-Rthinlto/llvm-project/llvm/include -fno-stack-protector -fno-common -Wno-profile-instr-unprofiled -fPIC -fvisibility-inlines-hidden -Werror=date-time -Werror=unguarded-availability-new -fmodules -fmodules-cache-path=/Users/buildslave/jenkins/workspace/clang-stage2-Rthinlto/clang-build/Build/module.cache -fcxx-modules -gmodules -Wall -Wextra -Wno-unused-parameter -Wwrite-strings -Wcast-qual -Wmissing-field-initializers -pedantic -Wno-long-long -Wimplicit-fallthrough -Wcovered-switch-default -Wno-noexcept-type -Wnon-virtual-dtor -Wdelete-non-virtual-dtor -Wstring-conversion -fdiagnostics-color -flto=thin -O2 -g -DNDEBUG -isysroot /Applications/Xcode.app/Contents/Developer/Platforms/MacOSX.platform/Developer/SDKs/MacOSX10.14.sdk   -std=c++14  -fno-exceptions -fno-rtti -MD -MT lib/Support/CMakeFiles/LLVMSupport.dir/CommandLine.cpp.o -MF lib/Support/CMakeFiles/LLVMSupport.dir/CommandLine.cpp.o.d -o lib/Support/CMakeFiles/LLVMSupport.dir/CommandLine.cpp.o -c /Users/buildslave/jenkins/workspace/clang-stage2-Rthinlto/llvm-project/llvm/lib/Support/CommandLine.cpp
[125/3809] /Users/buildslave/jenkins/workspace/clang-stage2-Rthinlto/host-compiler/bin/clang -DGTEST_HAS_RTTI=0 -D__STDC_CONSTANT_MACROS -D__STDC_FORMAT_MACROS -D__STDC_LIMIT_MACROS -Ilib/Support -I/Users/buildslave/jenkins/workspace/clang-stage2-Rthinlto/llvm-project/llvm/lib/Support -I/Applications/Xcode.app/Contents/Developer/Platforms/MacOSX.platform/Developer/SDKs/MacOSX10.14.sdk/usr/include/libxml2 -Iinclude -I/Users/buildslave/jenkins/workspace/clang-stage2-Rthinlto/llvm-project/llvm/include -fno-stack-protector -fno-common -Wno-profile-instr-unprofiled -fPIC -Werror=date-time -Werror=unguarded-availability-new -Wall -Wextra -Wno-unused-parameter -Wwrite-strings -Wmissing-field-initializers -pedantic -Wno-long-long -Wimplicit-fallthrough -Wcovered-switch-default -Wdelete-non-virtual-dtor -Wstring-conversion -fdiagnostics-color -flto=thin -O2 -g -DNDEBUG -isysroot /Applications/Xcode.app/Contents/Developer/Platforms/MacOSX.platform/Developer/SDKs/MacOSX10.14.sdk -MD -MT lib/Support/CMakeFiles/LLVMSupport.dir/regcomp.c.o -MF lib/Support/CMakeFiles/LLVMSupport.dir/regcomp.c.o.d -o lib/Support/CMakeFiles/LLVMSupport.dir/regcomp.c.o   -c /Users/buildslave/jenkins/workspace/clang-stage2-Rthinlto/llvm-project/llvm/lib/Support/regcomp.c
[126/3809] /Users/buildslave/jenkins/workspace/clang-stage2-Rthinlto/host-compiler/bin/clang++  -DGTEST_HAS_RTTI=0 -D__STDC_CONSTANT_MACROS -D__STDC_FORMAT_MACROS -D__STDC_LIMIT_MACROS -Ilib/Support -I/Users/buildslave/jenkins/workspace/clang-stage2-Rthinlto/llvm-project/llvm/lib/Support -I/Applications/Xcode.app/Contents/Developer/Platforms/MacOSX.platform/Developer/SDKs/MacOSX10.14.sdk/usr/include/libxml2 -Iinclude -I/Users/buildslave/jenkins/workspace/clang-stage2-Rthinlto/llvm-project/llvm/include -fno-stack-protector -fno-common -Wno-profile-instr-unprofiled -fPIC -fvisibility-inlines-hidden -Werror=date-time -Werror=unguarded-availability-new -fmodules -fmodules-cache-path=/Users/buildslave/jenkins/workspace/clang-stage2-Rthinlto/clang-build/Build/module.cache -fcxx-modules -gmodules -Wall -Wextra -Wno-unused-parameter -Wwrite-strings -Wcast-qual -Wmissing-field-initializers -pedantic -Wno-long-long -Wimplicit-fallthrough -Wcovered-switch-default -Wno-noexcept-type -Wnon-virtual-dtor -Wdelete-non-virtual-dtor -Wstring-conversion -fdiagnostics-color -flto=thin -O2 -g -DNDEBUG -isysroot /Applications/Xcode.app/Contents/Developer/Platforms/MacOSX.platform/Developer/SDKs/MacOSX10.14.sdk   -std=c++14  -fno-exceptions -fno-rtti -MD -MT lib/Support/CMakeFiles/LLVMSupport.dir/RWMutex.cpp.o -MF lib/Support/CMakeFiles/LLVMSupport.dir/RWMutex.cpp.o.d -o lib/Support/CMakeFiles/LLVMSupport.dir/RWMutex.cpp.o -c /Users/buildslave/jenkins/workspace/clang-stage2-Rthinlto/llvm-project/llvm/lib/Support/RWMutex.cpp
[127/3809] /Users/buildslave/jenkins/workspace/clang-stage2-Rthinlto/host-compiler/bin/clang++  -DGTEST_HAS_RTTI=0 -D__STDC_CONSTANT_MACROS -D__STDC_FORMAT_MACROS -D__STDC_LIMIT_MACROS -Ilib/Support -I/Users/buildslave/jenkins/workspace/clang-stage2-Rthinlto/llvm-project/llvm/lib/Support -I/Applications/Xcode.app/Contents/Developer/Platforms/MacOSX.platform/Developer/SDKs/MacOSX10.14.sdk/usr/include/libxml2 -Iinclude -I/Users/buildslave/jenkins/workspace/clang-stage2-Rthinlto/llvm-project/llvm/include -fno-stack-protector -fno-common -Wno-profile-instr-unprofiled -fPIC -fvisibility-inlines-hidden -Werror=date-time -Werror=unguarded-availability-new -fmodules -fmodules-cache-path=/Users/buildslave/jenkins/workspace/clang-stage2-Rthinlto/clang-build/Build/module.cache -fcxx-modules -gmodules -Wall -Wextra -Wno-unused-parameter -Wwrite-strings -Wcast-qual -Wmissing-field-initializers -pedantic -Wno-long-long -Wimplicit-fallthrough -Wcovered-switch-default -Wno-noexcept-type -Wnon-virtual-dtor -Wdelete-non-virtual-dtor -Wstring-conversion -fdiagnostics-color -flto=thin -O2 -g -DNDEBUG -isysroot /Applications/Xcode.app/Contents/Developer/Platforms/MacOSX.platform/Developer/SDKs/MacOSX10.14.sdk   -std=c++14  -fno-exceptions -fno-rtti -MD -MT lib/Support/CMakeFiles/LLVMSupport.dir/raw_ostream.cpp.o -MF lib/Support/CMakeFiles/LLVMSupport.dir/raw_ostream.cpp.o.d -o lib/Support/CMakeFiles/LLVMSupport.dir/raw_ostream.cpp.o -c /Users/buildslave/jenkins/workspace/clang-stage2-Rthinlto/llvm-project/llvm/lib/Support/raw_ostream.cpp
[128/3809] /Users/buildslave/jenkins/workspace/clang-stage2-Rthinlto/host-compiler/bin/clang++  -DCLANG_REPOSITORY_STRING=\"bf68bcb920ffdac5da8b82cd06535cec5dc5a56b\" -DCLANG_VENDOR="\"Apple \"" -DGTEST_HAS_RTTI=0 -D_GNU_SOURCE -D__STDC_CONSTANT_MACROS -D__STDC_FORMAT_MACROS -D__STDC_LIMIT_MACROS -Itools/clang/utils/TableGen -I/Users/buildslave/jenkins/workspace/clang-stage2-Rthinlto/llvm-project/clang/utils/TableGen -I/Users/buildslave/jenkins/workspace/clang-stage2-Rthinlto/llvm-project/clang/include -Itools/clang/include -I/Applications/Xcode.app/Contents/Developer/Platforms/MacOSX.platform/Developer/SDKs/MacOSX10.14.sdk/usr/include/libxml2 -Iinclude -I/Users/buildslave/jenkins/workspace/clang-stage2-Rthinlto/llvm-project/llvm/include -fno-stack-protector -fno-common -Wno-profile-instr-unprofiled -fPIC -fvisibility-inlines-hidden -Werror=date-time -Werror=unguarded-availability-new -fmodules -fmodules-cache-path=/Users/buildslave/jenkins/workspace/clang-stage2-Rthinlto/clang-build/Build/module.cache -fcxx-modules -gmodules -Wall -Wextra -Wno-unused-parameter -Wwrite-strings -Wcast-qual -Wmissing-field-initializers -pedantic -Wno-long-long -Wimplicit-fallthrough -Wcovered-switch-default -Wno-noexcept-type -Wnon-virtual-dtor -Wdelete-non-virtual-dtor -Wstring-conversion -fdiagnostics-color -flto=thin -fno-common -Woverloaded-virtual -Wno-nested-anon-types -O2 -g -DNDEBUG -isysroot /Applications/Xcode.app/Contents/Developer/Platforms/MacOSX.platform/Developer/SDKs/MacOSX10.14.sdk    -fno-exceptions -fno-rtti -std=c++14 -MD -MT tools/clang/utils/TableGen/CMakeFiles/clang-tblgen.dir/ClangDiagnosticsEmitter.cpp.o -MF tools/clang/utils/TableGen/CMakeFiles/clang-tblgen.dir/ClangDiagnosticsEmitter.cpp.o.d -o tools/clang/utils/TableGen/CMakeFiles/clang-tblgen.dir/ClangDiagnosticsEmitter.cpp.o -c /Users/buildslave/jenkins/workspace/clang-stage2-Rthinlto/llvm-project/clang/utils/TableGen/ClangDiagnosticsEmitter.cpp
[129/3809] /Users/buildslave/jenkins/workspace/clang-stage2-Rthinlto/host-compiler/bin/clang++  -DGTEST_HAS_RTTI=0 -D__STDC_CONSTANT_MACROS -D__STDC_FORMAT_MACROS -D__STDC_LIMIT_MACROS -Ilib/Support -I/Users/buildslave/jenkins/workspace/clang-stage2-Rthinlto/llvm-project/llvm/lib/Support -I/Applications/Xcode.app/Contents/Developer/Platforms/MacOSX.platform/Developer/SDKs/MacOSX10.14.sdk/usr/include/libxml2 -Iinclude -I/Users/buildslave/jenkins/workspace/clang-stage2-Rthinlto/llvm-project/llvm/include -fno-stack-protector -fno-common -Wno-profile-instr-unprofiled -fPIC -fvisibility-inlines-hidden -Werror=date-time -Werror=unguarded-availability-new -fmodules -fmodules-cache-path=/Users/buildslave/jenkins/workspace/clang-stage2-Rthinlto/clang-build/Build/module.cache -fcxx-modules -gmodules -Wall -Wextra -Wno-unused-parameter -Wwrite-strings -Wcast-qual -Wmissing-field-initializers -pedantic -Wno-long-long -Wimplicit-fallthrough -Wcovered-switch-default -Wno-noexcept-type -Wnon-virtual-dtor -Wdelete-non-virtual-dtor -Wstring-conversion -fdiagnostics-color -flto=thin -O2 -g -DNDEBUG -isysroot /Applications/Xcode.app/Contents/Developer/Platforms/MacOSX.platform/Developer/SDKs/MacOSX10.14.sdk   -std=c++14  -fno-exceptions -fno-rtti -MD -MT lib/Support/CMakeFiles/LLVMSupport.dir/ThreadLocal.cpp.o -MF lib/Support/CMakeFiles/LLVMSupport.dir/ThreadLocal.cpp.o.d -o lib/Support/CMakeFiles/LLVMSupport.dir/ThreadLocal.cpp.o -c /Users/buildslave/jenkins/workspace/clang-stage2-Rthinlto/llvm-project/llvm/lib/Support/ThreadLocal.cpp
[130/3809] /Users/buildslave/jenkins/workspace/clang-stage2-Rthinlto/host-compiler/bin/clang++  -DGTEST_HAS_RTTI=0 -D__STDC_CONSTANT_MACROS -D__STDC_FORMAT_MACROS -D__STDC_LIMIT_MACROS -Ilib/Support -I/Users/buildslave/jenkins/workspace/clang-stage2-Rthinlto/llvm-project/llvm/lib/Support -I/Applications/Xcode.app/Contents/Developer/Platforms/MacOSX.platform/Developer/SDKs/MacOSX10.14.sdk/usr/include/libxml2 -Iinclude -I/Users/buildslave/jenkins/workspace/clang-stage2-Rthinlto/llvm-project/llvm/include -fno-stack-protector -fno-common -Wno-profile-instr-unprofiled -fPIC -fvisibility-inlines-hidden -Werror=date-time -Werror=unguarded-availability-new -fmodules -fmodules-cache-path=/Users/buildslave/jenkins/workspace/clang-stage2-Rthinlto/clang-build/Build/module.cache -fcxx-modules -gmodules -Wall -Wextra -Wno-unused-parameter -Wwrite-strings -Wcast-qual -Wmissing-field-initializers -pedantic -Wno-long-long -Wimplicit-fallthrough -Wcovered-switch-default -Wno-noexcept-type -Wnon-virtual-dtor -Wdelete-non-virtual-dtor -Wstring-conversion -fdiagnostics-color -flto=thin -O2 -g -DNDEBUG -isysroot /Applications/Xcode.app/Contents/Developer/Platforms/MacOSX.platform/Developer/SDKs/MacOSX10.14.sdk   -std=c++14  -fno-exceptions -fno-rtti -MD -MT lib/Support/CMakeFiles/LLVMSupport.dir/Timer.cpp.o -MF lib/Support/CMakeFiles/LLVMSupport.dir/Timer.cpp.o.d -o lib/Support/CMakeFiles/LLVMSupport.dir/Timer.cpp.o -c /Users/buildslave/jenkins/workspace/clang-stage2-Rthinlto/llvm-project/llvm/lib/Support/Timer.cpp
[131/3809] /Users/buildslave/jenkins/workspace/clang-stage2-Rthinlto/host-compiler/bin/clang++  -DGTEST_HAS_RTTI=0 -D__STDC_CONSTANT_MACROS -D__STDC_FORMAT_MACROS -D__STDC_LIMIT_MACROS -Ilib/Support -I/Users/buildslave/jenkins/workspace/clang-stage2-Rthinlto/llvm-project/llvm/lib/Support -I/Applications/Xcode.app/Contents/Developer/Platforms/MacOSX.platform/Developer/SDKs/MacOSX10.14.sdk/usr/include/libxml2 -Iinclude -I/Users/buildslave/jenkins/workspace/clang-stage2-Rthinlto/llvm-project/llvm/include -fno-stack-protector -fno-common -Wno-profile-instr-unprofiled -fPIC -fvisibility-inlines-hidden -Werror=date-time -Werror=unguarded-availability-new -fmodules -fmodules-cache-path=/Users/buildslave/jenkins/workspace/clang-stage2-Rthinlto/clang-build/Build/module.cache -fcxx-modules -gmodules -Wall -Wextra -Wno-unused-parameter -Wwrite-strings -Wcast-qual -Wmissing-field-initializers -pedantic -Wno-long-long -Wimplicit-fallthrough -Wcovered-switch-default -Wno-noexcept-type -Wnon-virtual-dtor -Wdelete-non-virtual-dtor -Wstring-conversion -fdiagnostics-color -flto=thin -O2 -g -DNDEBUG -isysroot /Applications/Xcode.app/Contents/Developer/Platforms/MacOSX.platform/Developer/SDKs/MacOSX10.14.sdk   -std=c++14  -fno-exceptions -fno-rtti -MD -MT lib/Support/CMakeFiles/LLVMSupport.dir/Valgrind.cpp.o -MF lib/Support/CMakeFiles/LLVMSupport.dir/Valgrind.cpp.o.d -o lib/Support/CMakeFiles/LLVMSupport.dir/Valgrind.cpp.o -c /Users/buildslave/jenkins/workspace/clang-stage2-Rthinlto/llvm-project/llvm/lib/Support/Valgrind.cpp
[132/3809] /Users/buildslave/jenkins/workspace/clang-stage2-Rthinlto/host-compiler/bin/clang++  -DCLANG_REPOSITORY_STRING=\"bf68bcb920ffdac5da8b82cd06535cec5dc5a56b\" -DCLANG_VENDOR="\"Apple \"" -DGTEST_HAS_RTTI=0 -D_GNU_SOURCE -D__STDC_CONSTANT_MACROS -D__STDC_FORMAT_MACROS -D__STDC_LIMIT_MACROS -Itools/clang/utils/TableGen -I/Users/buildslave/jenkins/workspace/clang-stage2-Rthinlto/llvm-project/clang/utils/TableGen -I/Users/buildslave/jenkins/workspace/clang-stage2-Rthinlto/llvm-project/clang/include -Itools/clang/include -I/Applications/Xcode.app/Contents/Developer/Platforms/MacOSX.platform/Developer/SDKs/MacOSX10.14.sdk/usr/include/libxml2 -Iinclude -I/Users/buildslave/jenkins/workspace/clang-stage2-Rthinlto/llvm-project/llvm/include -fno-stack-protector -fno-common -Wno-profile-instr-unprofiled -fPIC -fvisibility-inlines-hidden -Werror=date-time -Werror=unguarded-availability-new -fmodules -fmodules-cache-path=/Users/buildslave/jenkins/workspace/clang-stage2-Rthinlto/clang-build/Build/module.cache -fcxx-modules -gmodules -Wall -Wextra -Wno-unused-parameter -Wwrite-strings -Wcast-qual -Wmissing-field-initializers -pedantic -Wno-long-long -Wimplicit-fallthrough -Wcovered-switch-default -Wno-noexcept-type -Wnon-virtual-dtor -Wdelete-non-virtual-dtor -Wstring-conversion -fdiagnostics-color -flto=thin -fno-common -Woverloaded-virtual -Wno-nested-anon-types -O2 -g -DNDEBUG -isysroot /Applications/Xcode.app/Contents/Developer/Platforms/MacOSX.platform/Developer/SDKs/MacOSX10.14.sdk    -fno-exceptions -fno-rtti -std=c++14 -MD -MT tools/clang/utils/TableGen/CMakeFiles/clang-tblgen.dir/MveEmitter.cpp.o -MF tools/clang/utils/TableGen/CMakeFiles/clang-tblgen.dir/MveEmitter.cpp.o.d -o tools/clang/utils/TableGen/CMakeFiles/clang-tblgen.dir/MveEmitter.cpp.o -c /Users/buildslave/jenkins/workspace/clang-stage2-Rthinlto/llvm-project/clang/utils/TableGen/MveEmitter.cpp
[133/3809] /Users/buildslave/jenkins/workspace/clang-stage2-Rthinlto/host-compiler/bin/clang++  -DGTEST_HAS_RTTI=0 -D__STDC_CONSTANT_MACROS -D__STDC_FORMAT_MACROS -D__STDC_LIMIT_MACROS -Ilib/Support -I/Users/buildslave/jenkins/workspace/clang-stage2-Rthinlto/llvm-project/llvm/lib/Support -I/Applications/Xcode.app/Contents/Developer/Platforms/MacOSX.platform/Developer/SDKs/MacOSX10.14.sdk/usr/include/libxml2 -Iinclude -I/Users/buildslave/jenkins/workspace/clang-stage2-Rthinlto/llvm-project/llvm/include -fno-stack-protector -fno-common -Wno-profile-instr-unprofiled -fPIC -fvisibility-inlines-hidden -Werror=date-time -Werror=unguarded-availability-new -fmodules -fmodules-cache-path=/Users/buildslave/jenkins/workspace/clang-stage2-Rthinlto/clang-build/Build/module.cache -fcxx-modules -gmodules -Wall -Wextra -Wno-unused-parameter -Wwrite-strings -Wcast-qual -Wmissing-field-initializers -pedantic -Wno-long-long -Wimplicit-fallthrough -Wcovered-switch-default -Wno-noexcept-type -Wnon-virtual-dtor -Wdelete-non-virtual-dtor -Wstring-conversion -fdiagnostics-color -flto=thin -O2 -g -DNDEBUG -isysroot /Applications/Xcode.app/Contents/Developer/Platforms/MacOSX.platform/Developer/SDKs/MacOSX10.14.sdk   -std=c++14  -fno-exceptions -fno-rtti -MD -MT lib/Support/CMakeFiles/LLVMSupport.dir/Watchdog.cpp.o -MF lib/Support/CMakeFiles/LLVMSupport.dir/Watchdog.cpp.o.d -o lib/Support/CMakeFiles/LLVMSupport.dir/Watchdog.cpp.o -c /Users/buildslave/jenkins/workspace/clang-stage2-Rthinlto/llvm-project/llvm/lib/Support/Watchdog.cpp
[134/3809] /Users/buildslave/jenkins/workspace/clang-stage2-Rthinlto/host-compiler/bin/clang++  -DGTEST_HAS_RTTI=0 -D__STDC_CONSTANT_MACROS -D__STDC_FORMAT_MACROS -D__STDC_LIMIT_MACROS -Ilib/Support -I/Users/buildslave/jenkins/workspace/clang-stage2-Rthinlto/llvm-project/llvm/lib/Support -I/Applications/Xcode.app/Contents/Developer/Platforms/MacOSX.platform/Developer/SDKs/MacOSX10.14.sdk/usr/include/libxml2 -Iinclude -I/Users/buildslave/jenkins/workspace/clang-stage2-Rthinlto/llvm-project/llvm/include -fno-stack-protector -fno-common -Wno-profile-instr-unprofiled -fPIC -fvisibility-inlines-hidden -Werror=date-time -Werror=unguarded-availability-new -fmodules -fmodules-cache-path=/Users/buildslave/jenkins/workspace/clang-stage2-Rthinlto/clang-build/Build/module.cache -fcxx-modules -gmodules -Wall -Wextra -Wno-unused-parameter -Wwrite-strings -Wcast-qual -Wmissing-field-initializers -pedantic -Wno-long-long -Wimplicit-fallthrough -Wcovered-switch-default -Wno-noexcept-type -Wnon-virtual-dtor -Wdelete-non-virtual-dtor -Wstring-conversion -fdiagnostics-color -flto=thin -O2 -g -DNDEBUG -isysroot /Applications/Xcode.app/Contents/Developer/Platforms/MacOSX.platform/Developer/SDKs/MacOSX10.14.sdk   -std=c++14  -fno-exceptions -fno-rtti -MD -MT lib/Support/CMakeFiles/LLVMSupport.dir/DynamicLibrary.cpp.o -MF lib/Support/CMakeFiles/LLVMSupport.dir/DynamicLibrary.cpp.o.d -o lib/Support/CMakeFiles/LLVMSupport.dir/DynamicLibrary.cpp.o -c /Users/buildslave/jenkins/workspace/clang-stage2-Rthinlto/llvm-project/llvm/lib/Support/DynamicLibrary.cpp
[135/3809] /Users/buildslave/jenkins/workspace/clang-stage2-Rthinlto/host-compiler/bin/clang++  -DGTEST_HAS_RTTI=0 -D__STDC_CONSTANT_MACROS -D__STDC_FORMAT_MACROS -D__STDC_LIMIT_MACROS -Ilib/Support -I/Users/buildslave/jenkins/workspace/clang-stage2-Rthinlto/llvm-project/llvm/lib/Support -I/Applications/Xcode.app/Contents/Developer/Platforms/MacOSX.platform/Developer/SDKs/MacOSX10.14.sdk/usr/include/libxml2 -Iinclude -I/Users/buildslave/jenkins/workspace/clang-stage2-Rthinlto/llvm-project/llvm/include -fno-stack-protector -fno-common -Wno-profile-instr-unprofiled -fPIC -fvisibility-inlines-hidden -Werror=date-time -Werror=unguarded-availability-new -fmodules -fmodules-cache-path=/Users/buildslave/jenkins/workspace/clang-stage2-Rthinlto/clang-build/Build/module.cache -fcxx-modules -gmodules -Wall -Wextra -Wno-unused-parameter -Wwrite-strings -Wcast-qual -Wmissing-field-initializers -pedantic -Wno-long-long -Wimplicit-fallthrough -Wcovered-switch-default -Wno-noexcept-type -Wnon-virtual-dtor -Wdelete-non-virtual-dtor -Wstring-conversion -fdiagnostics-color -flto=thin -O2 -g -DNDEBUG -isysroot /Applications/Xcode.app/Contents/Developer/Platforms/MacOSX.platform/Developer/SDKs/MacOSX10.14.sdk   -std=c++14  -fno-exceptions -fno-rtti -MD -MT lib/Support/CMakeFiles/LLVMSupport.dir/Memory.cpp.o -MF lib/Support/CMakeFiles/LLVMSupport.dir/Memory.cpp.o.d -o lib/Support/CMakeFiles/LLVMSupport.dir/Memory.cpp.o -c /Users/buildslave/jenkins/workspace/clang-stage2-Rthinlto/llvm-project/llvm/lib/Support/Memory.cpp
[136/3809] /Users/buildslave/jenkins/workspace/clang-stage2-Rthinlto/host-compiler/bin/clang++  -DGTEST_HAS_RTTI=0 -D__STDC_CONSTANT_MACROS -D__STDC_FORMAT_MACROS -D__STDC_LIMIT_MACROS -Ilib/Support -I/Users/buildslave/jenkins/workspace/clang-stage2-Rthinlto/llvm-project/llvm/lib/Support -I/Applications/Xcode.app/Contents/Developer/Platforms/MacOSX.platform/Developer/SDKs/MacOSX10.14.sdk/usr/include/libxml2 -Iinclude -I/Users/buildslave/jenkins/workspace/clang-stage2-Rthinlto/llvm-project/llvm/include -fno-stack-protector -fno-common -Wno-profile-instr-unprofiled -fPIC -fvisibility-inlines-hidden -Werror=date-time -Werror=unguarded-availability-new -fmodules -fmodules-cache-path=/Users/buildslave/jenkins/workspace/clang-stage2-Rthinlto/clang-build/Build/module.cache -fcxx-modules -gmodules -Wall -Wextra -Wno-unused-parameter -Wwrite-strings -Wcast-qual -Wmissing-field-initializers -pedantic -Wno-long-long -Wimplicit-fallthrough -Wcovered-switch-default -Wno-noexcept-type -Wnon-virtual-dtor -Wdelete-non-virtual-dtor -Wstring-conversion -fdiagnostics-color -flto=thin -O2 -g -DNDEBUG -isysroot /Applications/Xcode.app/Contents/Developer/Platforms/MacOSX.platform/Developer/SDKs/MacOSX10.14.sdk   -std=c++14  -fno-exceptions -fno-rtti -MD -MT lib/Support/CMakeFiles/LLVMSupport.dir/FileCheck.cpp.o -MF lib/Support/CMakeFiles/LLVMSupport.dir/FileCheck.cpp.o.d -o lib/Support/CMakeFiles/LLVMSupport.dir/FileCheck.cpp.o -c /Users/buildslave/jenkins/workspace/clang-stage2-Rthinlto/llvm-project/llvm/lib/Support/FileCheck.cpp
[137/3809] /Users/buildslave/jenkins/workspace/clang-stage2-Rthinlto/host-compiler/bin/clang++  -DGTEST_HAS_RTTI=0 -D__STDC_CONSTANT_MACROS -D__STDC_FORMAT_MACROS -D__STDC_LIMIT_MACROS -Ilib/Support -I/Users/buildslave/jenkins/workspace/clang-stage2-Rthinlto/llvm-project/llvm/lib/Support -I/Applications/Xcode.app/Contents/Developer/Platforms/MacOSX.platform/Developer/SDKs/MacOSX10.14.sdk/usr/include/libxml2 -Iinclude -I/Users/buildslave/jenkins/workspace/clang-stage2-Rthinlto/llvm-project/llvm/include -fno-stack-protector -fno-common -Wno-profile-instr-unprofiled -fPIC -fvisibility-inlines-hidden -Werror=date-time -Werror=unguarded-availability-new -fmodules -fmodules-cache-path=/Users/buildslave/jenkins/workspace/clang-stage2-Rthinlto/clang-build/Build/module.cache -fcxx-modules -gmodules -Wall -Wextra -Wno-unused-parameter -Wwrite-strings -Wcast-qual -Wmissing-field-initializers -pedantic -Wno-long-long -Wimplicit-fallthrough -Wcovered-switch-default -Wno-noexcept-type -Wnon-virtual-dtor -Wdelete-non-virtual-dtor -Wstring-conversion -fdiagnostics-color -flto=thin -O2 -g -DNDEBUG -isysroot /Applications/Xcode.app/Contents/Developer/Platforms/MacOSX.platform/Developer/SDKs/MacOSX10.14.sdk   -std=c++14  -fno-exceptions -fno-rtti -MD -MT lib/Support/CMakeFiles/LLVMSupport.dir/Process.cpp.o -MF lib/Support/CMakeFiles/LLVMSupport.dir/Process.cpp.o.d -o lib/Support/CMakeFiles/LLVMSupport.dir/Process.cpp.o -c /Users/buildslave/jenkins/workspace/clang-stage2-Rthinlto/llvm-project/llvm/lib/Support/Process.cpp
[138/3809] /Users/buildslave/jenkins/workspace/clang-stage2-Rthinlto/host-compiler/bin/clang++  -DGTEST_HAS_RTTI=0 -D__STDC_CONSTANT_MACROS -D__STDC_FORMAT_MACROS -D__STDC_LIMIT_MACROS -Ilib/Support -I/Users/buildslave/jenkins/workspace/clang-stage2-Rthinlto/llvm-project/llvm/lib/Support -I/Applications/Xcode.app/Contents/Developer/Platforms/MacOSX.platform/Developer/SDKs/MacOSX10.14.sdk/usr/include/libxml2 -Iinclude -I/Users/buildslave/jenkins/workspace/clang-stage2-Rthinlto/llvm-project/llvm/include -fno-stack-protector -fno-common -Wno-profile-instr-unprofiled -fPIC -fvisibility-inlines-hidden -Werror=date-time -Werror=unguarded-availability-new -fmodules -fmodules-cache-path=/Users/buildslave/jenkins/workspace/clang-stage2-Rthinlto/clang-build/Build/module.cache -fcxx-modules -gmodules -Wall -Wextra -Wno-unused-parameter -Wwrite-strings -Wcast-qual -Wmissing-field-initializers -pedantic -Wno-long-long -Wimplicit-fallthrough -Wcovered-switch-default -Wno-noexcept-type -Wnon-virtual-dtor -Wdelete-non-virtual-dtor -Wstring-conversion -fdiagnostics-color -flto=thin -O2 -g -DNDEBUG -isysroot /Applications/Xcode.app/Contents/Developer/Platforms/MacOSX.platform/Developer/SDKs/MacOSX10.14.sdk   -std=c++14  -fno-exceptions -fno-rtti -MD -MT lib/Support/CMakeFiles/LLVMSupport.dir/Threading.cpp.o -MF lib/Support/CMakeFiles/LLVMSupport.dir/Threading.cpp.o.d -o lib/Support/CMakeFiles/LLVMSupport.dir/Threading.cpp.o -c /Users/buildslave/jenkins/workspace/clang-stage2-Rthinlto/llvm-project/llvm/lib/Support/Threading.cpp
[139/3809] /Users/buildslave/jenkins/workspace/clang-stage2-Rthinlto/host-compiler/bin/clang++  -DGTEST_HAS_RTTI=0 -D__STDC_CONSTANT_MACROS -D__STDC_FORMAT_MACROS -D__STDC_LIMIT_MACROS -Ilib/Support -I/Users/buildslave/jenkins/workspace/clang-stage2-Rthinlto/llvm-project/llvm/lib/Support -I/Applications/Xcode.app/Contents/Developer/Platforms/MacOSX.platform/Developer/SDKs/MacOSX10.14.sdk/usr/include/libxml2 -Iinclude -I/Users/buildslave/jenkins/workspace/clang-stage2-Rthinlto/llvm-project/llvm/include -fno-stack-protector -fno-common -Wno-profile-instr-unprofiled -fPIC -fvisibility-inlines-hidden -Werror=date-time -Werror=unguarded-availability-new -fmodules -fmodules-cache-path=/Users/buildslave/jenkins/workspace/clang-stage2-Rthinlto/clang-build/Build/module.cache -fcxx-modules -gmodules -Wall -Wextra -Wno-unused-parameter -Wwrite-strings -Wcast-qual -Wmissing-field-initializers -pedantic -Wno-long-long -Wimplicit-fallthrough -Wcovered-switch-default -Wno-noexcept-type -Wnon-virtual-dtor -Wdelete-non-virtual-dtor -Wstring-conversion -fdiagnostics-color -flto=thin -O2 -g -DNDEBUG -isysroot /Applications/Xcode.app/Contents/Developer/Platforms/MacOSX.platform/Developer/SDKs/MacOSX10.14.sdk   -std=c++14  -fno-exceptions -fno-rtti -MD -MT lib/Support/CMakeFiles/LLVMSupport.dir/Host.cpp.o -MF lib/Support/CMakeFiles/LLVMSupport.dir/Host.cpp.o.d -o lib/Support/CMakeFiles/LLVMSupport.dir/Host.cpp.o -c /Users/buildslave/jenkins/workspace/clang-stage2-Rthinlto/llvm-project/llvm/lib/Support/Host.cpp
[140/3809] /Users/buildslave/jenkins/workspace/clang-stage2-Rthinlto/host-compiler/bin/clang++  -DGTEST_HAS_RTTI=0 -D__STDC_CONSTANT_MACROS -D__STDC_FORMAT_MACROS -D__STDC_LIMIT_MACROS -Ilib/Support -I/Users/buildslave/jenkins/workspace/clang-stage2-Rthinlto/llvm-project/llvm/lib/Support -I/Applications/Xcode.app/Contents/Developer/Platforms/MacOSX.platform/Developer/SDKs/MacOSX10.14.sdk/usr/include/libxml2 -Iinclude -I/Users/buildslave/jenkins/workspace/clang-stage2-Rthinlto/llvm-project/llvm/include -fno-stack-protector -fno-common -Wno-profile-instr-unprofiled -fPIC -fvisibility-inlines-hidden -Werror=date-time -Werror=unguarded-availability-new -fmodules -fmodules-cache-path=/Users/buildslave/jenkins/workspace/clang-stage2-Rthinlto/clang-build/Build/module.cache -fcxx-modules -gmodules -Wall -Wextra -Wno-unused-parameter -Wwrite-strings -Wcast-qual -Wmissing-field-initializers -pedantic -Wno-long-long -Wimplicit-fallthrough -Wcovered-switch-default -Wno-noexcept-type -Wnon-virtual-dtor -Wdelete-non-virtual-dtor -Wstring-conversion -fdiagnostics-color -flto=thin -O2 -g -DNDEBUG -isysroot /Applications/Xcode.app/Contents/Developer/Platforms/MacOSX.platform/Developer/SDKs/MacOSX10.14.sdk   -std=c++14  -fno-exceptions -fno-rtti -MD -MT lib/Support/CMakeFiles/LLVMSupport.dir/Program.cpp.o -MF lib/Support/CMakeFiles/LLVMSupport.dir/Program.cpp.o.d -o lib/Support/CMakeFiles/LLVMSupport.dir/Program.cpp.o -c /Users/buildslave/jenkins/workspace/clang-stage2-Rthinlto/llvm-project/llvm/lib/Support/Program.cpp
[141/3809] /Users/buildslave/jenkins/workspace/clang-stage2-Rthinlto/host-compiler/bin/clang++  -DGTEST_HAS_RTTI=0 -D__STDC_CONSTANT_MACROS -D__STDC_FORMAT_MACROS -D__STDC_LIMIT_MACROS -Ilib/Support -I/Users/buildslave/jenkins/workspace/clang-stage2-Rthinlto/llvm-project/llvm/lib/Support -I/Applications/Xcode.app/Contents/Developer/Platforms/MacOSX.platform/Developer/SDKs/MacOSX10.14.sdk/usr/include/libxml2 -Iinclude -I/Users/buildslave/jenkins/workspace/clang-stage2-Rthinlto/llvm-project/llvm/include -fno-stack-protector -fno-common -Wno-profile-instr-unprofiled -fPIC -fvisibility-inlines-hidden -Werror=date-time -Werror=unguarded-availability-new -fmodules -fmodules-cache-path=/Users/buildslave/jenkins/workspace/clang-stage2-Rthinlto/clang-build/Build/module.cache -fcxx-modules -gmodules -Wall -Wextra -Wno-unused-parameter -Wwrite-strings -Wcast-qual -Wmissing-field-initializers -pedantic -Wno-long-long -Wimplicit-fallthrough -Wcovered-switch-default -Wno-noexcept-type -Wnon-virtual-dtor -Wdelete-non-virtual-dtor -Wstring-conversion -fdiagnostics-color -flto=thin -O2 -g -DNDEBUG -isysroot /Applications/Xcode.app/Contents/Developer/Platforms/MacOSX.platform/Developer/SDKs/MacOSX10.14.sdk   -std=c++14  -fno-exceptions -fno-rtti -MD -MT lib/Support/CMakeFiles/LLVMSupport.dir/TargetRegistry.cpp.o -MF lib/Support/CMakeFiles/LLVMSupport.dir/TargetRegistry.cpp.o.d -o lib/Support/CMakeFiles/LLVMSupport.dir/TargetRegistry.cpp.o -c /Users/buildslave/jenkins/workspace/clang-stage2-Rthinlto/llvm-project/llvm/lib/Support/TargetRegistry.cpp
[142/3809] /Users/buildslave/jenkins/workspace/clang-stage2-Rthinlto/host-compiler/bin/clang++  -DCLANG_REPOSITORY_STRING=\"bf68bcb920ffdac5da8b82cd06535cec5dc5a56b\" -DCLANG_VENDOR="\"Apple \"" -DGTEST_HAS_RTTI=0 -D_GNU_SOURCE -D__STDC_CONSTANT_MACROS -D__STDC_FORMAT_MACROS -D__STDC_LIMIT_MACROS -Itools/clang/utils/TableGen -I/Users/buildslave/jenkins/workspace/clang-stage2-Rthinlto/llvm-project/clang/utils/TableGen -I/Users/buildslave/jenkins/workspace/clang-stage2-Rthinlto/llvm-project/clang/include -Itools/clang/include -I/Applications/Xcode.app/Contents/Developer/Platforms/MacOSX.platform/Developer/SDKs/MacOSX10.14.sdk/usr/include/libxml2 -Iinclude -I/Users/buildslave/jenkins/workspace/clang-stage2-Rthinlto/llvm-project/llvm/include -fno-stack-protector -fno-common -Wno-profile-instr-unprofiled -fPIC -fvisibility-inlines-hidden -Werror=date-time -Werror=unguarded-availability-new -fmodules -fmodules-cache-path=/Users/buildslave/jenkins/workspace/clang-stage2-Rthinlto/clang-build/Build/module.cache -fcxx-modules -gmodules -Wall -Wextra -Wno-unused-parameter -Wwrite-strings -Wcast-qual -Wmissing-field-initializers -pedantic -Wno-long-long -Wimplicit-fallthrough -Wcovered-switch-default -Wno-noexcept-type -Wnon-virtual-dtor -Wdelete-non-virtual-dtor -Wstring-conversion -fdiagnostics-color -flto=thin -fno-common -Woverloaded-virtual -Wno-nested-anon-types -O2 -g -DNDEBUG -isysroot /Applications/Xcode.app/Contents/Developer/Platforms/MacOSX.platform/Developer/SDKs/MacOSX10.14.sdk    -fno-exceptions -fno-rtti -std=c++14 -MD -MT tools/clang/utils/TableGen/CMakeFiles/clang-tblgen.dir/NeonEmitter.cpp.o -MF tools/clang/utils/TableGen/CMakeFiles/clang-tblgen.dir/NeonEmitter.cpp.o.d -o tools/clang/utils/TableGen/CMakeFiles/clang-tblgen.dir/NeonEmitter.cpp.o -c /Users/buildslave/jenkins/workspace/clang-stage2-Rthinlto/llvm-project/clang/utils/TableGen/NeonEmitter.cpp
[143/3809] /Users/buildslave/jenkins/workspace/clang-stage2-Rthinlto/host-compiler/bin/clang++  -DGTEST_HAS_RTTI=0 -D__STDC_CONSTANT_MACROS -D__STDC_FORMAT_MACROS -D__STDC_LIMIT_MACROS -Ilib/Support -I/Users/buildslave/jenkins/workspace/clang-stage2-Rthinlto/llvm-project/llvm/lib/Support -I/Applications/Xcode.app/Contents/Developer/Platforms/MacOSX.platform/Developer/SDKs/MacOSX10.14.sdk/usr/include/libxml2 -Iinclude -I/Users/buildslave/jenkins/workspace/clang-stage2-Rthinlto/llvm-project/llvm/include -fno-stack-protector -fno-common -Wno-profile-instr-unprofiled -fPIC -fvisibility-inlines-hidden -Werror=date-time -Werror=unguarded-availability-new -fmodules -fmodules-cache-path=/Users/buildslave/jenkins/workspace/clang-stage2-Rthinlto/clang-build/Build/module.cache -fcxx-modules -gmodules -Wall -Wextra -Wno-unused-parameter -Wwrite-strings -Wcast-qual -Wmissing-field-initializers -pedantic -Wno-long-long -Wimplicit-fallthrough -Wcovered-switch-default -Wno-noexcept-type -Wnon-virtual-dtor -Wdelete-non-virtual-dtor -Wstring-conversion -fdiagnostics-color -flto=thin -O2 -g -DNDEBUG -isysroot /Applications/Xcode.app/Contents/Developer/Platforms/MacOSX.platform/Developer/SDKs/MacOSX10.14.sdk   -std=c++14  -fno-exceptions -fno-rtti -MD -MT lib/Support/CMakeFiles/LLVMSupport.dir/YAMLTraits.cpp.o -MF lib/Support/CMakeFiles/LLVMSupport.dir/YAMLTraits.cpp.o.d -o lib/Support/CMakeFiles/LLVMSupport.dir/YAMLTraits.cpp.o -c /Users/buildslave/jenkins/workspace/clang-stage2-Rthinlto/llvm-project/llvm/lib/Support/YAMLTraits.cpp
[144/3809] /Users/buildslave/jenkins/workspace/clang-stage2-Rthinlto/host-compiler/bin/clang++  -DGTEST_HAS_RTTI=0 -D__STDC_CONSTANT_MACROS -D__STDC_FORMAT_MACROS -D__STDC_LIMIT_MACROS -Ilib/Support -I/Users/buildslave/jenkins/workspace/clang-stage2-Rthinlto/llvm-project/llvm/lib/Support -I/Applications/Xcode.app/Contents/Developer/Platforms/MacOSX.platform/Developer/SDKs/MacOSX10.14.sdk/usr/include/libxml2 -Iinclude -I/Users/buildslave/jenkins/workspace/clang-stage2-Rthinlto/llvm-project/llvm/include -fno-stack-protector -fno-common -Wno-profile-instr-unprofiled -fPIC -fvisibility-inlines-hidden -Werror=date-time -Werror=unguarded-availability-new -fmodules -fmodules-cache-path=/Users/buildslave/jenkins/workspace/clang-stage2-Rthinlto/clang-build/Build/module.cache -fcxx-modules -gmodules -Wall -Wextra -Wno-unused-parameter -Wwrite-strings -Wcast-qual -Wmissing-field-initializers -pedantic -Wno-long-long -Wimplicit-fallthrough -Wcovered-switch-default -Wno-noexcept-type -Wnon-virtual-dtor -Wdelete-non-virtual-dtor -Wstring-conversion -fdiagnostics-color -flto=thin -O2 -g -DNDEBUG -isysroot /Applications/Xcode.app/Contents/Developer/Platforms/MacOSX.platform/Developer/SDKs/MacOSX10.14.sdk   -std=c++14  -fno-exceptions -fno-rtti -MD -MT lib/Support/CMakeFiles/LLVMSupport.dir/Signals.cpp.o -MF lib/Support/CMakeFiles/LLVMSupport.dir/Signals.cpp.o.d -o lib/Support/CMakeFiles/LLVMSupport.dir/Signals.cpp.o -c /Users/buildslave/jenkins/workspace/clang-stage2-Rthinlto/llvm-project/llvm/lib/Support/Signals.cpp
[145/3809] /Users/buildslave/jenkins/workspace/clang-stage2-Rthinlto/host-compiler/bin/clang++  -DGTEST_HAS_RTTI=0 -D__STDC_CONSTANT_MACROS -D__STDC_FORMAT_MACROS -D__STDC_LIMIT_MACROS -Ilib/Support -I/Users/buildslave/jenkins/workspace/clang-stage2-Rthinlto/llvm-project/llvm/lib/Support -I/Applications/Xcode.app/Contents/Developer/Platforms/MacOSX.platform/Developer/SDKs/MacOSX10.14.sdk/usr/include/libxml2 -Iinclude -I/Users/buildslave/jenkins/workspace/clang-stage2-Rthinlto/llvm-project/llvm/include -fno-stack-protector -fno-common -Wno-profile-instr-unprofiled -fPIC -fvisibility-inlines-hidden -Werror=date-time -Werror=unguarded-availability-new -fmodules -fmodules-cache-path=/Users/buildslave/jenkins/workspace/clang-stage2-Rthinlto/clang-build/Build/module.cache -fcxx-modules -gmodules -Wall -Wextra -Wno-unused-parameter -Wwrite-strings -Wcast-qual -Wmissing-field-initializers -pedantic -Wno-long-long -Wimplicit-fallthrough -Wcovered-switch-default -Wno-noexcept-type -Wnon-virtual-dtor -Wdelete-non-virtual-dtor -Wstring-conversion -fdiagnostics-color -flto=thin -O2 -g -DNDEBUG -isysroot /Applications/Xcode.app/Contents/Developer/Platforms/MacOSX.platform/Developer/SDKs/MacOSX10.14.sdk   -std=c++14  -fno-exceptions -fno-rtti -MD -MT lib/Support/CMakeFiles/LLVMSupport.dir/YAMLParser.cpp.o -MF lib/Support/CMakeFiles/LLVMSupport.dir/YAMLParser.cpp.o.d -o lib/Support/CMakeFiles/LLVMSupport.dir/YAMLParser.cpp.o -c /Users/buildslave/jenkins/workspace/clang-stage2-Rthinlto/llvm-project/llvm/lib/Support/YAMLParser.cpp
[146/3809] /Users/buildslave/jenkins/workspace/clang-stage2-Rthinlto/host-compiler/bin/clang++  -DGTEST_HAS_RTTI=0 -D__STDC_CONSTANT_MACROS -D__STDC_FORMAT_MACROS -D__STDC_LIMIT_MACROS -Ilib/TableGen -I/Users/buildslave/jenkins/workspace/clang-stage2-Rthinlto/llvm-project/llvm/lib/TableGen -I/Applications/Xcode.app/Contents/Developer/Platforms/MacOSX.platform/Developer/SDKs/MacOSX10.14.sdk/usr/include/libxml2 -Iinclude -I/Users/buildslave/jenkins/workspace/clang-stage2-Rthinlto/llvm-project/llvm/include -fno-stack-protector -fno-common -Wno-profile-instr-unprofiled -fPIC -fvisibility-inlines-hidden -Werror=date-time -Werror=unguarded-availability-new -fmodules -fmodules-cache-path=/Users/buildslave/jenkins/workspace/clang-stage2-Rthinlto/clang-build/Build/module.cache -fcxx-modules -gmodules -Wall -Wextra -Wno-unused-parameter -Wwrite-strings -Wcast-qual -Wmissing-field-initializers -pedantic -Wno-long-long -Wimplicit-fallthrough -Wcovered-switch-default -Wno-noexcept-type -Wnon-virtual-dtor -Wdelete-non-virtual-dtor -Wstring-conversion -fdiagnostics-color -flto=thin -O2 -g -DNDEBUG -isysroot /Applications/Xcode.app/Contents/Developer/Platforms/MacOSX.platform/Developer/SDKs/MacOSX10.14.sdk    -fno-exceptions -fno-rtti -std=c++14 -MD -MT lib/TableGen/CMakeFiles/LLVMTableGen.dir/Error.cpp.o -MF lib/TableGen/CMakeFiles/LLVMTableGen.dir/Error.cpp.o.d -o lib/TableGen/CMakeFiles/LLVMTableGen.dir/Error.cpp.o -c /Users/buildslave/jenkins/workspace/clang-stage2-Rthinlto/llvm-project/llvm/lib/TableGen/Error.cpp
[147/3809] /Users/buildslave/jenkins/workspace/clang-stage2-Rthinlto/host-compiler/bin/clang++  -DGTEST_HAS_RTTI=0 -D__STDC_CONSTANT_MACROS -D__STDC_FORMAT_MACROS -D__STDC_LIMIT_MACROS -Ilib/Support -I/Users/buildslave/jenkins/workspace/clang-stage2-Rthinlto/llvm-project/llvm/lib/Support -I/Applications/Xcode.app/Contents/Developer/Platforms/MacOSX.platform/Developer/SDKs/MacOSX10.14.sdk/usr/include/libxml2 -Iinclude -I/Users/buildslave/jenkins/workspace/clang-stage2-Rthinlto/llvm-project/llvm/include -fno-stack-protector -fno-common -Wno-profile-instr-unprofiled -fPIC -fvisibility-inlines-hidden -Werror=date-time -Werror=unguarded-availability-new -fmodules -fmodules-cache-path=/Users/buildslave/jenkins/workspace/clang-stage2-Rthinlto/clang-build/Build/module.cache -fcxx-modules -gmodules -Wall -Wextra -Wno-unused-parameter -Wwrite-strings -Wcast-qual -Wmissing-field-initializers -pedantic -Wno-long-long -Wimplicit-fallthrough -Wcovered-switch-default -Wno-noexcept-type -Wnon-virtual-dtor -Wdelete-non-virtual-dtor -Wstring-conversion -fdiagnostics-color -flto=thin -O2 -g -DNDEBUG -isysroot /Applications/Xcode.app/Contents/Developer/Platforms/MacOSX.platform/Developer/SDKs/MacOSX10.14.sdk   -std=c++14  -fno-exceptions -fno-rtti -MD -MT lib/Support/CMakeFiles/LLVMSupport.dir/Path.cpp.o -MF lib/Support/CMakeFiles/LLVMSupport.dir/Path.cpp.o.d -o lib/Support/CMakeFiles/LLVMSupport.dir/Path.cpp.o -c /Users/buildslave/jenkins/workspace/clang-stage2-Rthinlto/llvm-project/llvm/lib/Support/Path.cpp
[148/3809] /Users/buildslave/jenkins/workspace/clang-stage2-Rthinlto/host-compiler/bin/clang++  -DGTEST_HAS_RTTI=0 -D__STDC_CONSTANT_MACROS -D__STDC_FORMAT_MACROS -D__STDC_LIMIT_MACROS -Ilib/TableGen -I/Users/buildslave/jenkins/workspace/clang-stage2-Rthinlto/llvm-project/llvm/lib/TableGen -I/Applications/Xcode.app/Contents/Developer/Platforms/MacOSX.platform/Developer/SDKs/MacOSX10.14.sdk/usr/include/libxml2 -Iinclude -I/Users/buildslave/jenkins/workspace/clang-stage2-Rthinlto/llvm-project/llvm/include -fno-stack-protector -fno-common -Wno-profile-instr-unprofiled -fPIC -fvisibility-inlines-hidden -Werror=date-time -Werror=unguarded-availability-new -fmodules -fmodules-cache-path=/Users/buildslave/jenkins/workspace/clang-stage2-Rthinlto/clang-build/Build/module.cache -fcxx-modules -gmodules -Wall -Wextra -Wno-unused-parameter -Wwrite-strings -Wcast-qual -Wmissing-field-initializers -pedantic -Wno-long-long -Wimplicit-fallthrough -Wcovered-switch-default -Wno-noexcept-type -Wnon-virtual-dtor -Wdelete-non-virtual-dtor -Wstring-conversion -fdiagnostics-color -flto=thin -O2 -g -DNDEBUG -isysroot /Applications/Xcode.app/Contents/Developer/Platforms/MacOSX.platform/Developer/SDKs/MacOSX10.14.sdk    -fno-exceptions -fno-rtti -std=c++14 -MD -MT lib/TableGen/CMakeFiles/LLVMTableGen.dir/TableGenBackend.cpp.o -MF lib/TableGen/CMakeFiles/LLVMTableGen.dir/TableGenBackend.cpp.o.d -o lib/TableGen/CMakeFiles/LLVMTableGen.dir/TableGenBackend.cpp.o -c /Users/buildslave/jenkins/workspace/clang-stage2-Rthinlto/llvm-project/llvm/lib/TableGen/TableGenBackend.cpp
[149/3809] /Users/buildslave/jenkins/workspace/clang-stage2-Rthinlto/host-compiler/bin/clang++  -DGTEST_HAS_RTTI=0 -D__STDC_CONSTANT_MACROS -D__STDC_FORMAT_MACROS -D__STDC_LIMIT_MACROS -Iutils/TableGen -I/Users/buildslave/jenkins/workspace/clang-stage2-Rthinlto/llvm-project/llvm/utils/TableGen -I/Applications/Xcode.app/Contents/Developer/Platforms/MacOSX.platform/Developer/SDKs/MacOSX10.14.sdk/usr/include/libxml2 -Iinclude -I/Users/buildslave/jenkins/workspace/clang-stage2-Rthinlto/llvm-project/llvm/include -fno-stack-protector -fno-common -Wno-profile-instr-unprofiled -fPIC -fvisibility-inlines-hidden -Werror=date-time -Werror=unguarded-availability-new -fmodules -fmodules-cache-path=/Users/buildslave/jenkins/workspace/clang-stage2-Rthinlto/clang-build/Build/module.cache -fcxx-modules -gmodules -Wall -Wextra -Wno-unused-parameter -Wwrite-strings -Wcast-qual -Wmissing-field-initializers -pedantic -Wno-long-long -Wimplicit-fallthrough -Wcovered-switch-default -Wno-noexcept-type -Wnon-virtual-dtor -Wdelete-non-virtual-dtor -Wstring-conversion -fdiagnostics-color -flto=thin -O2 -g -DNDEBUG -isysroot /Applications/Xcode.app/Contents/Developer/Platforms/MacOSX.platform/Developer/SDKs/MacOSX10.14.sdk    -fno-exceptions -fno-rtti -std=c++14 -MD -MT utils/TableGen/CMakeFiles/llvm-tblgen.dir/Attributes.cpp.o -MF utils/TableGen/CMakeFiles/llvm-tblgen.dir/Attributes.cpp.o.d -o utils/TableGen/CMakeFiles/llvm-tblgen.dir/Attributes.cpp.o -c /Users/buildslave/jenkins/workspace/clang-stage2-Rthinlto/llvm-project/llvm/utils/TableGen/Attributes.cpp
[150/3809] /Users/buildslave/jenkins/workspace/clang-stage2-Rthinlto/host-compiler/bin/clang++  -DGTEST_HAS_RTTI=0 -D__STDC_CONSTANT_MACROS -D__STDC_FORMAT_MACROS -D__STDC_LIMIT_MACROS -Ilib/TableGen -I/Users/buildslave/jenkins/workspace/clang-stage2-Rthinlto/llvm-project/llvm/lib/TableGen -I/Applications/Xcode.app/Contents/Developer/Platforms/MacOSX.platform/Developer/SDKs/MacOSX10.14.sdk/usr/include/libxml2 -Iinclude -I/Users/buildslave/jenkins/workspace/clang-stage2-Rthinlto/llvm-project/llvm/include -fno-stack-protector -fno-common -Wno-profile-instr-unprofiled -fPIC -fvisibility-inlines-hidden -Werror=date-time -Werror=unguarded-availability-new -fmodules -fmodules-cache-path=/Users/buildslave/jenkins/workspace/clang-stage2-Rthinlto/clang-build/Build/module.cache -fcxx-modules -gmodules -Wall -Wextra -Wno-unused-parameter -Wwrite-strings -Wcast-qual -Wmissing-field-initializers -pedantic -Wno-long-long -Wimplicit-fallthrough -Wcovered-switch-default -Wno-noexcept-type -Wnon-virtual-dtor -Wdelete-non-virtual-dtor -Wstring-conversion -fdiagnostics-color -flto=thin -O2 -g -DNDEBUG -isysroot /Applications/Xcode.app/Contents/Developer/Platforms/MacOSX.platform/Developer/SDKs/MacOSX10.14.sdk    -fno-exceptions -fno-rtti -std=c++14 -MD -MT lib/TableGen/CMakeFiles/LLVMTableGen.dir/TGLexer.cpp.o -MF lib/TableGen/CMakeFiles/LLVMTableGen.dir/TGLexer.cpp.o.d -o lib/TableGen/CMakeFiles/LLVMTableGen.dir/TGLexer.cpp.o -c /Users/buildslave/jenkins/workspace/clang-stage2-Rthinlto/llvm-project/llvm/lib/TableGen/TGLexer.cpp
[151/3809] /Users/buildslave/jenkins/workspace/clang-stage2-Rthinlto/host-compiler/bin/clang++  -DGTEST_HAS_RTTI=0 -D__STDC_CONSTANT_MACROS -D__STDC_FORMAT_MACROS -D__STDC_LIMIT_MACROS -Ilib/TableGen -I/Users/buildslave/jenkins/workspace/clang-stage2-Rthinlto/llvm-project/llvm/lib/TableGen -I/Applications/Xcode.app/Contents/Developer/Platforms/MacOSX.platform/Developer/SDKs/MacOSX10.14.sdk/usr/include/libxml2 -Iinclude -I/Users/buildslave/jenkins/workspace/clang-stage2-Rthinlto/llvm-project/llvm/include -fno-stack-protector -fno-common -Wno-profile-instr-unprofiled -fPIC -fvisibility-inlines-hidden -Werror=date-time -Werror=unguarded-availability-new -fmodules -fmodules-cache-path=/Users/buildslave/jenkins/workspace/clang-stage2-Rthinlto/clang-build/Build/module.cache -fcxx-modules -gmodules -Wall -Wextra -Wno-unused-parameter -Wwrite-strings -Wcast-qual -Wmissing-field-initializers -pedantic -Wno-long-long -Wimplicit-fallthrough -Wcovered-switch-default -Wno-noexcept-type -Wnon-virtual-dtor -Wdelete-non-virtual-dtor -Wstring-conversion -fdiagnostics-color -flto=thin -O2 -g -DNDEBUG -isysroot /Applications/Xcode.app/Contents/Developer/Platforms/MacOSX.platform/Developer/SDKs/MacOSX10.14.sdk    -fno-exceptions -fno-rtti -std=c++14 -MD -MT lib/TableGen/CMakeFiles/LLVMTableGen.dir/JSONBackend.cpp.o -MF lib/TableGen/CMakeFiles/LLVMTableGen.dir/JSONBackend.cpp.o.d -o lib/TableGen/CMakeFiles/LLVMTableGen.dir/JSONBackend.cpp.o -c /Users/buildslave/jenkins/workspace/clang-stage2-Rthinlto/llvm-project/llvm/lib/TableGen/JSONBackend.cpp
[152/3809] /Users/buildslave/jenkins/workspace/clang-stage2-Rthinlto/host-compiler/bin/clang++  -DGTEST_HAS_RTTI=0 -D__STDC_CONSTANT_MACROS -D__STDC_FORMAT_MACROS -D__STDC_LIMIT_MACROS -Ilib/TableGen -I/Users/buildslave/jenkins/workspace/clang-stage2-Rthinlto/llvm-project/llvm/lib/TableGen -I/Applications/Xcode.app/Contents/Developer/Platforms/MacOSX.platform/Developer/SDKs/MacOSX10.14.sdk/usr/include/libxml2 -Iinclude -I/Users/buildslave/jenkins/workspace/clang-stage2-Rthinlto/llvm-project/llvm/include -fno-stack-protector -fno-common -Wno-profile-instr-unprofiled -fPIC -fvisibility-inlines-hidden -Werror=date-time -Werror=unguarded-availability-new -fmodules -fmodules-cache-path=/Users/buildslave/jenkins/workspace/clang-stage2-Rthinlto/clang-build/Build/module.cache -fcxx-modules -gmodules -Wall -Wextra -Wno-unused-parameter -Wwrite-strings -Wcast-qual -Wmissing-field-initializers -pedantic -Wno-long-long -Wimplicit-fallthrough -Wcovered-switch-default -Wno-noexcept-type -Wnon-virtual-dtor -Wdelete-non-virtual-dtor -Wstring-conversion -fdiagnostics-color -flto=thin -O2 -g -DNDEBUG -isysroot /Applications/Xcode.app/Contents/Developer/Platforms/MacOSX.platform/Developer/SDKs/MacOSX10.14.sdk    -fno-exceptions -fno-rtti -std=c++14 -MD -MT lib/TableGen/CMakeFiles/LLVMTableGen.dir/StringMatcher.cpp.o -MF lib/TableGen/CMakeFiles/LLVMTableGen.dir/StringMatcher.cpp.o.d -o lib/TableGen/CMakeFiles/LLVMTableGen.dir/StringMatcher.cpp.o -c /Users/buildslave/jenkins/workspace/clang-stage2-Rthinlto/llvm-project/llvm/lib/TableGen/StringMatcher.cpp
[153/3809] /Users/buildslave/jenkins/workspace/clang-stage2-Rthinlto/host-compiler/bin/clang++  -DGTEST_HAS_RTTI=0 -D__STDC_CONSTANT_MACROS -D__STDC_FORMAT_MACROS -D__STDC_LIMIT_MACROS -Iutils/TableGen -I/Users/buildslave/jenkins/workspace/clang-stage2-Rthinlto/llvm-project/llvm/utils/TableGen -I/Applications/Xcode.app/Contents/Developer/Platforms/MacOSX.platform/Developer/SDKs/MacOSX10.14.sdk/usr/include/libxml2 -Iinclude -I/Users/buildslave/jenkins/workspace/clang-stage2-Rthinlto/llvm-project/llvm/include -fno-stack-protector -fno-common -Wno-profile-instr-unprofiled -fPIC -fvisibility-inlines-hidden -Werror=date-time -Werror=unguarded-availability-new -fmodules -fmodules-cache-path=/Users/buildslave/jenkins/workspace/clang-stage2-Rthinlto/clang-build/Build/module.cache -fcxx-modules -gmodules -Wall -Wextra -Wno-unused-parameter -Wwrite-strings -Wcast-qual -Wmissing-field-initializers -pedantic -Wno-long-long -Wimplicit-fallthrough -Wcovered-switch-default -Wno-noexcept-type -Wnon-virtual-dtor -Wdelete-non-virtual-dtor -Wstring-conversion -fdiagnostics-color -flto=thin -O2 -g -DNDEBUG -isysroot /Applications/Xcode.app/Contents/Developer/Platforms/MacOSX.platform/Developer/SDKs/MacOSX10.14.sdk    -fno-exceptions -fno-rtti -std=c++14 -MD -MT utils/TableGen/CMakeFiles/llvm-tblgen.dir/CodeGenHwModes.cpp.o -MF utils/TableGen/CMakeFiles/llvm-tblgen.dir/CodeGenHwModes.cpp.o.d -o utils/TableGen/CMakeFiles/llvm-tblgen.dir/CodeGenHwModes.cpp.o -c /Users/buildslave/jenkins/workspace/clang-stage2-Rthinlto/llvm-project/llvm/utils/TableGen/CodeGenHwModes.cpp
[154/3809] /Users/buildslave/jenkins/workspace/clang-stage2-Rthinlto/host-compiler/bin/clang++  -DGTEST_HAS_RTTI=0 -D__STDC_CONSTANT_MACROS -D__STDC_FORMAT_MACROS -D__STDC_LIMIT_MACROS -Iutils/TableGen -I/Users/buildslave/jenkins/workspace/clang-stage2-Rthinlto/llvm-project/llvm/utils/TableGen -I/Applications/Xcode.app/Contents/Developer/Platforms/MacOSX.platform/Developer/SDKs/MacOSX10.14.sdk/usr/include/libxml2 -Iinclude -I/Users/buildslave/jenkins/workspace/clang-stage2-Rthinlto/llvm-project/llvm/include -fno-stack-protector -fno-common -Wno-profile-instr-unprofiled -fPIC -fvisibility-inlines-hidden -Werror=date-time -Werror=unguarded-availability-new -fmodules -fmodules-cache-path=/Users/buildslave/jenkins/workspace/clang-stage2-Rthinlto/clang-build/Build/module.cache -fcxx-modules -gmodules -Wall -Wextra -Wno-unused-parameter -Wwrite-strings -Wcast-qual -Wmissing-field-initializers -pedantic -Wno-long-long -Wimplicit-fallthrough -Wcovered-switch-default -Wno-noexcept-type -Wnon-virtual-dtor -Wdelete-non-virtual-dtor -Wstring-conversion -fdiagnostics-color -flto=thin -O2 -g -DNDEBUG -isysroot /Applications/Xcode.app/Contents/Developer/Platforms/MacOSX.platform/Developer/SDKs/MacOSX10.14.sdk    -fno-exceptions -fno-rtti -std=c++14 -MD -MT utils/TableGen/CMakeFiles/llvm-tblgen.dir/CallingConvEmitter.cpp.o -MF utils/TableGen/CMakeFiles/llvm-tblgen.dir/CallingConvEmitter.cpp.o.d -o utils/TableGen/CMakeFiles/llvm-tblgen.dir/CallingConvEmitter.cpp.o -c /Users/buildslave/jenkins/workspace/clang-stage2-Rthinlto/llvm-project/llvm/utils/TableGen/CallingConvEmitter.cpp
[155/3809] /Users/buildslave/jenkins/workspace/clang-stage2-Rthinlto/host-compiler/bin/clang++  -DGTEST_HAS_RTTI=0 -D__STDC_CONSTANT_MACROS -D__STDC_FORMAT_MACROS -D__STDC_LIMIT_MACROS -Iutils/TableGen -I/Users/buildslave/jenkins/workspace/clang-stage2-Rthinlto/llvm-project/llvm/utils/TableGen -I/Applications/Xcode.app/Contents/Developer/Platforms/MacOSX.platform/Developer/SDKs/MacOSX10.14.sdk/usr/include/libxml2 -Iinclude -I/Users/buildslave/jenkins/workspace/clang-stage2-Rthinlto/llvm-project/llvm/include -fno-stack-protector -fno-common -Wno-profile-instr-unprofiled -fPIC -fvisibility-inlines-hidden -Werror=date-time -Werror=unguarded-availability-new -fmodules -fmodules-cache-path=/Users/buildslave/jenkins/workspace/clang-stage2-Rthinlto/clang-build/Build/module.cache -fcxx-modules -gmodules -Wall -Wextra -Wno-unused-parameter -Wwrite-strings -Wcast-qual -Wmissing-field-initializers -pedantic -Wno-long-long -Wimplicit-fallthrough -Wcovered-switch-default -Wno-noexcept-type -Wnon-virtual-dtor -Wdelete-non-virtual-dtor -Wstring-conversion -fdiagnostics-color -flto=thin -O2 -g -DNDEBUG -isysroot /Applications/Xcode.app/Contents/Developer/Platforms/MacOSX.platform/Developer/SDKs/MacOSX10.14.sdk    -fno-exceptions -fno-rtti -std=c++14 -MD -MT utils/TableGen/CMakeFiles/llvm-tblgen.dir/AsmWriterInst.cpp.o -MF utils/TableGen/CMakeFiles/llvm-tblgen.dir/AsmWriterInst.cpp.o.d -o utils/TableGen/CMakeFiles/llvm-tblgen.dir/AsmWriterInst.cpp.o -c /Users/buildslave/jenkins/workspace/clang-stage2-Rthinlto/llvm-project/llvm/utils/TableGen/AsmWriterInst.cpp
[156/3809] /Users/buildslave/jenkins/workspace/clang-stage2-Rthinlto/host-compiler/bin/clang++  -DGTEST_HAS_RTTI=0 -D__STDC_CONSTANT_MACROS -D__STDC_FORMAT_MACROS -D__STDC_LIMIT_MACROS -Ilib/TableGen -I/Users/buildslave/jenkins/workspace/clang-stage2-Rthinlto/llvm-project/llvm/lib/TableGen -I/Applications/Xcode.app/Contents/Developer/Platforms/MacOSX.platform/Developer/SDKs/MacOSX10.14.sdk/usr/include/libxml2 -Iinclude -I/Users/buildslave/jenkins/workspace/clang-stage2-Rthinlto/llvm-project/llvm/include -fno-stack-protector -fno-common -Wno-profile-instr-unprofiled -fPIC -fvisibility-inlines-hidden -Werror=date-time -Werror=unguarded-availability-new -fmodules -fmodules-cache-path=/Users/buildslave/jenkins/workspace/clang-stage2-Rthinlto/clang-build/Build/module.cache -fcxx-modules -gmodules -Wall -Wextra -Wno-unused-parameter -Wwrite-strings -Wcast-qual -Wmissing-field-initializers -pedantic -Wno-long-long -Wimplicit-fallthrough -Wcovered-switch-default -Wno-noexcept-type -Wnon-virtual-dtor -Wdelete-non-virtual-dtor -Wstring-conversion -fdiagnostics-color -flto=thin -O2 -g -DNDEBUG -isysroot /Applications/Xcode.app/Contents/Developer/Platforms/MacOSX.platform/Developer/SDKs/MacOSX10.14.sdk    -fno-exceptions -fno-rtti -std=c++14 -MD -MT lib/TableGen/CMakeFiles/LLVMTableGen.dir/SetTheory.cpp.o -MF lib/TableGen/CMakeFiles/LLVMTableGen.dir/SetTheory.cpp.o.d -o lib/TableGen/CMakeFiles/LLVMTableGen.dir/SetTheory.cpp.o -c /Users/buildslave/jenkins/workspace/clang-stage2-Rthinlto/llvm-project/llvm/lib/TableGen/SetTheory.cpp
[157/3809] /Users/buildslave/jenkins/workspace/clang-stage2-Rthinlto/host-compiler/bin/clang++  -DGTEST_HAS_RTTI=0 -D__STDC_CONSTANT_MACROS -D__STDC_FORMAT_MACROS -D__STDC_LIMIT_MACROS -Ilib/Support -I/Users/buildslave/jenkins/workspace/clang-stage2-Rthinlto/llvm-project/llvm/lib/Support -I/Applications/Xcode.app/Contents/Developer/Platforms/MacOSX.platform/Developer/SDKs/MacOSX10.14.sdk/usr/include/libxml2 -Iinclude -I/Users/buildslave/jenkins/workspace/clang-stage2-Rthinlto/llvm-project/llvm/include -fno-stack-protector -fno-common -Wno-profile-instr-unprofiled -fPIC -fvisibility-inlines-hidden -Werror=date-time -Werror=unguarded-availability-new -fmodules -fmodules-cache-path=/Users/buildslave/jenkins/workspace/clang-stage2-Rthinlto/clang-build/Build/module.cache -fcxx-modules -gmodules -Wall -Wextra -Wno-unused-parameter -Wwrite-strings -Wcast-qual -Wmissing-field-initializers -pedantic -Wno-long-long -Wimplicit-fallthrough -Wcovered-switch-default -Wno-noexcept-type -Wnon-virtual-dtor -Wdelete-non-virtual-dtor -Wstring-conversion -fdiagnostics-color -flto=thin -O2 -g -DNDEBUG -isysroot /Applications/Xcode.app/Contents/Developer/Platforms/MacOSX.platform/Developer/SDKs/MacOSX10.14.sdk   -std=c++14  -fno-exceptions -fno-rtti -MD -MT lib/Support/CMakeFiles/LLVMSupport.dir/VirtualFileSystem.cpp.o -MF lib/Support/CMakeFiles/LLVMSupport.dir/VirtualFileSystem.cpp.o.d -o lib/Support/CMakeFiles/LLVMSupport.dir/VirtualFileSystem.cpp.o -c /Users/buildslave/jenkins/workspace/clang-stage2-Rthinlto/llvm-project/llvm/lib/Support/VirtualFileSystem.cpp
[158/3809] /Users/buildslave/jenkins/workspace/clang-stage2-Rthinlto/host-compiler/bin/clang++  -DCLANG_REPOSITORY_STRING=\"bf68bcb920ffdac5da8b82cd06535cec5dc5a56b\" -DCLANG_VENDOR="\"Apple \"" -DGTEST_HAS_RTTI=0 -D_GNU_SOURCE -D__STDC_CONSTANT_MACROS -D__STDC_FORMAT_MACROS -D__STDC_LIMIT_MACROS -Itools/clang/utils/TableGen -I/Users/buildslave/jenkins/workspace/clang-stage2-Rthinlto/llvm-project/clang/utils/TableGen -I/Users/buildslave/jenkins/workspace/clang-stage2-Rthinlto/llvm-project/clang/include -Itools/clang/include -I/Applications/Xcode.app/Contents/Developer/Platforms/MacOSX.platform/Developer/SDKs/MacOSX10.14.sdk/usr/include/libxml2 -Iinclude -I/Users/buildslave/jenkins/workspace/clang-stage2-Rthinlto/llvm-project/llvm/include -fno-stack-protector -fno-common -Wno-profile-instr-unprofiled -fPIC -fvisibility-inlines-hidden -Werror=date-time -Werror=unguarded-availability-new -fmodules -fmodules-cache-path=/Users/buildslave/jenkins/workspace/clang-stage2-Rthinlto/clang-build/Build/module.cache -fcxx-modules -gmodules -Wall -Wextra -Wno-unused-parameter -Wwrite-strings -Wcast-qual -Wmissing-field-initializers -pedantic -Wno-long-long -Wimplicit-fallthrough -Wcovered-switch-default -Wno-noexcept-type -Wnon-virtual-dtor -Wdelete-non-virtual-dtor -Wstring-conversion -fdiagnostics-color -flto=thin -fno-common -Woverloaded-virtual -Wno-nested-anon-types -O2 -g -DNDEBUG -isysroot /Applications/Xcode.app/Contents/Developer/Platforms/MacOSX.platform/Developer/SDKs/MacOSX10.14.sdk    -fno-exceptions -fno-rtti -std=c++14 -MD -MT tools/clang/utils/TableGen/CMakeFiles/clang-tblgen.dir/ClangAttrEmitter.cpp.o -MF tools/clang/utils/TableGen/CMakeFiles/clang-tblgen.dir/ClangAttrEmitter.cpp.o.d -o tools/clang/utils/TableGen/CMakeFiles/clang-tblgen.dir/ClangAttrEmitter.cpp.o -c /Users/buildslave/jenkins/workspace/clang-stage2-Rthinlto/llvm-project/clang/utils/TableGen/ClangAttrEmitter.cpp
[159/3809] /Users/buildslave/jenkins/workspace/clang-stage2-Rthinlto/host-compiler/bin/clang++  -DGTEST_HAS_RTTI=0 -D__STDC_CONSTANT_MACROS -D__STDC_FORMAT_MACROS -D__STDC_LIMIT_MACROS -Ilib/Support -I/Users/buildslave/jenkins/workspace/clang-stage2-Rthinlto/llvm-project/llvm/lib/Support -I/Applications/Xcode.app/Contents/Developer/Platforms/MacOSX.platform/Developer/SDKs/MacOSX10.14.sdk/usr/include/libxml2 -Iinclude -I/Users/buildslave/jenkins/workspace/clang-stage2-Rthinlto/llvm-project/llvm/include -fno-stack-protector -fno-common -Wno-profile-instr-unprofiled -fPIC -fvisibility-inlines-hidden -Werror=date-time -Werror=unguarded-availability-new -fmodules -fmodules-cache-path=/Users/buildslave/jenkins/workspace/clang-stage2-Rthinlto/clang-build/Build/module.cache -fcxx-modules -gmodules -Wall -Wextra -Wno-unused-parameter -Wwrite-strings -Wcast-qual -Wmissing-field-initializers -pedantic -Wno-long-long -Wimplicit-fallthrough -Wcovered-switch-default -Wno-noexcept-type -Wnon-virtual-dtor -Wdelete-non-virtual-dtor -Wstring-conversion -fdiagnostics-color -flto=thin -O2 -g -DNDEBUG -isysroot /Applications/Xcode.app/Contents/Developer/Platforms/MacOSX.platform/Developer/SDKs/MacOSX10.14.sdk   -std=c++14  -fno-exceptions -fno-rtti -MD -MT lib/Support/CMakeFiles/LLVMSupport.dir/ItaniumManglingCanonicalizer.cpp.o -MF lib/Support/CMakeFiles/LLVMSupport.dir/ItaniumManglingCanonicalizer.cpp.o.d -o lib/Support/CMakeFiles/LLVMSupport.dir/ItaniumManglingCanonicalizer.cpp.o -c /Users/buildslave/jenkins/workspace/clang-stage2-Rthinlto/llvm-project/llvm/lib/Support/ItaniumManglingCanonicalizer.cpp
[160/3809] : && DYLD_LIBRARY_PATH=/Users/buildslave/jenkins/workspace/clang-stage2-Rthinlto/host-compiler/lib/ "/Applications/Xcode.app/Contents/Developer/Toolchains/XcodeDefault.xctoolchain/usr/bin/libtool" -static -no_warning_for_no_symbols -o lib/libLLVMSupport.a  lib/Support/CMakeFiles/LLVMSupport.dir/AArch64TargetParser.cpp.o lib/Support/CMakeFiles/LLVMSupport.dir/ABIBreak.cpp.o lib/Support/CMakeFiles/LLVMSupport.dir/ARMTargetParser.cpp.o lib/Support/CMakeFiles/LLVMSupport.dir/AMDGPUMetadata.cpp.o lib/Support/CMakeFiles/LLVMSupport.dir/APFloat.cpp.o lib/Support/CMakeFiles/LLVMSupport.dir/APInt.cpp.o lib/Support/CMakeFiles/LLVMSupport.dir/APSInt.cpp.o lib/Support/CMakeFiles/LLVMSupport.dir/ARMBuildAttrs.cpp.o lib/Support/CMakeFiles/LLVMSupport.dir/ARMAttributeParser.cpp.o lib/Support/CMakeFiles/LLVMSupport.dir/ARMWinEH.cpp.o lib/Support/CMakeFiles/LLVMSupport.dir/Allocator.cpp.o lib/Support/CMakeFiles/LLVMSupport.dir/BinaryStreamError.cpp.o lib/Support/CMakeFiles/LLVMSupport.dir/BinaryStreamReader.cpp.o lib/Support/CMakeFiles/LLVMSupport.dir/BinaryStreamRef.cpp.o lib/Support/CMakeFiles/LLVMSupport.dir/BinaryStreamWriter.cpp.o lib/Support/CMakeFiles/LLVMSupport.dir/BlockFrequency.cpp.o lib/Support/CMakeFiles/LLVMSupport.dir/BranchProbability.cpp.o lib/Support/CMakeFiles/LLVMSupport.dir/BuryPointer.cpp.o lib/Support/CMakeFiles/LLVMSupport.dir/CachePruning.cpp.o lib/Support/CMakeFiles/LLVMSupport.dir/circular_raw_ostream.cpp.o lib/Support/CMakeFiles/LLVMSupport.dir/Chrono.cpp.o lib/Support/CMakeFiles/LLVMSupport.dir/COM.cpp.o lib/Support/CMakeFiles/LLVMSupport.dir/CodeGenCoverage.cpp.o lib/Support/CMakeFiles/LLVMSupport.dir/CommandLine.cpp.o lib/Support/CMakeFiles/LLVMSupport.dir/Compression.cpp.o lib/Support/CMakeFiles/LLVMSupport.dir/CRC.cpp.o lib/Support/CMakeFiles/LLVMSupport.dir/ConvertUTF.cpp.o lib/Support/CMakeFiles/LLVMSupport.dir/ConvertUTFWrapper.cpp.o lib/Support/CMakeFiles/LLVMSupport.dir/CrashRecoveryContext.cpp.o lib/Support/CMakeFiles/LLVMSupport.dir/DataExtractor.cpp.o lib/Support/CMakeFiles/LLVMSupport.dir/Debug.cpp.o lib/Support/CMakeFiles/LLVMSupport.dir/DebugCounter.cpp.o lib/Support/CMakeFiles/LLVMSupport.dir/DeltaAlgorithm.cpp.o lib/Support/CMakeFiles/LLVMSupport.dir/DAGDeltaAlgorithm.cpp.o lib/Support/CMakeFiles/LLVMSupport.dir/DJB.cpp.o lib/Support/CMakeFiles/LLVMSupport.dir/Error.cpp.o lib/Support/CMakeFiles/LLVMSupport.dir/ErrorHandling.cpp.o lib/Support/CMakeFiles/LLVMSupport.dir/FileCheck.cpp.o lib/Support/CMakeFiles/LLVMSupport.dir/FileCollector.cpp.o lib/Support/CMakeFiles/LLVMSupport.dir/FileUtilities.cpp.o lib/Support/CMakeFiles/LLVMSupport.dir/FileOutputBuffer.cpp.o lib/Support/CMakeFiles/LLVMSupport.dir/FoldingSet.cpp.o lib/Support/CMakeFiles/LLVMSupport.dir/FormattedStream.cpp.o lib/Support/CMakeFiles/LLVMSupport.dir/FormatVariadic.cpp.o lib/Support/CMakeFiles/LLVMSupport.dir/GlobPattern.cpp.o lib/Support/CMakeFiles/LLVMSupport.dir/GraphWriter.cpp.o lib/Support/CMakeFiles/LLVMSupport.dir/Hashing.cpp.o lib/Support/CMakeFiles/LLVMSupport.dir/InitLLVM.cpp.o lib/Support/CMakeFiles/LLVMSupport.dir/IntEqClasses.cpp.o lib/Support/CMakeFiles/LLVMSupport.dir/IntervalMap.cpp.o lib/Support/CMakeFiles/LLVMSupport.dir/ItaniumManglingCanonicalizer.cpp.o lib/Support/CMakeFiles/LLVMSupport.dir/JSON.cpp.o lib/Support/CMakeFiles/LLVMSupport.dir/KnownBits.cpp.o lib/Support/CMakeFiles/LLVMSupport.dir/LEB128.cpp.o lib/Support/CMakeFiles/LLVMSupport.dir/LineIterator.cpp.o lib/Support/CMakeFiles/LLVMSupport.dir/Locale.cpp.o lib/Support/CMakeFiles/LLVMSupport.dir/LockFileManager.cpp.o lib/Support/CMakeFiles/LLVMSupport.dir/LowLevelType.cpp.o lib/Support/CMakeFiles/LLVMSupport.dir/ManagedStatic.cpp.o lib/Support/CMakeFiles/LLVMSupport.dir/MathExtras.cpp.o lib/Support/CMakeFiles/LLVMSupport.dir/MemoryBuffer.cpp.o lib/Support/CMakeFiles/LLVMSupport.dir/MD5.cpp.o lib/Support/CMakeFiles/LLVMSupport.dir/NativeFormatting.cpp.o lib/Support/CMakeFiles/LLVMSupport.dir/Optional.cpp.o lib/Support/CMakeFiles/LLVMSupport.dir/Parallel.cpp.o lib/Support/CMakeFiles/LLVMSupport.dir/PluginLoader.cpp.o lib/Support/CMakeFiles/LLVMSupport.dir/PrettyStackTrace.cpp.o lib/Support/CMakeFiles/LLVMSupport.dir/RandomNumberGenerator.cpp.o lib/Support/CMakeFiles/LLVMSupport.dir/Regex.cpp.o lib/Support/CMakeFiles/LLVMSupport.dir/ScaledNumber.cpp.o lib/Support/CMakeFiles/LLVMSupport.dir/ScopedPrinter.cpp.o lib/Support/CMakeFiles/LLVMSupport.dir/SHA1.cpp.o lib/Support/CMakeFiles/LLVMSupport.dir/Signposts.cpp.o lib/Support/CMakeFiles/LLVMSupport.dir/SmallPtrSet.cpp.o lib/Support/CMakeFiles/LLVMSupport.dir/SmallVector.cpp.o lib/Support/CMakeFiles/LLVMSupport.dir/SourceMgr.cpp.o lib/Support/CMakeFiles/LLVMSupport.dir/SpecialCaseList.cpp.o lib/Support/CMakeFiles/LLVMSupport.dir/Statistic.cpp.o lib/Support/CMakeFiles/LLVMSupport.dir/StringExtras.cpp.o lib/Support/CMakeFiles/LLVMSupport.dir/StringMap.cpp.o lib/Support/CMakeFiles/LLVMSupport.dir/StringPool.cpp.o lib/Support/CMakeFiles/LLVMSupport.dir/StringSaver.cpp.o lib/Support/CMakeFiles/LLVMSupport.dir/StringRef.cpp.o lib/Support/CMakeFiles/LLVMSupport.dir/SymbolRemappingReader.cpp.o lib/Support/CMakeFiles/LLVMSupport.dir/SystemUtils.cpp.o lib/Support/CMakeFiles/LLVMSupport.dir/TarWriter.cpp.o lib/Support/CMakeFiles/LLVMSupport.dir/TargetParser.cpp.o lib/Support/CMakeFiles/LLVMSupport.dir/ThreadPool.cpp.o lib/Support/CMakeFiles/LLVMSupport.dir/TimeProfiler.cpp.o lib/Support/CMakeFiles/LLVMSupport.dir/Timer.cpp.o lib/Support/CMakeFiles/LLVMSupport.dir/ToolOutputFile.cpp.o lib/Support/CMakeFiles/LLVMSupport.dir/TrigramIndex.cpp.o lib/Support/CMakeFiles/LLVMSupport.dir/Triple.cpp.o lib/Support/CMakeFiles/LLVMSupport.dir/Twine.cpp.o lib/Support/CMakeFiles/LLVMSupport.dir/Unicode.cpp.o lib/Support/CMakeFiles/LLVMSupport.dir/UnicodeCaseFold.cpp.o lib/Support/CMakeFiles/LLVMSupport.dir/VersionTuple.cpp.o lib/Support/CMakeFiles/LLVMSupport.dir/VirtualFileSystem.cpp.o lib/Support/CMakeFiles/LLVMSupport.dir/WithColor.cpp.o lib/Support/CMakeFiles/LLVMSupport.dir/YAMLParser.cpp.o lib/Support/CMakeFiles/LLVMSupport.dir/YAMLTraits.cpp.o lib/Support/CMakeFiles/LLVMSupport.dir/raw_os_ostream.cpp.o lib/Support/CMakeFiles/LLVMSupport.dir/raw_ostream.cpp.o lib/Support/CMakeFiles/LLVMSupport.dir/regcomp.c.o lib/Support/CMakeFiles/LLVMSupport.dir/regerror.c.o lib/Support/CMakeFiles/LLVMSupport.dir/regexec.c.o lib/Support/CMakeFiles/LLVMSupport.dir/regfree.c.o lib/Support/CMakeFiles/LLVMSupport.dir/regstrlcpy.c.o lib/Support/CMakeFiles/LLVMSupport.dir/xxhash.cpp.o lib/Support/CMakeFiles/LLVMSupport.dir/Z3Solver.cpp.o lib/Support/CMakeFiles/LLVMSupport.dir/Atomic.cpp.o lib/Support/CMakeFiles/LLVMSupport.dir/DynamicLibrary.cpp.o lib/Support/CMakeFiles/LLVMSupport.dir/Errno.cpp.o lib/Support/CMakeFiles/LLVMSupport.dir/Host.cpp.o lib/Support/CMakeFiles/LLVMSupport.dir/Memory.cpp.o lib/Support/CMakeFiles/LLVMSupport.dir/Path.cpp.o lib/Support/CMakeFiles/LLVMSupport.dir/Process.cpp.o lib/Support/CMakeFiles/LLVMSupport.dir/Program.cpp.o lib/Support/CMakeFiles/LLVMSupport.dir/RWMutex.cpp.o lib/Support/CMakeFiles/LLVMSupport.dir/Signals.cpp.o lib/Support/CMakeFiles/LLVMSupport.dir/TargetRegistry.cpp.o lib/Support/CMakeFiles/LLVMSupport.dir/ThreadLocal.cpp.o lib/Support/CMakeFiles/LLVMSupport.dir/Threading.cpp.o lib/Support/CMakeFiles/LLVMSupport.dir/Valgrind.cpp.o lib/Support/CMakeFiles/LLVMSupport.dir/Watchdog.cpp.o && :
[161/3809] /Users/buildslave/jenkins/workspace/clang-stage2-Rthinlto/host-compiler/bin/clang++  -DGTEST_HAS_RTTI=0 -D__STDC_CONSTANT_MACROS -D__STDC_FORMAT_MACROS -D__STDC_LIMIT_MACROS -Ilib/TableGen -I/Users/buildslave/jenkins/workspace/clang-stage2-Rthinlto/llvm-project/llvm/lib/TableGen -I/Applications/Xcode.app/Contents/Developer/Platforms/MacOSX.platform/Developer/SDKs/MacOSX10.14.sdk/usr/include/libxml2 -Iinclude -I/Users/buildslave/jenkins/workspace/clang-stage2-Rthinlto/llvm-project/llvm/include -fno-stack-protector -fno-common -Wno-profile-instr-unprofiled -fPIC -fvisibility-inlines-hidden -Werror=date-time -Werror=unguarded-availability-new -fmodules -fmodules-cache-path=/Users/buildslave/jenkins/workspace/clang-stage2-Rthinlto/clang-build/Build/module.cache -fcxx-modules -gmodules -Wall -Wextra -Wno-unused-parameter -Wwrite-strings -Wcast-qual -Wmissing-field-initializers -pedantic -Wno-long-long -Wimplicit-fallthrough -Wcovered-switch-default -Wno-noexcept-type -Wnon-virtual-dtor -Wdelete-non-virtual-dtor -Wstring-conversion -fdiagnostics-color -flto=thin -O2 -g -DNDEBUG -isysroot /Applications/Xcode.app/Contents/Developer/Platforms/MacOSX.platform/Developer/SDKs/MacOSX10.14.sdk    -fno-exceptions -fno-rtti -std=c++14 -MD -MT lib/TableGen/CMakeFiles/LLVMTableGen.dir/Main.cpp.o -MF lib/TableGen/CMakeFiles/LLVMTableGen.dir/Main.cpp.o.d -o lib/TableGen/CMakeFiles/LLVMTableGen.dir/Main.cpp.o -c /Users/buildslave/jenkins/workspace/clang-stage2-Rthinlto/llvm-project/llvm/lib/TableGen/Main.cpp
[162/3809] /Users/buildslave/jenkins/workspace/clang-stage2-Rthinlto/host-compiler/bin/clang++  -DGTEST_HAS_RTTI=0 -D__STDC_CONSTANT_MACROS -D__STDC_FORMAT_MACROS -D__STDC_LIMIT_MACROS -Iutils/TableGen -I/Users/buildslave/jenkins/workspace/clang-stage2-Rthinlto/llvm-project/llvm/utils/TableGen -I/Applications/Xcode.app/Contents/Developer/Platforms/MacOSX.platform/Developer/SDKs/MacOSX10.14.sdk/usr/include/libxml2 -Iinclude -I/Users/buildslave/jenkins/workspace/clang-stage2-Rthinlto/llvm-project/llvm/include -fno-stack-protector -fno-common -Wno-profile-instr-unprofiled -fPIC -fvisibility-inlines-hidden -Werror=date-time -Werror=unguarded-availability-new -fmodules -fmodules-cache-path=/Users/buildslave/jenkins/workspace/clang-stage2-Rthinlto/clang-build/Build/module.cache -fcxx-modules -gmodules -Wall -Wextra -Wno-unused-parameter -Wwrite-strings -Wcast-qual -Wmissing-field-initializers -pedantic -Wno-long-long -Wimplicit-fallthrough -Wcovered-switch-default -Wno-noexcept-type -Wnon-virtual-dtor -Wdelete-non-virtual-dtor -Wstring-conversion -fdiagnostics-color -flto=thin -O2 -g -DNDEBUG -isysroot /Applications/Xcode.app/Contents/Developer/Platforms/MacOSX.platform/Developer/SDKs/MacOSX10.14.sdk    -fno-exceptions -fno-rtti -std=c++14 -MD -MT utils/TableGen/CMakeFiles/llvm-tblgen.dir/CodeGenInstruction.cpp.o -MF utils/TableGen/CMakeFiles/llvm-tblgen.dir/CodeGenInstruction.cpp.o.d -o utils/TableGen/CMakeFiles/llvm-tblgen.dir/CodeGenInstruction.cpp.o -c /Users/buildslave/jenkins/workspace/clang-stage2-Rthinlto/llvm-project/llvm/utils/TableGen/CodeGenInstruction.cpp
[163/3809] : && /Users/buildslave/jenkins/workspace/clang-stage2-Rthinlto/host-compiler/bin/clang++  -fno-stack-protector -fno-common -Wno-profile-instr-unprofiled -fPIC -fvisibility-inlines-hidden -Werror=date-time -Werror=unguarded-availability-new -fmodules -fmodules-cache-path=/Users/buildslave/jenkins/workspace/clang-stage2-Rthinlto/clang-build/Build/module.cache -fcxx-modules -gmodules -Wall -Wextra -Wno-unused-parameter -Wwrite-strings -Wcast-qual -Wmissing-field-initializers -pedantic -Wno-long-long -Wimplicit-fallthrough -Wcovered-switch-default -Wno-noexcept-type -Wnon-virtual-dtor -Wdelete-non-virtual-dtor -Wstring-conversion -fdiagnostics-color -flto=thin -O2 -g -DNDEBUG -isysroot /Applications/Xcode.app/Contents/Developer/Platforms/MacOSX.platform/Developer/SDKs/MacOSX10.14.sdk -Wl,-search_paths_first -Wl,-headerpad_max_install_names -flto=thin -Wl,-cache_path_lto,/Users/buildslave/jenkins/workspace/clang-stage2-Rthinlto/clang-build/Build/lto.cache    -Wl,-dead_strip -Wl,-object_path_lto,/Users/buildslave/jenkins/workspace/clang-stage2-Rthinlto/clang-build/Build/tools/llvm-config/./llvm-config-lto.o tools/llvm-config/CMakeFiles/llvm-config.dir/llvm-config.cpp.o  -o bin/llvm-config  -Wl,-rpath,@loader_path/../lib lib/libLLVMSupport.a -lz -lcurses -lm lib/libLLVMDemangle.a && cd /Users/buildslave/jenkins/workspace/clang-stage2-Rthinlto/clang-build/Build/tools/llvm-config && /Users/buildslave/jenkins/workspace/clang-stage2-Rthinlto/host-compiler/bin/dsymutil -o=llvm-config.dSYM /Users/buildslave/jenkins/workspace/clang-stage2-Rthinlto/clang-build/Build/bin/llvm-config && /usr/bin/strip -Sxl /Users/buildslave/jenkins/workspace/clang-stage2-Rthinlto/clang-build/Build/bin/llvm-config
FAILED: bin/llvm-config 
: && /Users/buildslave/jenkins/workspace/clang-stage2-Rthinlto/host-compiler/bin/clang++  -fno-stack-protector -fno-common -Wno-profile-instr-unprofiled -fPIC -fvisibility-inlines-hidden -Werror=date-time -Werror=unguarded-availability-new -fmodules -fmodules-cache-path=/Users/buildslave/jenkins/workspace/clang-stage2-Rthinlto/clang-build/Build/module.cache -fcxx-modules -gmodules -Wall -Wextra -Wno-unused-parameter -Wwrite-strings -Wcast-qual -Wmissing-field-initializers -pedantic -Wno-long-long -Wimplicit-fallthrough -Wcovered-switch-default -Wno-noexcept-type -Wnon-virtual-dtor -Wdelete-non-virtual-dtor -Wstring-conversion -fdiagnostics-color -flto=thin -O2 -g -DNDEBUG -isysroot /Applications/Xcode.app/Contents/Developer/Platforms/MacOSX.platform/Developer/SDKs/MacOSX10.14.sdk -Wl,-search_paths_first -Wl,-headerpad_max_install_names -flto=thin -Wl,-cache_path_lto,/Users/buildslave/jenkins/workspace/clang-stage2-Rthinlto/clang-build/Build/lto.cache    -Wl,-dead_strip -Wl,-object_path_lto,/Users/buildslave/jenkins/workspace/clang-stage2-Rthinlto/clang-build/Build/tools/llvm-config/./llvm-config-lto.o tools/llvm-config/CMakeFiles/llvm-config.dir/llvm-config.cpp.o  -o bin/llvm-config  -Wl,-rpath,@loader_path/../lib lib/libLLVMSupport.a -lz -lcurses -lm lib/libLLVMDemangle.a && cd /Users/buildslave/jenkins/workspace/clang-stage2-Rthinlto/clang-build/Build/tools/llvm-config && /Users/buildslave/jenkins/workspace/clang-stage2-Rthinlto/host-compiler/bin/dsymutil -o=llvm-config.dSYM /Users/buildslave/jenkins/workspace/clang-stage2-Rthinlto/clang-build/Build/bin/llvm-config && /usr/bin/strip -Sxl /Users/buildslave/jenkins/workspace/clang-stage2-Rthinlto/clang-build/Build/bin/llvm-config
Assertion failed: (CU.getDIE(CalleeSP) && "Expected declaration subprogram DIE for callee"), function constructCallSiteEntryDIEs, file /Users/buildslave/jenkins/workspace/clang-stage1-RA/llvm-project/llvm/lib/CodeGen/AsmPrinter/DwarfDebug.cpp, line 763.
clang-10: error: unable to execute command: Abort trap: 6
clang-10: error: linker command failed due to signal (use -v to see invocation)
[164/3809] /Users/buildslave/jenkins/workspace/clang-stage2-Rthinlto/host-compiler/bin/clang++  -DGTEST_HAS_RTTI=0 -D__STDC_CONSTANT_MACROS -D__STDC_FORMAT_MACROS -D__STDC_LIMIT_MACROS -Ilib/TableGen -I/Users/buildslave/jenkins/workspace/clang-stage2-Rthinlto/llvm-project/llvm/lib/TableGen -I/Applications/Xcode.app/Contents/Developer/Platforms/MacOSX.platform/Developer/SDKs/MacOSX10.14.sdk/usr/include/libxml2 -Iinclude -I/Users/buildslave/jenkins/workspace/clang-stage2-Rthinlto/llvm-project/llvm/include -fno-stack-protector -fno-common -Wno-profile-instr-unprofiled -fPIC -fvisibility-inlines-hidden -Werror=date-time -Werror=unguarded-availability-new -fmodules -fmodules-cache-path=/Users/buildslave/jenkins/workspace/clang-stage2-Rthinlto/clang-build/Build/module.cache -fcxx-modules -gmodules -Wall -Wextra -Wno-unused-parameter -Wwrite-strings -Wcast-qual -Wmissing-field-initializers -pedantic -Wno-long-long -Wimplicit-fallthrough -Wcovered-switch-default -Wno-noexcept-type -Wnon-virtual-dtor -Wdelete-non-virtual-dtor -Wstring-conversion -fdiagnostics-color -flto=thin -O2 -g -DNDEBUG -isysroot /Applications/Xcode.app/Contents/Developer/Platforms/MacOSX.platform/Developer/SDKs/MacOSX10.14.sdk    -fno-exceptions -fno-rtti -std=c++14 -MD -MT lib/TableGen/CMakeFiles/LLVMTableGen.dir/TGParser.cpp.o -MF lib/TableGen/CMakeFiles/LLVMTableGen.dir/TGParser.cpp.o.d -o lib/TableGen/CMakeFiles/LLVMTableGen.dir/TGParser.cpp.o -c /Users/buildslave/jenkins/workspace/clang-stage2-Rthinlto/llvm-project/llvm/lib/TableGen/TGParser.cpp
[165/3809] /Users/buildslave/jenkins/workspace/clang-stage2-Rthinlto/host-compiler/bin/clang++  -DGTEST_HAS_RTTI=0 -D__STDC_CONSTANT_MACROS -D__STDC_FORMAT_MACROS -D__STDC_LIMIT_MACROS -Iutils/TableGen -I/Users/buildslave/jenkins/workspace/clang-stage2-Rthinlto/llvm-project/llvm/utils/TableGen -I/Applications/Xcode.app/Contents/Developer/Platforms/MacOSX.platform/Developer/SDKs/MacOSX10.14.sdk/usr/include/libxml2 -Iinclude -I/Users/buildslave/jenkins/workspace/clang-stage2-Rthinlto/llvm-project/llvm/include -fno-stack-protector -fno-common -Wno-profile-instr-unprofiled -fPIC -fvisibility-inlines-hidden -Werror=date-time -Werror=unguarded-availability-new -fmodules -fmodules-cache-path=/Users/buildslave/jenkins/workspace/clang-stage2-Rthinlto/clang-build/Build/module.cache -fcxx-modules -gmodules -Wall -Wextra -Wno-unused-parameter -Wwrite-strings -Wcast-qual -Wmissing-field-initializers -pedantic -Wno-long-long -Wimplicit-fallthrough -Wcovered-switch-default -Wno-noexcept-type -Wnon-virtual-dtor -Wdelete-non-virtual-dtor -Wstring-conversion -fdiagnostics-color -flto=thin -O2 -g -DNDEBUG -isysroot /Applications/Xcode.app/Contents/Developer/Platforms/MacOSX.platform/Developer/SDKs/MacOSX10.14.sdk    -fno-exceptions -fno-rtti -std=c++14 -MD -MT utils/TableGen/CMakeFiles/llvm-tblgen.dir/CodeGenMapTable.cpp.o -MF utils/TableGen/CMakeFiles/llvm-tblgen.dir/CodeGenMapTable.cpp.o.d -o utils/TableGen/CMakeFiles/llvm-tblgen.dir/CodeGenMapTable.cpp.o -c /Users/buildslave/jenkins/workspace/clang-stage2-Rthinlto/llvm-project/llvm/utils/TableGen/CodeGenMapTable.cpp
[166/3809] /Users/buildslave/jenkins/workspace/clang-stage2-Rthinlto/host-compiler/bin/clang++  -DGTEST_HAS_RTTI=0 -D__STDC_CONSTANT_MACROS -D__STDC_FORMAT_MACROS -D__STDC_LIMIT_MACROS -Iutils/TableGen -I/Users/buildslave/jenkins/workspace/clang-stage2-Rthinlto/llvm-project/llvm/utils/TableGen -I/Applications/Xcode.app/Contents/Developer/Platforms/MacOSX.platform/Developer/SDKs/MacOSX10.14.sdk/usr/include/libxml2 -Iinclude -I/Users/buildslave/jenkins/workspace/clang-stage2-Rthinlto/llvm-project/llvm/include -fno-stack-protector -fno-common -Wno-profile-instr-unprofiled -fPIC -fvisibility-inlines-hidden -Werror=date-time -Werror=unguarded-availability-new -fmodules -fmodules-cache-path=/Users/buildslave/jenkins/workspace/clang-stage2-Rthinlto/clang-build/Build/module.cache -fcxx-modules -gmodules -Wall -Wextra -Wno-unused-parameter -Wwrite-strings -Wcast-qual -Wmissing-field-initializers -pedantic -Wno-long-long -Wimplicit-fallthrough -Wcovered-switch-default -Wno-noexcept-type -Wnon-virtual-dtor -Wdelete-non-virtual-dtor -Wstring-conversion -fdiagnostics-color -flto=thin -O2 -g -DNDEBUG -isysroot /Applications/Xcode.app/Contents/Developer/Platforms/MacOSX.platform/Developer/SDKs/MacOSX10.14.sdk    -fno-exceptions -fno-rtti -std=c++14 -MD -MT utils/TableGen/CMakeFiles/llvm-tblgen.dir/CodeEmitterGen.cpp.o -MF utils/TableGen/CMakeFiles/llvm-tblgen.dir/CodeEmitterGen.cpp.o.d -o utils/TableGen/CMakeFiles/llvm-tblgen.dir/CodeEmitterGen.cpp.o -c /Users/buildslave/jenkins/workspace/clang-stage2-Rthinlto/llvm-project/llvm/utils/TableGen/CodeEmitterGen.cpp
[167/3809] /Users/buildslave/jenkins/workspace/clang-stage2-Rthinlto/host-compiler/bin/clang++  -DGTEST_HAS_RTTI=0 -D__STDC_CONSTANT_MACROS -D__STDC_FORMAT_MACROS -D__STDC_LIMIT_MACROS -Iutils/TableGen -I/Users/buildslave/jenkins/workspace/clang-stage2-Rthinlto/llvm-project/llvm/utils/TableGen -I/Applications/Xcode.app/Contents/Developer/Platforms/MacOSX.platform/Developer/SDKs/MacOSX10.14.sdk/usr/include/libxml2 -Iinclude -I/Users/buildslave/jenkins/workspace/clang-stage2-Rthinlto/llvm-project/llvm/include -fno-stack-protector -fno-common -Wno-profile-instr-unprofiled -fPIC -fvisibility-inlines-hidden -Werror=date-time -Werror=unguarded-availability-new -fmodules -fmodules-cache-path=/Users/buildslave/jenkins/workspace/clang-stage2-Rthinlto/clang-build/Build/module.cache -fcxx-modules -gmodules -Wall -Wextra -Wno-unused-parameter -Wwrite-strings -Wcast-qual -Wmissing-field-initializers -pedantic -Wno-long-long -Wimplicit-fallthrough -Wcovered-switch-default -Wno-noexcept-type -Wnon-virtual-dtor -Wdelete-non-virtual-dtor -Wstring-conversion -fdiagnostics-color -flto=thin -O2 -g -DNDEBUG -isysroot /Applications/Xcode.app/Contents/Developer/Platforms/MacOSX.platform/Developer/SDKs/MacOSX10.14.sdk    -fno-exceptions -fno-rtti -std=c++14 -MD -MT utils/TableGen/CMakeFiles/llvm-tblgen.dir/DAGISelMatcherOpt.cpp.o -MF utils/TableGen/CMakeFiles/llvm-tblgen.dir/DAGISelMatcherOpt.cpp.o.d -o utils/TableGen/CMakeFiles/llvm-tblgen.dir/DAGISelMatcherOpt.cpp.o -c /Users/buildslave/jenkins/workspace/clang-stage2-Rthinlto/llvm-project/llvm/utils/TableGen/DAGISelMatcherOpt.cpp
[168/3809] /Users/buildslave/jenkins/workspace/clang-stage2-Rthinlto/host-compiler/bin/clang++  -DGTEST_HAS_RTTI=0 -D__STDC_CONSTANT_MACROS -D__STDC_FORMAT_MACROS -D__STDC_LIMIT_MACROS -Iutils/TableGen -I/Users/buildslave/jenkins/workspace/clang-stage2-Rthinlto/llvm-project/llvm/utils/TableGen -I/Applications/Xcode.app/Contents/Developer/Platforms/MacOSX.platform/Developer/SDKs/MacOSX10.14.sdk/usr/include/libxml2 -Iinclude -I/Users/buildslave/jenkins/workspace/clang-stage2-Rthinlto/llvm-project/llvm/include -fno-stack-protector -fno-common -Wno-profile-instr-unprofiled -fPIC -fvisibility-inlines-hidden -Werror=date-time -Werror=unguarded-availability-new -fmodules -fmodules-cache-path=/Users/buildslave/jenkins/workspace/clang-stage2-Rthinlto/clang-build/Build/module.cache -fcxx-modules -gmodules -Wall -Wextra -Wno-unused-parameter -Wwrite-strings -Wcast-qual -Wmissing-field-initializers -pedantic -Wno-long-long -Wimplicit-fallthrough -Wcovered-switch-default -Wno-noexcept-type -Wnon-virtual-dtor -Wdelete-non-virtual-dtor -Wstring-conversion -fdiagnostics-color -flto=thin -O2 -g -DNDEBUG -isysroot /Applications/Xcode.app/Contents/Developer/Platforms/MacOSX.platform/Developer/SDKs/MacOSX10.14.sdk    -fno-exceptions -fno-rtti -std=c++14 -MD -MT utils/TableGen/CMakeFiles/llvm-tblgen.dir/DAGISelEmitter.cpp.o -MF utils/TableGen/CMakeFiles/llvm-tblgen.dir/DAGISelEmitter.cpp.o.d -o utils/TableGen/CMakeFiles/llvm-tblgen.dir/DAGISelEmitter.cpp.o -c /Users/buildslave/jenkins/workspace/clang-stage2-Rthinlto/llvm-project/llvm/utils/TableGen/DAGISelEmitter.cpp
[169/3809] /Users/buildslave/jenkins/workspace/clang-stage2-Rthinlto/host-compiler/bin/clang++  -DGTEST_HAS_RTTI=0 -D__STDC_CONSTANT_MACROS -D__STDC_FORMAT_MACROS -D__STDC_LIMIT_MACROS -Ilib/TableGen -I/Users/buildslave/jenkins/workspace/clang-stage2-Rthinlto/llvm-project/llvm/lib/TableGen -I/Applications/Xcode.app/Contents/Developer/Platforms/MacOSX.platform/Developer/SDKs/MacOSX10.14.sdk/usr/include/libxml2 -Iinclude -I/Users/buildslave/jenkins/workspace/clang-stage2-Rthinlto/llvm-project/llvm/include -fno-stack-protector -fno-common -Wno-profile-instr-unprofiled -fPIC -fvisibility-inlines-hidden -Werror=date-time -Werror=unguarded-availability-new -fmodules -fmodules-cache-path=/Users/buildslave/jenkins/workspace/clang-stage2-Rthinlto/clang-build/Build/module.cache -fcxx-modules -gmodules -Wall -Wextra -Wno-unused-parameter -Wwrite-strings -Wcast-qual -Wmissing-field-initializers -pedantic -Wno-long-long -Wimplicit-fallthrough -Wcovered-switch-default -Wno-noexcept-type -Wnon-virtual-dtor -Wdelete-non-virtual-dtor -Wstring-conversion -fdiagnostics-color -flto=thin -O2 -g -DNDEBUG -isysroot /Applications/Xcode.app/Contents/Developer/Platforms/MacOSX.platform/Developer/SDKs/MacOSX10.14.sdk    -fno-exceptions -fno-rtti -std=c++14 -MD -MT lib/TableGen/CMakeFiles/LLVMTableGen.dir/Record.cpp.o -MF lib/TableGen/CMakeFiles/LLVMTableGen.dir/Record.cpp.o.d -o lib/TableGen/CMakeFiles/LLVMTableGen.dir/Record.cpp.o -c /Users/buildslave/jenkins/workspace/clang-stage2-Rthinlto/llvm-project/llvm/lib/TableGen/Record.cpp
[170/3809] /Users/buildslave/jenkins/workspace/clang-stage2-Rthinlto/host-compiler/bin/clang++  -DGTEST_HAS_RTTI=0 -D__STDC_CONSTANT_MACROS -D__STDC_FORMAT_MACROS -D__STDC_LIMIT_MACROS -Iutils/TableGen -I/Users/buildslave/jenkins/workspace/clang-stage2-Rthinlto/llvm-project/llvm/utils/TableGen -I/Applications/Xcode.app/Contents/Developer/Platforms/MacOSX.platform/Developer/SDKs/MacOSX10.14.sdk/usr/include/libxml2 -Iinclude -I/Users/buildslave/jenkins/workspace/clang-stage2-Rthinlto/llvm-project/llvm/include -fno-stack-protector -fno-common -Wno-profile-instr-unprofiled -fPIC -fvisibility-inlines-hidden -Werror=date-time -Werror=unguarded-availability-new -fmodules -fmodules-cache-path=/Users/buildslave/jenkins/workspace/clang-stage2-Rthinlto/clang-build/Build/module.cache -fcxx-modules -gmodules -Wall -Wextra -Wno-unused-parameter -Wwrite-strings -Wcast-qual -Wmissing-field-initializers -pedantic -Wno-long-long -Wimplicit-fallthrough -Wcovered-switch-default -Wno-noexcept-type -Wnon-virtual-dtor -Wdelete-non-virtual-dtor -Wstring-conversion -fdiagnostics-color -flto=thin -O2 -g -DNDEBUG -isysroot /Applications/Xcode.app/Contents/Developer/Platforms/MacOSX.platform/Developer/SDKs/MacOSX10.14.sdk    -fno-exceptions -fno-rtti -std=c++14 -MD -MT utils/TableGen/CMakeFiles/llvm-tblgen.dir/DAGISelMatcher.cpp.o -MF utils/TableGen/CMakeFiles/llvm-tblgen.dir/DAGISelMatcher.cpp.o.d -o utils/TableGen/CMakeFiles/llvm-tblgen.dir/DAGISelMatcher.cpp.o -c /Users/buildslave/jenkins/workspace/clang-stage2-Rthinlto/llvm-project/llvm/utils/TableGen/DAGISelMatcher.cpp
[171/3809] /Users/buildslave/jenkins/workspace/clang-stage2-Rthinlto/host-compiler/bin/clang++  -DGTEST_HAS_RTTI=0 -D__STDC_CONSTANT_MACROS -D__STDC_FORMAT_MACROS -D__STDC_LIMIT_MACROS -Iutils/TableGen -I/Users/buildslave/jenkins/workspace/clang-stage2-Rthinlto/llvm-project/llvm/utils/TableGen -I/Applications/Xcode.app/Contents/Developer/Platforms/MacOSX.platform/Developer/SDKs/MacOSX10.14.sdk/usr/include/libxml2 -Iinclude -I/Users/buildslave/jenkins/workspace/clang-stage2-Rthinlto/llvm-project/llvm/include -fno-stack-protector -fno-common -Wno-profile-instr-unprofiled -fPIC -fvisibility-inlines-hidden -Werror=date-time -Werror=unguarded-availability-new -fmodules -fmodules-cache-path=/Users/buildslave/jenkins/workspace/clang-stage2-Rthinlto/clang-build/Build/module.cache -fcxx-modules -gmodules -Wall -Wextra -Wno-unused-parameter -Wwrite-strings -Wcast-qual -Wmissing-field-initializers -pedantic -Wno-long-long -Wimplicit-fallthrough -Wcovered-switch-default -Wno-noexcept-type -Wnon-virtual-dtor -Wdelete-non-virtual-dtor -Wstring-conversion -fdiagnostics-color -flto=thin -O2 -g -DNDEBUG -isysroot /Applications/Xcode.app/Contents/Developer/Platforms/MacOSX.platform/Developer/SDKs/MacOSX10.14.sdk    -fno-exceptions -fno-rtti -std=c++14 -MD -MT utils/TableGen/CMakeFiles/llvm-tblgen.dir/DAGISelMatcherGen.cpp.o -MF utils/TableGen/CMakeFiles/llvm-tblgen.dir/DAGISelMatcherGen.cpp.o.d -o utils/TableGen/CMakeFiles/llvm-tblgen.dir/DAGISelMatcherGen.cpp.o -c /Users/buildslave/jenkins/workspace/clang-stage2-Rthinlto/llvm-project/llvm/utils/TableGen/DAGISelMatcherGen.cpp
[172/3809] /Users/buildslave/jenkins/workspace/clang-stage2-Rthinlto/host-compiler/bin/clang++  -DGTEST_HAS_RTTI=0 -D__STDC_CONSTANT_MACROS -D__STDC_FORMAT_MACROS -D__STDC_LIMIT_MACROS -Iutils/TableGen -I/Users/buildslave/jenkins/workspace/clang-stage2-Rthinlto/llvm-project/llvm/utils/TableGen -I/Applications/Xcode.app/Contents/Developer/Platforms/MacOSX.platform/Developer/SDKs/MacOSX10.14.sdk/usr/include/libxml2 -Iinclude -I/Users/buildslave/jenkins/workspace/clang-stage2-Rthinlto/llvm-project/llvm/include -fno-stack-protector -fno-common -Wno-profile-instr-unprofiled -fPIC -fvisibility-inlines-hidden -Werror=date-time -Werror=unguarded-availability-new -fmodules -fmodules-cache-path=/Users/buildslave/jenkins/workspace/clang-stage2-Rthinlto/clang-build/Build/module.cache -fcxx-modules -gmodules -Wall -Wextra -Wno-unused-parameter -Wwrite-strings -Wcast-qual -Wmissing-field-initializers -pedantic -Wno-long-long -Wimplicit-fallthrough -Wcovered-switch-default -Wno-noexcept-type -Wnon-virtual-dtor -Wdelete-non-virtual-dtor -Wstring-conversion -fdiagnostics-color -flto=thin -O2 -g -DNDEBUG -isysroot /Applications/Xcode.app/Contents/Developer/Platforms/MacOSX.platform/Developer/SDKs/MacOSX10.14.sdk    -fno-exceptions -fno-rtti -std=c++14 -MD -MT utils/TableGen/CMakeFiles/llvm-tblgen.dir/DAGISelMatcherEmitter.cpp.o -MF utils/TableGen/CMakeFiles/llvm-tblgen.dir/DAGISelMatcherEmitter.cpp.o.d -o utils/TableGen/CMakeFiles/llvm-tblgen.dir/DAGISelMatcherEmitter.cpp.o -c /Users/buildslave/jenkins/workspace/clang-stage2-Rthinlto/llvm-project/llvm/utils/TableGen/DAGISelMatcherEmitter.cpp
[173/3809] /Users/buildslave/jenkins/workspace/clang-stage2-Rthinlto/host-compiler/bin/clang++  -DGTEST_HAS_RTTI=0 -D__STDC_CONSTANT_MACROS -D__STDC_FORMAT_MACROS -D__STDC_LIMIT_MACROS -Iutils/TableGen -I/Users/buildslave/jenkins/workspace/clang-stage2-Rthinlto/llvm-project/llvm/utils/TableGen -I/Applications/Xcode.app/Contents/Developer/Platforms/MacOSX.platform/Developer/SDKs/MacOSX10.14.sdk/usr/include/libxml2 -Iinclude -I/Users/buildslave/jenkins/workspace/clang-stage2-Rthinlto/llvm-project/llvm/include -fno-stack-protector -fno-common -Wno-profile-instr-unprofiled -fPIC -fvisibility-inlines-hidden -Werror=date-time -Werror=unguarded-availability-new -fmodules -fmodules-cache-path=/Users/buildslave/jenkins/workspace/clang-stage2-Rthinlto/clang-build/Build/module.cache -fcxx-modules -gmodules -Wall -Wextra -Wno-unused-parameter -Wwrite-strings -Wcast-qual -Wmissing-field-initializers -pedantic -Wno-long-long -Wimplicit-fallthrough -Wcovered-switch-default -Wno-noexcept-type -Wnon-virtual-dtor -Wdelete-non-virtual-dtor -Wstring-conversion -fdiagnostics-color -flto=thin -O2 -g -DNDEBUG -isysroot /Applications/Xcode.app/Contents/Developer/Platforms/MacOSX.platform/Developer/SDKs/MacOSX10.14.sdk    -fno-exceptions -fno-rtti -std=c++14 -MD -MT utils/TableGen/CMakeFiles/llvm-tblgen.dir/AsmWriterEmitter.cpp.o -MF utils/TableGen/CMakeFiles/llvm-tblgen.dir/AsmWriterEmitter.cpp.o.d -o utils/TableGen/CMakeFiles/llvm-tblgen.dir/AsmWriterEmitter.cpp.o -c /Users/buildslave/jenkins/workspace/clang-stage2-Rthinlto/llvm-project/llvm/utils/TableGen/AsmWriterEmitter.cpp
[174/3809] /Users/buildslave/jenkins/workspace/clang-stage2-Rthinlto/host-compiler/bin/clang++  -DGTEST_HAS_RTTI=0 -D__STDC_CONSTANT_MACROS -D__STDC_FORMAT_MACROS -D__STDC_LIMIT_MACROS -Iutils/TableGen -I/Users/buildslave/jenkins/workspace/clang-stage2-Rthinlto/llvm-project/llvm/utils/TableGen -I/Applications/Xcode.app/Contents/Developer/Platforms/MacOSX.platform/Developer/SDKs/MacOSX10.14.sdk/usr/include/libxml2 -Iinclude -I/Users/buildslave/jenkins/workspace/clang-stage2-Rthinlto/llvm-project/llvm/include -fno-stack-protector -fno-common -Wno-profile-instr-unprofiled -fPIC -fvisibility-inlines-hidden -Werror=date-time -Werror=unguarded-availability-new -fmodules -fmodules-cache-path=/Users/buildslave/jenkins/workspace/clang-stage2-Rthinlto/clang-build/Build/module.cache -fcxx-modules -gmodules -Wall -Wextra -Wno-unused-parameter -Wwrite-strings -Wcast-qual -Wmissing-field-initializers -pedantic -Wno-long-long -Wimplicit-fallthrough -Wcovered-switch-default -Wno-noexcept-type -Wnon-virtual-dtor -Wdelete-non-virtual-dtor -Wstring-conversion -fdiagnostics-color -flto=thin -O2 -g -DNDEBUG -isysroot /Applications/Xcode.app/Contents/Developer/Platforms/MacOSX.platform/Developer/SDKs/MacOSX10.14.sdk    -fno-exceptions -fno-rtti -std=c++14 -MD -MT utils/TableGen/CMakeFiles/llvm-tblgen.dir/CodeGenTarget.cpp.o -MF utils/TableGen/CMakeFiles/llvm-tblgen.dir/CodeGenTarget.cpp.o.d -o utils/TableGen/CMakeFiles/llvm-tblgen.dir/CodeGenTarget.cpp.o -c /Users/buildslave/jenkins/workspace/clang-stage2-Rthinlto/llvm-project/llvm/utils/TableGen/CodeGenTarget.cpp
[175/3809] /Users/buildslave/jenkins/workspace/clang-stage2-Rthinlto/host-compiler/bin/clang++  -DGTEST_HAS_RTTI=0 -D__STDC_CONSTANT_MACROS -D__STDC_FORMAT_MACROS -D__STDC_LIMIT_MACROS -Iutils/TableGen -I/Users/buildslave/jenkins/workspace/clang-stage2-Rthinlto/llvm-project/llvm/utils/TableGen -I/Applications/Xcode.app/Contents/Developer/Platforms/MacOSX.platform/Developer/SDKs/MacOSX10.14.sdk/usr/include/libxml2 -Iinclude -I/Users/buildslave/jenkins/workspace/clang-stage2-Rthinlto/llvm-project/llvm/include -fno-stack-protector -fno-common -Wno-profile-instr-unprofiled -fPIC -fvisibility-inlines-hidden -Werror=date-time -Werror=unguarded-availability-new -fmodules -fmodules-cache-path=/Users/buildslave/jenkins/workspace/clang-stage2-Rthinlto/clang-build/Build/module.cache -fcxx-modules -gmodules -Wall -Wextra -Wno-unused-parameter -Wwrite-strings -Wcast-qual -Wmissing-field-initializers -pedantic -Wno-long-long -Wimplicit-fallthrough -Wcovered-switch-default -Wno-noexcept-type -Wnon-virtual-dtor -Wdelete-non-virtual-dtor -Wstring-conversion -fdiagnostics-color -flto=thin -O2 -g -DNDEBUG -isysroot /Applications/Xcode.app/Contents/Developer/Platforms/MacOSX.platform/Developer/SDKs/MacOSX10.14.sdk    -fno-exceptions -fno-rtti -std=c++14 -MD -MT utils/TableGen/CMakeFiles/llvm-tblgen.dir/DFAEmitter.cpp.o -MF utils/TableGen/CMakeFiles/llvm-tblgen.dir/DFAEmitter.cpp.o.d -o utils/TableGen/CMakeFiles/llvm-tblgen.dir/DFAEmitter.cpp.o -c /Users/buildslave/jenkins/workspace/clang-stage2-Rthinlto/llvm-project/llvm/utils/TableGen/DFAEmitter.cpp
[176/3809] /Users/buildslave/jenkins/workspace/clang-stage2-Rthinlto/host-compiler/bin/clang++  -DGTEST_HAS_RTTI=0 -D__STDC_CONSTANT_MACROS -D__STDC_FORMAT_MACROS -D__STDC_LIMIT_MACROS -Iutils/TableGen -I/Users/buildslave/jenkins/workspace/clang-stage2-Rthinlto/llvm-project/llvm/utils/TableGen -I/Applications/Xcode.app/Contents/Developer/Platforms/MacOSX.platform/Developer/SDKs/MacOSX10.14.sdk/usr/include/libxml2 -Iinclude -I/Users/buildslave/jenkins/workspace/clang-stage2-Rthinlto/llvm-project/llvm/include -fno-stack-protector -fno-common -Wno-profile-instr-unprofiled -fPIC -fvisibility-inlines-hidden -Werror=date-time -Werror=unguarded-availability-new -fmodules -fmodules-cache-path=/Users/buildslave/jenkins/workspace/clang-stage2-Rthinlto/clang-build/Build/module.cache -fcxx-modules -gmodules -Wall -Wextra -Wno-unused-parameter -Wwrite-strings -Wcast-qual -Wmissing-field-initializers -pedantic -Wno-long-long -Wimplicit-fallthrough -Wcovered-switch-default -Wno-noexcept-type -Wnon-virtual-dtor -Wdelete-non-virtual-dtor -Wstring-conversion -fdiagnostics-color -flto=thin -O2 -g -DNDEBUG -isysroot /Applications/Xcode.app/Contents/Developer/Platforms/MacOSX.platform/Developer/SDKs/MacOSX10.14.sdk    -fno-exceptions -fno-rtti -std=c++14 -MD -MT utils/TableGen/CMakeFiles/llvm-tblgen.dir/DFAPacketizerEmitter.cpp.o -MF utils/TableGen/CMakeFiles/llvm-tblgen.dir/DFAPacketizerEmitter.cpp.o.d -o utils/TableGen/CMakeFiles/llvm-tblgen.dir/DFAPacketizerEmitter.cpp.o -c /Users/buildslave/jenkins/workspace/clang-stage2-Rthinlto/llvm-project/llvm/utils/TableGen/DFAPacketizerEmitter.cpp
[177/3809] /Users/buildslave/jenkins/workspace/clang-stage2-Rthinlto/host-compiler/bin/clang++  -DGTEST_HAS_RTTI=0 -D__STDC_CONSTANT_MACROS -D__STDC_FORMAT_MACROS -D__STDC_LIMIT_MACROS -Iutils/TableGen -I/Users/buildslave/jenkins/workspace/clang-stage2-Rthinlto/llvm-project/llvm/utils/TableGen -I/Applications/Xcode.app/Contents/Developer/Platforms/MacOSX.platform/Developer/SDKs/MacOSX10.14.sdk/usr/include/libxml2 -Iinclude -I/Users/buildslave/jenkins/workspace/clang-stage2-Rthinlto/llvm-project/llvm/include -fno-stack-protector -fno-common -Wno-profile-instr-unprofiled -fPIC -fvisibility-inlines-hidden -Werror=date-time -Werror=unguarded-availability-new -fmodules -fmodules-cache-path=/Users/buildslave/jenkins/workspace/clang-stage2-Rthinlto/clang-build/Build/module.cache -fcxx-modules -gmodules -Wall -Wextra -Wno-unused-parameter -Wwrite-strings -Wcast-qual -Wmissing-field-initializers -pedantic -Wno-long-long -Wimplicit-fallthrough -Wcovered-switch-default -Wno-noexcept-type -Wnon-virtual-dtor -Wdelete-non-virtual-dtor -Wstring-conversion -fdiagnostics-color -flto=thin -O2 -g -DNDEBUG -isysroot /Applications/Xcode.app/Contents/Developer/Platforms/MacOSX.platform/Developer/SDKs/MacOSX10.14.sdk    -fno-exceptions -fno-rtti -std=c++14 -MD -MT utils/TableGen/CMakeFiles/llvm-tblgen.dir/CodeGenSchedule.cpp.o -MF utils/TableGen/CMakeFiles/llvm-tblgen.dir/CodeGenSchedule.cpp.o.d -o utils/TableGen/CMakeFiles/llvm-tblgen.dir/CodeGenSchedule.cpp.o -c /Users/buildslave/jenkins/workspace/clang-stage2-Rthinlto/llvm-project/llvm/utils/TableGen/CodeGenSchedule.cpp
[178/3809] /Users/buildslave/jenkins/workspace/clang-stage2-Rthinlto/host-compiler/bin/clang++  -DGTEST_HAS_RTTI=0 -D__STDC_CONSTANT_MACROS -D__STDC_FORMAT_MACROS -D__STDC_LIMIT_MACROS -Iutils/TableGen -I/Users/buildslave/jenkins/workspace/clang-stage2-Rthinlto/llvm-project/llvm/utils/TableGen -I/Applications/Xcode.app/Contents/Developer/Platforms/MacOSX.platform/Developer/SDKs/MacOSX10.14.sdk/usr/include/libxml2 -Iinclude -I/Users/buildslave/jenkins/workspace/clang-stage2-Rthinlto/llvm-project/llvm/include -fno-stack-protector -fno-common -Wno-profile-instr-unprofiled -fPIC -fvisibility-inlines-hidden -Werror=date-time -Werror=unguarded-availability-new -fmodules -fmodules-cache-path=/Users/buildslave/jenkins/workspace/clang-stage2-Rthinlto/clang-build/Build/module.cache -fcxx-modules -gmodules -Wall -Wextra -Wno-unused-parameter -Wwrite-strings -Wcast-qual -Wmissing-field-initializers -pedantic -Wno-long-long -Wimplicit-fallthrough -Wcovered-switch-default -Wno-noexcept-type -Wnon-virtual-dtor -Wdelete-non-virtual-dtor -Wstring-conversion -fdiagnostics-color -flto=thin -O2 -g -DNDEBUG -isysroot /Applications/Xcode.app/Contents/Developer/Platforms/MacOSX.platform/Developer/SDKs/MacOSX10.14.sdk    -fno-exceptions -fno-rtti -std=c++14 -MD -MT utils/TableGen/CMakeFiles/llvm-tblgen.dir/AsmMatcherEmitter.cpp.o -MF utils/TableGen/CMakeFiles/llvm-tblgen.dir/AsmMatcherEmitter.cpp.o.d -o utils/TableGen/CMakeFiles/llvm-tblgen.dir/AsmMatcherEmitter.cpp.o -c /Users/buildslave/jenkins/workspace/clang-stage2-Rthinlto/llvm-project/llvm/utils/TableGen/AsmMatcherEmitter.cpp
[179/3809] /Users/buildslave/jenkins/workspace/clang-stage2-Rthinlto/host-compiler/bin/clang++  -DGTEST_HAS_RTTI=0 -D__STDC_CONSTANT_MACROS -D__STDC_FORMAT_MACROS -D__STDC_LIMIT_MACROS -Iutils/TableGen -I/Users/buildslave/jenkins/workspace/clang-stage2-Rthinlto/llvm-project/llvm/utils/TableGen -I/Applications/Xcode.app/Contents/Developer/Platforms/MacOSX.platform/Developer/SDKs/MacOSX10.14.sdk/usr/include/libxml2 -Iinclude -I/Users/buildslave/jenkins/workspace/clang-stage2-Rthinlto/llvm-project/llvm/include -fno-stack-protector -fno-common -Wno-profile-instr-unprofiled -fPIC -fvisibility-inlines-hidden -Werror=date-time -Werror=unguarded-availability-new -fmodules -fmodules-cache-path=/Users/buildslave/jenkins/workspace/clang-stage2-Rthinlto/clang-build/Build/module.cache -fcxx-modules -gmodules -Wall -Wextra -Wno-unused-parameter -Wwrite-strings -Wcast-qual -Wmissing-field-initializers -pedantic -Wno-long-long -Wimplicit-fallthrough -Wcovered-switch-default -Wno-noexcept-type -Wnon-virtual-dtor -Wdelete-non-virtual-dtor -Wstring-conversion -fdiagnostics-color -flto=thin -O2 -g -DNDEBUG -isysroot /Applications/Xcode.app/Contents/Developer/Platforms/MacOSX.platform/Developer/SDKs/MacOSX10.14.sdk    -fno-exceptions -fno-rtti -std=c++14 -MD -MT utils/TableGen/CMakeFiles/llvm-tblgen.dir/CodeGenRegisters.cpp.o -MF utils/TableGen/CMakeFiles/llvm-tblgen.dir/CodeGenRegisters.cpp.o.d -o utils/TableGen/CMakeFiles/llvm-tblgen.dir/CodeGenRegisters.cpp.o -c /Users/buildslave/jenkins/workspace/clang-stage2-Rthinlto/llvm-project/llvm/utils/TableGen/CodeGenRegisters.cpp
[180/3809] /Users/buildslave/jenkins/workspace/clang-stage2-Rthinlto/host-compiler/bin/clang++  -DGTEST_HAS_RTTI=0 -D__STDC_CONSTANT_MACROS -D__STDC_FORMAT_MACROS -D__STDC_LIMIT_MACROS -Iutils/TableGen -I/Users/buildslave/jenkins/workspace/clang-stage2-Rthinlto/llvm-project/llvm/utils/TableGen -I/Applications/Xcode.app/Contents/Developer/Platforms/MacOSX.platform/Developer/SDKs/MacOSX10.14.sdk/usr/include/libxml2 -Iinclude -I/Users/buildslave/jenkins/workspace/clang-stage2-Rthinlto/llvm-project/llvm/include -fno-stack-protector -fno-common -Wno-profile-instr-unprofiled -fPIC -fvisibility-inlines-hidden -Werror=date-time -Werror=unguarded-availability-new -fmodules -fmodules-cache-path=/Users/buildslave/jenkins/workspace/clang-stage2-Rthinlto/clang-build/Build/module.cache -fcxx-modules -gmodules -Wall -Wextra -Wno-unused-parameter -Wwrite-strings -Wcast-qual -Wmissing-field-initializers -pedantic -Wno-long-long -Wimplicit-fallthrough -Wcovered-switch-default -Wno-noexcept-type -Wnon-virtual-dtor -Wdelete-non-virtual-dtor -Wstring-conversion -fdiagnostics-color -flto=thin -O2 -g -DNDEBUG -isysroot /Applications/Xcode.app/Contents/Developer/Platforms/MacOSX.platform/Developer/SDKs/MacOSX10.14.sdk    -fno-exceptions -fno-rtti -std=c++14 -MD -MT utils/TableGen/CMakeFiles/llvm-tblgen.dir/CodeGenDAGPatterns.cpp.o -MF utils/TableGen/CMakeFiles/llvm-tblgen.dir/CodeGenDAGPatterns.cpp.o.d -o utils/TableGen/CMakeFiles/llvm-tblgen.dir/CodeGenDAGPatterns.cpp.o -c /Users/buildslave/jenkins/workspace/clang-stage2-Rthinlto/llvm-project/llvm/utils/TableGen/CodeGenDAGPatterns.cpp
ninja: build stopped: subcommand failed.
Command failed 
Command: ['/usr/local/bin/ninja', '-v', 'install']
[Pipeline] }
[Pipeline] // timeout
[Pipeline] }
[Pipeline] // stage
[Pipeline] stage
[Pipeline] { (Test)
Stage "Test" skipped due to earlier failure(s)
[Pipeline] }
[Pipeline] // stage
[Pipeline] stage
[Pipeline] { (Declarative: Post Actions)
[Pipeline] scanForIssues
No credentials specified
[Clang (LLVM based)] Sleeping for 5 seconds due to JENKINS-32191...
[Clang (LLVM based)] Parsing console log (workspace: '/Users/buildslave/jenkins/workspace/clang-stage2-Rthinlto')
[Pipeline] }
[Pipeline] // stage
[Pipeline] }
[Pipeline] // node
[Pipeline] End of Pipeline
[BFA] Scanning build for known causes...
[BFA] Found failure cause(s):
[BFA] Ninja target failed from category Compile
[BFA] Assertion failure from category Assert
[BFA] Compile Error from category Compile
[BFA] Done. 0s
ERROR: script returned exit code 1
Finished: FAILURE