FailedConsole Output

Skipping 563 KB.. Full Log
53/3809] /Users/buildslave/jenkins/workspace/clang-stage2-Rthinlto/host-compiler/bin/clang++  -DGTEST_HAS_RTTI=0 -D__STDC_CONSTANT_MACROS -D__STDC_FORMAT_MACROS -D__STDC_LIMIT_MACROS -Ilib/DebugInfo/DWARF -I/Users/buildslave/jenkins/workspace/clang-stage2-Rthinlto/llvm-project/llvm/lib/DebugInfo/DWARF -I/Applications/Xcode.app/Contents/Developer/Platforms/MacOSX.platform/Developer/SDKs/MacOSX10.14.sdk/usr/include/libxml2 -Iinclude -I/Users/buildslave/jenkins/workspace/clang-stage2-Rthinlto/llvm-project/llvm/include -fno-stack-protector -fno-common -Wno-profile-instr-unprofiled -fPIC -fvisibility-inlines-hidden -Werror=date-time -Werror=unguarded-availability-new -fmodules -fmodules-cache-path=/Users/buildslave/jenkins/workspace/clang-stage2-Rthinlto/clang-build/Build/module.cache -fcxx-modules -gmodules -Wall -Wextra -Wno-unused-parameter -Wwrite-strings -Wcast-qual -Wmissing-field-initializers -pedantic -Wno-long-long -Wimplicit-fallthrough -Wcovered-switch-default -Wno-noexcept-type -Wnon-virtual-dtor -Wdelete-non-virtual-dtor -Wstring-conversion -fdiagnostics-color -flto=thin -O2 -g -DNDEBUG -isysroot /Applications/Xcode.app/Contents/Developer/Platforms/MacOSX.platform/Developer/SDKs/MacOSX10.14.sdk    -fno-exceptions -fno-rtti -std=c++14 -MD -MT lib/DebugInfo/DWARF/CMakeFiles/LLVMDebugInfoDWARF.dir/DWARFCompileUnit.cpp.o -MF lib/DebugInfo/DWARF/CMakeFiles/LLVMDebugInfoDWARF.dir/DWARFCompileUnit.cpp.o.d -o lib/DebugInfo/DWARF/CMakeFiles/LLVMDebugInfoDWARF.dir/DWARFCompileUnit.cpp.o -c /Users/buildslave/jenkins/workspace/clang-stage2-Rthinlto/llvm-project/llvm/lib/DebugInfo/DWARF/DWARFCompileUnit.cpp
[354/3809] /Users/buildslave/jenkins/workspace/clang-stage2-Rthinlto/host-compiler/bin/clang++  -DGTEST_HAS_RTTI=0 -D__STDC_CONSTANT_MACROS -D__STDC_FORMAT_MACROS -D__STDC_LIMIT_MACROS -Ilib/DebugInfo/DWARF -I/Users/buildslave/jenkins/workspace/clang-stage2-Rthinlto/llvm-project/llvm/lib/DebugInfo/DWARF -I/Applications/Xcode.app/Contents/Developer/Platforms/MacOSX.platform/Developer/SDKs/MacOSX10.14.sdk/usr/include/libxml2 -Iinclude -I/Users/buildslave/jenkins/workspace/clang-stage2-Rthinlto/llvm-project/llvm/include -fno-stack-protector -fno-common -Wno-profile-instr-unprofiled -fPIC -fvisibility-inlines-hidden -Werror=date-time -Werror=unguarded-availability-new -fmodules -fmodules-cache-path=/Users/buildslave/jenkins/workspace/clang-stage2-Rthinlto/clang-build/Build/module.cache -fcxx-modules -gmodules -Wall -Wextra -Wno-unused-parameter -Wwrite-strings -Wcast-qual -Wmissing-field-initializers -pedantic -Wno-long-long -Wimplicit-fallthrough -Wcovered-switch-default -Wno-noexcept-type -Wnon-virtual-dtor -Wdelete-non-virtual-dtor -Wstring-conversion -fdiagnostics-color -flto=thin -O2 -g -DNDEBUG -isysroot /Applications/Xcode.app/Contents/Developer/Platforms/MacOSX.platform/Developer/SDKs/MacOSX10.14.sdk    -fno-exceptions -fno-rtti -std=c++14 -MD -MT lib/DebugInfo/DWARF/CMakeFiles/LLVMDebugInfoDWARF.dir/DWARFDebugLoc.cpp.o -MF lib/DebugInfo/DWARF/CMakeFiles/LLVMDebugInfoDWARF.dir/DWARFDebugLoc.cpp.o.d -o lib/DebugInfo/DWARF/CMakeFiles/LLVMDebugInfoDWARF.dir/DWARFDebugLoc.cpp.o -c /Users/buildslave/jenkins/workspace/clang-stage2-Rthinlto/llvm-project/llvm/lib/DebugInfo/DWARF/DWARFDebugLoc.cpp
[355/3809] /Users/buildslave/jenkins/workspace/clang-stage2-Rthinlto/host-compiler/bin/clang++  -DGTEST_HAS_RTTI=0 -D__STDC_CONSTANT_MACROS -D__STDC_FORMAT_MACROS -D__STDC_LIMIT_MACROS -Ilib/DebugInfo/DWARF -I/Users/buildslave/jenkins/workspace/clang-stage2-Rthinlto/llvm-project/llvm/lib/DebugInfo/DWARF -I/Applications/Xcode.app/Contents/Developer/Platforms/MacOSX.platform/Developer/SDKs/MacOSX10.14.sdk/usr/include/libxml2 -Iinclude -I/Users/buildslave/jenkins/workspace/clang-stage2-Rthinlto/llvm-project/llvm/include -fno-stack-protector -fno-common -Wno-profile-instr-unprofiled -fPIC -fvisibility-inlines-hidden -Werror=date-time -Werror=unguarded-availability-new -fmodules -fmodules-cache-path=/Users/buildslave/jenkins/workspace/clang-stage2-Rthinlto/clang-build/Build/module.cache -fcxx-modules -gmodules -Wall -Wextra -Wno-unused-parameter -Wwrite-strings -Wcast-qual -Wmissing-field-initializers -pedantic -Wno-long-long -Wimplicit-fallthrough -Wcovered-switch-default -Wno-noexcept-type -Wnon-virtual-dtor -Wdelete-non-virtual-dtor -Wstring-conversion -fdiagnostics-color -flto=thin -O2 -g -DNDEBUG -isysroot /Applications/Xcode.app/Contents/Developer/Platforms/MacOSX.platform/Developer/SDKs/MacOSX10.14.sdk    -fno-exceptions -fno-rtti -std=c++14 -MD -MT lib/DebugInfo/DWARF/CMakeFiles/LLVMDebugInfoDWARF.dir/DWARFFormValue.cpp.o -MF lib/DebugInfo/DWARF/CMakeFiles/LLVMDebugInfoDWARF.dir/DWARFFormValue.cpp.o.d -o lib/DebugInfo/DWARF/CMakeFiles/LLVMDebugInfoDWARF.dir/DWARFFormValue.cpp.o -c /Users/buildslave/jenkins/workspace/clang-stage2-Rthinlto/llvm-project/llvm/lib/DebugInfo/DWARF/DWARFFormValue.cpp
[356/3809] /Users/buildslave/jenkins/workspace/clang-stage2-Rthinlto/host-compiler/bin/clang++  -DGTEST_HAS_RTTI=0 -D__STDC_CONSTANT_MACROS -D__STDC_FORMAT_MACROS -D__STDC_LIMIT_MACROS -Ilib/DebugInfo/DWARF -I/Users/buildslave/jenkins/workspace/clang-stage2-Rthinlto/llvm-project/llvm/lib/DebugInfo/DWARF -I/Applications/Xcode.app/Contents/Developer/Platforms/MacOSX.platform/Developer/SDKs/MacOSX10.14.sdk/usr/include/libxml2 -Iinclude -I/Users/buildslave/jenkins/workspace/clang-stage2-Rthinlto/llvm-project/llvm/include -fno-stack-protector -fno-common -Wno-profile-instr-unprofiled -fPIC -fvisibility-inlines-hidden -Werror=date-time -Werror=unguarded-availability-new -fmodules -fmodules-cache-path=/Users/buildslave/jenkins/workspace/clang-stage2-Rthinlto/clang-build/Build/module.cache -fcxx-modules -gmodules -Wall -Wextra -Wno-unused-parameter -Wwrite-strings -Wcast-qual -Wmissing-field-initializers -pedantic -Wno-long-long -Wimplicit-fallthrough -Wcovered-switch-default -Wno-noexcept-type -Wnon-virtual-dtor -Wdelete-non-virtual-dtor -Wstring-conversion -fdiagnostics-color -flto=thin -O2 -g -DNDEBUG -isysroot /Applications/Xcode.app/Contents/Developer/Platforms/MacOSX.platform/Developer/SDKs/MacOSX10.14.sdk    -fno-exceptions -fno-rtti -std=c++14 -MD -MT lib/DebugInfo/DWARF/CMakeFiles/LLVMDebugInfoDWARF.dir/DWARFTypeUnit.cpp.o -MF lib/DebugInfo/DWARF/CMakeFiles/LLVMDebugInfoDWARF.dir/DWARFTypeUnit.cpp.o.d -o lib/DebugInfo/DWARF/CMakeFiles/LLVMDebugInfoDWARF.dir/DWARFTypeUnit.cpp.o -c /Users/buildslave/jenkins/workspace/clang-stage2-Rthinlto/llvm-project/llvm/lib/DebugInfo/DWARF/DWARFTypeUnit.cpp
[357/3809] /Users/buildslave/jenkins/workspace/clang-stage2-Rthinlto/host-compiler/bin/clang++  -DGTEST_HAS_RTTI=0 -D__STDC_CONSTANT_MACROS -D__STDC_FORMAT_MACROS -D__STDC_LIMIT_MACROS -Ilib/DebugInfo/GSYM -I/Users/buildslave/jenkins/workspace/clang-stage2-Rthinlto/llvm-project/llvm/lib/DebugInfo/GSYM -I/Applications/Xcode.app/Contents/Developer/Platforms/MacOSX.platform/Developer/SDKs/MacOSX10.14.sdk/usr/include/libxml2 -Iinclude -I/Users/buildslave/jenkins/workspace/clang-stage2-Rthinlto/llvm-project/llvm/include -fno-stack-protector -fno-common -Wno-profile-instr-unprofiled -fPIC -fvisibility-inlines-hidden -Werror=date-time -Werror=unguarded-availability-new -fmodules -fmodules-cache-path=/Users/buildslave/jenkins/workspace/clang-stage2-Rthinlto/clang-build/Build/module.cache -fcxx-modules -gmodules -Wall -Wextra -Wno-unused-parameter -Wwrite-strings -Wcast-qual -Wmissing-field-initializers -pedantic -Wno-long-long -Wimplicit-fallthrough -Wcovered-switch-default -Wno-noexcept-type -Wnon-virtual-dtor -Wdelete-non-virtual-dtor -Wstring-conversion -fdiagnostics-color -flto=thin -O2 -g -DNDEBUG -isysroot /Applications/Xcode.app/Contents/Developer/Platforms/MacOSX.platform/Developer/SDKs/MacOSX10.14.sdk    -fno-exceptions -fno-rtti -std=c++14 -MD -MT lib/DebugInfo/GSYM/CMakeFiles/LLVMDebugInfoGSYM.dir/FileWriter.cpp.o -MF lib/DebugInfo/GSYM/CMakeFiles/LLVMDebugInfoGSYM.dir/FileWriter.cpp.o.d -o lib/DebugInfo/GSYM/CMakeFiles/LLVMDebugInfoGSYM.dir/FileWriter.cpp.o -c /Users/buildslave/jenkins/workspace/clang-stage2-Rthinlto/llvm-project/llvm/lib/DebugInfo/GSYM/FileWriter.cpp
[358/3809] /Users/buildslave/jenkins/workspace/clang-stage2-Rthinlto/host-compiler/bin/clang++  -DGTEST_HAS_RTTI=0 -D__STDC_CONSTANT_MACROS -D__STDC_FORMAT_MACROS -D__STDC_LIMIT_MACROS -Ilib/DebugInfo/DWARF -I/Users/buildslave/jenkins/workspace/clang-stage2-Rthinlto/llvm-project/llvm/lib/DebugInfo/DWARF -I/Applications/Xcode.app/Contents/Developer/Platforms/MacOSX.platform/Developer/SDKs/MacOSX10.14.sdk/usr/include/libxml2 -Iinclude -I/Users/buildslave/jenkins/workspace/clang-stage2-Rthinlto/llvm-project/llvm/include -fno-stack-protector -fno-common -Wno-profile-instr-unprofiled -fPIC -fvisibility-inlines-hidden -Werror=date-time -Werror=unguarded-availability-new -fmodules -fmodules-cache-path=/Users/buildslave/jenkins/workspace/clang-stage2-Rthinlto/clang-build/Build/module.cache -fcxx-modules -gmodules -Wall -Wextra -Wno-unused-parameter -Wwrite-strings -Wcast-qual -Wmissing-field-initializers -pedantic -Wno-long-long -Wimplicit-fallthrough -Wcovered-switch-default -Wno-noexcept-type -Wnon-virtual-dtor -Wdelete-non-virtual-dtor -Wstring-conversion -fdiagnostics-color -flto=thin -O2 -g -DNDEBUG -isysroot /Applications/Xcode.app/Contents/Developer/Platforms/MacOSX.platform/Developer/SDKs/MacOSX10.14.sdk    -fno-exceptions -fno-rtti -std=c++14 -MD -MT lib/DebugInfo/DWARF/CMakeFiles/LLVMDebugInfoDWARF.dir/DWARFLocationExpression.cpp.o -MF lib/DebugInfo/DWARF/CMakeFiles/LLVMDebugInfoDWARF.dir/DWARFLocationExpression.cpp.o.d -o lib/DebugInfo/DWARF/CMakeFiles/LLVMDebugInfoDWARF.dir/DWARFLocationExpression.cpp.o -c /Users/buildslave/jenkins/workspace/clang-stage2-Rthinlto/llvm-project/llvm/lib/DebugInfo/DWARF/DWARFLocationExpression.cpp
[359/3809] /Users/buildslave/jenkins/workspace/clang-stage2-Rthinlto/host-compiler/bin/clang++  -DGTEST_HAS_RTTI=0 -D__STDC_CONSTANT_MACROS -D__STDC_FORMAT_MACROS -D__STDC_LIMIT_MACROS -Ilib/DebugInfo/DWARF -I/Users/buildslave/jenkins/workspace/clang-stage2-Rthinlto/llvm-project/llvm/lib/DebugInfo/DWARF -I/Applications/Xcode.app/Contents/Developer/Platforms/MacOSX.platform/Developer/SDKs/MacOSX10.14.sdk/usr/include/libxml2 -Iinclude -I/Users/buildslave/jenkins/workspace/clang-stage2-Rthinlto/llvm-project/llvm/include -fno-stack-protector -fno-common -Wno-profile-instr-unprofiled -fPIC -fvisibility-inlines-hidden -Werror=date-time -Werror=unguarded-availability-new -fmodules -fmodules-cache-path=/Users/buildslave/jenkins/workspace/clang-stage2-Rthinlto/clang-build/Build/module.cache -fcxx-modules -gmodules -Wall -Wextra -Wno-unused-parameter -Wwrite-strings -Wcast-qual -Wmissing-field-initializers -pedantic -Wno-long-long -Wimplicit-fallthrough -Wcovered-switch-default -Wno-noexcept-type -Wnon-virtual-dtor -Wdelete-non-virtual-dtor -Wstring-conversion -fdiagnostics-color -flto=thin -O2 -g -DNDEBUG -isysroot /Applications/Xcode.app/Contents/Developer/Platforms/MacOSX.platform/Developer/SDKs/MacOSX10.14.sdk    -fno-exceptions -fno-rtti -std=c++14 -MD -MT lib/DebugInfo/DWARF/CMakeFiles/LLVMDebugInfoDWARF.dir/DWARFExpression.cpp.o -MF lib/DebugInfo/DWARF/CMakeFiles/LLVMDebugInfoDWARF.dir/DWARFExpression.cpp.o.d -o lib/DebugInfo/DWARF/CMakeFiles/LLVMDebugInfoDWARF.dir/DWARFExpression.cpp.o -c /Users/buildslave/jenkins/workspace/clang-stage2-Rthinlto/llvm-project/llvm/lib/DebugInfo/DWARF/DWARFExpression.cpp
[360/3809] /Users/buildslave/jenkins/workspace/clang-stage2-Rthinlto/host-compiler/bin/clang++  -DGTEST_HAS_RTTI=0 -D__STDC_CONSTANT_MACROS -D__STDC_FORMAT_MACROS -D__STDC_LIMIT_MACROS -Ilib/DebugInfo/DWARF -I/Users/buildslave/jenkins/workspace/clang-stage2-Rthinlto/llvm-project/llvm/lib/DebugInfo/DWARF -I/Applications/Xcode.app/Contents/Developer/Platforms/MacOSX.platform/Developer/SDKs/MacOSX10.14.sdk/usr/include/libxml2 -Iinclude -I/Users/buildslave/jenkins/workspace/clang-stage2-Rthinlto/llvm-project/llvm/include -fno-stack-protector -fno-common -Wno-profile-instr-unprofiled -fPIC -fvisibility-inlines-hidden -Werror=date-time -Werror=unguarded-availability-new -fmodules -fmodules-cache-path=/Users/buildslave/jenkins/workspace/clang-stage2-Rthinlto/clang-build/Build/module.cache -fcxx-modules -gmodules -Wall -Wextra -Wno-unused-parameter -Wwrite-strings -Wcast-qual -Wmissing-field-initializers -pedantic -Wno-long-long -Wimplicit-fallthrough -Wcovered-switch-default -Wno-noexcept-type -Wnon-virtual-dtor -Wdelete-non-virtual-dtor -Wstring-conversion -fdiagnostics-color -flto=thin -O2 -g -DNDEBUG -isysroot /Applications/Xcode.app/Contents/Developer/Platforms/MacOSX.platform/Developer/SDKs/MacOSX10.14.sdk    -fno-exceptions -fno-rtti -std=c++14 -MD -MT lib/DebugInfo/DWARF/CMakeFiles/LLVMDebugInfoDWARF.dir/DWARFListTable.cpp.o -MF lib/DebugInfo/DWARF/CMakeFiles/LLVMDebugInfoDWARF.dir/DWARFListTable.cpp.o.d -o lib/DebugInfo/DWARF/CMakeFiles/LLVMDebugInfoDWARF.dir/DWARFListTable.cpp.o -c /Users/buildslave/jenkins/workspace/clang-stage2-Rthinlto/llvm-project/llvm/lib/DebugInfo/DWARF/DWARFListTable.cpp
[361/3809] /Users/buildslave/jenkins/workspace/clang-stage2-Rthinlto/host-compiler/bin/clang++  -DGTEST_HAS_RTTI=0 -D__STDC_CONSTANT_MACROS -D__STDC_FORMAT_MACROS -D__STDC_LIMIT_MACROS -Ilib/DebugInfo/DWARF -I/Users/buildslave/jenkins/workspace/clang-stage2-Rthinlto/llvm-project/llvm/lib/DebugInfo/DWARF -I/Applications/Xcode.app/Contents/Developer/Platforms/MacOSX.platform/Developer/SDKs/MacOSX10.14.sdk/usr/include/libxml2 -Iinclude -I/Users/buildslave/jenkins/workspace/clang-stage2-Rthinlto/llvm-project/llvm/include -fno-stack-protector -fno-common -Wno-profile-instr-unprofiled -fPIC -fvisibility-inlines-hidden -Werror=date-time -Werror=unguarded-availability-new -fmodules -fmodules-cache-path=/Users/buildslave/jenkins/workspace/clang-stage2-Rthinlto/clang-build/Build/module.cache -fcxx-modules -gmodules -Wall -Wextra -Wno-unused-parameter -Wwrite-strings -Wcast-qual -Wmissing-field-initializers -pedantic -Wno-long-long -Wimplicit-fallthrough -Wcovered-switch-default -Wno-noexcept-type -Wnon-virtual-dtor -Wdelete-non-virtual-dtor -Wstring-conversion -fdiagnostics-color -flto=thin -O2 -g -DNDEBUG -isysroot /Applications/Xcode.app/Contents/Developer/Platforms/MacOSX.platform/Developer/SDKs/MacOSX10.14.sdk    -fno-exceptions -fno-rtti -std=c++14 -MD -MT lib/DebugInfo/DWARF/CMakeFiles/LLVMDebugInfoDWARF.dir/DWARFDebugAranges.cpp.o -MF lib/DebugInfo/DWARF/CMakeFiles/LLVMDebugInfoDWARF.dir/DWARFDebugAranges.cpp.o.d -o lib/DebugInfo/DWARF/CMakeFiles/LLVMDebugInfoDWARF.dir/DWARFDebugAranges.cpp.o -c /Users/buildslave/jenkins/workspace/clang-stage2-Rthinlto/llvm-project/llvm/lib/DebugInfo/DWARF/DWARFDebugAranges.cpp
[362/3809] /Users/buildslave/jenkins/workspace/clang-stage2-Rthinlto/host-compiler/bin/clang++  -DGTEST_HAS_RTTI=0 -D__STDC_CONSTANT_MACROS -D__STDC_FORMAT_MACROS -D__STDC_LIMIT_MACROS -Ilib/DebugInfo/DWARF -I/Users/buildslave/jenkins/workspace/clang-stage2-Rthinlto/llvm-project/llvm/lib/DebugInfo/DWARF -I/Applications/Xcode.app/Contents/Developer/Platforms/MacOSX.platform/Developer/SDKs/MacOSX10.14.sdk/usr/include/libxml2 -Iinclude -I/Users/buildslave/jenkins/workspace/clang-stage2-Rthinlto/llvm-project/llvm/include -fno-stack-protector -fno-common -Wno-profile-instr-unprofiled -fPIC -fvisibility-inlines-hidden -Werror=date-time -Werror=unguarded-availability-new -fmodules -fmodules-cache-path=/Users/buildslave/jenkins/workspace/clang-stage2-Rthinlto/clang-build/Build/module.cache -fcxx-modules -gmodules -Wall -Wextra -Wno-unused-parameter -Wwrite-strings -Wcast-qual -Wmissing-field-initializers -pedantic -Wno-long-long -Wimplicit-fallthrough -Wcovered-switch-default -Wno-noexcept-type -Wnon-virtual-dtor -Wdelete-non-virtual-dtor -Wstring-conversion -fdiagnostics-color -flto=thin -O2 -g -DNDEBUG -isysroot /Applications/Xcode.app/Contents/Developer/Platforms/MacOSX.platform/Developer/SDKs/MacOSX10.14.sdk    -fno-exceptions -fno-rtti -std=c++14 -MD -MT lib/DebugInfo/DWARF/CMakeFiles/LLVMDebugInfoDWARF.dir/DWARFGdbIndex.cpp.o -MF lib/DebugInfo/DWARF/CMakeFiles/LLVMDebugInfoDWARF.dir/DWARFGdbIndex.cpp.o.d -o lib/DebugInfo/DWARF/CMakeFiles/LLVMDebugInfoDWARF.dir/DWARFGdbIndex.cpp.o -c /Users/buildslave/jenkins/workspace/clang-stage2-Rthinlto/llvm-project/llvm/lib/DebugInfo/DWARF/DWARFGdbIndex.cpp
[363/3809] /Users/buildslave/jenkins/workspace/clang-stage2-Rthinlto/host-compiler/bin/clang++  -DGTEST_HAS_RTTI=0 -D__STDC_CONSTANT_MACROS -D__STDC_FORMAT_MACROS -D__STDC_LIMIT_MACROS -Ilib/DebugInfo/GSYM -I/Users/buildslave/jenkins/workspace/clang-stage2-Rthinlto/llvm-project/llvm/lib/DebugInfo/GSYM -I/Applications/Xcode.app/Contents/Developer/Platforms/MacOSX.platform/Developer/SDKs/MacOSX10.14.sdk/usr/include/libxml2 -Iinclude -I/Users/buildslave/jenkins/workspace/clang-stage2-Rthinlto/llvm-project/llvm/include -fno-stack-protector -fno-common -Wno-profile-instr-unprofiled -fPIC -fvisibility-inlines-hidden -Werror=date-time -Werror=unguarded-availability-new -fmodules -fmodules-cache-path=/Users/buildslave/jenkins/workspace/clang-stage2-Rthinlto/clang-build/Build/module.cache -fcxx-modules -gmodules -Wall -Wextra -Wno-unused-parameter -Wwrite-strings -Wcast-qual -Wmissing-field-initializers -pedantic -Wno-long-long -Wimplicit-fallthrough -Wcovered-switch-default -Wno-noexcept-type -Wnon-virtual-dtor -Wdelete-non-virtual-dtor -Wstring-conversion -fdiagnostics-color -flto=thin -O2 -g -DNDEBUG -isysroot /Applications/Xcode.app/Contents/Developer/Platforms/MacOSX.platform/Developer/SDKs/MacOSX10.14.sdk    -fno-exceptions -fno-rtti -std=c++14 -MD -MT lib/DebugInfo/GSYM/CMakeFiles/LLVMDebugInfoGSYM.dir/Header.cpp.o -MF lib/DebugInfo/GSYM/CMakeFiles/LLVMDebugInfoGSYM.dir/Header.cpp.o.d -o lib/DebugInfo/GSYM/CMakeFiles/LLVMDebugInfoGSYM.dir/Header.cpp.o -c /Users/buildslave/jenkins/workspace/clang-stage2-Rthinlto/llvm-project/llvm/lib/DebugInfo/GSYM/Header.cpp
[364/3809] /Users/buildslave/jenkins/workspace/clang-stage2-Rthinlto/host-compiler/bin/clang++  -DGTEST_HAS_RTTI=0 -D__STDC_CONSTANT_MACROS -D__STDC_FORMAT_MACROS -D__STDC_LIMIT_MACROS -Ilib/DebugInfo/DWARF -I/Users/buildslave/jenkins/workspace/clang-stage2-Rthinlto/llvm-project/llvm/lib/DebugInfo/DWARF -I/Applications/Xcode.app/Contents/Developer/Platforms/MacOSX.platform/Developer/SDKs/MacOSX10.14.sdk/usr/include/libxml2 -Iinclude -I/Users/buildslave/jenkins/workspace/clang-stage2-Rthinlto/llvm-project/llvm/include -fno-stack-protector -fno-common -Wno-profile-instr-unprofiled -fPIC -fvisibility-inlines-hidden -Werror=date-time -Werror=unguarded-availability-new -fmodules -fmodules-cache-path=/Users/buildslave/jenkins/workspace/clang-stage2-Rthinlto/clang-build/Build/module.cache -fcxx-modules -gmodules -Wall -Wextra -Wno-unused-parameter -Wwrite-strings -Wcast-qual -Wmissing-field-initializers -pedantic -Wno-long-long -Wimplicit-fallthrough -Wcovered-switch-default -Wno-noexcept-type -Wnon-virtual-dtor -Wdelete-non-virtual-dtor -Wstring-conversion -fdiagnostics-color -flto=thin -O2 -g -DNDEBUG -isysroot /Applications/Xcode.app/Contents/Developer/Platforms/MacOSX.platform/Developer/SDKs/MacOSX10.14.sdk    -fno-exceptions -fno-rtti -std=c++14 -MD -MT lib/DebugInfo/DWARF/CMakeFiles/LLVMDebugInfoDWARF.dir/DWARFUnitIndex.cpp.o -MF lib/DebugInfo/DWARF/CMakeFiles/LLVMDebugInfoDWARF.dir/DWARFUnitIndex.cpp.o.d -o lib/DebugInfo/DWARF/CMakeFiles/LLVMDebugInfoDWARF.dir/DWARFUnitIndex.cpp.o -c /Users/buildslave/jenkins/workspace/clang-stage2-Rthinlto/llvm-project/llvm/lib/DebugInfo/DWARF/DWARFUnitIndex.cpp
[365/3809] /Users/buildslave/jenkins/workspace/clang-stage2-Rthinlto/host-compiler/bin/clang++  -DGTEST_HAS_RTTI=0 -D__STDC_CONSTANT_MACROS -D__STDC_FORMAT_MACROS -D__STDC_LIMIT_MACROS -Ilib/DebugInfo/DWARF -I/Users/buildslave/jenkins/workspace/clang-stage2-Rthinlto/llvm-project/llvm/lib/DebugInfo/DWARF -I/Applications/Xcode.app/Contents/Developer/Platforms/MacOSX.platform/Developer/SDKs/MacOSX10.14.sdk/usr/include/libxml2 -Iinclude -I/Users/buildslave/jenkins/workspace/clang-stage2-Rthinlto/llvm-project/llvm/include -fno-stack-protector -fno-common -Wno-profile-instr-unprofiled -fPIC -fvisibility-inlines-hidden -Werror=date-time -Werror=unguarded-availability-new -fmodules -fmodules-cache-path=/Users/buildslave/jenkins/workspace/clang-stage2-Rthinlto/clang-build/Build/module.cache -fcxx-modules -gmodules -Wall -Wextra -Wno-unused-parameter -Wwrite-strings -Wcast-qual -Wmissing-field-initializers -pedantic -Wno-long-long -Wimplicit-fallthrough -Wcovered-switch-default -Wno-noexcept-type -Wnon-virtual-dtor -Wdelete-non-virtual-dtor -Wstring-conversion -fdiagnostics-color -flto=thin -O2 -g -DNDEBUG -isysroot /Applications/Xcode.app/Contents/Developer/Platforms/MacOSX.platform/Developer/SDKs/MacOSX10.14.sdk    -fno-exceptions -fno-rtti -std=c++14 -MD -MT lib/DebugInfo/DWARF/CMakeFiles/LLVMDebugInfoDWARF.dir/DWARFDebugFrame.cpp.o -MF lib/DebugInfo/DWARF/CMakeFiles/LLVMDebugInfoDWARF.dir/DWARFDebugFrame.cpp.o.d -o lib/DebugInfo/DWARF/CMakeFiles/LLVMDebugInfoDWARF.dir/DWARFDebugFrame.cpp.o -c /Users/buildslave/jenkins/workspace/clang-stage2-Rthinlto/llvm-project/llvm/lib/DebugInfo/DWARF/DWARFDebugFrame.cpp
[366/3809] /Users/buildslave/jenkins/workspace/clang-stage2-Rthinlto/host-compiler/bin/clang++  -DGTEST_HAS_RTTI=0 -D__STDC_CONSTANT_MACROS -D__STDC_FORMAT_MACROS -D__STDC_LIMIT_MACROS -Ilib/DebugInfo/GSYM -I/Users/buildslave/jenkins/workspace/clang-stage2-Rthinlto/llvm-project/llvm/lib/DebugInfo/GSYM -I/Applications/Xcode.app/Contents/Developer/Platforms/MacOSX.platform/Developer/SDKs/MacOSX10.14.sdk/usr/include/libxml2 -Iinclude -I/Users/buildslave/jenkins/workspace/clang-stage2-Rthinlto/llvm-project/llvm/include -fno-stack-protector -fno-common -Wno-profile-instr-unprofiled -fPIC -fvisibility-inlines-hidden -Werror=date-time -Werror=unguarded-availability-new -fmodules -fmodules-cache-path=/Users/buildslave/jenkins/workspace/clang-stage2-Rthinlto/clang-build/Build/module.cache -fcxx-modules -gmodules -Wall -Wextra -Wno-unused-parameter -Wwrite-strings -Wcast-qual -Wmissing-field-initializers -pedantic -Wno-long-long -Wimplicit-fallthrough -Wcovered-switch-default -Wno-noexcept-type -Wnon-virtual-dtor -Wdelete-non-virtual-dtor -Wstring-conversion -fdiagnostics-color -flto=thin -O2 -g -DNDEBUG -isysroot /Applications/Xcode.app/Contents/Developer/Platforms/MacOSX.platform/Developer/SDKs/MacOSX10.14.sdk    -fno-exceptions -fno-rtti -std=c++14 -MD -MT lib/DebugInfo/GSYM/CMakeFiles/LLVMDebugInfoGSYM.dir/LookupResult.cpp.o -MF lib/DebugInfo/GSYM/CMakeFiles/LLVMDebugInfoGSYM.dir/LookupResult.cpp.o.d -o lib/DebugInfo/GSYM/CMakeFiles/LLVMDebugInfoGSYM.dir/LookupResult.cpp.o -c /Users/buildslave/jenkins/workspace/clang-stage2-Rthinlto/llvm-project/llvm/lib/DebugInfo/GSYM/LookupResult.cpp
[367/3809] /Users/buildslave/jenkins/workspace/clang-stage2-Rthinlto/host-compiler/bin/clang++  -DGTEST_HAS_RTTI=0 -D__STDC_CONSTANT_MACROS -D__STDC_FORMAT_MACROS -D__STDC_LIMIT_MACROS -Ilib/DebugInfo/MSF -I/Users/buildslave/jenkins/workspace/clang-stage2-Rthinlto/llvm-project/llvm/lib/DebugInfo/MSF -I/Applications/Xcode.app/Contents/Developer/Platforms/MacOSX.platform/Developer/SDKs/MacOSX10.14.sdk/usr/include/libxml2 -Iinclude -I/Users/buildslave/jenkins/workspace/clang-stage2-Rthinlto/llvm-project/llvm/include -fno-stack-protector -fno-common -Wno-profile-instr-unprofiled -fPIC -fvisibility-inlines-hidden -Werror=date-time -Werror=unguarded-availability-new -fmodules -fmodules-cache-path=/Users/buildslave/jenkins/workspace/clang-stage2-Rthinlto/clang-build/Build/module.cache -fcxx-modules -gmodules -Wall -Wextra -Wno-unused-parameter -Wwrite-strings -Wcast-qual -Wmissing-field-initializers -pedantic -Wno-long-long -Wimplicit-fallthrough -Wcovered-switch-default -Wno-noexcept-type -Wnon-virtual-dtor -Wdelete-non-virtual-dtor -Wstring-conversion -fdiagnostics-color -flto=thin -O2 -g -DNDEBUG -isysroot /Applications/Xcode.app/Contents/Developer/Platforms/MacOSX.platform/Developer/SDKs/MacOSX10.14.sdk    -fno-exceptions -fno-rtti -std=c++14 -MD -MT lib/DebugInfo/MSF/CMakeFiles/LLVMDebugInfoMSF.dir/MSFError.cpp.o -MF lib/DebugInfo/MSF/CMakeFiles/LLVMDebugInfoMSF.dir/MSFError.cpp.o.d -o lib/DebugInfo/MSF/CMakeFiles/LLVMDebugInfoMSF.dir/MSFError.cpp.o -c /Users/buildslave/jenkins/workspace/clang-stage2-Rthinlto/llvm-project/llvm/lib/DebugInfo/MSF/MSFError.cpp
[368/3809] /Users/buildslave/jenkins/workspace/clang-stage2-Rthinlto/host-compiler/bin/clang++  -DGTEST_HAS_RTTI=0 -D__STDC_CONSTANT_MACROS -D__STDC_FORMAT_MACROS -D__STDC_LIMIT_MACROS -Ilib/DebugInfo/GSYM -I/Users/buildslave/jenkins/workspace/clang-stage2-Rthinlto/llvm-project/llvm/lib/DebugInfo/GSYM -I/Applications/Xcode.app/Contents/Developer/Platforms/MacOSX.platform/Developer/SDKs/MacOSX10.14.sdk/usr/include/libxml2 -Iinclude -I/Users/buildslave/jenkins/workspace/clang-stage2-Rthinlto/llvm-project/llvm/include -fno-stack-protector -fno-common -Wno-profile-instr-unprofiled -fPIC -fvisibility-inlines-hidden -Werror=date-time -Werror=unguarded-availability-new -fmodules -fmodules-cache-path=/Users/buildslave/jenkins/workspace/clang-stage2-Rthinlto/clang-build/Build/module.cache -fcxx-modules -gmodules -Wall -Wextra -Wno-unused-parameter -Wwrite-strings -Wcast-qual -Wmissing-field-initializers -pedantic -Wno-long-long -Wimplicit-fallthrough -Wcovered-switch-default -Wno-noexcept-type -Wnon-virtual-dtor -Wdelete-non-virtual-dtor -Wstring-conversion -fdiagnostics-color -flto=thin -O2 -g -DNDEBUG -isysroot /Applications/Xcode.app/Contents/Developer/Platforms/MacOSX.platform/Developer/SDKs/MacOSX10.14.sdk    -fno-exceptions -fno-rtti -std=c++14 -MD -MT lib/DebugInfo/GSYM/CMakeFiles/LLVMDebugInfoGSYM.dir/Range.cpp.o -MF lib/DebugInfo/GSYM/CMakeFiles/LLVMDebugInfoGSYM.dir/Range.cpp.o.d -o lib/DebugInfo/GSYM/CMakeFiles/LLVMDebugInfoGSYM.dir/Range.cpp.o -c /Users/buildslave/jenkins/workspace/clang-stage2-Rthinlto/llvm-project/llvm/lib/DebugInfo/GSYM/Range.cpp
[369/3809] /Users/buildslave/jenkins/workspace/clang-stage2-Rthinlto/host-compiler/bin/clang++  -DGTEST_HAS_RTTI=0 -D__STDC_CONSTANT_MACROS -D__STDC_FORMAT_MACROS -D__STDC_LIMIT_MACROS -Ilib/DebugInfo/GSYM -I/Users/buildslave/jenkins/workspace/clang-stage2-Rthinlto/llvm-project/llvm/lib/DebugInfo/GSYM -I/Applications/Xcode.app/Contents/Developer/Platforms/MacOSX.platform/Developer/SDKs/MacOSX10.14.sdk/usr/include/libxml2 -Iinclude -I/Users/buildslave/jenkins/workspace/clang-stage2-Rthinlto/llvm-project/llvm/include -fno-stack-protector -fno-common -Wno-profile-instr-unprofiled -fPIC -fvisibility-inlines-hidden -Werror=date-time -Werror=unguarded-availability-new -fmodules -fmodules-cache-path=/Users/buildslave/jenkins/workspace/clang-stage2-Rthinlto/clang-build/Build/module.cache -fcxx-modules -gmodules -Wall -Wextra -Wno-unused-parameter -Wwrite-strings -Wcast-qual -Wmissing-field-initializers -pedantic -Wno-long-long -Wimplicit-fallthrough -Wcovered-switch-default -Wno-noexcept-type -Wnon-virtual-dtor -Wdelete-non-virtual-dtor -Wstring-conversion -fdiagnostics-color -flto=thin -O2 -g -DNDEBUG -isysroot /Applications/Xcode.app/Contents/Developer/Platforms/MacOSX.platform/Developer/SDKs/MacOSX10.14.sdk    -fno-exceptions -fno-rtti -std=c++14 -MD -MT lib/DebugInfo/GSYM/CMakeFiles/LLVMDebugInfoGSYM.dir/FunctionInfo.cpp.o -MF lib/DebugInfo/GSYM/CMakeFiles/LLVMDebugInfoGSYM.dir/FunctionInfo.cpp.o.d -o lib/DebugInfo/GSYM/CMakeFiles/LLVMDebugInfoGSYM.dir/FunctionInfo.cpp.o -c /Users/buildslave/jenkins/workspace/clang-stage2-Rthinlto/llvm-project/llvm/lib/DebugInfo/GSYM/FunctionInfo.cpp
[370/3809] /Users/buildslave/jenkins/workspace/clang-stage2-Rthinlto/host-compiler/bin/clang++  -DGTEST_HAS_RTTI=0 -D__STDC_CONSTANT_MACROS -D__STDC_FORMAT_MACROS -D__STDC_LIMIT_MACROS -Ilib/DebugInfo/CodeView -I/Users/buildslave/jenkins/workspace/clang-stage2-Rthinlto/llvm-project/llvm/lib/DebugInfo/CodeView -I/Applications/Xcode.app/Contents/Developer/Platforms/MacOSX.platform/Developer/SDKs/MacOSX10.14.sdk/usr/include/libxml2 -Iinclude -I/Users/buildslave/jenkins/workspace/clang-stage2-Rthinlto/llvm-project/llvm/include -fno-stack-protector -fno-common -Wno-profile-instr-unprofiled -fPIC -fvisibility-inlines-hidden -Werror=date-time -Werror=unguarded-availability-new -fmodules -fmodules-cache-path=/Users/buildslave/jenkins/workspace/clang-stage2-Rthinlto/clang-build/Build/module.cache -fcxx-modules -gmodules -Wall -Wextra -Wno-unused-parameter -Wwrite-strings -Wcast-qual -Wmissing-field-initializers -pedantic -Wno-long-long -Wimplicit-fallthrough -Wcovered-switch-default -Wno-noexcept-type -Wnon-virtual-dtor -Wdelete-non-virtual-dtor -Wstring-conversion -fdiagnostics-color -flto=thin -O2 -g -DNDEBUG -isysroot /Applications/Xcode.app/Contents/Developer/Platforms/MacOSX.platform/Developer/SDKs/MacOSX10.14.sdk    -fno-exceptions -fno-rtti -std=c++14 -MD -MT lib/DebugInfo/CodeView/CMakeFiles/LLVMDebugInfoCodeView.dir/CodeViewError.cpp.o -MF lib/DebugInfo/CodeView/CMakeFiles/LLVMDebugInfoCodeView.dir/CodeViewError.cpp.o.d -o lib/DebugInfo/CodeView/CMakeFiles/LLVMDebugInfoCodeView.dir/CodeViewError.cpp.o -c /Users/buildslave/jenkins/workspace/clang-stage2-Rthinlto/llvm-project/llvm/lib/DebugInfo/CodeView/CodeViewError.cpp
[371/3809] /Users/buildslave/jenkins/workspace/clang-stage2-Rthinlto/host-compiler/bin/clang++  -DGTEST_HAS_RTTI=0 -D__STDC_CONSTANT_MACROS -D__STDC_FORMAT_MACROS -D__STDC_LIMIT_MACROS -Ilib/DebugInfo/MSF -I/Users/buildslave/jenkins/workspace/clang-stage2-Rthinlto/llvm-project/llvm/lib/DebugInfo/MSF -I/Applications/Xcode.app/Contents/Developer/Platforms/MacOSX.platform/Developer/SDKs/MacOSX10.14.sdk/usr/include/libxml2 -Iinclude -I/Users/buildslave/jenkins/workspace/clang-stage2-Rthinlto/llvm-project/llvm/include -fno-stack-protector -fno-common -Wno-profile-instr-unprofiled -fPIC -fvisibility-inlines-hidden -Werror=date-time -Werror=unguarded-availability-new -fmodules -fmodules-cache-path=/Users/buildslave/jenkins/workspace/clang-stage2-Rthinlto/clang-build/Build/module.cache -fcxx-modules -gmodules -Wall -Wextra -Wno-unused-parameter -Wwrite-strings -Wcast-qual -Wmissing-field-initializers -pedantic -Wno-long-long -Wimplicit-fallthrough -Wcovered-switch-default -Wno-noexcept-type -Wnon-virtual-dtor -Wdelete-non-virtual-dtor -Wstring-conversion -fdiagnostics-color -flto=thin -O2 -g -DNDEBUG -isysroot /Applications/Xcode.app/Contents/Developer/Platforms/MacOSX.platform/Developer/SDKs/MacOSX10.14.sdk    -fno-exceptions -fno-rtti -std=c++14 -MD -MT lib/DebugInfo/MSF/CMakeFiles/LLVMDebugInfoMSF.dir/MSFCommon.cpp.o -MF lib/DebugInfo/MSF/CMakeFiles/LLVMDebugInfoMSF.dir/MSFCommon.cpp.o.d -o lib/DebugInfo/MSF/CMakeFiles/LLVMDebugInfoMSF.dir/MSFCommon.cpp.o -c /Users/buildslave/jenkins/workspace/clang-stage2-Rthinlto/llvm-project/llvm/lib/DebugInfo/MSF/MSFCommon.cpp
[372/3809] /Users/buildslave/jenkins/workspace/clang-stage2-Rthinlto/host-compiler/bin/clang++  -DGTEST_HAS_RTTI=0 -D__STDC_CONSTANT_MACROS -D__STDC_FORMAT_MACROS -D__STDC_LIMIT_MACROS -Ilib/DebugInfo/GSYM -I/Users/buildslave/jenkins/workspace/clang-stage2-Rthinlto/llvm-project/llvm/lib/DebugInfo/GSYM -I/Applications/Xcode.app/Contents/Developer/Platforms/MacOSX.platform/Developer/SDKs/MacOSX10.14.sdk/usr/include/libxml2 -Iinclude -I/Users/buildslave/jenkins/workspace/clang-stage2-Rthinlto/llvm-project/llvm/include -fno-stack-protector -fno-common -Wno-profile-instr-unprofiled -fPIC -fvisibility-inlines-hidden -Werror=date-time -Werror=unguarded-availability-new -fmodules -fmodules-cache-path=/Users/buildslave/jenkins/workspace/clang-stage2-Rthinlto/clang-build/Build/module.cache -fcxx-modules -gmodules -Wall -Wextra -Wno-unused-parameter -Wwrite-strings -Wcast-qual -Wmissing-field-initializers -pedantic -Wno-long-long -Wimplicit-fallthrough -Wcovered-switch-default -Wno-noexcept-type -Wnon-virtual-dtor -Wdelete-non-virtual-dtor -Wstring-conversion -fdiagnostics-color -flto=thin -O2 -g -DNDEBUG -isysroot /Applications/Xcode.app/Contents/Developer/Platforms/MacOSX.platform/Developer/SDKs/MacOSX10.14.sdk    -fno-exceptions -fno-rtti -std=c++14 -MD -MT lib/DebugInfo/GSYM/CMakeFiles/LLVMDebugInfoGSYM.dir/InlineInfo.cpp.o -MF lib/DebugInfo/GSYM/CMakeFiles/LLVMDebugInfoGSYM.dir/InlineInfo.cpp.o.d -o lib/DebugInfo/GSYM/CMakeFiles/LLVMDebugInfoGSYM.dir/InlineInfo.cpp.o -c /Users/buildslave/jenkins/workspace/clang-stage2-Rthinlto/llvm-project/llvm/lib/DebugInfo/GSYM/InlineInfo.cpp
[373/3809] /Users/buildslave/jenkins/workspace/clang-stage2-Rthinlto/host-compiler/bin/clang++  -DGTEST_HAS_RTTI=0 -D__STDC_CONSTANT_MACROS -D__STDC_FORMAT_MACROS -D__STDC_LIMIT_MACROS -Ilib/DebugInfo/DWARF -I/Users/buildslave/jenkins/workspace/clang-stage2-Rthinlto/llvm-project/llvm/lib/DebugInfo/DWARF -I/Applications/Xcode.app/Contents/Developer/Platforms/MacOSX.platform/Developer/SDKs/MacOSX10.14.sdk/usr/include/libxml2 -Iinclude -I/Users/buildslave/jenkins/workspace/clang-stage2-Rthinlto/llvm-project/llvm/include -fno-stack-protector -fno-common -Wno-profile-instr-unprofiled -fPIC -fvisibility-inlines-hidden -Werror=date-time -Werror=unguarded-availability-new -fmodules -fmodules-cache-path=/Users/buildslave/jenkins/workspace/clang-stage2-Rthinlto/clang-build/Build/module.cache -fcxx-modules -gmodules -Wall -Wextra -Wno-unused-parameter -Wwrite-strings -Wcast-qual -Wmissing-field-initializers -pedantic -Wno-long-long -Wimplicit-fallthrough -Wcovered-switch-default -Wno-noexcept-type -Wnon-virtual-dtor -Wdelete-non-virtual-dtor -Wstring-conversion -fdiagnostics-color -flto=thin -O2 -g -DNDEBUG -isysroot /Applications/Xcode.app/Contents/Developer/Platforms/MacOSX.platform/Developer/SDKs/MacOSX10.14.sdk    -fno-exceptions -fno-rtti -std=c++14 -MD -MT lib/DebugInfo/DWARF/CMakeFiles/LLVMDebugInfoDWARF.dir/DWARFDebugLine.cpp.o -MF lib/DebugInfo/DWARF/CMakeFiles/LLVMDebugInfoDWARF.dir/DWARFDebugLine.cpp.o.d -o lib/DebugInfo/DWARF/CMakeFiles/LLVMDebugInfoDWARF.dir/DWARFDebugLine.cpp.o -c /Users/buildslave/jenkins/workspace/clang-stage2-Rthinlto/llvm-project/llvm/lib/DebugInfo/DWARF/DWARFDebugLine.cpp
[374/3809] /Users/buildslave/jenkins/workspace/clang-stage2-Rthinlto/host-compiler/bin/clang++  -DGTEST_HAS_RTTI=0 -D__STDC_CONSTANT_MACROS -D__STDC_FORMAT_MACROS -D__STDC_LIMIT_MACROS -Ilib/DebugInfo/CodeView -I/Users/buildslave/jenkins/workspace/clang-stage2-Rthinlto/llvm-project/llvm/lib/DebugInfo/CodeView -I/Applications/Xcode.app/Contents/Developer/Platforms/MacOSX.platform/Developer/SDKs/MacOSX10.14.sdk/usr/include/libxml2 -Iinclude -I/Users/buildslave/jenkins/workspace/clang-stage2-Rthinlto/llvm-project/llvm/include -fno-stack-protector -fno-common -Wno-profile-instr-unprofiled -fPIC -fvisibility-inlines-hidden -Werror=date-time -Werror=unguarded-availability-new -fmodules -fmodules-cache-path=/Users/buildslave/jenkins/workspace/clang-stage2-Rthinlto/clang-build/Build/module.cache -fcxx-modules -gmodules -Wall -Wextra -Wno-unused-parameter -Wwrite-strings -Wcast-qual -Wmissing-field-initializers -pedantic -Wno-long-long -Wimplicit-fallthrough -Wcovered-switch-default -Wno-noexcept-type -Wnon-virtual-dtor -Wdelete-non-virtual-dtor -Wstring-conversion -fdiagnostics-color -flto=thin -O2 -g -DNDEBUG -isysroot /Applications/Xcode.app/Contents/Developer/Platforms/MacOSX.platform/Developer/SDKs/MacOSX10.14.sdk    -fno-exceptions -fno-rtti -std=c++14 -MD -MT lib/DebugInfo/CodeView/CMakeFiles/LLVMDebugInfoCodeView.dir/AppendingTypeTableBuilder.cpp.o -MF lib/DebugInfo/CodeView/CMakeFiles/LLVMDebugInfoCodeView.dir/AppendingTypeTableBuilder.cpp.o.d -o lib/DebugInfo/CodeView/CMakeFiles/LLVMDebugInfoCodeView.dir/AppendingTypeTableBuilder.cpp.o -c /Users/buildslave/jenkins/workspace/clang-stage2-Rthinlto/llvm-project/llvm/lib/DebugInfo/CodeView/AppendingTypeTableBuilder.cpp
[375/3809] /Users/buildslave/jenkins/workspace/clang-stage2-Rthinlto/host-compiler/bin/clang++  -DGTEST_HAS_RTTI=0 -D__STDC_CONSTANT_MACROS -D__STDC_FORMAT_MACROS -D__STDC_LIMIT_MACROS -Ilib/DebugInfo/GSYM -I/Users/buildslave/jenkins/workspace/clang-stage2-Rthinlto/llvm-project/llvm/lib/DebugInfo/GSYM -I/Applications/Xcode.app/Contents/Developer/Platforms/MacOSX.platform/Developer/SDKs/MacOSX10.14.sdk/usr/include/libxml2 -Iinclude -I/Users/buildslave/jenkins/workspace/clang-stage2-Rthinlto/llvm-project/llvm/include -fno-stack-protector -fno-common -Wno-profile-instr-unprofiled -fPIC -fvisibility-inlines-hidden -Werror=date-time -Werror=unguarded-availability-new -fmodules -fmodules-cache-path=/Users/buildslave/jenkins/workspace/clang-stage2-Rthinlto/clang-build/Build/module.cache -fcxx-modules -gmodules -Wall -Wextra -Wno-unused-parameter -Wwrite-strings -Wcast-qual -Wmissing-field-initializers -pedantic -Wno-long-long -Wimplicit-fallthrough -Wcovered-switch-default -Wno-noexcept-type -Wnon-virtual-dtor -Wdelete-non-virtual-dtor -Wstring-conversion -fdiagnostics-color -flto=thin -O2 -g -DNDEBUG -isysroot /Applications/Xcode.app/Contents/Developer/Platforms/MacOSX.platform/Developer/SDKs/MacOSX10.14.sdk    -fno-exceptions -fno-rtti -std=c++14 -MD -MT lib/DebugInfo/GSYM/CMakeFiles/LLVMDebugInfoGSYM.dir/LineTable.cpp.o -MF lib/DebugInfo/GSYM/CMakeFiles/LLVMDebugInfoGSYM.dir/LineTable.cpp.o.d -o lib/DebugInfo/GSYM/CMakeFiles/LLVMDebugInfoGSYM.dir/LineTable.cpp.o -c /Users/buildslave/jenkins/workspace/clang-stage2-Rthinlto/llvm-project/llvm/lib/DebugInfo/GSYM/LineTable.cpp
[376/3809] /Users/buildslave/jenkins/workspace/clang-stage2-Rthinlto/host-compiler/bin/clang++  -DGTEST_HAS_RTTI=0 -D__STDC_CONSTANT_MACROS -D__STDC_FORMAT_MACROS -D__STDC_LIMIT_MACROS -Ilib/DebugInfo/GSYM -I/Users/buildslave/jenkins/workspace/clang-stage2-Rthinlto/llvm-project/llvm/lib/DebugInfo/GSYM -I/Applications/Xcode.app/Contents/Developer/Platforms/MacOSX.platform/Developer/SDKs/MacOSX10.14.sdk/usr/include/libxml2 -Iinclude -I/Users/buildslave/jenkins/workspace/clang-stage2-Rthinlto/llvm-project/llvm/include -fno-stack-protector -fno-common -Wno-profile-instr-unprofiled -fPIC -fvisibility-inlines-hidden -Werror=date-time -Werror=unguarded-availability-new -fmodules -fmodules-cache-path=/Users/buildslave/jenkins/workspace/clang-stage2-Rthinlto/clang-build/Build/module.cache -fcxx-modules -gmodules -Wall -Wextra -Wno-unused-parameter -Wwrite-strings -Wcast-qual -Wmissing-field-initializers -pedantic -Wno-long-long -Wimplicit-fallthrough -Wcovered-switch-default -Wno-noexcept-type -Wnon-virtual-dtor -Wdelete-non-virtual-dtor -Wstring-conversion -fdiagnostics-color -flto=thin -O2 -g -DNDEBUG -isysroot /Applications/Xcode.app/Contents/Developer/Platforms/MacOSX.platform/Developer/SDKs/MacOSX10.14.sdk    -fno-exceptions -fno-rtti -std=c++14 -MD -MT lib/DebugInfo/GSYM/CMakeFiles/LLVMDebugInfoGSYM.dir/GsymReader.cpp.o -MF lib/DebugInfo/GSYM/CMakeFiles/LLVMDebugInfoGSYM.dir/GsymReader.cpp.o.d -o lib/DebugInfo/GSYM/CMakeFiles/LLVMDebugInfoGSYM.dir/GsymReader.cpp.o -c /Users/buildslave/jenkins/workspace/clang-stage2-Rthinlto/llvm-project/llvm/lib/DebugInfo/GSYM/GsymReader.cpp
[377/3809] /Users/buildslave/jenkins/workspace/clang-stage2-Rthinlto/host-compiler/bin/clang++  -DGTEST_HAS_RTTI=0 -D__STDC_CONSTANT_MACROS -D__STDC_FORMAT_MACROS -D__STDC_LIMIT_MACROS -Ilib/DebugInfo/DWARF -I/Users/buildslave/jenkins/workspace/clang-stage2-Rthinlto/llvm-project/llvm/lib/DebugInfo/DWARF -I/Applications/Xcode.app/Contents/Developer/Platforms/MacOSX.platform/Developer/SDKs/MacOSX10.14.sdk/usr/include/libxml2 -Iinclude -I/Users/buildslave/jenkins/workspace/clang-stage2-Rthinlto/llvm-project/llvm/include -fno-stack-protector -fno-common -Wno-profile-instr-unprofiled -fPIC -fvisibility-inlines-hidden -Werror=date-time -Werror=unguarded-availability-new -fmodules -fmodules-cache-path=/Users/buildslave/jenkins/workspace/clang-stage2-Rthinlto/clang-build/Build/module.cache -fcxx-modules -gmodules -Wall -Wextra -Wno-unused-parameter -Wwrite-strings -Wcast-qual -Wmissing-field-initializers -pedantic -Wno-long-long -Wimplicit-fallthrough -Wcovered-switch-default -Wno-noexcept-type -Wnon-virtual-dtor -Wdelete-non-virtual-dtor -Wstring-conversion -fdiagnostics-color -flto=thin -O2 -g -DNDEBUG -isysroot /Applications/Xcode.app/Contents/Developer/Platforms/MacOSX.platform/Developer/SDKs/MacOSX10.14.sdk    -fno-exceptions -fno-rtti -std=c++14 -MD -MT lib/DebugInfo/DWARF/CMakeFiles/LLVMDebugInfoDWARF.dir/DWARFDie.cpp.o -MF lib/DebugInfo/DWARF/CMakeFiles/LLVMDebugInfoDWARF.dir/DWARFDie.cpp.o.d -o lib/DebugInfo/DWARF/CMakeFiles/LLVMDebugInfoDWARF.dir/DWARFDie.cpp.o -c /Users/buildslave/jenkins/workspace/clang-stage2-Rthinlto/llvm-project/llvm/lib/DebugInfo/DWARF/DWARFDie.cpp
[378/3809] /Users/buildslave/jenkins/workspace/clang-stage2-Rthinlto/host-compiler/bin/clang++  -DGTEST_HAS_RTTI=0 -D__STDC_CONSTANT_MACROS -D__STDC_FORMAT_MACROS -D__STDC_LIMIT_MACROS -Ilib/DebugInfo/CodeView -I/Users/buildslave/jenkins/workspace/clang-stage2-Rthinlto/llvm-project/llvm/lib/DebugInfo/CodeView -I/Applications/Xcode.app/Contents/Developer/Platforms/MacOSX.platform/Developer/SDKs/MacOSX10.14.sdk/usr/include/libxml2 -Iinclude -I/Users/buildslave/jenkins/workspace/clang-stage2-Rthinlto/llvm-project/llvm/include -fno-stack-protector -fno-common -Wno-profile-instr-unprofiled -fPIC -fvisibility-inlines-hidden -Werror=date-time -Werror=unguarded-availability-new -fmodules -fmodules-cache-path=/Users/buildslave/jenkins/workspace/clang-stage2-Rthinlto/clang-build/Build/module.cache -fcxx-modules -gmodules -Wall -Wextra -Wno-unused-parameter -Wwrite-strings -Wcast-qual -Wmissing-field-initializers -pedantic -Wno-long-long -Wimplicit-fallthrough -Wcovered-switch-default -Wno-noexcept-type -Wnon-virtual-dtor -Wdelete-non-virtual-dtor -Wstring-conversion -fdiagnostics-color -flto=thin -O2 -g -DNDEBUG -isysroot /Applications/Xcode.app/Contents/Developer/Platforms/MacOSX.platform/Developer/SDKs/MacOSX10.14.sdk    -fno-exceptions -fno-rtti -std=c++14 -MD -MT lib/DebugInfo/CodeView/CMakeFiles/LLVMDebugInfoCodeView.dir/CodeViewRecordIO.cpp.o -MF lib/DebugInfo/CodeView/CMakeFiles/LLVMDebugInfoCodeView.dir/CodeViewRecordIO.cpp.o.d -o lib/DebugInfo/CodeView/CMakeFiles/LLVMDebugInfoCodeView.dir/CodeViewRecordIO.cpp.o -c /Users/buildslave/jenkins/workspace/clang-stage2-Rthinlto/llvm-project/llvm/lib/DebugInfo/CodeView/CodeViewRecordIO.cpp
[379/3809] /Users/buildslave/jenkins/workspace/clang-stage2-Rthinlto/host-compiler/bin/clang++  -DGTEST_HAS_RTTI=0 -D__STDC_CONSTANT_MACROS -D__STDC_FORMAT_MACROS -D__STDC_LIMIT_MACROS -Ilib/DebugInfo/DWARF -I/Users/buildslave/jenkins/workspace/clang-stage2-Rthinlto/llvm-project/llvm/lib/DebugInfo/DWARF -I/Applications/Xcode.app/Contents/Developer/Platforms/MacOSX.platform/Developer/SDKs/MacOSX10.14.sdk/usr/include/libxml2 -Iinclude -I/Users/buildslave/jenkins/workspace/clang-stage2-Rthinlto/llvm-project/llvm/include -fno-stack-protector -fno-common -Wno-profile-instr-unprofiled -fPIC -fvisibility-inlines-hidden -Werror=date-time -Werror=unguarded-availability-new -fmodules -fmodules-cache-path=/Users/buildslave/jenkins/workspace/clang-stage2-Rthinlto/clang-build/Build/module.cache -fcxx-modules -gmodules -Wall -Wextra -Wno-unused-parameter -Wwrite-strings -Wcast-qual -Wmissing-field-initializers -pedantic -Wno-long-long -Wimplicit-fallthrough -Wcovered-switch-default -Wno-noexcept-type -Wnon-virtual-dtor -Wdelete-non-virtual-dtor -Wstring-conversion -fdiagnostics-color -flto=thin -O2 -g -DNDEBUG -isysroot /Applications/Xcode.app/Contents/Developer/Platforms/MacOSX.platform/Developer/SDKs/MacOSX10.14.sdk    -fno-exceptions -fno-rtti -std=c++14 -MD -MT lib/DebugInfo/DWARF/CMakeFiles/LLVMDebugInfoDWARF.dir/DWARFAcceleratorTable.cpp.o -MF lib/DebugInfo/DWARF/CMakeFiles/LLVMDebugInfoDWARF.dir/DWARFAcceleratorTable.cpp.o.d -o lib/DebugInfo/DWARF/CMakeFiles/LLVMDebugInfoDWARF.dir/DWARFAcceleratorTable.cpp.o -c /Users/buildslave/jenkins/workspace/clang-stage2-Rthinlto/llvm-project/llvm/lib/DebugInfo/DWARF/DWARFAcceleratorTable.cpp
[380/3809] /Users/buildslave/jenkins/workspace/clang-stage2-Rthinlto/host-compiler/bin/clang++  -DGTEST_HAS_RTTI=0 -D__STDC_CONSTANT_MACROS -D__STDC_FORMAT_MACROS -D__STDC_LIMIT_MACROS -Ilib/DebugInfo/CodeView -I/Users/buildslave/jenkins/workspace/clang-stage2-Rthinlto/llvm-project/llvm/lib/DebugInfo/CodeView -I/Applications/Xcode.app/Contents/Developer/Platforms/MacOSX.platform/Developer/SDKs/MacOSX10.14.sdk/usr/include/libxml2 -Iinclude -I/Users/buildslave/jenkins/workspace/clang-stage2-Rthinlto/llvm-project/llvm/include -fno-stack-protector -fno-common -Wno-profile-instr-unprofiled -fPIC -fvisibility-inlines-hidden -Werror=date-time -Werror=unguarded-availability-new -fmodules -fmodules-cache-path=/Users/buildslave/jenkins/workspace/clang-stage2-Rthinlto/clang-build/Build/module.cache -fcxx-modules -gmodules -Wall -Wextra -Wno-unused-parameter -Wwrite-strings -Wcast-qual -Wmissing-field-initializers -pedantic -Wno-long-long -Wimplicit-fallthrough -Wcovered-switch-default -Wno-noexcept-type -Wnon-virtual-dtor -Wdelete-non-virtual-dtor -Wstring-conversion -fdiagnostics-color -flto=thin -O2 -g -DNDEBUG -isysroot /Applications/Xcode.app/Contents/Developer/Platforms/MacOSX.platform/Developer/SDKs/MacOSX10.14.sdk    -fno-exceptions -fno-rtti -std=c++14 -MD -MT lib/DebugInfo/CodeView/CMakeFiles/LLVMDebugInfoCodeView.dir/DebugCrossExSubsection.cpp.o -MF lib/DebugInfo/CodeView/CMakeFiles/LLVMDebugInfoCodeView.dir/DebugCrossExSubsection.cpp.o.d -o lib/DebugInfo/CodeView/CMakeFiles/LLVMDebugInfoCodeView.dir/DebugCrossExSubsection.cpp.o -c /Users/buildslave/jenkins/workspace/clang-stage2-Rthinlto/llvm-project/llvm/lib/DebugInfo/CodeView/DebugCrossExSubsection.cpp
[381/3809] /Users/buildslave/jenkins/workspace/clang-stage2-Rthinlto/host-compiler/bin/clang++  -DGTEST_HAS_RTTI=0 -D__STDC_CONSTANT_MACROS -D__STDC_FORMAT_MACROS -D__STDC_LIMIT_MACROS -Ilib/DebugInfo/CodeView -I/Users/buildslave/jenkins/workspace/clang-stage2-Rthinlto/llvm-project/llvm/lib/DebugInfo/CodeView -I/Applications/Xcode.app/Contents/Developer/Platforms/MacOSX.platform/Developer/SDKs/MacOSX10.14.sdk/usr/include/libxml2 -Iinclude -I/Users/buildslave/jenkins/workspace/clang-stage2-Rthinlto/llvm-project/llvm/include -fno-stack-protector -fno-common -Wno-profile-instr-unprofiled -fPIC -fvisibility-inlines-hidden -Werror=date-time -Werror=unguarded-availability-new -fmodules -fmodules-cache-path=/Users/buildslave/jenkins/workspace/clang-stage2-Rthinlto/clang-build/Build/module.cache -fcxx-modules -gmodules -Wall -Wextra -Wno-unused-parameter -Wwrite-strings -Wcast-qual -Wmissing-field-initializers -pedantic -Wno-long-long -Wimplicit-fallthrough -Wcovered-switch-default -Wno-noexcept-type -Wnon-virtual-dtor -Wdelete-non-virtual-dtor -Wstring-conversion -fdiagnostics-color -flto=thin -O2 -g -DNDEBUG -isysroot /Applications/Xcode.app/Contents/Developer/Platforms/MacOSX.platform/Developer/SDKs/MacOSX10.14.sdk    -fno-exceptions -fno-rtti -std=c++14 -MD -MT lib/DebugInfo/CodeView/CMakeFiles/LLVMDebugInfoCodeView.dir/DebugChecksumsSubsection.cpp.o -MF lib/DebugInfo/CodeView/CMakeFiles/LLVMDebugInfoCodeView.dir/DebugChecksumsSubsection.cpp.o.d -o lib/DebugInfo/CodeView/CMakeFiles/LLVMDebugInfoCodeView.dir/DebugChecksumsSubsection.cpp.o -c /Users/buildslave/jenkins/workspace/clang-stage2-Rthinlto/llvm-project/llvm/lib/DebugInfo/CodeView/DebugChecksumsSubsection.cpp
[382/3809] /Users/buildslave/jenkins/workspace/clang-stage2-Rthinlto/host-compiler/bin/clang++  -DGTEST_HAS_RTTI=0 -D__STDC_CONSTANT_MACROS -D__STDC_FORMAT_MACROS -D__STDC_LIMIT_MACROS -Ilib/DebugInfo/CodeView -I/Users/buildslave/jenkins/workspace/clang-stage2-Rthinlto/llvm-project/llvm/lib/DebugInfo/CodeView -I/Applications/Xcode.app/Contents/Developer/Platforms/MacOSX.platform/Developer/SDKs/MacOSX10.14.sdk/usr/include/libxml2 -Iinclude -I/Users/buildslave/jenkins/workspace/clang-stage2-Rthinlto/llvm-project/llvm/include -fno-stack-protector -fno-common -Wno-profile-instr-unprofiled -fPIC -fvisibility-inlines-hidden -Werror=date-time -Werror=unguarded-availability-new -fmodules -fmodules-cache-path=/Users/buildslave/jenkins/workspace/clang-stage2-Rthinlto/clang-build/Build/module.cache -fcxx-modules -gmodules -Wall -Wextra -Wno-unused-parameter -Wwrite-strings -Wcast-qual -Wmissing-field-initializers -pedantic -Wno-long-long -Wimplicit-fallthrough -Wcovered-switch-default -Wno-noexcept-type -Wnon-virtual-dtor -Wdelete-non-virtual-dtor -Wstring-conversion -fdiagnostics-color -flto=thin -O2 -g -DNDEBUG -isysroot /Applications/Xcode.app/Contents/Developer/Platforms/MacOSX.platform/Developer/SDKs/MacOSX10.14.sdk    -fno-exceptions -fno-rtti -std=c++14 -MD -MT lib/DebugInfo/CodeView/CMakeFiles/LLVMDebugInfoCodeView.dir/DebugSubsection.cpp.o -MF lib/DebugInfo/CodeView/CMakeFiles/LLVMDebugInfoCodeView.dir/DebugSubsection.cpp.o.d -o lib/DebugInfo/CodeView/CMakeFiles/LLVMDebugInfoCodeView.dir/DebugSubsection.cpp.o -c /Users/buildslave/jenkins/workspace/clang-stage2-Rthinlto/llvm-project/llvm/lib/DebugInfo/CodeView/DebugSubsection.cpp
[383/3809] /Users/buildslave/jenkins/workspace/clang-stage2-Rthinlto/host-compiler/bin/clang++  -DGTEST_HAS_RTTI=0 -D__STDC_CONSTANT_MACROS -D__STDC_FORMAT_MACROS -D__STDC_LIMIT_MACROS -Ilib/DebugInfo/GSYM -I/Users/buildslave/jenkins/workspace/clang-stage2-Rthinlto/llvm-project/llvm/lib/DebugInfo/GSYM -I/Applications/Xcode.app/Contents/Developer/Platforms/MacOSX.platform/Developer/SDKs/MacOSX10.14.sdk/usr/include/libxml2 -Iinclude -I/Users/buildslave/jenkins/workspace/clang-stage2-Rthinlto/llvm-project/llvm/include -fno-stack-protector -fno-common -Wno-profile-instr-unprofiled -fPIC -fvisibility-inlines-hidden -Werror=date-time -Werror=unguarded-availability-new -fmodules -fmodules-cache-path=/Users/buildslave/jenkins/workspace/clang-stage2-Rthinlto/clang-build/Build/module.cache -fcxx-modules -gmodules -Wall -Wextra -Wno-unused-parameter -Wwrite-strings -Wcast-qual -Wmissing-field-initializers -pedantic -Wno-long-long -Wimplicit-fallthrough -Wcovered-switch-default -Wno-noexcept-type -Wnon-virtual-dtor -Wdelete-non-virtual-dtor -Wstring-conversion -fdiagnostics-color -flto=thin -O2 -g -DNDEBUG -isysroot /Applications/Xcode.app/Contents/Developer/Platforms/MacOSX.platform/Developer/SDKs/MacOSX10.14.sdk    -fno-exceptions -fno-rtti -std=c++14 -MD -MT lib/DebugInfo/GSYM/CMakeFiles/LLVMDebugInfoGSYM.dir/GsymCreator.cpp.o -MF lib/DebugInfo/GSYM/CMakeFiles/LLVMDebugInfoGSYM.dir/GsymCreator.cpp.o.d -o lib/DebugInfo/GSYM/CMakeFiles/LLVMDebugInfoGSYM.dir/GsymCreator.cpp.o -c /Users/buildslave/jenkins/workspace/clang-stage2-Rthinlto/llvm-project/llvm/lib/DebugInfo/GSYM/GsymCreator.cpp
[384/3809] /Users/buildslave/jenkins/workspace/clang-stage2-Rthinlto/host-compiler/bin/clang++  -DGTEST_HAS_RTTI=0 -D__STDC_CONSTANT_MACROS -D__STDC_FORMAT_MACROS -D__STDC_LIMIT_MACROS -Ilib/DebugInfo/CodeView -I/Users/buildslave/jenkins/workspace/clang-stage2-Rthinlto/llvm-project/llvm/lib/DebugInfo/CodeView -I/Applications/Xcode.app/Contents/Developer/Platforms/MacOSX.platform/Developer/SDKs/MacOSX10.14.sdk/usr/include/libxml2 -Iinclude -I/Users/buildslave/jenkins/workspace/clang-stage2-Rthinlto/llvm-project/llvm/include -fno-stack-protector -fno-common -Wno-profile-instr-unprofiled -fPIC -fvisibility-inlines-hidden -Werror=date-time -Werror=unguarded-availability-new -fmodules -fmodules-cache-path=/Users/buildslave/jenkins/workspace/clang-stage2-Rthinlto/clang-build/Build/module.cache -fcxx-modules -gmodules -Wall -Wextra -Wno-unused-parameter -Wwrite-strings -Wcast-qual -Wmissing-field-initializers -pedantic -Wno-long-long -Wimplicit-fallthrough -Wcovered-switch-default -Wno-noexcept-type -Wnon-virtual-dtor -Wdelete-non-virtual-dtor -Wstring-conversion -fdiagnostics-color -flto=thin -O2 -g -DNDEBUG -isysroot /Applications/Xcode.app/Contents/Developer/Platforms/MacOSX.platform/Developer/SDKs/MacOSX10.14.sdk    -fno-exceptions -fno-rtti -std=c++14 -MD -MT lib/DebugInfo/CodeView/CMakeFiles/LLVMDebugInfoCodeView.dir/ContinuationRecordBuilder.cpp.o -MF lib/DebugInfo/CodeView/CMakeFiles/LLVMDebugInfoCodeView.dir/ContinuationRecordBuilder.cpp.o.d -o lib/DebugInfo/CodeView/CMakeFiles/LLVMDebugInfoCodeView.dir/ContinuationRecordBuilder.cpp.o -c /Users/buildslave/jenkins/workspace/clang-stage2-Rthinlto/llvm-project/llvm/lib/DebugInfo/CodeView/ContinuationRecordBuilder.cpp
[385/3809] /Users/buildslave/jenkins/workspace/clang-stage2-Rthinlto/host-compiler/bin/clang++  -DGTEST_HAS_RTTI=0 -D__STDC_CONSTANT_MACROS -D__STDC_FORMAT_MACROS -D__STDC_LIMIT_MACROS -Ilib/DebugInfo/MSF -I/Users/buildslave/jenkins/workspace/clang-stage2-Rthinlto/llvm-project/llvm/lib/DebugInfo/MSF -I/Applications/Xcode.app/Contents/Developer/Platforms/MacOSX.platform/Developer/SDKs/MacOSX10.14.sdk/usr/include/libxml2 -Iinclude -I/Users/buildslave/jenkins/workspace/clang-stage2-Rthinlto/llvm-project/llvm/include -fno-stack-protector -fno-common -Wno-profile-instr-unprofiled -fPIC -fvisibility-inlines-hidden -Werror=date-time -Werror=unguarded-availability-new -fmodules -fmodules-cache-path=/Users/buildslave/jenkins/workspace/clang-stage2-Rthinlto/clang-build/Build/module.cache -fcxx-modules -gmodules -Wall -Wextra -Wno-unused-parameter -Wwrite-strings -Wcast-qual -Wmissing-field-initializers -pedantic -Wno-long-long -Wimplicit-fallthrough -Wcovered-switch-default -Wno-noexcept-type -Wnon-virtual-dtor -Wdelete-non-virtual-dtor -Wstring-conversion -fdiagnostics-color -flto=thin -O2 -g -DNDEBUG -isysroot /Applications/Xcode.app/Contents/Developer/Platforms/MacOSX.platform/Developer/SDKs/MacOSX10.14.sdk    -fno-exceptions -fno-rtti -std=c++14 -MD -MT lib/DebugInfo/MSF/CMakeFiles/LLVMDebugInfoMSF.dir/MappedBlockStream.cpp.o -MF lib/DebugInfo/MSF/CMakeFiles/LLVMDebugInfoMSF.dir/MappedBlockStream.cpp.o.d -o lib/DebugInfo/MSF/CMakeFiles/LLVMDebugInfoMSF.dir/MappedBlockStream.cpp.o -c /Users/buildslave/jenkins/workspace/clang-stage2-Rthinlto/llvm-project/llvm/lib/DebugInfo/MSF/MappedBlockStream.cpp
[386/3809] /Users/buildslave/jenkins/workspace/clang-stage2-Rthinlto/host-compiler/bin/clang++  -DGTEST_HAS_RTTI=0 -D__STDC_CONSTANT_MACROS -D__STDC_FORMAT_MACROS -D__STDC_LIMIT_MACROS -Ilib/DebugInfo/MSF -I/Users/buildslave/jenkins/workspace/clang-stage2-Rthinlto/llvm-project/llvm/lib/DebugInfo/MSF -I/Applications/Xcode.app/Contents/Developer/Platforms/MacOSX.platform/Developer/SDKs/MacOSX10.14.sdk/usr/include/libxml2 -Iinclude -I/Users/buildslave/jenkins/workspace/clang-stage2-Rthinlto/llvm-project/llvm/include -fno-stack-protector -fno-common -Wno-profile-instr-unprofiled -fPIC -fvisibility-inlines-hidden -Werror=date-time -Werror=unguarded-availability-new -fmodules -fmodules-cache-path=/Users/buildslave/jenkins/workspace/clang-stage2-Rthinlto/clang-build/Build/module.cache -fcxx-modules -gmodules -Wall -Wextra -Wno-unused-parameter -Wwrite-strings -Wcast-qual -Wmissing-field-initializers -pedantic -Wno-long-long -Wimplicit-fallthrough -Wcovered-switch-default -Wno-noexcept-type -Wnon-virtual-dtor -Wdelete-non-virtual-dtor -Wstring-conversion -fdiagnostics-color -flto=thin -O2 -g -DNDEBUG -isysroot /Applications/Xcode.app/Contents/Developer/Platforms/MacOSX.platform/Developer/SDKs/MacOSX10.14.sdk    -fno-exceptions -fno-rtti -std=c++14 -MD -MT lib/DebugInfo/MSF/CMakeFiles/LLVMDebugInfoMSF.dir/MSFBuilder.cpp.o -MF lib/DebugInfo/MSF/CMakeFiles/LLVMDebugInfoMSF.dir/MSFBuilder.cpp.o.d -o lib/DebugInfo/MSF/CMakeFiles/LLVMDebugInfoMSF.dir/MSFBuilder.cpp.o -c /Users/buildslave/jenkins/workspace/clang-stage2-Rthinlto/llvm-project/llvm/lib/DebugInfo/MSF/MSFBuilder.cpp
[387/3809] /Users/buildslave/jenkins/workspace/clang-stage2-Rthinlto/host-compiler/bin/clang++  -DGTEST_HAS_RTTI=0 -D__STDC_CONSTANT_MACROS -D__STDC_FORMAT_MACROS -D__STDC_LIMIT_MACROS -Ilib/DebugInfo/CodeView -I/Users/buildslave/jenkins/workspace/clang-stage2-Rthinlto/llvm-project/llvm/lib/DebugInfo/CodeView -I/Applications/Xcode.app/Contents/Developer/Platforms/MacOSX.platform/Developer/SDKs/MacOSX10.14.sdk/usr/include/libxml2 -Iinclude -I/Users/buildslave/jenkins/workspace/clang-stage2-Rthinlto/llvm-project/llvm/include -fno-stack-protector -fno-common -Wno-profile-instr-unprofiled -fPIC -fvisibility-inlines-hidden -Werror=date-time -Werror=unguarded-availability-new -fmodules -fmodules-cache-path=/Users/buildslave/jenkins/workspace/clang-stage2-Rthinlto/clang-build/Build/module.cache -fcxx-modules -gmodules -Wall -Wextra -Wno-unused-parameter -Wwrite-strings -Wcast-qual -Wmissing-field-initializers -pedantic -Wno-long-long -Wimplicit-fallthrough -Wcovered-switch-default -Wno-noexcept-type -Wnon-virtual-dtor -Wdelete-non-virtual-dtor -Wstring-conversion -fdiagnostics-color -flto=thin -O2 -g -DNDEBUG -isysroot /Applications/Xcode.app/Contents/Developer/Platforms/MacOSX.platform/Developer/SDKs/MacOSX10.14.sdk    -fno-exceptions -fno-rtti -std=c++14 -MD -MT lib/DebugInfo/CodeView/CMakeFiles/LLVMDebugInfoCodeView.dir/DebugSubsectionRecord.cpp.o -MF lib/DebugInfo/CodeView/CMakeFiles/LLVMDebugInfoCodeView.dir/DebugSubsectionRecord.cpp.o.d -o lib/DebugInfo/CodeView/CMakeFiles/LLVMDebugInfoCodeView.dir/DebugSubsectionRecord.cpp.o -c /Users/buildslave/jenkins/workspace/clang-stage2-Rthinlto/llvm-project/llvm/lib/DebugInfo/CodeView/DebugSubsectionRecord.cpp
[388/3809] /Users/buildslave/jenkins/workspace/clang-stage2-Rthinlto/host-compiler/bin/clang++  -DGTEST_HAS_RTTI=0 -D__STDC_CONSTANT_MACROS -D__STDC_FORMAT_MACROS -D__STDC_LIMIT_MACROS -Ilib/DebugInfo/CodeView -I/Users/buildslave/jenkins/workspace/clang-stage2-Rthinlto/llvm-project/llvm/lib/DebugInfo/CodeView -I/Applications/Xcode.app/Contents/Developer/Platforms/MacOSX.platform/Developer/SDKs/MacOSX10.14.sdk/usr/include/libxml2 -Iinclude -I/Users/buildslave/jenkins/workspace/clang-stage2-Rthinlto/llvm-project/llvm/include -fno-stack-protector -fno-common -Wno-profile-instr-unprofiled -fPIC -fvisibility-inlines-hidden -Werror=date-time -Werror=unguarded-availability-new -fmodules -fmodules-cache-path=/Users/buildslave/jenkins/workspace/clang-stage2-Rthinlto/clang-build/Build/module.cache -fcxx-modules -gmodules -Wall -Wextra -Wno-unused-parameter -Wwrite-strings -Wcast-qual -Wmissing-field-initializers -pedantic -Wno-long-long -Wimplicit-fallthrough -Wcovered-switch-default -Wno-noexcept-type -Wnon-virtual-dtor -Wdelete-non-virtual-dtor -Wstring-conversion -fdiagnostics-color -flto=thin -O2 -g -DNDEBUG -isysroot /Applications/Xcode.app/Contents/Developer/Platforms/MacOSX.platform/Developer/SDKs/MacOSX10.14.sdk    -fno-exceptions -fno-rtti -std=c++14 -MD -MT lib/DebugInfo/CodeView/CMakeFiles/LLVMDebugInfoCodeView.dir/DebugSubsectionVisitor.cpp.o -MF lib/DebugInfo/CodeView/CMakeFiles/LLVMDebugInfoCodeView.dir/DebugSubsectionVisitor.cpp.o.d -o lib/DebugInfo/CodeView/CMakeFiles/LLVMDebugInfoCodeView.dir/DebugSubsectionVisitor.cpp.o -c /Users/buildslave/jenkins/workspace/clang-stage2-Rthinlto/llvm-project/llvm/lib/DebugInfo/CodeView/DebugSubsectionVisitor.cpp
[389/3809] /Users/buildslave/jenkins/workspace/clang-stage2-Rthinlto/host-compiler/bin/clang++  -DGTEST_HAS_RTTI=0 -D__STDC_CONSTANT_MACROS -D__STDC_FORMAT_MACROS -D__STDC_LIMIT_MACROS -Ilib/DebugInfo/CodeView -I/Users/buildslave/jenkins/workspace/clang-stage2-Rthinlto/llvm-project/llvm/lib/DebugInfo/CodeView -I/Applications/Xcode.app/Contents/Developer/Platforms/MacOSX.platform/Developer/SDKs/MacOSX10.14.sdk/usr/include/libxml2 -Iinclude -I/Users/buildslave/jenkins/workspace/clang-stage2-Rthinlto/llvm-project/llvm/include -fno-stack-protector -fno-common -Wno-profile-instr-unprofiled -fPIC -fvisibility-inlines-hidden -Werror=date-time -Werror=unguarded-availability-new -fmodules -fmodules-cache-path=/Users/buildslave/jenkins/workspace/clang-stage2-Rthinlto/clang-build/Build/module.cache -fcxx-modules -gmodules -Wall -Wextra -Wno-unused-parameter -Wwrite-strings -Wcast-qual -Wmissing-field-initializers -pedantic -Wno-long-long -Wimplicit-fallthrough -Wcovered-switch-default -Wno-noexcept-type -Wnon-virtual-dtor -Wdelete-non-virtual-dtor -Wstring-conversion -fdiagnostics-color -flto=thin -O2 -g -DNDEBUG -isysroot /Applications/Xcode.app/Contents/Developer/Platforms/MacOSX.platform/Developer/SDKs/MacOSX10.14.sdk    -fno-exceptions -fno-rtti -std=c++14 -MD -MT lib/DebugInfo/CodeView/CMakeFiles/LLVMDebugInfoCodeView.dir/Formatters.cpp.o -MF lib/DebugInfo/CodeView/CMakeFiles/LLVMDebugInfoCodeView.dir/Formatters.cpp.o.d -o lib/DebugInfo/CodeView/CMakeFiles/LLVMDebugInfoCodeView.dir/Formatters.cpp.o -c /Users/buildslave/jenkins/workspace/clang-stage2-Rthinlto/llvm-project/llvm/lib/DebugInfo/CodeView/Formatters.cpp
[390/3809] /Users/buildslave/jenkins/workspace/clang-stage2-Rthinlto/host-compiler/bin/clang++  -DGTEST_HAS_RTTI=0 -D__STDC_CONSTANT_MACROS -D__STDC_FORMAT_MACROS -D__STDC_LIMIT_MACROS -Ilib/DebugInfo/CodeView -I/Users/buildslave/jenkins/workspace/clang-stage2-Rthinlto/llvm-project/llvm/lib/DebugInfo/CodeView -I/Applications/Xcode.app/Contents/Developer/Platforms/MacOSX.platform/Developer/SDKs/MacOSX10.14.sdk/usr/include/libxml2 -Iinclude -I/Users/buildslave/jenkins/workspace/clang-stage2-Rthinlto/llvm-project/llvm/include -fno-stack-protector -fno-common -Wno-profile-instr-unprofiled -fPIC -fvisibility-inlines-hidden -Werror=date-time -Werror=unguarded-availability-new -fmodules -fmodules-cache-path=/Users/buildslave/jenkins/workspace/clang-stage2-Rthinlto/clang-build/Build/module.cache -fcxx-modules -gmodules -Wall -Wextra -Wno-unused-parameter -Wwrite-strings -Wcast-qual -Wmissing-field-initializers -pedantic -Wno-long-long -Wimplicit-fallthrough -Wcovered-switch-default -Wno-noexcept-type -Wnon-virtual-dtor -Wdelete-non-virtual-dtor -Wstring-conversion -fdiagnostics-color -flto=thin -O2 -g -DNDEBUG -isysroot /Applications/Xcode.app/Contents/Developer/Platforms/MacOSX.platform/Developer/SDKs/MacOSX10.14.sdk    -fno-exceptions -fno-rtti -std=c++14 -MD -MT lib/DebugInfo/CodeView/CMakeFiles/LLVMDebugInfoCodeView.dir/CVSymbolVisitor.cpp.o -MF lib/DebugInfo/CodeView/CMakeFiles/LLVMDebugInfoCodeView.dir/CVSymbolVisitor.cpp.o.d -o lib/DebugInfo/CodeView/CMakeFiles/LLVMDebugInfoCodeView.dir/CVSymbolVisitor.cpp.o -c /Users/buildslave/jenkins/workspace/clang-stage2-Rthinlto/llvm-project/llvm/lib/DebugInfo/CodeView/CVSymbolVisitor.cpp
[391/3809] /Users/buildslave/jenkins/workspace/clang-stage2-Rthinlto/host-compiler/bin/clang++  -DGTEST_HAS_RTTI=0 -D__STDC_CONSTANT_MACROS -D__STDC_FORMAT_MACROS -D__STDC_LIMIT_MACROS -Ilib/DebugInfo/CodeView -I/Users/buildslave/jenkins/workspace/clang-stage2-Rthinlto/llvm-project/llvm/lib/DebugInfo/CodeView -I/Applications/Xcode.app/Contents/Developer/Platforms/MacOSX.platform/Developer/SDKs/MacOSX10.14.sdk/usr/include/libxml2 -Iinclude -I/Users/buildslave/jenkins/workspace/clang-stage2-Rthinlto/llvm-project/llvm/include -fno-stack-protector -fno-common -Wno-profile-instr-unprofiled -fPIC -fvisibility-inlines-hidden -Werror=date-time -Werror=unguarded-availability-new -fmodules -fmodules-cache-path=/Users/buildslave/jenkins/workspace/clang-stage2-Rthinlto/clang-build/Build/module.cache -fcxx-modules -gmodules -Wall -Wextra -Wno-unused-parameter -Wwrite-strings -Wcast-qual -Wmissing-field-initializers -pedantic -Wno-long-long -Wimplicit-fallthrough -Wcovered-switch-default -Wno-noexcept-type -Wnon-virtual-dtor -Wdelete-non-virtual-dtor -Wstring-conversion -fdiagnostics-color -flto=thin -O2 -g -DNDEBUG -isysroot /Applications/Xcode.app/Contents/Developer/Platforms/MacOSX.platform/Developer/SDKs/MacOSX10.14.sdk    -fno-exceptions -fno-rtti -std=c++14 -MD -MT lib/DebugInfo/CodeView/CMakeFiles/LLVMDebugInfoCodeView.dir/Line.cpp.o -MF lib/DebugInfo/CodeView/CMakeFiles/LLVMDebugInfoCodeView.dir/Line.cpp.o.d -o lib/DebugInfo/CodeView/CMakeFiles/LLVMDebugInfoCodeView.dir/Line.cpp.o -c /Users/buildslave/jenkins/workspace/clang-stage2-Rthinlto/llvm-project/llvm/lib/DebugInfo/CodeView/Line.cpp
[392/3809] /Users/buildslave/jenkins/workspace/clang-stage2-Rthinlto/host-compiler/bin/clang++  -DGTEST_HAS_RTTI=0 -D__STDC_CONSTANT_MACROS -D__STDC_FORMAT_MACROS -D__STDC_LIMIT_MACROS -Ilib/DebugInfo/CodeView -I/Users/buildslave/jenkins/workspace/clang-stage2-Rthinlto/llvm-project/llvm/lib/DebugInfo/CodeView -I/Applications/Xcode.app/Contents/Developer/Platforms/MacOSX.platform/Developer/SDKs/MacOSX10.14.sdk/usr/include/libxml2 -Iinclude -I/Users/buildslave/jenkins/workspace/clang-stage2-Rthinlto/llvm-project/llvm/include -fno-stack-protector -fno-common -Wno-profile-instr-unprofiled -fPIC -fvisibility-inlines-hidden -Werror=date-time -Werror=unguarded-availability-new -fmodules -fmodules-cache-path=/Users/buildslave/jenkins/workspace/clang-stage2-Rthinlto/clang-build/Build/module.cache -fcxx-modules -gmodules -Wall -Wextra -Wno-unused-parameter -Wwrite-strings -Wcast-qual -Wmissing-field-initializers -pedantic -Wno-long-long -Wimplicit-fallthrough -Wcovered-switch-default -Wno-noexcept-type -Wnon-virtual-dtor -Wdelete-non-virtual-dtor -Wstring-conversion -fdiagnostics-color -flto=thin -O2 -g -DNDEBUG -isysroot /Applications/Xcode.app/Contents/Developer/Platforms/MacOSX.platform/Developer/SDKs/MacOSX10.14.sdk    -fno-exceptions -fno-rtti -std=c++14 -MD -MT lib/DebugInfo/CodeView/CMakeFiles/LLVMDebugInfoCodeView.dir/DebugFrameDataSubsection.cpp.o -MF lib/DebugInfo/CodeView/CMakeFiles/LLVMDebugInfoCodeView.dir/DebugFrameDataSubsection.cpp.o.d -o lib/DebugInfo/CodeView/CMakeFiles/LLVMDebugInfoCodeView.dir/DebugFrameDataSubsection.cpp.o -c /Users/buildslave/jenkins/workspace/clang-stage2-Rthinlto/llvm-project/llvm/lib/DebugInfo/CodeView/DebugFrameDataSubsection.cpp
[393/3809] /Users/buildslave/jenkins/workspace/clang-stage2-Rthinlto/host-compiler/bin/clang++  -DGTEST_HAS_RTTI=0 -D__STDC_CONSTANT_MACROS -D__STDC_FORMAT_MACROS -D__STDC_LIMIT_MACROS -Ilib/DebugInfo/CodeView -I/Users/buildslave/jenkins/workspace/clang-stage2-Rthinlto/llvm-project/llvm/lib/DebugInfo/CodeView -I/Applications/Xcode.app/Contents/Developer/Platforms/MacOSX.platform/Developer/SDKs/MacOSX10.14.sdk/usr/include/libxml2 -Iinclude -I/Users/buildslave/jenkins/workspace/clang-stage2-Rthinlto/llvm-project/llvm/include -fno-stack-protector -fno-common -Wno-profile-instr-unprofiled -fPIC -fvisibility-inlines-hidden -Werror=date-time -Werror=unguarded-availability-new -fmodules -fmodules-cache-path=/Users/buildslave/jenkins/workspace/clang-stage2-Rthinlto/clang-build/Build/module.cache -fcxx-modules -gmodules -Wall -Wextra -Wno-unused-parameter -Wwrite-strings -Wcast-qual -Wmissing-field-initializers -pedantic -Wno-long-long -Wimplicit-fallthrough -Wcovered-switch-default -Wno-noexcept-type -Wnon-virtual-dtor -Wdelete-non-virtual-dtor -Wstring-conversion -fdiagnostics-color -flto=thin -O2 -g -DNDEBUG -isysroot /Applications/Xcode.app/Contents/Developer/Platforms/MacOSX.platform/Developer/SDKs/MacOSX10.14.sdk    -fno-exceptions -fno-rtti -std=c++14 -MD -MT lib/DebugInfo/CodeView/CMakeFiles/LLVMDebugInfoCodeView.dir/DebugInlineeLinesSubsection.cpp.o -MF lib/DebugInfo/CodeView/CMakeFiles/LLVMDebugInfoCodeView.dir/DebugInlineeLinesSubsection.cpp.o.d -o lib/DebugInfo/CodeView/CMakeFiles/LLVMDebugInfoCodeView.dir/DebugInlineeLinesSubsection.cpp.o -c /Users/buildslave/jenkins/workspace/clang-stage2-Rthinlto/llvm-project/llvm/lib/DebugInfo/CodeView/DebugInlineeLinesSubsection.cpp
[394/3809] /Users/buildslave/jenkins/workspace/clang-stage2-Rthinlto/host-compiler/bin/clang++  -DGTEST_HAS_RTTI=0 -D__STDC_CONSTANT_MACROS -D__STDC_FORMAT_MACROS -D__STDC_LIMIT_MACROS -Ilib/DebugInfo/CodeView -I/Users/buildslave/jenkins/workspace/clang-stage2-Rthinlto/llvm-project/llvm/lib/DebugInfo/CodeView -I/Applications/Xcode.app/Contents/Developer/Platforms/MacOSX.platform/Developer/SDKs/MacOSX10.14.sdk/usr/include/libxml2 -Iinclude -I/Users/buildslave/jenkins/workspace/clang-stage2-Rthinlto/llvm-project/llvm/include -fno-stack-protector -fno-common -Wno-profile-instr-unprofiled -fPIC -fvisibility-inlines-hidden -Werror=date-time -Werror=unguarded-availability-new -fmodules -fmodules-cache-path=/Users/buildslave/jenkins/workspace/clang-stage2-Rthinlto/clang-build/Build/module.cache -fcxx-modules -gmodules -Wall -Wextra -Wno-unused-parameter -Wwrite-strings -Wcast-qual -Wmissing-field-initializers -pedantic -Wno-long-long -Wimplicit-fallthrough -Wcovered-switch-default -Wno-noexcept-type -Wnon-virtual-dtor -Wdelete-non-virtual-dtor -Wstring-conversion -fdiagnostics-color -flto=thin -O2 -g -DNDEBUG -isysroot /Applications/Xcode.app/Contents/Developer/Platforms/MacOSX.platform/Developer/SDKs/MacOSX10.14.sdk    -fno-exceptions -fno-rtti -std=c++14 -MD -MT lib/DebugInfo/CodeView/CMakeFiles/LLVMDebugInfoCodeView.dir/DebugCrossImpSubsection.cpp.o -MF lib/DebugInfo/CodeView/CMakeFiles/LLVMDebugInfoCodeView.dir/DebugCrossImpSubsection.cpp.o.d -o lib/DebugInfo/CodeView/CMakeFiles/LLVMDebugInfoCodeView.dir/DebugCrossImpSubsection.cpp.o -c /Users/buildslave/jenkins/workspace/clang-stage2-Rthinlto/llvm-project/llvm/lib/DebugInfo/CodeView/DebugCrossImpSubsection.cpp
[395/3809] /Users/buildslave/jenkins/workspace/clang-stage2-Rthinlto/host-compiler/bin/clang++  -DGTEST_HAS_RTTI=0 -D__STDC_CONSTANT_MACROS -D__STDC_FORMAT_MACROS -D__STDC_LIMIT_MACROS -Ilib/DebugInfo/CodeView -I/Users/buildslave/jenkins/workspace/clang-stage2-Rthinlto/llvm-project/llvm/lib/DebugInfo/CodeView -I/Applications/Xcode.app/Contents/Developer/Platforms/MacOSX.platform/Developer/SDKs/MacOSX10.14.sdk/usr/include/libxml2 -Iinclude -I/Users/buildslave/jenkins/workspace/clang-stage2-Rthinlto/llvm-project/llvm/include -fno-stack-protector -fno-common -Wno-profile-instr-unprofiled -fPIC -fvisibility-inlines-hidden -Werror=date-time -Werror=unguarded-availability-new -fmodules -fmodules-cache-path=/Users/buildslave/jenkins/workspace/clang-stage2-Rthinlto/clang-build/Build/module.cache -fcxx-modules -gmodules -Wall -Wextra -Wno-unused-parameter -Wwrite-strings -Wcast-qual -Wmissing-field-initializers -pedantic -Wno-long-long -Wimplicit-fallthrough -Wcovered-switch-default -Wno-noexcept-type -Wnon-virtual-dtor -Wdelete-non-virtual-dtor -Wstring-conversion -fdiagnostics-color -flto=thin -O2 -g -DNDEBUG -isysroot /Applications/Xcode.app/Contents/Developer/Platforms/MacOSX.platform/Developer/SDKs/MacOSX10.14.sdk    -fno-exceptions -fno-rtti -std=c++14 -MD -MT lib/DebugInfo/CodeView/CMakeFiles/LLVMDebugInfoCodeView.dir/DebugSymbolRVASubsection.cpp.o -MF lib/DebugInfo/CodeView/CMakeFiles/LLVMDebugInfoCodeView.dir/DebugSymbolRVASubsection.cpp.o.d -o lib/DebugInfo/CodeView/CMakeFiles/LLVMDebugInfoCodeView.dir/DebugSymbolRVASubsection.cpp.o -c /Users/buildslave/jenkins/workspace/clang-stage2-Rthinlto/llvm-project/llvm/lib/DebugInfo/CodeView/DebugSymbolRVASubsection.cpp
[396/3809] /Users/buildslave/jenkins/workspace/clang-stage2-Rthinlto/host-compiler/bin/clang++  -DGTEST_HAS_RTTI=0 -D__STDC_CONSTANT_MACROS -D__STDC_FORMAT_MACROS -D__STDC_LIMIT_MACROS -Ilib/DebugInfo/CodeView -I/Users/buildslave/jenkins/workspace/clang-stage2-Rthinlto/llvm-project/llvm/lib/DebugInfo/CodeView -I/Applications/Xcode.app/Contents/Developer/Platforms/MacOSX.platform/Developer/SDKs/MacOSX10.14.sdk/usr/include/libxml2 -Iinclude -I/Users/buildslave/jenkins/workspace/clang-stage2-Rthinlto/llvm-project/llvm/include -fno-stack-protector -fno-common -Wno-profile-instr-unprofiled -fPIC -fvisibility-inlines-hidden -Werror=date-time -Werror=unguarded-availability-new -fmodules -fmodules-cache-path=/Users/buildslave/jenkins/workspace/clang-stage2-Rthinlto/clang-build/Build/module.cache -fcxx-modules -gmodules -Wall -Wextra -Wno-unused-parameter -Wwrite-strings -Wcast-qual -Wmissing-field-initializers -pedantic -Wno-long-long -Wimplicit-fallthrough -Wcovered-switch-default -Wno-noexcept-type -Wnon-virtual-dtor -Wdelete-non-virtual-dtor -Wstring-conversion -fdiagnostics-color -flto=thin -O2 -g -DNDEBUG -isysroot /Applications/Xcode.app/Contents/Developer/Platforms/MacOSX.platform/Developer/SDKs/MacOSX10.14.sdk    -fno-exceptions -fno-rtti -std=c++14 -MD -MT lib/DebugInfo/CodeView/CMakeFiles/LLVMDebugInfoCodeView.dir/DebugSymbolsSubsection.cpp.o -MF lib/DebugInfo/CodeView/CMakeFiles/LLVMDebugInfoCodeView.dir/DebugSymbolsSubsection.cpp.o.d -o lib/DebugInfo/CodeView/CMakeFiles/LLVMDebugInfoCodeView.dir/DebugSymbolsSubsection.cpp.o -c /Users/buildslave/jenkins/workspace/clang-stage2-Rthinlto/llvm-project/llvm/lib/DebugInfo/CodeView/DebugSymbolsSubsection.cpp
[397/3809] /Users/buildslave/jenkins/workspace/clang-stage2-Rthinlto/host-compiler/bin/clang++  -DGTEST_HAS_RTTI=0 -D__STDC_CONSTANT_MACROS -D__STDC_FORMAT_MACROS -D__STDC_LIMIT_MACROS -Ilib/DebugInfo/CodeView -I/Users/buildslave/jenkins/workspace/clang-stage2-Rthinlto/llvm-project/llvm/lib/DebugInfo/CodeView -I/Applications/Xcode.app/Contents/Developer/Platforms/MacOSX.platform/Developer/SDKs/MacOSX10.14.sdk/usr/include/libxml2 -Iinclude -I/Users/buildslave/jenkins/workspace/clang-stage2-Rthinlto/llvm-project/llvm/include -fno-stack-protector -fno-common -Wno-profile-instr-unprofiled -fPIC -fvisibility-inlines-hidden -Werror=date-time -Werror=unguarded-availability-new -fmodules -fmodules-cache-path=/Users/buildslave/jenkins/workspace/clang-stage2-Rthinlto/clang-build/Build/module.cache -fcxx-modules -gmodules -Wall -Wextra -Wno-unused-parameter -Wwrite-strings -Wcast-qual -Wmissing-field-initializers -pedantic -Wno-long-long -Wimplicit-fallthrough -Wcovered-switch-default -Wno-noexcept-type -Wnon-virtual-dtor -Wdelete-non-virtual-dtor -Wstring-conversion -fdiagnostics-color -flto=thin -O2 -g -DNDEBUG -isysroot /Applications/Xcode.app/Contents/Developer/Platforms/MacOSX.platform/Developer/SDKs/MacOSX10.14.sdk    -fno-exceptions -fno-rtti -std=c++14 -MD -MT lib/DebugInfo/CodeView/CMakeFiles/LLVMDebugInfoCodeView.dir/DebugStringTableSubsection.cpp.o -MF lib/DebugInfo/CodeView/CMakeFiles/LLVMDebugInfoCodeView.dir/DebugStringTableSubsection.cpp.o.d -o lib/DebugInfo/CodeView/CMakeFiles/LLVMDebugInfoCodeView.dir/DebugStringTableSubsection.cpp.o -c /Users/buildslave/jenkins/workspace/clang-stage2-Rthinlto/llvm-project/llvm/lib/DebugInfo/CodeView/DebugStringTableSubsection.cpp
[398/3809] /Users/buildslave/jenkins/workspace/clang-stage2-Rthinlto/host-compiler/bin/clang++  -DGTEST_HAS_RTTI=0 -D__STDC_CONSTANT_MACROS -D__STDC_FORMAT_MACROS -D__STDC_LIMIT_MACROS -Ilib/DebugInfo/CodeView -I/Users/buildslave/jenkins/workspace/clang-stage2-Rthinlto/llvm-project/llvm/lib/DebugInfo/CodeView -I/Applications/Xcode.app/Contents/Developer/Platforms/MacOSX.platform/Developer/SDKs/MacOSX10.14.sdk/usr/include/libxml2 -Iinclude -I/Users/buildslave/jenkins/workspace/clang-stage2-Rthinlto/llvm-project/llvm/include -fno-stack-protector -fno-common -Wno-profile-instr-unprofiled -fPIC -fvisibility-inlines-hidden -Werror=date-time -Werror=unguarded-availability-new -fmodules -fmodules-cache-path=/Users/buildslave/jenkins/workspace/clang-stage2-Rthinlto/clang-build/Build/module.cache -fcxx-modules -gmodules -Wall -Wextra -Wno-unused-parameter -Wwrite-strings -Wcast-qual -Wmissing-field-initializers -pedantic -Wno-long-long -Wimplicit-fallthrough -Wcovered-switch-default -Wno-noexcept-type -Wnon-virtual-dtor -Wdelete-non-virtual-dtor -Wstring-conversion -fdiagnostics-color -flto=thin -O2 -g -DNDEBUG -isysroot /Applications/Xcode.app/Contents/Developer/Platforms/MacOSX.platform/Developer/SDKs/MacOSX10.14.sdk    -fno-exceptions -fno-rtti -std=c++14 -MD -MT lib/DebugInfo/CodeView/CMakeFiles/LLVMDebugInfoCodeView.dir/DebugLinesSubsection.cpp.o -MF lib/DebugInfo/CodeView/CMakeFiles/LLVMDebugInfoCodeView.dir/DebugLinesSubsection.cpp.o.d -o lib/DebugInfo/CodeView/CMakeFiles/LLVMDebugInfoCodeView.dir/DebugLinesSubsection.cpp.o -c /Users/buildslave/jenkins/workspace/clang-stage2-Rthinlto/llvm-project/llvm/lib/DebugInfo/CodeView/DebugLinesSubsection.cpp
[399/3809] /Users/buildslave/jenkins/workspace/clang-stage2-Rthinlto/host-compiler/bin/clang++  -DGTEST_HAS_RTTI=0 -D__STDC_CONSTANT_MACROS -D__STDC_FORMAT_MACROS -D__STDC_LIMIT_MACROS -Ilib/DebugInfo/CodeView -I/Users/buildslave/jenkins/workspace/clang-stage2-Rthinlto/llvm-project/llvm/lib/DebugInfo/CodeView -I/Applications/Xcode.app/Contents/Developer/Platforms/MacOSX.platform/Developer/SDKs/MacOSX10.14.sdk/usr/include/libxml2 -Iinclude -I/Users/buildslave/jenkins/workspace/clang-stage2-Rthinlto/llvm-project/llvm/include -fno-stack-protector -fno-common -Wno-profile-instr-unprofiled -fPIC -fvisibility-inlines-hidden -Werror=date-time -Werror=unguarded-availability-new -fmodules -fmodules-cache-path=/Users/buildslave/jenkins/workspace/clang-stage2-Rthinlto/clang-build/Build/module.cache -fcxx-modules -gmodules -Wall -Wextra -Wno-unused-parameter -Wwrite-strings -Wcast-qual -Wmissing-field-initializers -pedantic -Wno-long-long -Wimplicit-fallthrough -Wcovered-switch-default -Wno-noexcept-type -Wnon-virtual-dtor -Wdelete-non-virtual-dtor -Wstring-conversion -fdiagnostics-color -flto=thin -O2 -g -DNDEBUG -isysroot /Applications/Xcode.app/Contents/Developer/Platforms/MacOSX.platform/Developer/SDKs/MacOSX10.14.sdk    -fno-exceptions -fno-rtti -std=c++14 -MD -MT lib/DebugInfo/CodeView/CMakeFiles/LLVMDebugInfoCodeView.dir/RecordSerialization.cpp.o -MF lib/DebugInfo/CodeView/CMakeFiles/LLVMDebugInfoCodeView.dir/RecordSerialization.cpp.o.d -o lib/DebugInfo/CodeView/CMakeFiles/LLVMDebugInfoCodeView.dir/RecordSerialization.cpp.o -c /Users/buildslave/jenkins/workspace/clang-stage2-Rthinlto/llvm-project/llvm/lib/DebugInfo/CodeView/RecordSerialization.cpp
[400/3809] /Users/buildslave/jenkins/workspace/clang-stage2-Rthinlto/host-compiler/bin/clang++  -DGTEST_HAS_RTTI=0 -D__STDC_CONSTANT_MACROS -D__STDC_FORMAT_MACROS -D__STDC_LIMIT_MACROS -Ilib/DebugInfo/CodeView -I/Users/buildslave/jenkins/workspace/clang-stage2-Rthinlto/llvm-project/llvm/lib/DebugInfo/CodeView -I/Applications/Xcode.app/Contents/Developer/Platforms/MacOSX.platform/Developer/SDKs/MacOSX10.14.sdk/usr/include/libxml2 -Iinclude -I/Users/buildslave/jenkins/workspace/clang-stage2-Rthinlto/llvm-project/llvm/include -fno-stack-protector -fno-common -Wno-profile-instr-unprofiled -fPIC -fvisibility-inlines-hidden -Werror=date-time -Werror=unguarded-availability-new -fmodules -fmodules-cache-path=/Users/buildslave/jenkins/workspace/clang-stage2-Rthinlto/clang-build/Build/module.cache -fcxx-modules -gmodules -Wall -Wextra -Wno-unused-parameter -Wwrite-strings -Wcast-qual -Wmissing-field-initializers -pedantic -Wno-long-long -Wimplicit-fallthrough -Wcovered-switch-default -Wno-noexcept-type -Wnon-virtual-dtor -Wdelete-non-virtual-dtor -Wstring-conversion -fdiagnostics-color -flto=thin -O2 -g -DNDEBUG -isysroot /Applications/Xcode.app/Contents/Developer/Platforms/MacOSX.platform/Developer/SDKs/MacOSX10.14.sdk    -fno-exceptions -fno-rtti -std=c++14 -MD -MT lib/DebugInfo/CodeView/CMakeFiles/LLVMDebugInfoCodeView.dir/SimpleTypeSerializer.cpp.o -MF lib/DebugInfo/CodeView/CMakeFiles/LLVMDebugInfoCodeView.dir/SimpleTypeSerializer.cpp.o.d -o lib/DebugInfo/CodeView/CMakeFiles/LLVMDebugInfoCodeView.dir/SimpleTypeSerializer.cpp.o -c /Users/buildslave/jenkins/workspace/clang-stage2-Rthinlto/llvm-project/llvm/lib/DebugInfo/CodeView/SimpleTypeSerializer.cpp
[401/3809] /Users/buildslave/jenkins/workspace/clang-stage2-Rthinlto/host-compiler/bin/clang++  -DGTEST_HAS_RTTI=0 -D__STDC_CONSTANT_MACROS -D__STDC_FORMAT_MACROS -D__STDC_LIMIT_MACROS -Ilib/DebugInfo/CodeView -I/Users/buildslave/jenkins/workspace/clang-stage2-Rthinlto/llvm-project/llvm/lib/DebugInfo/CodeView -I/Applications/Xcode.app/Contents/Developer/Platforms/MacOSX.platform/Developer/SDKs/MacOSX10.14.sdk/usr/include/libxml2 -Iinclude -I/Users/buildslave/jenkins/workspace/clang-stage2-Rthinlto/llvm-project/llvm/include -fno-stack-protector -fno-common -Wno-profile-instr-unprofiled -fPIC -fvisibility-inlines-hidden -Werror=date-time -Werror=unguarded-availability-new -fmodules -fmodules-cache-path=/Users/buildslave/jenkins/workspace/clang-stage2-Rthinlto/clang-build/Build/module.cache -fcxx-modules -gmodules -Wall -Wextra -Wno-unused-parameter -Wwrite-strings -Wcast-qual -Wmissing-field-initializers -pedantic -Wno-long-long -Wimplicit-fallthrough -Wcovered-switch-default -Wno-noexcept-type -Wnon-virtual-dtor -Wdelete-non-virtual-dtor -Wstring-conversion -fdiagnostics-color -flto=thin -O2 -g -DNDEBUG -isysroot /Applications/Xcode.app/Contents/Developer/Platforms/MacOSX.platform/Developer/SDKs/MacOSX10.14.sdk    -fno-exceptions -fno-rtti -std=c++14 -MD -MT lib/DebugInfo/CodeView/CMakeFiles/LLVMDebugInfoCodeView.dir/GlobalTypeTableBuilder.cpp.o -MF lib/DebugInfo/CodeView/CMakeFiles/LLVMDebugInfoCodeView.dir/GlobalTypeTableBuilder.cpp.o.d -o lib/DebugInfo/CodeView/CMakeFiles/LLVMDebugInfoCodeView.dir/GlobalTypeTableBuilder.cpp.o -c /Users/buildslave/jenkins/workspace/clang-stage2-Rthinlto/llvm-project/llvm/lib/DebugInfo/CodeView/GlobalTypeTableBuilder.cpp
[402/3809] /Users/buildslave/jenkins/workspace/clang-stage2-Rthinlto/host-compiler/bin/clang++  -DGTEST_HAS_RTTI=0 -D__STDC_CONSTANT_MACROS -D__STDC_FORMAT_MACROS -D__STDC_LIMIT_MACROS -Ilib/DebugInfo/CodeView -I/Users/buildslave/jenkins/workspace/clang-stage2-Rthinlto/llvm-project/llvm/lib/DebugInfo/CodeView -I/Applications/Xcode.app/Contents/Developer/Platforms/MacOSX.platform/Developer/SDKs/MacOSX10.14.sdk/usr/include/libxml2 -Iinclude -I/Users/buildslave/jenkins/workspace/clang-stage2-Rthinlto/llvm-project/llvm/include -fno-stack-protector -fno-common -Wno-profile-instr-unprofiled -fPIC -fvisibility-inlines-hidden -Werror=date-time -Werror=unguarded-availability-new -fmodules -fmodules-cache-path=/Users/buildslave/jenkins/workspace/clang-stage2-Rthinlto/clang-build/Build/module.cache -fcxx-modules -gmodules -Wall -Wextra -Wno-unused-parameter -Wwrite-strings -Wcast-qual -Wmissing-field-initializers -pedantic -Wno-long-long -Wimplicit-fallthrough -Wcovered-switch-default -Wno-noexcept-type -Wnon-virtual-dtor -Wdelete-non-virtual-dtor -Wstring-conversion -fdiagnostics-color -flto=thin -O2 -g -DNDEBUG -isysroot /Applications/Xcode.app/Contents/Developer/Platforms/MacOSX.platform/Developer/SDKs/MacOSX10.14.sdk    -fno-exceptions -fno-rtti -std=c++14 -MD -MT lib/DebugInfo/CodeView/CMakeFiles/LLVMDebugInfoCodeView.dir/CVTypeVisitor.cpp.o -MF lib/DebugInfo/CodeView/CMakeFiles/LLVMDebugInfoCodeView.dir/CVTypeVisitor.cpp.o.d -o lib/DebugInfo/CodeView/CMakeFiles/LLVMDebugInfoCodeView.dir/CVTypeVisitor.cpp.o -c /Users/buildslave/jenkins/workspace/clang-stage2-Rthinlto/llvm-project/llvm/lib/DebugInfo/CodeView/CVTypeVisitor.cpp
[403/3809] /Users/buildslave/jenkins/workspace/clang-stage2-Rthinlto/host-compiler/bin/clang++  -DGTEST_HAS_RTTI=0 -D__STDC_CONSTANT_MACROS -D__STDC_FORMAT_MACROS -D__STDC_LIMIT_MACROS -Ilib/DebugInfo/CodeView -I/Users/buildslave/jenkins/workspace/clang-stage2-Rthinlto/llvm-project/llvm/lib/DebugInfo/CodeView -I/Applications/Xcode.app/Contents/Developer/Platforms/MacOSX.platform/Developer/SDKs/MacOSX10.14.sdk/usr/include/libxml2 -Iinclude -I/Users/buildslave/jenkins/workspace/clang-stage2-Rthinlto/llvm-project/llvm/include -fno-stack-protector -fno-common -Wno-profile-instr-unprofiled -fPIC -fvisibility-inlines-hidden -Werror=date-time -Werror=unguarded-availability-new -fmodules -fmodules-cache-path=/Users/buildslave/jenkins/workspace/clang-stage2-Rthinlto/clang-build/Build/module.cache -fcxx-modules -gmodules -Wall -Wextra -Wno-unused-parameter -Wwrite-strings -Wcast-qual -Wmissing-field-initializers -pedantic -Wno-long-long -Wimplicit-fallthrough -Wcovered-switch-default -Wno-noexcept-type -Wnon-virtual-dtor -Wdelete-non-virtual-dtor -Wstring-conversion -fdiagnostics-color -flto=thin -O2 -g -DNDEBUG -isysroot /Applications/Xcode.app/Contents/Developer/Platforms/MacOSX.platform/Developer/SDKs/MacOSX10.14.sdk    -fno-exceptions -fno-rtti -std=c++14 -MD -MT lib/DebugInfo/CodeView/CMakeFiles/LLVMDebugInfoCodeView.dir/TypeIndex.cpp.o -MF lib/DebugInfo/CodeView/CMakeFiles/LLVMDebugInfoCodeView.dir/TypeIndex.cpp.o.d -o lib/DebugInfo/CodeView/CMakeFiles/LLVMDebugInfoCodeView.dir/TypeIndex.cpp.o -c /Users/buildslave/jenkins/workspace/clang-stage2-Rthinlto/llvm-project/llvm/lib/DebugInfo/CodeView/TypeIndex.cpp
[404/3809] /Users/buildslave/jenkins/workspace/clang-stage2-Rthinlto/host-compiler/bin/clang++  -DGTEST_HAS_RTTI=0 -D__STDC_CONSTANT_MACROS -D__STDC_FORMAT_MACROS -D__STDC_LIMIT_MACROS -Ilib/DebugInfo/CodeView -I/Users/buildslave/jenkins/workspace/clang-stage2-Rthinlto/llvm-project/llvm/lib/DebugInfo/CodeView -I/Applications/Xcode.app/Contents/Developer/Platforms/MacOSX.platform/Developer/SDKs/MacOSX10.14.sdk/usr/include/libxml2 -Iinclude -I/Users/buildslave/jenkins/workspace/clang-stage2-Rthinlto/llvm-project/llvm/include -fno-stack-protector -fno-common -Wno-profile-instr-unprofiled -fPIC -fvisibility-inlines-hidden -Werror=date-time -Werror=unguarded-availability-new -fmodules -fmodules-cache-path=/Users/buildslave/jenkins/workspace/clang-stage2-Rthinlto/clang-build/Build/module.cache -fcxx-modules -gmodules -Wall -Wextra -Wno-unused-parameter -Wwrite-strings -Wcast-qual -Wmissing-field-initializers -pedantic -Wno-long-long -Wimplicit-fallthrough -Wcovered-switch-default -Wno-noexcept-type -Wnon-virtual-dtor -Wdelete-non-virtual-dtor -Wstring-conversion -fdiagnostics-color -flto=thin -O2 -g -DNDEBUG -isysroot /Applications/Xcode.app/Contents/Developer/Platforms/MacOSX.platform/Developer/SDKs/MacOSX10.14.sdk    -fno-exceptions -fno-rtti -std=c++14 -MD -MT lib/DebugInfo/CodeView/CMakeFiles/LLVMDebugInfoCodeView.dir/MergingTypeTableBuilder.cpp.o -MF lib/DebugInfo/CodeView/CMakeFiles/LLVMDebugInfoCodeView.dir/MergingTypeTableBuilder.cpp.o.d -o lib/DebugInfo/CodeView/CMakeFiles/LLVMDebugInfoCodeView.dir/MergingTypeTableBuilder.cpp.o -c /Users/buildslave/jenkins/workspace/clang-stage2-Rthinlto/llvm-project/llvm/lib/DebugInfo/CodeView/MergingTypeTableBuilder.cpp
[405/3809] /Users/buildslave/jenkins/workspace/clang-stage2-Rthinlto/host-compiler/bin/clang++  -DGTEST_HAS_RTTI=0 -D__STDC_CONSTANT_MACROS -D__STDC_FORMAT_MACROS -D__STDC_LIMIT_MACROS -Ilib/DebugInfo/DWARF -I/Users/buildslave/jenkins/workspace/clang-stage2-Rthinlto/llvm-project/llvm/lib/DebugInfo/DWARF -I/Applications/Xcode.app/Contents/Developer/Platforms/MacOSX.platform/Developer/SDKs/MacOSX10.14.sdk/usr/include/libxml2 -Iinclude -I/Users/buildslave/jenkins/workspace/clang-stage2-Rthinlto/llvm-project/llvm/include -fno-stack-protector -fno-common -Wno-profile-instr-unprofiled -fPIC -fvisibility-inlines-hidden -Werror=date-time -Werror=unguarded-availability-new -fmodules -fmodules-cache-path=/Users/buildslave/jenkins/workspace/clang-stage2-Rthinlto/clang-build/Build/module.cache -fcxx-modules -gmodules -Wall -Wextra -Wno-unused-parameter -Wwrite-strings -Wcast-qual -Wmissing-field-initializers -pedantic -Wno-long-long -Wimplicit-fallthrough -Wcovered-switch-default -Wno-noexcept-type -Wnon-virtual-dtor -Wdelete-non-virtual-dtor -Wstring-conversion -fdiagnostics-color -flto=thin -O2 -g -DNDEBUG -isysroot /Applications/Xcode.app/Contents/Developer/Platforms/MacOSX.platform/Developer/SDKs/MacOSX10.14.sdk    -fno-exceptions -fno-rtti -std=c++14 -MD -MT lib/DebugInfo/DWARF/CMakeFiles/LLVMDebugInfoDWARF.dir/DWARFUnit.cpp.o -MF lib/DebugInfo/DWARF/CMakeFiles/LLVMDebugInfoDWARF.dir/DWARFUnit.cpp.o.d -o lib/DebugInfo/DWARF/CMakeFiles/LLVMDebugInfoDWARF.dir/DWARFUnit.cpp.o -c /Users/buildslave/jenkins/workspace/clang-stage2-Rthinlto/llvm-project/llvm/lib/DebugInfo/DWARF/DWARFUnit.cpp
[406/3809] /Users/buildslave/jenkins/workspace/clang-stage2-Rthinlto/host-compiler/bin/clang++  -DGTEST_HAS_RTTI=0 -D__STDC_CONSTANT_MACROS -D__STDC_FORMAT_MACROS -D__STDC_LIMIT_MACROS -Ilib/DebugInfo/CodeView -I/Users/buildslave/jenkins/workspace/clang-stage2-Rthinlto/llvm-project/llvm/lib/DebugInfo/CodeView -I/Applications/Xcode.app/Contents/Developer/Platforms/MacOSX.platform/Developer/SDKs/MacOSX10.14.sdk/usr/include/libxml2 -Iinclude -I/Users/buildslave/jenkins/workspace/clang-stage2-Rthinlto/llvm-project/llvm/include -fno-stack-protector -fno-common -Wno-profile-instr-unprofiled -fPIC -fvisibility-inlines-hidden -Werror=date-time -Werror=unguarded-availability-new -fmodules -fmodules-cache-path=/Users/buildslave/jenkins/workspace/clang-stage2-Rthinlto/clang-build/Build/module.cache -fcxx-modules -gmodules -Wall -Wextra -Wno-unused-parameter -Wwrite-strings -Wcast-qual -Wmissing-field-initializers -pedantic -Wno-long-long -Wimplicit-fallthrough -Wcovered-switch-default -Wno-noexcept-type -Wnon-virtual-dtor -Wdelete-non-virtual-dtor -Wstring-conversion -fdiagnostics-color -flto=thin -O2 -g -DNDEBUG -isysroot /Applications/Xcode.app/Contents/Developer/Platforms/MacOSX.platform/Developer/SDKs/MacOSX10.14.sdk    -fno-exceptions -fno-rtti -std=c++14 -MD -MT lib/DebugInfo/CodeView/CMakeFiles/LLVMDebugInfoCodeView.dir/StringsAndChecksums.cpp.o -MF lib/DebugInfo/CodeView/CMakeFiles/LLVMDebugInfoCodeView.dir/StringsAndChecksums.cpp.o.d -o lib/DebugInfo/CodeView/CMakeFiles/LLVMDebugInfoCodeView.dir/StringsAndChecksums.cpp.o -c /Users/buildslave/jenkins/workspace/clang-stage2-Rthinlto/llvm-project/llvm/lib/DebugInfo/CodeView/StringsAndChecksums.cpp
[407/3809] /Users/buildslave/jenkins/workspace/clang-stage2-Rthinlto/host-compiler/bin/clang++  -DGTEST_HAS_RTTI=0 -D__STDC_CONSTANT_MACROS -D__STDC_FORMAT_MACROS -D__STDC_LIMIT_MACROS -Ilib/ObjectYAML -I/Users/buildslave/jenkins/workspace/clang-stage2-Rthinlto/llvm-project/llvm/lib/ObjectYAML -I/Applications/Xcode.app/Contents/Developer/Platforms/MacOSX.platform/Developer/SDKs/MacOSX10.14.sdk/usr/include/libxml2 -Iinclude -I/Users/buildslave/jenkins/workspace/clang-stage2-Rthinlto/llvm-project/llvm/include -fno-stack-protector -fno-common -Wno-profile-instr-unprofiled -fPIC -fvisibility-inlines-hidden -Werror=date-time -Werror=unguarded-availability-new -fmodules -fmodules-cache-path=/Users/buildslave/jenkins/workspace/clang-stage2-Rthinlto/clang-build/Build/module.cache -fcxx-modules -gmodules -Wall -Wextra -Wno-unused-parameter -Wwrite-strings -Wcast-qual -Wmissing-field-initializers -pedantic -Wno-long-long -Wimplicit-fallthrough -Wcovered-switch-default -Wno-noexcept-type -Wnon-virtual-dtor -Wdelete-non-virtual-dtor -Wstring-conversion -fdiagnostics-color -flto=thin -O2 -g -DNDEBUG -isysroot /Applications/Xcode.app/Contents/Developer/Platforms/MacOSX.platform/Developer/SDKs/MacOSX10.14.sdk    -fno-exceptions -fno-rtti -std=c++14 -MD -MT lib/ObjectYAML/CMakeFiles/LLVMObjectYAML.dir/ELFEmitter.cpp.o -MF lib/ObjectYAML/CMakeFiles/LLVMObjectYAML.dir/ELFEmitter.cpp.o.d -o lib/ObjectYAML/CMakeFiles/LLVMObjectYAML.dir/ELFEmitter.cpp.o -c /Users/buildslave/jenkins/workspace/clang-stage2-Rthinlto/llvm-project/llvm/lib/ObjectYAML/ELFEmitter.cpp
[408/3809] /Users/buildslave/jenkins/workspace/clang-stage2-Rthinlto/host-compiler/bin/clang++  -DGTEST_HAS_RTTI=0 -D__STDC_CONSTANT_MACROS -D__STDC_FORMAT_MACROS -D__STDC_LIMIT_MACROS -Ilib/DebugInfo/CodeView -I/Users/buildslave/jenkins/workspace/clang-stage2-Rthinlto/llvm-project/llvm/lib/DebugInfo/CodeView -I/Applications/Xcode.app/Contents/Developer/Platforms/MacOSX.platform/Developer/SDKs/MacOSX10.14.sdk/usr/include/libxml2 -Iinclude -I/Users/buildslave/jenkins/workspace/clang-stage2-Rthinlto/llvm-project/llvm/include -fno-stack-protector -fno-common -Wno-profile-instr-unprofiled -fPIC -fvisibility-inlines-hidden -Werror=date-time -Werror=unguarded-availability-new -fmodules -fmodules-cache-path=/Users/buildslave/jenkins/workspace/clang-stage2-Rthinlto/clang-build/Build/module.cache -fcxx-modules -gmodules -Wall -Wextra -Wno-unused-parameter -Wwrite-strings -Wcast-qual -Wmissing-field-initializers -pedantic -Wno-long-long -Wimplicit-fallthrough -Wcovered-switch-default -Wno-noexcept-type -Wnon-virtual-dtor -Wdelete-non-virtual-dtor -Wstring-conversion -fdiagnostics-color -flto=thin -O2 -g -DNDEBUG -isysroot /Applications/Xcode.app/Contents/Developer/Platforms/MacOSX.platform/Developer/SDKs/MacOSX10.14.sdk    -fno-exceptions -fno-rtti -std=c++14 -MD -MT lib/DebugInfo/CodeView/CMakeFiles/LLVMDebugInfoCodeView.dir/SymbolSerializer.cpp.o -MF lib/DebugInfo/CodeView/CMakeFiles/LLVMDebugInfoCodeView.dir/SymbolSerializer.cpp.o.d -o lib/DebugInfo/CodeView/CMakeFiles/LLVMDebugInfoCodeView.dir/SymbolSerializer.cpp.o -c /Users/buildslave/jenkins/workspace/clang-stage2-Rthinlto/llvm-project/llvm/lib/DebugInfo/CodeView/SymbolSerializer.cpp
[409/3809] /Users/buildslave/jenkins/workspace/clang-stage2-Rthinlto/host-compiler/bin/clang++  -DGTEST_HAS_RTTI=0 -D__STDC_CONSTANT_MACROS -D__STDC_FORMAT_MACROS -D__STDC_LIMIT_MACROS -Ilib/DebugInfo/CodeView -I/Users/buildslave/jenkins/workspace/clang-stage2-Rthinlto/llvm-project/llvm/lib/DebugInfo/CodeView -I/Applications/Xcode.app/Contents/Developer/Platforms/MacOSX.platform/Developer/SDKs/MacOSX10.14.sdk/usr/include/libxml2 -Iinclude -I/Users/buildslave/jenkins/workspace/clang-stage2-Rthinlto/llvm-project/llvm/include -fno-stack-protector -fno-common -Wno-profile-instr-unprofiled -fPIC -fvisibility-inlines-hidden -Werror=date-time -Werror=unguarded-availability-new -fmodules -fmodules-cache-path=/Users/buildslave/jenkins/workspace/clang-stage2-Rthinlto/clang-build/Build/module.cache -fcxx-modules -gmodules -Wall -Wextra -Wno-unused-parameter -Wwrite-strings -Wcast-qual -Wmissing-field-initializers -pedantic -Wno-long-long -Wimplicit-fallthrough -Wcovered-switch-default -Wno-noexcept-type -Wnon-virtual-dtor -Wdelete-non-virtual-dtor -Wstring-conversion -fdiagnostics-color -flto=thin -O2 -g -DNDEBUG -isysroot /Applications/Xcode.app/Contents/Developer/Platforms/MacOSX.platform/Developer/SDKs/MacOSX10.14.sdk    -fno-exceptions -fno-rtti -std=c++14 -MD -MT lib/DebugInfo/CodeView/CMakeFiles/LLVMDebugInfoCodeView.dir/TypeHashing.cpp.o -MF lib/DebugInfo/CodeView/CMakeFiles/LLVMDebugInfoCodeView.dir/TypeHashing.cpp.o.d -o lib/DebugInfo/CodeView/CMakeFiles/LLVMDebugInfoCodeView.dir/TypeHashing.cpp.o -c /Users/buildslave/jenkins/workspace/clang-stage2-Rthinlto/llvm-project/llvm/lib/DebugInfo/CodeView/TypeHashing.cpp
[410/3809] /Users/buildslave/jenkins/workspace/clang-stage2-Rthinlto/host-compiler/bin/clang++  -DGTEST_HAS_RTTI=0 -D__STDC_CONSTANT_MACROS -D__STDC_FORMAT_MACROS -D__STDC_LIMIT_MACROS -Ilib/DebugInfo/CodeView -I/Users/buildslave/jenkins/workspace/clang-stage2-Rthinlto/llvm-project/llvm/lib/DebugInfo/CodeView -I/Applications/Xcode.app/Contents/Developer/Platforms/MacOSX.platform/Developer/SDKs/MacOSX10.14.sdk/usr/include/libxml2 -Iinclude -I/Users/buildslave/jenkins/workspace/clang-stage2-Rthinlto/llvm-project/llvm/include -fno-stack-protector -fno-common -Wno-profile-instr-unprofiled -fPIC -fvisibility-inlines-hidden -Werror=date-time -Werror=unguarded-availability-new -fmodules -fmodules-cache-path=/Users/buildslave/jenkins/workspace/clang-stage2-Rthinlto/clang-build/Build/module.cache -fcxx-modules -gmodules -Wall -Wextra -Wno-unused-parameter -Wwrite-strings -Wcast-qual -Wmissing-field-initializers -pedantic -Wno-long-long -Wimplicit-fallthrough -Wcovered-switch-default -Wno-noexcept-type -Wnon-virtual-dtor -Wdelete-non-virtual-dtor -Wstring-conversion -fdiagnostics-color -flto=thin -O2 -g -DNDEBUG -isysroot /Applications/Xcode.app/Contents/Developer/Platforms/MacOSX.platform/Developer/SDKs/MacOSX10.14.sdk    -fno-exceptions -fno-rtti -std=c++14 -MD -MT lib/DebugInfo/CodeView/CMakeFiles/LLVMDebugInfoCodeView.dir/LazyRandomTypeCollection.cpp.o -MF lib/DebugInfo/CodeView/CMakeFiles/LLVMDebugInfoCodeView.dir/LazyRandomTypeCollection.cpp.o.d -o lib/DebugInfo/CodeView/CMakeFiles/LLVMDebugInfoCodeView.dir/LazyRandomTypeCollection.cpp.o -c /Users/buildslave/jenkins/workspace/clang-stage2-Rthinlto/llvm-project/llvm/lib/DebugInfo/CodeView/LazyRandomTypeCollection.cpp
[411/3809] /Users/buildslave/jenkins/workspace/clang-stage2-Rthinlto/host-compiler/bin/clang++  -DGTEST_HAS_RTTI=0 -D__STDC_CONSTANT_MACROS -D__STDC_FORMAT_MACROS -D__STDC_LIMIT_MACROS -Ilib/DebugInfo/CodeView -I/Users/buildslave/jenkins/workspace/clang-stage2-Rthinlto/llvm-project/llvm/lib/DebugInfo/CodeView -I/Applications/Xcode.app/Contents/Developer/Platforms/MacOSX.platform/Developer/SDKs/MacOSX10.14.sdk/usr/include/libxml2 -Iinclude -I/Users/buildslave/jenkins/workspace/clang-stage2-Rthinlto/llvm-project/llvm/include -fno-stack-protector -fno-common -Wno-profile-instr-unprofiled -fPIC -fvisibility-inlines-hidden -Werror=date-time -Werror=unguarded-availability-new -fmodules -fmodules-cache-path=/Users/buildslave/jenkins/workspace/clang-stage2-Rthinlto/clang-build/Build/module.cache -fcxx-modules -gmodules -Wall -Wextra -Wno-unused-parameter -Wwrite-strings -Wcast-qual -Wmissing-field-initializers -pedantic -Wno-long-long -Wimplicit-fallthrough -Wcovered-switch-default -Wno-noexcept-type -Wnon-virtual-dtor -Wdelete-non-virtual-dtor -Wstring-conversion -fdiagnostics-color -flto=thin -O2 -g -DNDEBUG -isysroot /Applications/Xcode.app/Contents/Developer/Platforms/MacOSX.platform/Developer/SDKs/MacOSX10.14.sdk    -fno-exceptions -fno-rtti -std=c++14 -MD -MT lib/DebugInfo/CodeView/CMakeFiles/LLVMDebugInfoCodeView.dir/SymbolRecordHelpers.cpp.o -MF lib/DebugInfo/CodeView/CMakeFiles/LLVMDebugInfoCodeView.dir/SymbolRecordHelpers.cpp.o.d -o lib/DebugInfo/CodeView/CMakeFiles/LLVMDebugInfoCodeView.dir/SymbolRecordHelpers.cpp.o -c /Users/buildslave/jenkins/workspace/clang-stage2-Rthinlto/llvm-project/llvm/lib/DebugInfo/CodeView/SymbolRecordHelpers.cpp
[412/3809] /Users/buildslave/jenkins/workspace/clang-stage2-Rthinlto/host-compiler/bin/clang++  -DGTEST_HAS_RTTI=0 -D__STDC_CONSTANT_MACROS -D__STDC_FORMAT_MACROS -D__STDC_LIMIT_MACROS -Ilib/DebugInfo/CodeView -I/Users/buildslave/jenkins/workspace/clang-stage2-Rthinlto/llvm-project/llvm/lib/DebugInfo/CodeView -I/Applications/Xcode.app/Contents/Developer/Platforms/MacOSX.platform/Developer/SDKs/MacOSX10.14.sdk/usr/include/libxml2 -Iinclude -I/Users/buildslave/jenkins/workspace/clang-stage2-Rthinlto/llvm-project/llvm/include -fno-stack-protector -fno-common -Wno-profile-instr-unprofiled -fPIC -fvisibility-inlines-hidden -Werror=date-time -Werror=unguarded-availability-new -fmodules -fmodules-cache-path=/Users/buildslave/jenkins/workspace/clang-stage2-Rthinlto/clang-build/Build/module.cache -fcxx-modules -gmodules -Wall -Wextra -Wno-unused-parameter -Wwrite-strings -Wcast-qual -Wmissing-field-initializers -pedantic -Wno-long-long -Wimplicit-fallthrough -Wcovered-switch-default -Wno-noexcept-type -Wnon-virtual-dtor -Wdelete-non-virtual-dtor -Wstring-conversion -fdiagnostics-color -flto=thin -O2 -g -DNDEBUG -isysroot /Applications/Xcode.app/Contents/Developer/Platforms/MacOSX.platform/Developer/SDKs/MacOSX10.14.sdk    -fno-exceptions -fno-rtti -std=c++14 -MD -MT lib/DebugInfo/CodeView/CMakeFiles/LLVMDebugInfoCodeView.dir/RecordName.cpp.o -MF lib/DebugInfo/CodeView/CMakeFiles/LLVMDebugInfoCodeView.dir/RecordName.cpp.o.d -o lib/DebugInfo/CodeView/CMakeFiles/LLVMDebugInfoCodeView.dir/RecordName.cpp.o -c /Users/buildslave/jenkins/workspace/clang-stage2-Rthinlto/llvm-project/llvm/lib/DebugInfo/CodeView/RecordName.cpp
[413/3809] /Users/buildslave/jenkins/workspace/clang-stage2-Rthinlto/host-compiler/bin/clang++  -DGTEST_HAS_RTTI=0 -D__STDC_CONSTANT_MACROS -D__STDC_FORMAT_MACROS -D__STDC_LIMIT_MACROS -Ilib/DebugInfo/CodeView -I/Users/buildslave/jenkins/workspace/clang-stage2-Rthinlto/llvm-project/llvm/lib/DebugInfo/CodeView -I/Applications/Xcode.app/Contents/Developer/Platforms/MacOSX.platform/Developer/SDKs/MacOSX10.14.sdk/usr/include/libxml2 -Iinclude -I/Users/buildslave/jenkins/workspace/clang-stage2-Rthinlto/llvm-project/llvm/include -fno-stack-protector -fno-common -Wno-profile-instr-unprofiled -fPIC -fvisibility-inlines-hidden -Werror=date-time -Werror=unguarded-availability-new -fmodules -fmodules-cache-path=/Users/buildslave/jenkins/workspace/clang-stage2-Rthinlto/clang-build/Build/module.cache -fcxx-modules -gmodules -Wall -Wextra -Wno-unused-parameter -Wwrite-strings -Wcast-qual -Wmissing-field-initializers -pedantic -Wno-long-long -Wimplicit-fallthrough -Wcovered-switch-default -Wno-noexcept-type -Wnon-virtual-dtor -Wdelete-non-virtual-dtor -Wstring-conversion -fdiagnostics-color -flto=thin -O2 -g -DNDEBUG -isysroot /Applications/Xcode.app/Contents/Developer/Platforms/MacOSX.platform/Developer/SDKs/MacOSX10.14.sdk    -fno-exceptions -fno-rtti -std=c++14 -MD -MT lib/DebugInfo/CodeView/CMakeFiles/LLVMDebugInfoCodeView.dir/TypeTableCollection.cpp.o -MF lib/DebugInfo/CodeView/CMakeFiles/LLVMDebugInfoCodeView.dir/TypeTableCollection.cpp.o.d -o lib/DebugInfo/CodeView/CMakeFiles/LLVMDebugInfoCodeView.dir/TypeTableCollection.cpp.o -c /Users/buildslave/jenkins/workspace/clang-stage2-Rthinlto/llvm-project/llvm/lib/DebugInfo/CodeView/TypeTableCollection.cpp
[414/3809] /Users/buildslave/jenkins/workspace/clang-stage2-Rthinlto/host-compiler/bin/clang++  -DGTEST_HAS_RTTI=0 -D__STDC_CONSTANT_MACROS -D__STDC_FORMAT_MACROS -D__STDC_LIMIT_MACROS -Ilib/DebugInfo/CodeView -I/Users/buildslave/jenkins/workspace/clang-stage2-Rthinlto/llvm-project/llvm/lib/DebugInfo/CodeView -I/Applications/Xcode.app/Contents/Developer/Platforms/MacOSX.platform/Developer/SDKs/MacOSX10.14.sdk/usr/include/libxml2 -Iinclude -I/Users/buildslave/jenkins/workspace/clang-stage2-Rthinlto/llvm-project/llvm/include -fno-stack-protector -fno-common -Wno-profile-instr-unprofiled -fPIC -fvisibility-inlines-hidden -Werror=date-time -Werror=unguarded-availability-new -fmodules -fmodules-cache-path=/Users/buildslave/jenkins/workspace/clang-stage2-Rthinlto/clang-build/Build/module.cache -fcxx-modules -gmodules -Wall -Wextra -Wno-unused-parameter -Wwrite-strings -Wcast-qual -Wmissing-field-initializers -pedantic -Wno-long-long -Wimplicit-fallthrough -Wcovered-switch-default -Wno-noexcept-type -Wnon-virtual-dtor -Wdelete-non-virtual-dtor -Wstring-conversion -fdiagnostics-color -flto=thin -O2 -g -DNDEBUG -isysroot /Applications/Xcode.app/Contents/Developer/Platforms/MacOSX.platform/Developer/SDKs/MacOSX10.14.sdk    -fno-exceptions -fno-rtti -std=c++14 -MD -MT lib/DebugInfo/CodeView/CMakeFiles/LLVMDebugInfoCodeView.dir/TypeRecordHelpers.cpp.o -MF lib/DebugInfo/CodeView/CMakeFiles/LLVMDebugInfoCodeView.dir/TypeRecordHelpers.cpp.o.d -o lib/DebugInfo/CodeView/CMakeFiles/LLVMDebugInfoCodeView.dir/TypeRecordHelpers.cpp.o -c /Users/buildslave/jenkins/workspace/clang-stage2-Rthinlto/llvm-project/llvm/lib/DebugInfo/CodeView/TypeRecordHelpers.cpp
[415/3809] /Users/buildslave/jenkins/workspace/clang-stage2-Rthinlto/host-compiler/bin/clang++  -DGTEST_HAS_RTTI=0 -D__STDC_CONSTANT_MACROS -D__STDC_FORMAT_MACROS -D__STDC_LIMIT_MACROS -Ilib/DebugInfo/CodeView -I/Users/buildslave/jenkins/workspace/clang-stage2-Rthinlto/llvm-project/llvm/lib/DebugInfo/CodeView -I/Applications/Xcode.app/Contents/Developer/Platforms/MacOSX.platform/Developer/SDKs/MacOSX10.14.sdk/usr/include/libxml2 -Iinclude -I/Users/buildslave/jenkins/workspace/clang-stage2-Rthinlto/llvm-project/llvm/include -fno-stack-protector -fno-common -Wno-profile-instr-unprofiled -fPIC -fvisibility-inlines-hidden -Werror=date-time -Werror=unguarded-availability-new -fmodules -fmodules-cache-path=/Users/buildslave/jenkins/workspace/clang-stage2-Rthinlto/clang-build/Build/module.cache -fcxx-modules -gmodules -Wall -Wextra -Wno-unused-parameter -Wwrite-strings -Wcast-qual -Wmissing-field-initializers -pedantic -Wno-long-long -Wimplicit-fallthrough -Wcovered-switch-default -Wno-noexcept-type -Wnon-virtual-dtor -Wdelete-non-virtual-dtor -Wstring-conversion -fdiagnostics-color -flto=thin -O2 -g -DNDEBUG -isysroot /Applications/Xcode.app/Contents/Developer/Platforms/MacOSX.platform/Developer/SDKs/MacOSX10.14.sdk    -fno-exceptions -fno-rtti -std=c++14 -MD -MT lib/DebugInfo/CodeView/CMakeFiles/LLVMDebugInfoCodeView.dir/TypeIndexDiscovery.cpp.o -MF lib/DebugInfo/CodeView/CMakeFiles/LLVMDebugInfoCodeView.dir/TypeIndexDiscovery.cpp.o.d -o lib/DebugInfo/CodeView/CMakeFiles/LLVMDebugInfoCodeView.dir/TypeIndexDiscovery.cpp.o -c /Users/buildslave/jenkins/workspace/clang-stage2-Rthinlto/llvm-project/llvm/lib/DebugInfo/CodeView/TypeIndexDiscovery.cpp
[416/3809] /Users/buildslave/jenkins/workspace/clang-stage2-Rthinlto/host-compiler/bin/clang++  -DGTEST_HAS_RTTI=0 -D__STDC_CONSTANT_MACROS -D__STDC_FORMAT_MACROS -D__STDC_LIMIT_MACROS -Ilib/DebugInfo/CodeView -I/Users/buildslave/jenkins/workspace/clang-stage2-Rthinlto/llvm-project/llvm/lib/DebugInfo/CodeView -I/Applications/Xcode.app/Contents/Developer/Platforms/MacOSX.platform/Developer/SDKs/MacOSX10.14.sdk/usr/include/libxml2 -Iinclude -I/Users/buildslave/jenkins/workspace/clang-stage2-Rthinlto/llvm-project/llvm/include -fno-stack-protector -fno-common -Wno-profile-instr-unprofiled -fPIC -fvisibility-inlines-hidden -Werror=date-time -Werror=unguarded-availability-new -fmodules -fmodules-cache-path=/Users/buildslave/jenkins/workspace/clang-stage2-Rthinlto/clang-build/Build/module.cache -fcxx-modules -gmodules -Wall -Wextra -Wno-unused-parameter -Wwrite-strings -Wcast-qual -Wmissing-field-initializers -pedantic -Wno-long-long -Wimplicit-fallthrough -Wcovered-switch-default -Wno-noexcept-type -Wnon-virtual-dtor -Wdelete-non-virtual-dtor -Wstring-conversion -fdiagnostics-color -flto=thin -O2 -g -DNDEBUG -isysroot /Applications/Xcode.app/Contents/Developer/Platforms/MacOSX.platform/Developer/SDKs/MacOSX10.14.sdk    -fno-exceptions -fno-rtti -std=c++14 -MD -MT lib/DebugInfo/CodeView/CMakeFiles/LLVMDebugInfoCodeView.dir/SymbolRecordMapping.cpp.o -MF lib/DebugInfo/CodeView/CMakeFiles/LLVMDebugInfoCodeView.dir/SymbolRecordMapping.cpp.o.d -o lib/DebugInfo/CodeView/CMakeFiles/LLVMDebugInfoCodeView.dir/SymbolRecordMapping.cpp.o -c /Users/buildslave/jenkins/workspace/clang-stage2-Rthinlto/llvm-project/llvm/lib/DebugInfo/CodeView/SymbolRecordMapping.cpp
[417/3809] /Users/buildslave/jenkins/workspace/clang-stage2-Rthinlto/host-compiler/bin/clang++  -DGTEST_HAS_RTTI=0 -D__STDC_CONSTANT_MACROS -D__STDC_FORMAT_MACROS -D__STDC_LIMIT_MACROS -Ilib/DebugInfo/CodeView -I/Users/buildslave/jenkins/workspace/clang-stage2-Rthinlto/llvm-project/llvm/lib/DebugInfo/CodeView -I/Applications/Xcode.app/Contents/Developer/Platforms/MacOSX.platform/Developer/SDKs/MacOSX10.14.sdk/usr/include/libxml2 -Iinclude -I/Users/buildslave/jenkins/workspace/clang-stage2-Rthinlto/llvm-project/llvm/include -fno-stack-protector -fno-common -Wno-profile-instr-unprofiled -fPIC -fvisibility-inlines-hidden -Werror=date-time -Werror=unguarded-availability-new -fmodules -fmodules-cache-path=/Users/buildslave/jenkins/workspace/clang-stage2-Rthinlto/clang-build/Build/module.cache -fcxx-modules -gmodules -Wall -Wextra -Wno-unused-parameter -Wwrite-strings -Wcast-qual -Wmissing-field-initializers -pedantic -Wno-long-long -Wimplicit-fallthrough -Wcovered-switch-default -Wno-noexcept-type -Wnon-virtual-dtor -Wdelete-non-virtual-dtor -Wstring-conversion -fdiagnostics-color -flto=thin -O2 -g -DNDEBUG -isysroot /Applications/Xcode.app/Contents/Developer/Platforms/MacOSX.platform/Developer/SDKs/MacOSX10.14.sdk    -fno-exceptions -fno-rtti -std=c++14 -MD -MT lib/DebugInfo/CodeView/CMakeFiles/LLVMDebugInfoCodeView.dir/EnumTables.cpp.o -MF lib/DebugInfo/CodeView/CMakeFiles/LLVMDebugInfoCodeView.dir/EnumTables.cpp.o.d -o lib/DebugInfo/CodeView/CMakeFiles/LLVMDebugInfoCodeView.dir/EnumTables.cpp.o -c /Users/buildslave/jenkins/workspace/clang-stage2-Rthinlto/llvm-project/llvm/lib/DebugInfo/CodeView/EnumTables.cpp
[418/3809] /Users/buildslave/jenkins/workspace/clang-stage2-Rthinlto/host-compiler/bin/clang++  -DGTEST_HAS_RTTI=0 -D__STDC_CONSTANT_MACROS -D__STDC_FORMAT_MACROS -D__STDC_LIMIT_MACROS -Ilib/DebugInfo/CodeView -I/Users/buildslave/jenkins/workspace/clang-stage2-Rthinlto/llvm-project/llvm/lib/DebugInfo/CodeView -I/Applications/Xcode.app/Contents/Developer/Platforms/MacOSX.platform/Developer/SDKs/MacOSX10.14.sdk/usr/include/libxml2 -Iinclude -I/Users/buildslave/jenkins/workspace/clang-stage2-Rthinlto/llvm-project/llvm/include -fno-stack-protector -fno-common -Wno-profile-instr-unprofiled -fPIC -fvisibility-inlines-hidden -Werror=date-time -Werror=unguarded-availability-new -fmodules -fmodules-cache-path=/Users/buildslave/jenkins/workspace/clang-stage2-Rthinlto/clang-build/Build/module.cache -fcxx-modules -gmodules -Wall -Wextra -Wno-unused-parameter -Wwrite-strings -Wcast-qual -Wmissing-field-initializers -pedantic -Wno-long-long -Wimplicit-fallthrough -Wcovered-switch-default -Wno-noexcept-type -Wnon-virtual-dtor -Wdelete-non-virtual-dtor -Wstring-conversion -fdiagnostics-color -flto=thin -O2 -g -DNDEBUG -isysroot /Applications/Xcode.app/Contents/Developer/Platforms/MacOSX.platform/Developer/SDKs/MacOSX10.14.sdk    -fno-exceptions -fno-rtti -std=c++14 -MD -MT lib/DebugInfo/CodeView/CMakeFiles/LLVMDebugInfoCodeView.dir/TypeStreamMerger.cpp.o -MF lib/DebugInfo/CodeView/CMakeFiles/LLVMDebugInfoCodeView.dir/TypeStreamMerger.cpp.o.d -o lib/DebugInfo/CodeView/CMakeFiles/LLVMDebugInfoCodeView.dir/TypeStreamMerger.cpp.o -c /Users/buildslave/jenkins/workspace/clang-stage2-Rthinlto/llvm-project/llvm/lib/DebugInfo/CodeView/TypeStreamMerger.cpp
[419/3809] /Users/buildslave/jenkins/workspace/clang-stage2-Rthinlto/host-compiler/bin/clang++  -DGTEST_HAS_RTTI=0 -D__STDC_CONSTANT_MACROS -D__STDC_FORMAT_MACROS -D__STDC_LIMIT_MACROS -Ilib/DebugInfo/CodeView -I/Users/buildslave/jenkins/workspace/clang-stage2-Rthinlto/llvm-project/llvm/lib/DebugInfo/CodeView -I/Applications/Xcode.app/Contents/Developer/Platforms/MacOSX.platform/Developer/SDKs/MacOSX10.14.sdk/usr/include/libxml2 -Iinclude -I/Users/buildslave/jenkins/workspace/clang-stage2-Rthinlto/llvm-project/llvm/include -fno-stack-protector -fno-common -Wno-profile-instr-unprofiled -fPIC -fvisibility-inlines-hidden -Werror=date-time -Werror=unguarded-availability-new -fmodules -fmodules-cache-path=/Users/buildslave/jenkins/workspace/clang-stage2-Rthinlto/clang-build/Build/module.cache -fcxx-modules -gmodules -Wall -Wextra -Wno-unused-parameter -Wwrite-strings -Wcast-qual -Wmissing-field-initializers -pedantic -Wno-long-long -Wimplicit-fallthrough -Wcovered-switch-default -Wno-noexcept-type -Wnon-virtual-dtor -Wdelete-non-virtual-dtor -Wstring-conversion -fdiagnostics-color -flto=thin -O2 -g -DNDEBUG -isysroot /Applications/Xcode.app/Contents/Developer/Platforms/MacOSX.platform/Developer/SDKs/MacOSX10.14.sdk    -fno-exceptions -fno-rtti -std=c++14 -MD -MT lib/DebugInfo/CodeView/CMakeFiles/LLVMDebugInfoCodeView.dir/TypeDumpVisitor.cpp.o -MF lib/DebugInfo/CodeView/CMakeFiles/LLVMDebugInfoCodeView.dir/TypeDumpVisitor.cpp.o.d -o lib/DebugInfo/CodeView/CMakeFiles/LLVMDebugInfoCodeView.dir/TypeDumpVisitor.cpp.o -c /Users/buildslave/jenkins/workspace/clang-stage2-Rthinlto/llvm-project/llvm/lib/DebugInfo/CodeView/TypeDumpVisitor.cpp
[420/3809] : && /Users/buildslave/jenkins/workspace/clang-stage2-Rthinlto/host-compiler/bin/clang++  -fno-stack-protector -fno-common -Wno-profile-instr-unprofiled -fPIC -fvisibility-inlines-hidden -Werror=date-time -Werror=unguarded-availability-new -fmodules -fmodules-cache-path=/Users/buildslave/jenkins/workspace/clang-stage2-Rthinlto/clang-build/Build/module.cache -fcxx-modules -gmodules -Wall -Wextra -Wno-unused-parameter -Wwrite-strings -Wcast-qual -Wmissing-field-initializers -pedantic -Wno-long-long -Wimplicit-fallthrough -Wcovered-switch-default -Wno-noexcept-type -Wnon-virtual-dtor -Wdelete-non-virtual-dtor -Wstring-conversion -fdiagnostics-color -flto=thin -O2 -g -DNDEBUG -isysroot /Applications/Xcode.app/Contents/Developer/Platforms/MacOSX.platform/Developer/SDKs/MacOSX10.14.sdk -Wl,-search_paths_first -Wl,-headerpad_max_install_names -flto=thin -Wl,-cache_path_lto,/Users/buildslave/jenkins/workspace/clang-stage2-Rthinlto/clang-build/Build/lto.cache    -Wl,-dead_strip -Wl,-object_path_lto,/Users/buildslave/jenkins/workspace/clang-stage2-Rthinlto/clang-build/Build/utils/TableGen/./llvm-tblgen-lto.o utils/TableGen/CMakeFiles/llvm-tblgen.dir/AsmMatcherEmitter.cpp.o utils/TableGen/CMakeFiles/llvm-tblgen.dir/AsmWriterEmitter.cpp.o utils/TableGen/CMakeFiles/llvm-tblgen.dir/AsmWriterInst.cpp.o utils/TableGen/CMakeFiles/llvm-tblgen.dir/Attributes.cpp.o utils/TableGen/CMakeFiles/llvm-tblgen.dir/CallingConvEmitter.cpp.o utils/TableGen/CMakeFiles/llvm-tblgen.dir/CodeEmitterGen.cpp.o utils/TableGen/CMakeFiles/llvm-tblgen.dir/CodeGenDAGPatterns.cpp.o utils/TableGen/CMakeFiles/llvm-tblgen.dir/CodeGenHwModes.cpp.o utils/TableGen/CMakeFiles/llvm-tblgen.dir/CodeGenInstruction.cpp.o utils/TableGen/CMakeFiles/llvm-tblgen.dir/CodeGenMapTable.cpp.o utils/TableGen/CMakeFiles/llvm-tblgen.dir/CodeGenRegisters.cpp.o utils/TableGen/CMakeFiles/llvm-tblgen.dir/CodeGenSchedule.cpp.o utils/TableGen/CMakeFiles/llvm-tblgen.dir/CodeGenTarget.cpp.o utils/TableGen/CMakeFiles/llvm-tblgen.dir/DAGISelEmitter.cpp.o utils/TableGen/CMakeFiles/llvm-tblgen.dir/DAGISelMatcherEmitter.cpp.o utils/TableGen/CMakeFiles/llvm-tblgen.dir/DAGISelMatcherGen.cpp.o utils/TableGen/CMakeFiles/llvm-tblgen.dir/DAGISelMatcherOpt.cpp.o utils/TableGen/CMakeFiles/llvm-tblgen.dir/DAGISelMatcher.cpp.o utils/TableGen/CMakeFiles/llvm-tblgen.dir/DFAEmitter.cpp.o utils/TableGen/CMakeFiles/llvm-tblgen.dir/DFAPacketizerEmitter.cpp.o utils/TableGen/CMakeFiles/llvm-tblgen.dir/DisassemblerEmitter.cpp.o utils/TableGen/CMakeFiles/llvm-tblgen.dir/ExegesisEmitter.cpp.o utils/TableGen/CMakeFiles/llvm-tblgen.dir/FastISelEmitter.cpp.o utils/TableGen/CMakeFiles/llvm-tblgen.dir/FixedLenDecoderEmitter.cpp.o utils/TableGen/CMakeFiles/llvm-tblgen.dir/GICombinerEmitter.cpp.o utils/TableGen/CMakeFiles/llvm-tblgen.dir/GlobalISelEmitter.cpp.o utils/TableGen/CMakeFiles/llvm-tblgen.dir/InfoByHwMode.cpp.o utils/TableGen/CMakeFiles/llvm-tblgen.dir/InstrInfoEmitter.cpp.o utils/TableGen/CMakeFiles/llvm-tblgen.dir/InstrDocsEmitter.cpp.o utils/TableGen/CMakeFiles/llvm-tblgen.dir/IntrinsicEmitter.cpp.o utils/TableGen/CMakeFiles/llvm-tblgen.dir/OptEmitter.cpp.o utils/TableGen/CMakeFiles/llvm-tblgen.dir/OptParserEmitter.cpp.o utils/TableGen/CMakeFiles/llvm-tblgen.dir/OptRSTEmitter.cpp.o utils/TableGen/CMakeFiles/llvm-tblgen.dir/PredicateExpander.cpp.o utils/TableGen/CMakeFiles/llvm-tblgen.dir/PseudoLoweringEmitter.cpp.o utils/TableGen/CMakeFiles/llvm-tblgen.dir/RISCVCompressInstEmitter.cpp.o utils/TableGen/CMakeFiles/llvm-tblgen.dir/RegisterBankEmitter.cpp.o utils/TableGen/CMakeFiles/llvm-tblgen.dir/RegisterInfoEmitter.cpp.o utils/TableGen/CMakeFiles/llvm-tblgen.dir/SDNodeProperties.cpp.o utils/TableGen/CMakeFiles/llvm-tblgen.dir/SearchableTableEmitter.cpp.o utils/TableGen/CMakeFiles/llvm-tblgen.dir/SubtargetEmitter.cpp.o utils/TableGen/CMakeFiles/llvm-tblgen.dir/SubtargetFeatureInfo.cpp.o utils/TableGen/CMakeFiles/llvm-tblgen.dir/TableGen.cpp.o utils/TableGen/CMakeFiles/llvm-tblgen.dir/Types.cpp.o utils/TableGen/CMakeFiles/llvm-tblgen.dir/X86DisassemblerTables.cpp.o utils/TableGen/CMakeFiles/llvm-tblgen.dir/X86EVEX2VEXTablesEmitter.cpp.o utils/TableGen/CMakeFiles/llvm-tblgen.dir/X86FoldTablesEmitter.cpp.o utils/TableGen/CMakeFiles/llvm-tblgen.dir/X86ModRMFilters.cpp.o utils/TableGen/CMakeFiles/llvm-tblgen.dir/X86RecognizableInstr.cpp.o utils/TableGen/CMakeFiles/llvm-tblgen.dir/WebAssemblyDisassemblerEmitter.cpp.o utils/TableGen/CMakeFiles/llvm-tblgen.dir/CTagsEmitter.cpp.o  -o bin/llvm-tblgen  -Wl,-rpath,@loader_path/../lib lib/libLLVMSupport.a lib/libLLVMTableGen.a lib/libLLVMTableGenGlobalISel.a lib/libLLVMSupport.a -lz -lcurses -lm lib/libLLVMDemangle.a && cd /Users/buildslave/jenkins/workspace/clang-stage2-Rthinlto/clang-build/Build/utils/TableGen && /Users/buildslave/jenkins/workspace/clang-stage2-Rthinlto/host-compiler/bin/dsymutil -o=llvm-tblgen.dSYM /Users/buildslave/jenkins/workspace/clang-stage2-Rthinlto/clang-build/Build/bin/llvm-tblgen && /usr/bin/strip -Sxl /Users/buildslave/jenkins/workspace/clang-stage2-Rthinlto/clang-build/Build/bin/llvm-tblgen
FAILED: bin/llvm-tblgen 
: && /Users/buildslave/jenkins/workspace/clang-stage2-Rthinlto/host-compiler/bin/clang++  -fno-stack-protector -fno-common -Wno-profile-instr-unprofiled -fPIC -fvisibility-inlines-hidden -Werror=date-time -Werror=unguarded-availability-new -fmodules -fmodules-cache-path=/Users/buildslave/jenkins/workspace/clang-stage2-Rthinlto/clang-build/Build/module.cache -fcxx-modules -gmodules -Wall -Wextra -Wno-unused-parameter -Wwrite-strings -Wcast-qual -Wmissing-field-initializers -pedantic -Wno-long-long -Wimplicit-fallthrough -Wcovered-switch-default -Wno-noexcept-type -Wnon-virtual-dtor -Wdelete-non-virtual-dtor -Wstring-conversion -fdiagnostics-color -flto=thin -O2 -g -DNDEBUG -isysroot /Applications/Xcode.app/Contents/Developer/Platforms/MacOSX.platform/Developer/SDKs/MacOSX10.14.sdk -Wl,-search_paths_first -Wl,-headerpad_max_install_names -flto=thin -Wl,-cache_path_lto,/Users/buildslave/jenkins/workspace/clang-stage2-Rthinlto/clang-build/Build/lto.cache    -Wl,-dead_strip -Wl,-object_path_lto,/Users/buildslave/jenkins/workspace/clang-stage2-Rthinlto/clang-build/Build/utils/TableGen/./llvm-tblgen-lto.o utils/TableGen/CMakeFiles/llvm-tblgen.dir/AsmMatcherEmitter.cpp.o utils/TableGen/CMakeFiles/llvm-tblgen.dir/AsmWriterEmitter.cpp.o utils/TableGen/CMakeFiles/llvm-tblgen.dir/AsmWriterInst.cpp.o utils/TableGen/CMakeFiles/llvm-tblgen.dir/Attributes.cpp.o utils/TableGen/CMakeFiles/llvm-tblgen.dir/CallingConvEmitter.cpp.o utils/TableGen/CMakeFiles/llvm-tblgen.dir/CodeEmitterGen.cpp.o utils/TableGen/CMakeFiles/llvm-tblgen.dir/CodeGenDAGPatterns.cpp.o utils/TableGen/CMakeFiles/llvm-tblgen.dir/CodeGenHwModes.cpp.o utils/TableGen/CMakeFiles/llvm-tblgen.dir/CodeGenInstruction.cpp.o utils/TableGen/CMakeFiles/llvm-tblgen.dir/CodeGenMapTable.cpp.o utils/TableGen/CMakeFiles/llvm-tblgen.dir/CodeGenRegisters.cpp.o utils/TableGen/CMakeFiles/llvm-tblgen.dir/CodeGenSchedule.cpp.o utils/TableGen/CMakeFiles/llvm-tblgen.dir/CodeGenTarget.cpp.o utils/TableGen/CMakeFiles/llvm-tblgen.dir/DAGISelEmitter.cpp.o utils/TableGen/CMakeFiles/llvm-tblgen.dir/DAGISelMatcherEmitter.cpp.o utils/TableGen/CMakeFiles/llvm-tblgen.dir/DAGISelMatcherGen.cpp.o utils/TableGen/CMakeFiles/llvm-tblgen.dir/DAGISelMatcherOpt.cpp.o utils/TableGen/CMakeFiles/llvm-tblgen.dir/DAGISelMatcher.cpp.o utils/TableGen/CMakeFiles/llvm-tblgen.dir/DFAEmitter.cpp.o utils/TableGen/CMakeFiles/llvm-tblgen.dir/DFAPacketizerEmitter.cpp.o utils/TableGen/CMakeFiles/llvm-tblgen.dir/DisassemblerEmitter.cpp.o utils/TableGen/CMakeFiles/llvm-tblgen.dir/ExegesisEmitter.cpp.o utils/TableGen/CMakeFiles/llvm-tblgen.dir/FastISelEmitter.cpp.o utils/TableGen/CMakeFiles/llvm-tblgen.dir/FixedLenDecoderEmitter.cpp.o utils/TableGen/CMakeFiles/llvm-tblgen.dir/GICombinerEmitter.cpp.o utils/TableGen/CMakeFiles/llvm-tblgen.dir/GlobalISelEmitter.cpp.o utils/TableGen/CMakeFiles/llvm-tblgen.dir/InfoByHwMode.cpp.o utils/TableGen/CMakeFiles/llvm-tblgen.dir/InstrInfoEmitter.cpp.o utils/TableGen/CMakeFiles/llvm-tblgen.dir/InstrDocsEmitter.cpp.o utils/TableGen/CMakeFiles/llvm-tblgen.dir/IntrinsicEmitter.cpp.o utils/TableGen/CMakeFiles/llvm-tblgen.dir/OptEmitter.cpp.o utils/TableGen/CMakeFiles/llvm-tblgen.dir/OptParserEmitter.cpp.o utils/TableGen/CMakeFiles/llvm-tblgen.dir/OptRSTEmitter.cpp.o utils/TableGen/CMakeFiles/llvm-tblgen.dir/PredicateExpander.cpp.o utils/TableGen/CMakeFiles/llvm-tblgen.dir/PseudoLoweringEmitter.cpp.o utils/TableGen/CMakeFiles/llvm-tblgen.dir/RISCVCompressInstEmitter.cpp.o utils/TableGen/CMakeFiles/llvm-tblgen.dir/RegisterBankEmitter.cpp.o utils/TableGen/CMakeFiles/llvm-tblgen.dir/RegisterInfoEmitter.cpp.o utils/TableGen/CMakeFiles/llvm-tblgen.dir/SDNodeProperties.cpp.o utils/TableGen/CMakeFiles/llvm-tblgen.dir/SearchableTableEmitter.cpp.o utils/TableGen/CMakeFiles/llvm-tblgen.dir/SubtargetEmitter.cpp.o utils/TableGen/CMakeFiles/llvm-tblgen.dir/SubtargetFeatureInfo.cpp.o utils/TableGen/CMakeFiles/llvm-tblgen.dir/TableGen.cpp.o utils/TableGen/CMakeFiles/llvm-tblgen.dir/Types.cpp.o utils/TableGen/CMakeFiles/llvm-tblgen.dir/X86DisassemblerTables.cpp.o utils/TableGen/CMakeFiles/llvm-tblgen.dir/X86EVEX2VEXTablesEmitter.cpp.o utils/TableGen/CMakeFiles/llvm-tblgen.dir/X86FoldTablesEmitter.cpp.o utils/TableGen/CMakeFiles/llvm-tblgen.dir/X86ModRMFilters.cpp.o utils/TableGen/CMakeFiles/llvm-tblgen.dir/X86RecognizableInstr.cpp.o utils/TableGen/CMakeFiles/llvm-tblgen.dir/WebAssemblyDisassemblerEmitter.cpp.o utils/TableGen/CMakeFiles/llvm-tblgen.dir/CTagsEmitter.cpp.o  -o bin/llvm-tblgen  -Wl,-rpath,@loader_path/../lib lib/libLLVMSupport.a lib/libLLVMTableGen.a lib/libLLVMTableGenGlobalISel.a lib/libLLVMSupport.a -lz -lcurses -lm lib/libLLVMDemangle.a && cd /Users/buildslave/jenkins/workspace/clang-stage2-Rthinlto/clang-build/Build/utils/TableGen && /Users/buildslave/jenkins/workspace/clang-stage2-Rthinlto/host-compiler/bin/dsymutil -o=llvm-tblgen.dSYM /Users/buildslave/jenkins/workspace/clang-stage2-Rthinlto/clang-build/Build/bin/llvm-tblgen && /usr/bin/strip -Sxl /Users/buildslave/jenkins/workspace/clang-stage2-Rthinlto/clang-build/Build/bin/llvm-tblgen
Assertion failed: (CU.getDIE(CalleeSP) && "Expected declaration subprogram DIE for callee"), function constructCallSiteEntryDIEs, file /Users/buildslave/jenkins/workspace/clang-stage1-RA/llvm-project/llvm/lib/CodeGen/AsmPrinter/DwarfDebug.cpp, line 763.
clang-10: error: unable to execute command: Abort trap: 6
clang-10: error: linker command failed due to signal (use -v to see invocation)
[421/3809] /Users/buildslave/jenkins/workspace/clang-stage2-Rthinlto/host-compiler/bin/clang++  -DGTEST_HAS_RTTI=0 -D__STDC_CONSTANT_MACROS -D__STDC_FORMAT_MACROS -D__STDC_LIMIT_MACROS -Ilib/DebugInfo/CodeView -I/Users/buildslave/jenkins/workspace/clang-stage2-Rthinlto/llvm-project/llvm/lib/DebugInfo/CodeView -I/Applications/Xcode.app/Contents/Developer/Platforms/MacOSX.platform/Developer/SDKs/MacOSX10.14.sdk/usr/include/libxml2 -Iinclude -I/Users/buildslave/jenkins/workspace/clang-stage2-Rthinlto/llvm-project/llvm/include -fno-stack-protector -fno-common -Wno-profile-instr-unprofiled -fPIC -fvisibility-inlines-hidden -Werror=date-time -Werror=unguarded-availability-new -fmodules -fmodules-cache-path=/Users/buildslave/jenkins/workspace/clang-stage2-Rthinlto/clang-build/Build/module.cache -fcxx-modules -gmodules -Wall -Wextra -Wno-unused-parameter -Wwrite-strings -Wcast-qual -Wmissing-field-initializers -pedantic -Wno-long-long -Wimplicit-fallthrough -Wcovered-switch-default -Wno-noexcept-type -Wnon-virtual-dtor -Wdelete-non-virtual-dtor -Wstring-conversion -fdiagnostics-color -flto=thin -O2 -g -DNDEBUG -isysroot /Applications/Xcode.app/Contents/Developer/Platforms/MacOSX.platform/Developer/SDKs/MacOSX10.14.sdk    -fno-exceptions -fno-rtti -std=c++14 -MD -MT lib/DebugInfo/CodeView/CMakeFiles/LLVMDebugInfoCodeView.dir/SymbolDumper.cpp.o -MF lib/DebugInfo/CodeView/CMakeFiles/LLVMDebugInfoCodeView.dir/SymbolDumper.cpp.o.d -o lib/DebugInfo/CodeView/CMakeFiles/LLVMDebugInfoCodeView.dir/SymbolDumper.cpp.o -c /Users/buildslave/jenkins/workspace/clang-stage2-Rthinlto/llvm-project/llvm/lib/DebugInfo/CodeView/SymbolDumper.cpp
[422/3809] /Users/buildslave/jenkins/workspace/clang-stage2-Rthinlto/host-compiler/bin/clang++  -DGTEST_HAS_RTTI=0 -D__STDC_CONSTANT_MACROS -D__STDC_FORMAT_MACROS -D__STDC_LIMIT_MACROS -Ilib/DebugInfo/PDB -I/Users/buildslave/jenkins/workspace/clang-stage2-Rthinlto/llvm-project/llvm/lib/DebugInfo/PDB -I/Applications/Xcode.app/Contents/Developer/Platforms/MacOSX.platform/Developer/SDKs/MacOSX10.14.sdk/usr/include/libxml2 -Iinclude -I/Users/buildslave/jenkins/workspace/clang-stage2-Rthinlto/llvm-project/llvm/include -fno-stack-protector -fno-common -Wno-profile-instr-unprofiled -fPIC -fvisibility-inlines-hidden -Werror=date-time -Werror=unguarded-availability-new -fmodules -fmodules-cache-path=/Users/buildslave/jenkins/workspace/clang-stage2-Rthinlto/clang-build/Build/module.cache -fcxx-modules -gmodules -Wall -Wextra -Wno-unused-parameter -Wwrite-strings -Wcast-qual -Wmissing-field-initializers -pedantic -Wno-long-long -Wimplicit-fallthrough -Wcovered-switch-default -Wno-noexcept-type -Wnon-virtual-dtor -Wdelete-non-virtual-dtor -Wstring-conversion -fdiagnostics-color -flto=thin -O2 -g -DNDEBUG -isysroot /Applications/Xcode.app/Contents/Developer/Platforms/MacOSX.platform/Developer/SDKs/MacOSX10.14.sdk    -fno-exceptions -fno-rtti -std=c++14 -MD -MT lib/DebugInfo/PDB/CMakeFiles/LLVMDebugInfoPDB.dir/PDBSymbolCompilandDetails.cpp.o -MF lib/DebugInfo/PDB/CMakeFiles/LLVMDebugInfoPDB.dir/PDBSymbolCompilandDetails.cpp.o.d -o lib/DebugInfo/PDB/CMakeFiles/LLVMDebugInfoPDB.dir/PDBSymbolCompilandDetails.cpp.o -c /Users/buildslave/jenkins/workspace/clang-stage2-Rthinlto/llvm-project/llvm/lib/DebugInfo/PDB/PDBSymbolCompilandDetails.cpp
[423/3809] /Users/buildslave/jenkins/workspace/clang-stage2-Rthinlto/host-compiler/bin/clang++  -DGTEST_HAS_RTTI=0 -D__STDC_CONSTANT_MACROS -D__STDC_FORMAT_MACROS -D__STDC_LIMIT_MACROS -Ilib/DebugInfo/CodeView -I/Users/buildslave/jenkins/workspace/clang-stage2-Rthinlto/llvm-project/llvm/lib/DebugInfo/CodeView -I/Applications/Xcode.app/Contents/Developer/Platforms/MacOSX.platform/Developer/SDKs/MacOSX10.14.sdk/usr/include/libxml2 -Iinclude -I/Users/buildslave/jenkins/workspace/clang-stage2-Rthinlto/llvm-project/llvm/include -fno-stack-protector -fno-common -Wno-profile-instr-unprofiled -fPIC -fvisibility-inlines-hidden -Werror=date-time -Werror=unguarded-availability-new -fmodules -fmodules-cache-path=/Users/buildslave/jenkins/workspace/clang-stage2-Rthinlto/clang-build/Build/module.cache -fcxx-modules -gmodules -Wall -Wextra -Wno-unused-parameter -Wwrite-strings -Wcast-qual -Wmissing-field-initializers -pedantic -Wno-long-long -Wimplicit-fallthrough -Wcovered-switch-default -Wno-noexcept-type -Wnon-virtual-dtor -Wdelete-non-virtual-dtor -Wstring-conversion -fdiagnostics-color -flto=thin -O2 -g -DNDEBUG -isysroot /Applications/Xcode.app/Contents/Developer/Platforms/MacOSX.platform/Developer/SDKs/MacOSX10.14.sdk    -fno-exceptions -fno-rtti -std=c++14 -MD -MT lib/DebugInfo/CodeView/CMakeFiles/LLVMDebugInfoCodeView.dir/TypeRecordMapping.cpp.o -MF lib/DebugInfo/CodeView/CMakeFiles/LLVMDebugInfoCodeView.dir/TypeRecordMapping.cpp.o.d -o lib/DebugInfo/CodeView/CMakeFiles/LLVMDebugInfoCodeView.dir/TypeRecordMapping.cpp.o -c /Users/buildslave/jenkins/workspace/clang-stage2-Rthinlto/llvm-project/llvm/lib/DebugInfo/CodeView/TypeRecordMapping.cpp
[424/3809] /Users/buildslave/jenkins/workspace/clang-stage2-Rthinlto/host-compiler/bin/clang++  -DGTEST_HAS_RTTI=0 -D__STDC_CONSTANT_MACROS -D__STDC_FORMAT_MACROS -D__STDC_LIMIT_MACROS -Ilib/DebugInfo/PDB -I/Users/buildslave/jenkins/workspace/clang-stage2-Rthinlto/llvm-project/llvm/lib/DebugInfo/PDB -I/Applications/Xcode.app/Contents/Developer/Platforms/MacOSX.platform/Developer/SDKs/MacOSX10.14.sdk/usr/include/libxml2 -Iinclude -I/Users/buildslave/jenkins/workspace/clang-stage2-Rthinlto/llvm-project/llvm/include -fno-stack-protector -fno-common -Wno-profile-instr-unprofiled -fPIC -fvisibility-inlines-hidden -Werror=date-time -Werror=unguarded-availability-new -fmodules -fmodules-cache-path=/Users/buildslave/jenkins/workspace/clang-stage2-Rthinlto/clang-build/Build/module.cache -fcxx-modules -gmodules -Wall -Wextra -Wno-unused-parameter -Wwrite-strings -Wcast-qual -Wmissing-field-initializers -pedantic -Wno-long-long -Wimplicit-fallthrough -Wcovered-switch-default -Wno-noexcept-type -Wnon-virtual-dtor -Wdelete-non-virtual-dtor -Wstring-conversion -fdiagnostics-color -flto=thin -O2 -g -DNDEBUG -isysroot /Applications/Xcode.app/Contents/Developer/Platforms/MacOSX.platform/Developer/SDKs/MacOSX10.14.sdk    -fno-exceptions -fno-rtti -std=c++14 -MD -MT lib/DebugInfo/PDB/CMakeFiles/LLVMDebugInfoPDB.dir/GenericError.cpp.o -MF lib/DebugInfo/PDB/CMakeFiles/LLVMDebugInfoPDB.dir/GenericError.cpp.o.d -o lib/DebugInfo/PDB/CMakeFiles/LLVMDebugInfoPDB.dir/GenericError.cpp.o -c /Users/buildslave/jenkins/workspace/clang-stage2-Rthinlto/llvm-project/llvm/lib/DebugInfo/PDB/GenericError.cpp
[425/3809] /Users/buildslave/jenkins/workspace/clang-stage2-Rthinlto/host-compiler/bin/clang++  -DGTEST_HAS_RTTI=0 -D__STDC_CONSTANT_MACROS -D__STDC_FORMAT_MACROS -D__STDC_LIMIT_MACROS -Ilib/DebugInfo/PDB -I/Users/buildslave/jenkins/workspace/clang-stage2-Rthinlto/llvm-project/llvm/lib/DebugInfo/PDB -I/Applications/Xcode.app/Contents/Developer/Platforms/MacOSX.platform/Developer/SDKs/MacOSX10.14.sdk/usr/include/libxml2 -Iinclude -I/Users/buildslave/jenkins/workspace/clang-stage2-Rthinlto/llvm-project/llvm/include -fno-stack-protector -fno-common -Wno-profile-instr-unprofiled -fPIC -fvisibility-inlines-hidden -Werror=date-time -Werror=unguarded-availability-new -fmodules -fmodules-cache-path=/Users/buildslave/jenkins/workspace/clang-stage2-Rthinlto/clang-build/Build/module.cache -fcxx-modules -gmodules -Wall -Wextra -Wno-unused-parameter -Wwrite-strings -Wcast-qual -Wmissing-field-initializers -pedantic -Wno-long-long -Wimplicit-fallthrough -Wcovered-switch-default -Wno-noexcept-type -Wnon-virtual-dtor -Wdelete-non-virtual-dtor -Wstring-conversion -fdiagnostics-color -flto=thin -O2 -g -DNDEBUG -isysroot /Applications/Xcode.app/Contents/Developer/Platforms/MacOSX.platform/Developer/SDKs/MacOSX10.14.sdk    -fno-exceptions -fno-rtti -std=c++14 -MD -MT lib/DebugInfo/PDB/CMakeFiles/LLVMDebugInfoPDB.dir/PDBSymbolCustom.cpp.o -MF lib/DebugInfo/PDB/CMakeFiles/LLVMDebugInfoPDB.dir/PDBSymbolCustom.cpp.o.d -o lib/DebugInfo/PDB/CMakeFiles/LLVMDebugInfoPDB.dir/PDBSymbolCustom.cpp.o -c /Users/buildslave/jenkins/workspace/clang-stage2-Rthinlto/llvm-project/llvm/lib/DebugInfo/PDB/PDBSymbolCustom.cpp
[426/3809] /Users/buildslave/jenkins/workspace/clang-stage2-Rthinlto/host-compiler/bin/clang++  -DGTEST_HAS_RTTI=0 -D__STDC_CONSTANT_MACROS -D__STDC_FORMAT_MACROS -D__STDC_LIMIT_MACROS -Ilib/DebugInfo/DWARF -I/Users/buildslave/jenkins/workspace/clang-stage2-Rthinlto/llvm-project/llvm/lib/DebugInfo/DWARF -I/Applications/Xcode.app/Contents/Developer/Platforms/MacOSX.platform/Developer/SDKs/MacOSX10.14.sdk/usr/include/libxml2 -Iinclude -I/Users/buildslave/jenkins/workspace/clang-stage2-Rthinlto/llvm-project/llvm/include -fno-stack-protector -fno-common -Wno-profile-instr-unprofiled -fPIC -fvisibility-inlines-hidden -Werror=date-time -Werror=unguarded-availability-new -fmodules -fmodules-cache-path=/Users/buildslave/jenkins/workspace/clang-stage2-Rthinlto/clang-build/Build/module.cache -fcxx-modules -gmodules -Wall -Wextra -Wno-unused-parameter -Wwrite-strings -Wcast-qual -Wmissing-field-initializers -pedantic -Wno-long-long -Wimplicit-fallthrough -Wcovered-switch-default -Wno-noexcept-type -Wnon-virtual-dtor -Wdelete-non-virtual-dtor -Wstring-conversion -fdiagnostics-color -flto=thin -O2 -g -DNDEBUG -isysroot /Applications/Xcode.app/Contents/Developer/Platforms/MacOSX.platform/Developer/SDKs/MacOSX10.14.sdk    -fno-exceptions -fno-rtti -std=c++14 -MD -MT lib/DebugInfo/DWARF/CMakeFiles/LLVMDebugInfoDWARF.dir/DWARFVerifier.cpp.o -MF lib/DebugInfo/DWARF/CMakeFiles/LLVMDebugInfoDWARF.dir/DWARFVerifier.cpp.o.d -o lib/DebugInfo/DWARF/CMakeFiles/LLVMDebugInfoDWARF.dir/DWARFVerifier.cpp.o -c /Users/buildslave/jenkins/workspace/clang-stage2-Rthinlto/llvm-project/llvm/lib/DebugInfo/DWARF/DWARFVerifier.cpp
[427/3809] /Users/buildslave/jenkins/workspace/clang-stage2-Rthinlto/host-compiler/bin/clang++  -DGTEST_HAS_RTTI=0 -D__STDC_CONSTANT_MACROS -D__STDC_FORMAT_MACROS -D__STDC_LIMIT_MACROS -Ilib/DebugInfo/DWARF -I/Users/buildslave/jenkins/workspace/clang-stage2-Rthinlto/llvm-project/llvm/lib/DebugInfo/DWARF -I/Applications/Xcode.app/Contents/Developer/Platforms/MacOSX.platform/Developer/SDKs/MacOSX10.14.sdk/usr/include/libxml2 -Iinclude -I/Users/buildslave/jenkins/workspace/clang-stage2-Rthinlto/llvm-project/llvm/include -fno-stack-protector -fno-common -Wno-profile-instr-unprofiled -fPIC -fvisibility-inlines-hidden -Werror=date-time -Werror=unguarded-availability-new -fmodules -fmodules-cache-path=/Users/buildslave/jenkins/workspace/clang-stage2-Rthinlto/clang-build/Build/module.cache -fcxx-modules -gmodules -Wall -Wextra -Wno-unused-parameter -Wwrite-strings -Wcast-qual -Wmissing-field-initializers -pedantic -Wno-long-long -Wimplicit-fallthrough -Wcovered-switch-default -Wno-noexcept-type -Wnon-virtual-dtor -Wdelete-non-virtual-dtor -Wstring-conversion -fdiagnostics-color -flto=thin -O2 -g -DNDEBUG -isysroot /Applications/Xcode.app/Contents/Developer/Platforms/MacOSX.platform/Developer/SDKs/MacOSX10.14.sdk    -fno-exceptions -fno-rtti -std=c++14 -MD -MT lib/DebugInfo/DWARF/CMakeFiles/LLVMDebugInfoDWARF.dir/DWARFContext.cpp.o -MF lib/DebugInfo/DWARF/CMakeFiles/LLVMDebugInfoDWARF.dir/DWARFContext.cpp.o.d -o lib/DebugInfo/DWARF/CMakeFiles/LLVMDebugInfoDWARF.dir/DWARFContext.cpp.o -c /Users/buildslave/jenkins/workspace/clang-stage2-Rthinlto/llvm-project/llvm/lib/DebugInfo/DWARF/DWARFContext.cpp
[428/3809] /Users/buildslave/jenkins/workspace/clang-stage2-Rthinlto/host-compiler/bin/clang++  -DGTEST_HAS_RTTI=0 -D__STDC_CONSTANT_MACROS -D__STDC_FORMAT_MACROS -D__STDC_LIMIT_MACROS -Ilib/DebugInfo/PDB -I/Users/buildslave/jenkins/workspace/clang-stage2-Rthinlto/llvm-project/llvm/lib/DebugInfo/PDB -I/Applications/Xcode.app/Contents/Developer/Platforms/MacOSX.platform/Developer/SDKs/MacOSX10.14.sdk/usr/include/libxml2 -Iinclude -I/Users/buildslave/jenkins/workspace/clang-stage2-Rthinlto/llvm-project/llvm/include -fno-stack-protector -fno-common -Wno-profile-instr-unprofiled -fPIC -fvisibility-inlines-hidden -Werror=date-time -Werror=unguarded-availability-new -fmodules -fmodules-cache-path=/Users/buildslave/jenkins/workspace/clang-stage2-Rthinlto/clang-build/Build/module.cache -fcxx-modules -gmodules -Wall -Wextra -Wno-unused-parameter -Wwrite-strings -Wcast-qual -Wmissing-field-initializers -pedantic -Wno-long-long -Wimplicit-fallthrough -Wcovered-switch-default -Wno-noexcept-type -Wnon-virtual-dtor -Wdelete-non-virtual-dtor -Wstring-conversion -fdiagnostics-color -flto=thin -O2 -g -DNDEBUG -isysroot /Applications/Xcode.app/Contents/Developer/Platforms/MacOSX.platform/Developer/SDKs/MacOSX10.14.sdk    -fno-exceptions -fno-rtti -std=c++14 -MD -MT lib/DebugInfo/PDB/CMakeFiles/LLVMDebugInfoPDB.dir/PDBSymbolCompilandEnv.cpp.o -MF lib/DebugInfo/PDB/CMakeFiles/LLVMDebugInfoPDB.dir/PDBSymbolCompilandEnv.cpp.o.d -o lib/DebugInfo/PDB/CMakeFiles/LLVMDebugInfoPDB.dir/PDBSymbolCompilandEnv.cpp.o -c /Users/buildslave/jenkins/workspace/clang-stage2-Rthinlto/llvm-project/llvm/lib/DebugInfo/PDB/PDBSymbolCompilandEnv.cpp
[429/3809] /Users/buildslave/jenkins/workspace/clang-stage2-Rthinlto/host-compiler/bin/clang++  -DGTEST_HAS_RTTI=0 -D__STDC_CONSTANT_MACROS -D__STDC_FORMAT_MACROS -D__STDC_LIMIT_MACROS -Ilib/DebugInfo/PDB -I/Users/buildslave/jenkins/workspace/clang-stage2-Rthinlto/llvm-project/llvm/lib/DebugInfo/PDB -I/Applications/Xcode.app/Contents/Developer/Platforms/MacOSX.platform/Developer/SDKs/MacOSX10.14.sdk/usr/include/libxml2 -Iinclude -I/Users/buildslave/jenkins/workspace/clang-stage2-Rthinlto/llvm-project/llvm/include -fno-stack-protector -fno-common -Wno-profile-instr-unprofiled -fPIC -fvisibility-inlines-hidden -Werror=date-time -Werror=unguarded-availability-new -fmodules -fmodules-cache-path=/Users/buildslave/jenkins/workspace/clang-stage2-Rthinlto/clang-build/Build/module.cache -fcxx-modules -gmodules -Wall -Wextra -Wno-unused-parameter -Wwrite-strings -Wcast-qual -Wmissing-field-initializers -pedantic -Wno-long-long -Wimplicit-fallthrough -Wcovered-switch-default -Wno-noexcept-type -Wnon-virtual-dtor -Wdelete-non-virtual-dtor -Wstring-conversion -fdiagnostics-color -flto=thin -O2 -g -DNDEBUG -isysroot /Applications/Xcode.app/Contents/Developer/Platforms/MacOSX.platform/Developer/SDKs/MacOSX10.14.sdk    -fno-exceptions -fno-rtti -std=c++14 -MD -MT lib/DebugInfo/PDB/CMakeFiles/LLVMDebugInfoPDB.dir/PDB.cpp.o -MF lib/DebugInfo/PDB/CMakeFiles/LLVMDebugInfoPDB.dir/PDB.cpp.o.d -o lib/DebugInfo/PDB/CMakeFiles/LLVMDebugInfoPDB.dir/PDB.cpp.o -c /Users/buildslave/jenkins/workspace/clang-stage2-Rthinlto/llvm-project/llvm/lib/DebugInfo/PDB/PDB.cpp
[430/3809] /Users/buildslave/jenkins/workspace/clang-stage2-Rthinlto/host-compiler/bin/clang++  -DGTEST_HAS_RTTI=0 -D__STDC_CONSTANT_MACROS -D__STDC_FORMAT_MACROS -D__STDC_LIMIT_MACROS -Ilib/DebugInfo/PDB -I/Users/buildslave/jenkins/workspace/clang-stage2-Rthinlto/llvm-project/llvm/lib/DebugInfo/PDB -I/Applications/Xcode.app/Contents/Developer/Platforms/MacOSX.platform/Developer/SDKs/MacOSX10.14.sdk/usr/include/libxml2 -Iinclude -I/Users/buildslave/jenkins/workspace/clang-stage2-Rthinlto/llvm-project/llvm/include -fno-stack-protector -fno-common -Wno-profile-instr-unprofiled -fPIC -fvisibility-inlines-hidden -Werror=date-time -Werror=unguarded-availability-new -fmodules -fmodules-cache-path=/Users/buildslave/jenkins/workspace/clang-stage2-Rthinlto/clang-build/Build/module.cache -fcxx-modules -gmodules -Wall -Wextra -Wno-unused-parameter -Wwrite-strings -Wcast-qual -Wmissing-field-initializers -pedantic -Wno-long-long -Wimplicit-fallthrough -Wcovered-switch-default -Wno-noexcept-type -Wnon-virtual-dtor -Wdelete-non-virtual-dtor -Wstring-conversion -fdiagnostics-color -flto=thin -O2 -g -DNDEBUG -isysroot /Applications/Xcode.app/Contents/Developer/Platforms/MacOSX.platform/Developer/SDKs/MacOSX10.14.sdk    -fno-exceptions -fno-rtti -std=c++14 -MD -MT lib/DebugInfo/PDB/CMakeFiles/LLVMDebugInfoPDB.dir/PDBInterfaceAnchors.cpp.o -MF lib/DebugInfo/PDB/CMakeFiles/LLVMDebugInfoPDB.dir/PDBInterfaceAnchors.cpp.o.d -o lib/DebugInfo/PDB/CMakeFiles/LLVMDebugInfoPDB.dir/PDBInterfaceAnchors.cpp.o -c /Users/buildslave/jenkins/workspace/clang-stage2-Rthinlto/llvm-project/llvm/lib/DebugInfo/PDB/PDBInterfaceAnchors.cpp
[431/3809] /Users/buildslave/jenkins/workspace/clang-stage2-Rthinlto/host-compiler/bin/clang++  -DGTEST_HAS_RTTI=0 -D__STDC_CONSTANT_MACROS -D__STDC_FORMAT_MACROS -D__STDC_LIMIT_MACROS -Ilib/DebugInfo/PDB -I/Users/buildslave/jenkins/workspace/clang-stage2-Rthinlto/llvm-project/llvm/lib/DebugInfo/PDB -I/Applications/Xcode.app/Contents/Developer/Platforms/MacOSX.platform/Developer/SDKs/MacOSX10.14.sdk/usr/include/libxml2 -Iinclude -I/Users/buildslave/jenkins/workspace/clang-stage2-Rthinlto/llvm-project/llvm/include -fno-stack-protector -fno-common -Wno-profile-instr-unprofiled -fPIC -fvisibility-inlines-hidden -Werror=date-time -Werror=unguarded-availability-new -fmodules -fmodules-cache-path=/Users/buildslave/jenkins/workspace/clang-stage2-Rthinlto/clang-build/Build/module.cache -fcxx-modules -gmodules -Wall -Wextra -Wno-unused-parameter -Wwrite-strings -Wcast-qual -Wmissing-field-initializers -pedantic -Wno-long-long -Wimplicit-fallthrough -Wcovered-switch-default -Wno-noexcept-type -Wnon-virtual-dtor -Wdelete-non-virtual-dtor -Wstring-conversion -fdiagnostics-color -flto=thin -O2 -g -DNDEBUG -isysroot /Applications/Xcode.app/Contents/Developer/Platforms/MacOSX.platform/Developer/SDKs/MacOSX10.14.sdk    -fno-exceptions -fno-rtti -std=c++14 -MD -MT lib/DebugInfo/PDB/CMakeFiles/LLVMDebugInfoPDB.dir/PDBSymbolAnnotation.cpp.o -MF lib/DebugInfo/PDB/CMakeFiles/LLVMDebugInfoPDB.dir/PDBSymbolAnnotation.cpp.o.d -o lib/DebugInfo/PDB/CMakeFiles/LLVMDebugInfoPDB.dir/PDBSymbolAnnotation.cpp.o -c /Users/buildslave/jenkins/workspace/clang-stage2-Rthinlto/llvm-project/llvm/lib/DebugInfo/PDB/PDBSymbolAnnotation.cpp
[432/3809] /Users/buildslave/jenkins/workspace/clang-stage2-Rthinlto/host-compiler/bin/clang++  -DGTEST_HAS_RTTI=0 -D__STDC_CONSTANT_MACROS -D__STDC_FORMAT_MACROS -D__STDC_LIMIT_MACROS -Ilib/DebugInfo/PDB -I/Users/buildslave/jenkins/workspace/clang-stage2-Rthinlto/llvm-project/llvm/lib/DebugInfo/PDB -I/Applications/Xcode.app/Contents/Developer/Platforms/MacOSX.platform/Developer/SDKs/MacOSX10.14.sdk/usr/include/libxml2 -Iinclude -I/Users/buildslave/jenkins/workspace/clang-stage2-Rthinlto/llvm-project/llvm/include -fno-stack-protector -fno-common -Wno-profile-instr-unprofiled -fPIC -fvisibility-inlines-hidden -Werror=date-time -Werror=unguarded-availability-new -fmodules -fmodules-cache-path=/Users/buildslave/jenkins/workspace/clang-stage2-Rthinlto/clang-build/Build/module.cache -fcxx-modules -gmodules -Wall -Wextra -Wno-unused-parameter -Wwrite-strings -Wcast-qual -Wmissing-field-initializers -pedantic -Wno-long-long -Wimplicit-fallthrough -Wcovered-switch-default -Wno-noexcept-type -Wnon-virtual-dtor -Wdelete-non-virtual-dtor -Wstring-conversion -fdiagnostics-color -flto=thin -O2 -g -DNDEBUG -isysroot /Applications/Xcode.app/Contents/Developer/Platforms/MacOSX.platform/Developer/SDKs/MacOSX10.14.sdk    -fno-exceptions -fno-rtti -std=c++14 -MD -MT lib/DebugInfo/PDB/CMakeFiles/LLVMDebugInfoPDB.dir/PDBSymbolBlock.cpp.o -MF lib/DebugInfo/PDB/CMakeFiles/LLVMDebugInfoPDB.dir/PDBSymbolBlock.cpp.o.d -o lib/DebugInfo/PDB/CMakeFiles/LLVMDebugInfoPDB.dir/PDBSymbolBlock.cpp.o -c /Users/buildslave/jenkins/workspace/clang-stage2-Rthinlto/llvm-project/llvm/lib/DebugInfo/PDB/PDBSymbolBlock.cpp
[433/3809] /Users/buildslave/jenkins/workspace/clang-stage2-Rthinlto/host-compiler/bin/clang++  -DGTEST_HAS_RTTI=0 -D__STDC_CONSTANT_MACROS -D__STDC_FORMAT_MACROS -D__STDC_LIMIT_MACROS -Ilib/DebugInfo/PDB -I/Users/buildslave/jenkins/workspace/clang-stage2-Rthinlto/llvm-project/llvm/lib/DebugInfo/PDB -I/Applications/Xcode.app/Contents/Developer/Platforms/MacOSX.platform/Developer/SDKs/MacOSX10.14.sdk/usr/include/libxml2 -Iinclude -I/Users/buildslave/jenkins/workspace/clang-stage2-Rthinlto/llvm-project/llvm/include -fno-stack-protector -fno-common -Wno-profile-instr-unprofiled -fPIC -fvisibility-inlines-hidden -Werror=date-time -Werror=unguarded-availability-new -fmodules -fmodules-cache-path=/Users/buildslave/jenkins/workspace/clang-stage2-Rthinlto/clang-build/Build/module.cache -fcxx-modules -gmodules -Wall -Wextra -Wno-unused-parameter -Wwrite-strings -Wcast-qual -Wmissing-field-initializers -pedantic -Wno-long-long -Wimplicit-fallthrough -Wcovered-switch-default -Wno-noexcept-type -Wnon-virtual-dtor -Wdelete-non-virtual-dtor -Wstring-conversion -fdiagnostics-color -flto=thin -O2 -g -DNDEBUG -isysroot /Applications/Xcode.app/Contents/Developer/Platforms/MacOSX.platform/Developer/SDKs/MacOSX10.14.sdk    -fno-exceptions -fno-rtti -std=c++14 -MD -MT lib/DebugInfo/PDB/CMakeFiles/LLVMDebugInfoPDB.dir/PDBContext.cpp.o -MF lib/DebugInfo/PDB/CMakeFiles/LLVMDebugInfoPDB.dir/PDBContext.cpp.o.d -o lib/DebugInfo/PDB/CMakeFiles/LLVMDebugInfoPDB.dir/PDBContext.cpp.o -c /Users/buildslave/jenkins/workspace/clang-stage2-Rthinlto/llvm-project/llvm/lib/DebugInfo/PDB/PDBContext.cpp
[434/3809] /Users/buildslave/jenkins/workspace/clang-stage2-Rthinlto/host-compiler/bin/clang++  -DGTEST_HAS_RTTI=0 -D__STDC_CONSTANT_MACROS -D__STDC_FORMAT_MACROS -D__STDC_LIMIT_MACROS -Ilib/DebugInfo/PDB -I/Users/buildslave/jenkins/workspace/clang-stage2-Rthinlto/llvm-project/llvm/lib/DebugInfo/PDB -I/Applications/Xcode.app/Contents/Developer/Platforms/MacOSX.platform/Developer/SDKs/MacOSX10.14.sdk/usr/include/libxml2 -Iinclude -I/Users/buildslave/jenkins/workspace/clang-stage2-Rthinlto/llvm-project/llvm/include -fno-stack-protector -fno-common -Wno-profile-instr-unprofiled -fPIC -fvisibility-inlines-hidden -Werror=date-time -Werror=unguarded-availability-new -fmodules -fmodules-cache-path=/Users/buildslave/jenkins/workspace/clang-stage2-Rthinlto/clang-build/Build/module.cache -fcxx-modules -gmodules -Wall -Wextra -Wno-unused-parameter -Wwrite-strings -Wcast-qual -Wmissing-field-initializers -pedantic -Wno-long-long -Wimplicit-fallthrough -Wcovered-switch-default -Wno-noexcept-type -Wnon-virtual-dtor -Wdelete-non-virtual-dtor -Wstring-conversion -fdiagnostics-color -flto=thin -O2 -g -DNDEBUG -isysroot /Applications/Xcode.app/Contents/Developer/Platforms/MacOSX.platform/Developer/SDKs/MacOSX10.14.sdk    -fno-exceptions -fno-rtti -std=c++14 -MD -MT lib/DebugInfo/PDB/CMakeFiles/LLVMDebugInfoPDB.dir/PDBExtras.cpp.o -MF lib/DebugInfo/PDB/CMakeFiles/LLVMDebugInfoPDB.dir/PDBExtras.cpp.o.d -o lib/DebugInfo/PDB/CMakeFiles/LLVMDebugInfoPDB.dir/PDBExtras.cpp.o -c /Users/buildslave/jenkins/workspace/clang-stage2-Rthinlto/llvm-project/llvm/lib/DebugInfo/PDB/PDBExtras.cpp
[435/3809] /Users/buildslave/jenkins/workspace/clang-stage2-Rthinlto/host-compiler/bin/clang++  -DGTEST_HAS_RTTI=0 -D__STDC_CONSTANT_MACROS -D__STDC_FORMAT_MACROS -D__STDC_LIMIT_MACROS -Ilib/DebugInfo/PDB -I/Users/buildslave/jenkins/workspace/clang-stage2-Rthinlto/llvm-project/llvm/lib/DebugInfo/PDB -I/Applications/Xcode.app/Contents/Developer/Platforms/MacOSX.platform/Developer/SDKs/MacOSX10.14.sdk/usr/include/libxml2 -Iinclude -I/Users/buildslave/jenkins/workspace/clang-stage2-Rthinlto/llvm-project/llvm/include -fno-stack-protector -fno-common -Wno-profile-instr-unprofiled -fPIC -fvisibility-inlines-hidden -Werror=date-time -Werror=unguarded-availability-new -fmodules -fmodules-cache-path=/Users/buildslave/jenkins/workspace/clang-stage2-Rthinlto/clang-build/Build/module.cache -fcxx-modules -gmodules -Wall -Wextra -Wno-unused-parameter -Wwrite-strings -Wcast-qual -Wmissing-field-initializers -pedantic -Wno-long-long -Wimplicit-fallthrough -Wcovered-switch-default -Wno-noexcept-type -Wnon-virtual-dtor -Wdelete-non-virtual-dtor -Wstring-conversion -fdiagnostics-color -flto=thin -O2 -g -DNDEBUG -isysroot /Applications/Xcode.app/Contents/Developer/Platforms/MacOSX.platform/Developer/SDKs/MacOSX10.14.sdk    -fno-exceptions -fno-rtti -std=c++14 -MD -MT lib/DebugInfo/PDB/CMakeFiles/LLVMDebugInfoPDB.dir/PDBSymbol.cpp.o -MF lib/DebugInfo/PDB/CMakeFiles/LLVMDebugInfoPDB.dir/PDBSymbol.cpp.o.d -o lib/DebugInfo/PDB/CMakeFiles/LLVMDebugInfoPDB.dir/PDBSymbol.cpp.o -c /Users/buildslave/jenkins/workspace/clang-stage2-Rthinlto/llvm-project/llvm/lib/DebugInfo/PDB/PDBSymbol.cpp
[436/3809] /Users/buildslave/jenkins/workspace/clang-stage2-Rthinlto/host-compiler/bin/clang++  -DGTEST_HAS_RTTI=0 -D__STDC_CONSTANT_MACROS -D__STDC_FORMAT_MACROS -D__STDC_LIMIT_MACROS -Ilib/DebugInfo/PDB -I/Users/buildslave/jenkins/workspace/clang-stage2-Rthinlto/llvm-project/llvm/lib/DebugInfo/PDB -I/Applications/Xcode.app/Contents/Developer/Platforms/MacOSX.platform/Developer/SDKs/MacOSX10.14.sdk/usr/include/libxml2 -Iinclude -I/Users/buildslave/jenkins/workspace/clang-stage2-Rthinlto/llvm-project/llvm/include -fno-stack-protector -fno-common -Wno-profile-instr-unprofiled -fPIC -fvisibility-inlines-hidden -Werror=date-time -Werror=unguarded-availability-new -fmodules -fmodules-cache-path=/Users/buildslave/jenkins/workspace/clang-stage2-Rthinlto/clang-build/Build/module.cache -fcxx-modules -gmodules -Wall -Wextra -Wno-unused-parameter -Wwrite-strings -Wcast-qual -Wmissing-field-initializers -pedantic -Wno-long-long -Wimplicit-fallthrough -Wcovered-switch-default -Wno-noexcept-type -Wnon-virtual-dtor -Wdelete-non-virtual-dtor -Wstring-conversion -fdiagnostics-color -flto=thin -O2 -g -DNDEBUG -isysroot /Applications/Xcode.app/Contents/Developer/Platforms/MacOSX.platform/Developer/SDKs/MacOSX10.14.sdk    -fno-exceptions -fno-rtti -std=c++14 -MD -MT lib/DebugInfo/PDB/CMakeFiles/LLVMDebugInfoPDB.dir/PDBSymbolCompiland.cpp.o -MF lib/DebugInfo/PDB/CMakeFiles/LLVMDebugInfoPDB.dir/PDBSymbolCompiland.cpp.o.d -o lib/DebugInfo/PDB/CMakeFiles/LLVMDebugInfoPDB.dir/PDBSymbolCompiland.cpp.o -c /Users/buildslave/jenkins/workspace/clang-stage2-Rthinlto/llvm-project/llvm/lib/DebugInfo/PDB/PDBSymbolCompiland.cpp
[437/3809] /Users/buildslave/jenkins/workspace/clang-stage2-Rthinlto/host-compiler/bin/clang++  -DGTEST_HAS_RTTI=0 -D__STDC_CONSTANT_MACROS -D__STDC_FORMAT_MACROS -D__STDC_LIMIT_MACROS -Ilib/DebugInfo/PDB -I/Users/buildslave/jenkins/workspace/clang-stage2-Rthinlto/llvm-project/llvm/lib/DebugInfo/PDB -I/Applications/Xcode.app/Contents/Developer/Platforms/MacOSX.platform/Developer/SDKs/MacOSX10.14.sdk/usr/include/libxml2 -Iinclude -I/Users/buildslave/jenkins/workspace/clang-stage2-Rthinlto/llvm-project/llvm/include -fno-stack-protector -fno-common -Wno-profile-instr-unprofiled -fPIC -fvisibility-inlines-hidden -Werror=date-time -Werror=unguarded-availability-new -fmodules -fmodules-cache-path=/Users/buildslave/jenkins/workspace/clang-stage2-Rthinlto/clang-build/Build/module.cache -fcxx-modules -gmodules -Wall -Wextra -Wno-unused-parameter -Wwrite-strings -Wcast-qual -Wmissing-field-initializers -pedantic -Wno-long-long -Wimplicit-fallthrough -Wcovered-switch-default -Wno-noexcept-type -Wnon-virtual-dtor -Wdelete-non-virtual-dtor -Wstring-conversion -fdiagnostics-color -flto=thin -O2 -g -DNDEBUG -isysroot /Applications/Xcode.app/Contents/Developer/Platforms/MacOSX.platform/Developer/SDKs/MacOSX10.14.sdk    -fno-exceptions -fno-rtti -std=c++14 -MD -MT lib/DebugInfo/PDB/CMakeFiles/LLVMDebugInfoPDB.dir/IPDBSourceFile.cpp.o -MF lib/DebugInfo/PDB/CMakeFiles/LLVMDebugInfoPDB.dir/IPDBSourceFile.cpp.o.d -o lib/DebugInfo/PDB/CMakeFiles/LLVMDebugInfoPDB.dir/IPDBSourceFile.cpp.o -c /Users/buildslave/jenkins/workspace/clang-stage2-Rthinlto/llvm-project/llvm/lib/DebugInfo/PDB/IPDBSourceFile.cpp
ninja: build stopped: subcommand failed.
Command failed 
Command: ['/usr/local/bin/ninja', '-v', 'install']
[Pipeline] }
[Pipeline] // timeout
[Pipeline] }
[Pipeline] // stage
[Pipeline] stage
[Pipeline] { (Test)
Stage "Test" skipped due to earlier failure(s)
[Pipeline] }
[Pipeline] // stage
[Pipeline] stage
[Pipeline] { (Declarative: Post Actions)
[Pipeline] scanForIssues
No credentials specified
[Clang (LLVM based)] Sleeping for 5 seconds due to JENKINS-32191...
[Clang (LLVM based)] Parsing console log (workspace: '/Users/buildslave/jenkins/workspace/clang-stage2-Rthinlto')
[Pipeline] }
[Pipeline] // stage
[Pipeline] }
[Pipeline] // node
[Pipeline] End of Pipeline
[BFA] Scanning build for known causes...
[BFA] Found failure cause(s):
[BFA] Ninja target failed from category Compile
[BFA] Assertion failure from category Assert
[BFA] Compile Error from category Compile
[BFA] Done. 0s
ERROR: script returned exit code 1
Finished: FAILURE