AbortedConsole Output

Skipping 73,559 KB.. Full Log
 of 2167)
PASS: lldb-api :: functionalities/data-formatter/data-formatter-stl/libcxx/multimap/TestDataFormatterLibccMultiMap.py (769 of 2167)
PASS: lldb-api :: commands/expression/import-std-module/deque-dbg-info-content/TestDbgInfoContentDequeFromStdModule.py (770 of 2167)
PASS: lldb-api :: functionalities/dlopen_other_executable/TestDlopenOtherExecutable.py (771 of 2167)
PASS: lldb-unit :: Utility/./UtilityTests/SerializationRountripTest.SerializeDeserializePod (772 of 2167)
PASS: lldb-shell :: ObjectFile/MachO/symtab.yaml (773 of 2167)
PASS: lldb-unit :: Utility/./UtilityTests/StreamTeeTest.SetStreamAtIndexOutOfBounds (774 of 2167)
PASS: lldb-api :: lang/objc/ptr_refs/TestPtrRefsObjC.py (775 of 2167)
PASS: lldb-unit :: ScriptInterpreter/Python/./ScriptInterpreterPythonTests/PythonDataObjectsTest.TestPythonCallableInvoke (776 of 2167)
PASS: lldb-api :: commands/expression/import-std-module/basic/TestImportStdModule.py (777 of 2167)
PASS: lldb-api :: functionalities/backticks/TestBackticksWithoutATarget.py (778 of 2167)
PASS: lldb-shell :: SymbolFile/DWARF/debug_line-tombstone.s (779 of 2167)
PASS: lldb-api :: lang/objc/foundation/TestConstStrings.py (780 of 2167)
PASS: lldb-unit :: Utility/./UtilityTests/ArgsTest.ReplaceArgumentAtIndexEqual (781 of 2167)
PASS: lldb-unit :: Expression/./ExpressionTests/ClangHostTest.MacOSX (782 of 2167)
PASS: lldb-api :: lang/objc/blocks/TestObjCIvarsInBlocks.py (783 of 2167)
PASS: lldb-unit :: ScriptInterpreter/Python/./ScriptInterpreterPythonTests/PythonDataObjectsTest.TestPythonDictionaryValueEquality (784 of 2167)
PASS: lldb-shell :: SymbolFile/Breakpad/symtab.test (785 of 2167)
PASS: lldb-unit :: Utility/./UtilityTests/BinaryStreamTest.PutSLEB128EightBytes (786 of 2167)
PASS: lldb-api :: functionalities/thread/concurrent_events/TestConcurrentDelaySignalBreak.py (787 of 2167)
PASS: lldb-unit :: Utility/./UtilityTests/LogChannelEnabledTest.LogThread (788 of 2167)
PASS: lldb-api :: tools/lldb-server/TestGdbRemoteAttach.py (789 of 2167)
PASS: lldb-unit :: Utility/./UtilityTests/StringExtractorTest.GetHexBytes_Underflow (790 of 2167)
PASS: lldb-api :: functionalities/breakpoint/breakpoint_command/TestBreakpointCommand.py (791 of 2167)
PASS: lldb-shell :: Reproducer/TestGDBRemoteRepro.test (792 of 2167)
PASS: lldb-unit :: Symbol/./SymbolTests/SymbolsTest.LocateExecutableSymbolFileForUnknownExecutableAndMissingSymbolFile (793 of 2167)
PASS: lldb-unit :: ScriptInterpreter/Python/./ScriptInterpreterPythonTests/PythonDataObjectsTest.TestScript (794 of 2167)
PASS: lldb-shell :: Reproducer/Functionalities/TestExpressionEvaluation.test (795 of 2167)
PASS: lldb-api :: macosx/universal/TestUniversal.py (796 of 2167)
UNSUPPORTED: lldb-api :: functionalities/thread/concurrent_events/TestConcurrentTwoWatchpointThreads.py (797 of 2167)
PASS: lldb-api :: commands/expression/import-std-module/shared_ptr-dbg-info-content/TestSharedPtrDbgInfoContentFromStdModule.py (798 of 2167)
PASS: lldb-unit :: UnwindAssembly/x86/./UnwindAssemblyx86Tests/Testx86AssemblyInspectionEngine.TestPush0 (799 of 2167)
PASS: lldb-unit :: UnwindAssembly/x86/./UnwindAssemblyx86Tests/Testx86AssemblyInspectionEngine.TestPopEBX (800 of 2167)
PASS: lldb-api :: lang/cpp/dynamic-value/TestCppValueCast.py (801 of 2167)
PASS: lldb-unit :: Utility/./UtilityTests/StringListTest.InsertStringAtIndexOutOfBounds (802 of 2167)
PASS: lldb-api :: lang/c/register_variables/TestRegisterVariables.py (803 of 2167)
PASS: lldb-unit :: Utility/./UtilityTests/StringExtractorTest.GetHexBytesAvail_Underflow (804 of 2167)
PASS: lldb-unit :: Utility/./UtilityTests/StreamTest.SetIndentLevel (805 of 2167)
PASS: lldb-api :: api/check_public_api_headers/TestPublicAPIHeaders.py (806 of 2167)
PASS: lldb-api :: commands/frame/language/TestGuessLanguage.py (807 of 2167)
PASS: lldb-api :: commands/expression/import-std-module/conflicts/TestStdModuleWithConflicts.py (808 of 2167)
PASS: lldb-api :: commands/target/create-deps/TestTargetCreateDeps.py (809 of 2167)
PASS: lldb-unit :: Expression/./ExpressionTests/DiagnosticManagerTest.AppendMessageAttachToLastDiag (810 of 2167)
PASS: lldb-api :: functionalities/breakpoint/inlined_breakpoints/TestInlinedBreakpoints.py (811 of 2167)
PASS: lldb-unit :: DataFormatter/./LLDBFormatterTests/TypeMatcherTests.RegexName (812 of 2167)
PASS: lldb-api :: commands/process/attach-resume/TestAttachResume.py (813 of 2167)
PASS: lldb-unit :: SymbolFile/DWARF/./SymbolFileDWARFTests/XcodeSDKModuleTests.TestModuleGetXcodeSDK (814 of 2167)
PASS: lldb-shell :: Settings/TestSettingsSet.test (815 of 2167)
PASS: lldb-unit :: Language/Highlighting/./HighlighterTests/HighlighterTest.Colons (816 of 2167)
PASS: lldb-api :: commands/expression/codegen-crash-typedefdecl-not-in_declcontext/TestCodegenCrashTypedefDeclNotInDeclContext.py (817 of 2167)
PASS: lldb-unit :: Utility/./UtilityTests/BinaryStreamTest.PutSLEB128SixBytes (818 of 2167)
PASS: lldb-api :: commands/target/dump-symtab-demangle/TestDumpSymtabDemangle.py (819 of 2167)
PASS: lldb-unit :: UnwindAssembly/x86/./UnwindAssemblyx86Tests/Testx86AssemblyInspectionEngine.TestMovRSPtoRBP (820 of 2167)
PASS: lldb-unit :: Utility/./UtilityTests/ScalarTest.GetValue (821 of 2167)
UNSUPPORTED: lldb-shell :: ScriptInterpreter/Lua/independent_state.test (822 of 2167)
PASS: lldb-shell :: Driver/TestHelp.test (823 of 2167)
PASS: lldb-unit :: UnwindAssembly/x86/./UnwindAssemblyx86Tests/Testx86AssemblyInspectionEngine.TestLEAVE (824 of 2167)
PASS: lldb-api :: functionalities/thread/concurrent_events/TestConcurrentBreakpointOneDelayBreakpointThreads.py (825 of 2167)
PASS: lldb-unit :: Utility/./UtilityTests/ArgsTest.Yaml (826 of 2167)
PASS: lldb-unit :: Core/./LLDBCoreTests/MangledTest.ResultForBlockInvocation (827 of 2167)
PASS: lldb-api :: commands/process/launch-with-shellexpand/TestLaunchWithShellExpand.py (828 of 2167)
PASS: lldb-api :: commands/process/signal/TestProcessSignal.py (829 of 2167)
UNSUPPORTED: lldb-api :: lang/c/typedef/Testtypedef.py (830 of 2167)
PASS: lldb-shell :: Commands/command-disassemble-process.yaml (831 of 2167)
PASS: lldb-api :: types/TestShortType.py (832 of 2167)
PASS: lldb-api :: iohandler/completion/TestIOHandlerCompletion.py (833 of 2167)
PASS: lldb-unit :: Utility/./UtilityTests/VASprintfTest.BufferResize (834 of 2167)
PASS: lldb-api :: functionalities/data-formatter/data-formatter-stl/libcxx/iterator/TestDataFormatterLibccIterator.py (835 of 2167)
PASS: lldb-api :: lang/cpp/covariant-return-types/TestCovariantReturnTypes.py (836 of 2167)
PASS: lldb-api :: functionalities/tail_call_frames/sbapi_support/TestTailCallFrameSBAPI.py (837 of 2167)
UNSUPPORTED: lldb-api :: tools/lldb-server/TestGdbRemote_vContThreads.py (838 of 2167)
PASS: lldb-unit :: DataFormatter/./LLDBFormatterTests/StringPrinterTests.SwiftUTF8 (839 of 2167)
PASS: lldb-shell :: Breakpoint/dummy-target.test (840 of 2167)
PASS: lldb-shell :: ExecControl/StopHook/stop-hook.test (841 of 2167)
PASS: lldb-shell :: Reproducer/TestReuseDirectory.test (842 of 2167)
PASS: lldb-unit :: Utility/./UtilityTests/StreamTest.AddressEmptyPrefix (843 of 2167)
PASS: lldb-api :: types/TestRecursiveTypes.py (844 of 2167)
PASS: lldb-api :: functionalities/data-formatter/data-formatter-synthval/TestDataFormatterSynthVal.py (845 of 2167)
PASS: lldb-unit :: Expression/./ExpressionTests/DiagnosticManagerTest.GetStringMultiline (846 of 2167)
PASS: lldb-api :: functionalities/breakpoint/address_breakpoints/TestBadAddressBreakpoints.py (847 of 2167)
PASS: lldb-shell :: Settings/TestStopCommandSourceOnError.test (848 of 2167)
PASS: lldb-unit :: Utility/./UtilityTests/StreamTeeTest.Assignment (849 of 2167)
PASS: lldb-unit :: Utility/./UtilityTests/RangeDataVector.FindEntryThatContains (850 of 2167)
PASS: lldb-api :: api/multiple-debuggers/TestMultipleDebuggers.py (851 of 2167)
UNSUPPORTED: lldb-api :: functionalities/breakpoint/hardware_breakpoints/hardware_breakpoint_on_multiple_threads/TestHWBreakMultiThread.py (852 of 2167)
UNSUPPORTED: lldb-shell :: Breakpoint/ppc64-localentry.test (853 of 2167)
PASS: lldb-api :: functionalities/breakpoint/scripted_bkpt/TestScriptedResolver.py (854 of 2167)
PASS: lldb-unit :: Utility/./UtilityTests/ArgsTest.ReplaceArgumentAtIndexLonger (855 of 2167)
UNSUPPORTED: lldb-shell :: ObjectFile/PECOFF/export-dllfunc.yaml (856 of 2167)
UNSUPPORTED: lldb-api :: functionalities/thread/concurrent_events/TestConcurrentWatchpointDelayWatchpointOneBreakpoint.py (857 of 2167)
PASS: lldb-unit :: Utility/./UtilityTests/StreamTeeTest.AppendStream (858 of 2167)
PASS: lldb-unit :: Language/Highlighting/./HighlighterTests/HighlighterTest.ClangPreserveNewLine (859 of 2167)
PASS: lldb-shell :: Unwind/trap_frame_sym_ctx.test (860 of 2167)
PASS: lldb-unit :: Utility/./UtilityTests/ArgsTest.TestSingleArgWithQuotedSpace (861 of 2167)
PASS: lldb-api :: types/TestCharType.py (862 of 2167)
PASS: lldb-unit :: Utility/./UtilityTests/UriParserTest.Minimal (863 of 2167)
PASS: lldb-unit :: ScriptInterpreter/Python/./ScriptInterpreterPythonTests/PythonDataObjectsTest.TestPythonListManipulation (864 of 2167)
UNSUPPORTED: lldb-api :: commands/watchpoints/step_over_watchpoint/TestStepOverWatchpoint.py (865 of 2167)
PASS: lldb-unit :: ObjectFile/Breakpad/./ObjectFileBreakpadTests/Record.classify (866 of 2167)
PASS: lldb-api :: functionalities/mtc/simple/TestMTCSimple.py (867 of 2167)
FAIL: lldb-api :: tools/lldb-vscode/launch/TestVSCode_launch.py (868 of 2167)
******************** TEST 'lldb-api :: tools/lldb-vscode/launch/TestVSCode_launch.py' FAILED ********************
Script:
--
/usr/local/Frameworks/Python.framework/Versions/3.7/bin/python3.7 /Users/buildslave/jenkins/workspace/lldb-cmake-matrix/llvm-project/lldb/test/API/dotest.py -S nm -u CXXFLAGS -u CFLAGS --codesign-identity lldb_codesign --arch x86_64 --build-dir /Users/buildslave/jenkins/workspace/lldb-cmake-matrix/lldb-build/lldb-test-build.noindex -s=/Users/buildslave/jenkins/workspace/lldb-cmake-matrix/test/logs -t --env TERM=vt100 --skip-category gmodules --skip-category watchpoint --arch=x86_64 --env LLVM_LIBS_DIR=/Users/buildslave/jenkins/workspace/lldb-cmake-matrix/lldb-build/./lib --arch x86_64 --build-dir /Users/buildslave/jenkins/workspace/lldb-cmake-matrix/lldb-build/lldb-test-build.noindex -s /Users/buildslave/jenkins/workspace/lldb-cmake-matrix/lldb-build/lldb-test-traces --lldb-module-cache-dir /Users/buildslave/jenkins/workspace/lldb-cmake-matrix/lldb-build/lldb-test-build.noindex/module-cache-lldb/lldb-api --clang-module-cache-dir /Users/buildslave/jenkins/workspace/lldb-cmake-matrix/lldb-build/lldb-test-build.noindex/module-cache-clang/lldb-api --executable /Users/buildslave/jenkins/workspace/lldb-cmake-matrix/lldb-build/./bin/lldb --compiler /Users/buildslave/jenkins/workspace/lldb-cmake-matrix/lldb-build/./bin/clang --dsymutil /Users/buildslave/jenkins/workspace/lldb-cmake-matrix/lldb-build/./bin/dsymutil --filecheck /Users/buildslave/jenkins/workspace/lldb-cmake-matrix/lldb-build/./bin/FileCheck --yaml2obj /Users/buildslave/jenkins/workspace/lldb-cmake-matrix/lldb-build/./bin/yaml2obj --server /Users/buildslave/jenkins/workspace/lldb-cmake-matrix/lldb-build/./bin/debugserver --lldb-libs-dir /Users/buildslave/jenkins/workspace/lldb-cmake-matrix/lldb-build/./lib /Users/buildslave/jenkins/workspace/lldb-cmake-matrix/llvm-project/lldb/test/API/tools/lldb-vscode/launch -p TestVSCode_launch.py
--
Exit Code: 1

Hide Details

Command Output (stdout): -- lldb version 12.0.99 (http://labmaster3.local/git/llvm-project.git revision 7b3515880c22c887cd5ca4825dfb060ad82d3ebc) clang revision 7b3515880c22c887cd5ca4825dfb060ad82d3ebc llvm revision 7b3515880c22c887cd5ca4825dfb060ad82d3ebc libstdcxx tests will not be run because: Don't know how to build with libstdcxx on macosx Skipping following debug info categories: ['dwo'] description: breakpoint 1.1 description: breakpoint 2.1

Hide Details

-- Command Output (stderr): --

Hide Details

Session logs for test failures/errors/unexpected successes will go into directory '/Users/buildslave/jenkins/workspace/lldb-cmake-matrix/lldb-build/lldb-test-traces' Change dir to: /Users/buildslave/jenkins/workspace/lldb-cmake-matrix/llvm-project/lldb/test/API/tools/lldb-vscode/launch runCmd: settings clear -all output:

Hide Details

runCmd: settings set symbols.enable-external-lookup false output:

Hide Details

runCmd: settings set target.inherit-tcc true output:

Hide Details

runCmd: settings set target.auto-apply-fixits false output:

Hide Details

runCmd: settings set plugin.process.gdb-remote.packet-timeout 60 output:

Hide Details

runCmd: settings set symbols.clang-modules-cache-path "/Users/buildslave/jenkins/workspace/lldb-cmake-matrix/lldb-build/lldb-test-build.noindex/module-cache-lldb/lldb-api" output:

Hide Details

runCmd: settings set use-color false output:

Hide Details

runCmd: setting set target.prefer-dynamic-value no-dynamic-values output:

Hide Details

Adding tearDown hook: def cleanup(): if disconnectAutomatically: self.vscode.request_disconnect(terminateDebuggee=True) self.vscode.terminate()

Hide Details

Hide Details

Executing tearDown hook: def cleanup(): if disconnectAutomatically: self.vscode.request_disconnect(terminateDebuggee=True) self.vscode.terminate()

Hide Details

Hide Details

PASS: LLDB (/Users/buildslave/jenkins/workspace/lldb-cmake-matrix/lldb-build/bin/clang-x86_64) :: test_args (TestVSCode_launch.TestVSCode_launch) runCmd: settings clear -all output:

Hide Details

runCmd: settings set symbols.enable-external-lookup false output:

Hide Details

runCmd: settings set target.inherit-tcc true output:

Hide Details

runCmd: settings set target.auto-apply-fixits false output:

Hide Details

runCmd: settings set plugin.process.gdb-remote.packet-timeout 60 output:

Hide Details

runCmd: settings set symbols.clang-modules-cache-path "/Users/buildslave/jenkins/workspace/lldb-cmake-matrix/lldb-build/lldb-test-build.noindex/module-cache-lldb/lldb-api" output:

Hide Details

runCmd: settings set use-color false output:

Hide Details

runCmd: setting set target.prefer-dynamic-value no-dynamic-values output:

Hide Details

Adding tearDown hook: def cleanup(): if disconnectAutomatically: self.vscode.request_disconnect(terminateDebuggee=True) self.vscode.terminate()

Hide Details

Hide Details

Executing tearDown hook: def cleanup(): if disconnectAutomatically: self.vscode.request_disconnect(terminateDebuggee=True) self.vscode.terminate()

Hide Details

Hide Details

PASS: LLDB (/Users/buildslave/jenkins/workspace/lldb-cmake-matrix/lldb-build/bin/clang-x86_64) :: test_commands (TestVSCode_launch.TestVSCode_launch) runCmd: settings clear -all output:

Hide Details

runCmd: settings set symbols.enable-external-lookup false output:

Hide Details

runCmd: settings set target.inherit-tcc true output:

Hide Details

runCmd: settings set target.auto-apply-fixits false output:

Hide Details

runCmd: settings set plugin.process.gdb-remote.packet-timeout 60 output:

Hide Details

runCmd: settings set symbols.clang-modules-cache-path "/Users/buildslave/jenkins/workspace/lldb-cmake-matrix/lldb-build/lldb-test-build.noindex/module-cache-lldb/lldb-api" output:

Hide Details

runCmd: settings set use-color false output:

Hide Details

runCmd: setting set target.prefer-dynamic-value no-dynamic-values output:

Hide Details

Adding tearDown hook: def cleanup(): if disconnectAutomatically: self.vscode.request_disconnect(terminateDebuggee=True) self.vscode.terminate()

Hide Details

Hide Details

Executing tearDown hook: def cleanup(): if disconnectAutomatically: self.vscode.request_disconnect(terminateDebuggee=True) self.vscode.terminate()

Hide Details

Hide Details

PASS: LLDB (/Users/buildslave/jenkins/workspace/lldb-cmake-matrix/lldb-build/bin/clang-x86_64) :: test_cwd (TestVSCode_launch.TestVSCode_launch) runCmd: settings clear -all output:

Hide Details

runCmd: settings set symbols.enable-external-lookup false output:

Hide Details

runCmd: settings set target.inherit-tcc true output:

Hide Details

runCmd: settings set target.auto-apply-fixits false output:

Hide Details

runCmd: settings set plugin.process.gdb-remote.packet-timeout 60 output:

Hide Details

runCmd: settings set symbols.clang-modules-cache-path "/Users/buildslave/jenkins/workspace/lldb-cmake-matrix/lldb-build/lldb-test-build.noindex/module-cache-lldb/lldb-api" output:

Hide Details

runCmd: settings set use-color false output:

Hide Details

runCmd: setting set target.prefer-dynamic-value no-dynamic-values output:

Hide Details

Adding tearDown hook: def cleanup(): if disconnectAutomatically: self.vscode.request_disconnect(terminateDebuggee=True) self.vscode.terminate()

Hide Details

Hide Details

Executing tearDown hook: def cleanup(): if disconnectAutomatically: self.vscode.request_disconnect(terminateDebuggee=True) self.vscode.terminate()

Hide Details

Hide Details

PASS: LLDB (/Users/buildslave/jenkins/workspace/lldb-cmake-matrix/lldb-build/bin/clang-x86_64) :: test_debuggerRoot (TestVSCode_launch.TestVSCode_launch) UNSUPPORTED: LLDB (/Users/buildslave/jenkins/workspace/lldb-cmake-matrix/lldb-build/bin/clang-x86_64) :: test_default (TestVSCode_launch.TestVSCode_launch) (skip on macosx, darwin, ios, tvos, watchos, bridgeos) runCmd: settings clear -all output:

Hide Details

runCmd: settings set symbols.enable-external-lookup false output:

Hide Details

runCmd: settings set target.inherit-tcc true output:

Hide Details

runCmd: settings set target.auto-apply-fixits false output:

Hide Details

runCmd: settings set plugin.process.gdb-remote.packet-timeout 60 output:

Hide Details

runCmd: settings set symbols.clang-modules-cache-path "/Users/buildslave/jenkins/workspace/lldb-cmake-matrix/lldb-build/lldb-test-build.noindex/module-cache-lldb/lldb-api" output:

Hide Details

runCmd: settings set use-color false output:

Hide Details

runCmd: setting set target.prefer-dynamic-value no-dynamic-values output:

Hide Details

Adding tearDown hook: def cleanup(): if disconnectAutomatically: self.vscode.request_disconnect(terminateDebuggee=True) self.vscode.terminate()

Hide Details

Hide Details

FAIL: LLDB (/Users/buildslave/jenkins/workspace/lldb-cmake-matrix/lldb-build/bin/clang-x86_64) :: test_disableSTDIO (TestVSCode_launch.TestVSCode_launch) Executing tearDown hook: def cleanup(): if disconnectAutomatically: self.vscode.request_disconnect(terminateDebuggee=True) self.vscode.terminate()

Hide Details

Hide Details

runCmd: settings clear -all output:

Hide Details

runCmd: settings set symbols.enable-external-lookup false output:

Hide Details

runCmd: settings set target.inherit-tcc true output:

Hide Details

runCmd: settings set target.auto-apply-fixits false output:

Hide Details

runCmd: settings set plugin.process.gdb-remote.packet-timeout 60 output:

Hide Details

runCmd: settings set symbols.clang-modules-cache-path "/Users/buildslave/jenkins/workspace/lldb-cmake-matrix/lldb-build/lldb-test-build.noindex/module-cache-lldb/lldb-api" output:

Hide Details

runCmd: settings set use-color false output:

Hide Details

runCmd: setting set target.prefer-dynamic-value no-dynamic-values output:

Hide Details

Adding tearDown hook: def cleanup(): if disconnectAutomatically: self.vscode.request_disconnect(terminateDebuggee=True) self.vscode.terminate()

Hide Details

Hide Details

Executing tearDown hook: def cleanup(): if disconnectAutomatically: self.vscode.request_disconnect(terminateDebuggee=True) self.vscode.terminate()

Hide Details

Hide Details

PASS: LLDB (/Users/buildslave/jenkins/workspace/lldb-cmake-matrix/lldb-build/bin/clang-x86_64) :: test_environment (TestVSCode_launch.TestVSCode_launch) runCmd: settings clear -all output:

Hide Details

runCmd: settings set symbols.enable-external-lookup false output:

Hide Details

runCmd: settings set target.inherit-tcc true output:

Hide Details

runCmd: settings set target.auto-apply-fixits false output:

Hide Details

runCmd: settings set plugin.process.gdb-remote.packet-timeout 60 output:

Hide Details

runCmd: settings set symbols.clang-modules-cache-path "/Users/buildslave/jenkins/workspace/lldb-cmake-matrix/lldb-build/lldb-test-build.noindex/module-cache-lldb/lldb-api" output:

Hide Details

runCmd: settings set use-color false output:

Hide Details

runCmd: setting set target.prefer-dynamic-value no-dynamic-values output:

Hide Details

Adding tearDown hook: def cleanup(): if disconnectAutomatically: self.vscode.request_disconnect(terminateDebuggee=True) self.vscode.terminate()

Hide Details

Hide Details

Executing tearDown hook: def cleanup(): if disconnectAutomatically: self.vscode.request_disconnect(terminateDebuggee=True) self.vscode.terminate()

Hide Details

Hide Details

PASS: LLDB (/Users/buildslave/jenkins/workspace/lldb-cmake-matrix/lldb-build/bin/clang-x86_64) :: test_extra_launch_commands (TestVSCode_launch.TestVSCode_launch) runCmd: settings clear -all output:

Hide Details

runCmd: settings set symbols.enable-external-lookup false output:

Hide Details

runCmd: settings set target.inherit-tcc true output:

Hide Details

runCmd: settings set target.auto-apply-fixits false output:

Hide Details

runCmd: settings set plugin.process.gdb-remote.packet-timeout 60 output:

Hide Details

runCmd: settings set symbols.clang-modules-cache-path "/Users/buildslave/jenkins/workspace/lldb-cmake-matrix/lldb-build/lldb-test-build.noindex/module-cache-lldb/lldb-api" output:

Hide Details

runCmd: settings set use-color false output:

Hide Details

runCmd: setting set target.prefer-dynamic-value no-dynamic-values output:

Hide Details

Adding tearDown hook: def cleanup(): if disconnectAutomatically: self.vscode.request_disconnect(terminateDebuggee=True) self.vscode.terminate()

Hide Details

Hide Details

Executing tearDown hook: def cleanup(): if disconnectAutomatically: self.vscode.request_disconnect(terminateDebuggee=True) self.vscode.terminate()

Hide Details

Hide Details

PASS: LLDB (/Users/buildslave/jenkins/workspace/lldb-cmake-matrix/lldb-build/bin/clang-x86_64) :: test_shellExpandArguments_disabled (TestVSCode_launch.TestVSCode_launch) runCmd: settings clear -all output:

Hide Details

runCmd: settings set symbols.enable-external-lookup false output:

Hide Details

runCmd: settings set target.inherit-tcc true output:

Hide Details

runCmd: settings set target.auto-apply-fixits false output:

Hide Details

runCmd: settings set plugin.process.gdb-remote.packet-timeout 60 output:

Hide Details

runCmd: settings set symbols.clang-modules-cache-path "/Users/buildslave/jenkins/workspace/lldb-cmake-matrix/lldb-build/lldb-test-build.noindex/module-cache-lldb/lldb-api" output:

Hide Details

runCmd: settings set use-color false output:

Hide Details

runCmd: setting set target.prefer-dynamic-value no-dynamic-values output:

Hide Details

Adding tearDown hook: def cleanup(): if disconnectAutomatically: self.vscode.request_disconnect(terminateDebuggee=True) self.vscode.terminate()

Hide Details

Hide Details

Executing tearDown hook: def cleanup(): if disconnectAutomatically: self.vscode.request_disconnect(terminateDebuggee=True) self.vscode.terminate()

Hide Details

Hide Details

PASS: LLDB (/Users/buildslave/jenkins/workspace/lldb-cmake-matrix/lldb-build/bin/clang-x86_64) :: test_shellExpandArguments_enabled (TestVSCode_launch.TestVSCode_launch) runCmd: settings clear -all output:

Hide Details

runCmd: settings set symbols.enable-external-lookup false output:

Hide Details

runCmd: settings set target.inherit-tcc true output:

Hide Details

runCmd: settings set target.auto-apply-fixits false output:

Hide Details

runCmd: settings set plugin.process.gdb-remote.packet-timeout 60 output:

Hide Details

runCmd: settings set symbols.clang-modules-cache-path "/Users/buildslave/jenkins/workspace/lldb-cmake-matrix/lldb-build/lldb-test-build.noindex/module-cache-lldb/lldb-api" output:

Hide Details

runCmd: settings set use-color false output:

Hide Details

runCmd: setting set target.prefer-dynamic-value no-dynamic-values output:

Hide Details

Adding tearDown hook: def cleanup(): if disconnectAutomatically: self.vscode.request_disconnect(terminateDebuggee=True) self.vscode.terminate()

Hide Details

Hide Details

Executing tearDown hook: def cleanup(): if disconnectAutomatically: self.vscode.request_disconnect(terminateDebuggee=True) self.vscode.terminate()

Hide Details

Hide Details

PASS: LLDB (/Users/buildslave/jenkins/workspace/lldb-cmake-matrix/lldb-build/bin/clang-x86_64) :: test_sourcePath (TestVSCode_launch.TestVSCode_launch) runCmd: settings clear -all output:

Hide Details

runCmd: settings set symbols.enable-external-lookup false output:

Hide Details

runCmd: settings set target.inherit-tcc true output:

Hide Details

runCmd: settings set target.auto-apply-fixits false output:

Hide Details

runCmd: settings set plugin.process.gdb-remote.packet-timeout 60 output:

Hide Details

runCmd: settings set symbols.clang-modules-cache-path "/Users/buildslave/jenkins/workspace/lldb-cmake-matrix/lldb-build/lldb-test-build.noindex/module-cache-lldb/lldb-api" output:

Hide Details

runCmd: settings set use-color false output:

Hide Details

runCmd: setting set target.prefer-dynamic-value no-dynamic-values output:

Hide Details

Adding tearDown hook: def cleanup(): if disconnectAutomatically: self.vscode.request_disconnect(terminateDebuggee=True) self.vscode.terminate()

Hide Details

Hide Details

Executing tearDown hook: def cleanup(): if disconnectAutomatically: self.vscode.request_disconnect(terminateDebuggee=True) self.vscode.terminate()

Hide Details

Hide Details

PASS: LLDB (/Users/buildslave/jenkins/workspace/lldb-cmake-matrix/lldb-build/bin/clang-x86_64) :: test_stopOnEntry (TestVSCode_launch.TestVSCode_launch) UNSUPPORTED: LLDB (/Users/buildslave/jenkins/workspace/lldb-cmake-matrix/lldb-build/bin/clang-x86_64) :: test_terminate_commands (TestVSCode_launch.TestVSCode_launch) (skip on macosx, darwin, ios, tvos, watchos, bridgeos) runCmd: settings clear -all output:

Hide Details

runCmd: settings set symbols.enable-external-lookup false output:

Hide Details

runCmd: settings set target.inherit-tcc true output:

Hide Details

runCmd: settings set target.auto-apply-fixits false output:

Hide Details

runCmd: settings set plugin.process.gdb-remote.packet-timeout 60 output:

Hide Details

runCmd: settings set symbols.clang-modules-cache-path "/Users/buildslave/jenkins/workspace/lldb-cmake-matrix/lldb-build/lldb-test-build.noindex/module-cache-lldb/lldb-api" output:

Hide Details

runCmd: settings set use-color false output:

Hide Details

runCmd: setting set target.prefer-dynamic-value no-dynamic-values output:

Hide Details

PASS: LLDB (/Users/buildslave/jenkins/workspace/lldb-cmake-matrix/lldb-build/bin/clang-x86_64) :: test_termination (TestVSCode_launch.TestVSCode_launch) Restore dir to: /Users/buildslave/jenkins/workspace/lldb-cmake-matrix/lldb-build/tools/lldb/test ====================================================================== FAIL: test_disableSTDIO (TestVSCode_launch.TestVSCode_launch) ---------------------------------------------------------------------- Traceback (most recent call last): File "/Users/buildslave/jenkins/workspace/lldb-cmake-matrix/llvm-project/lldb/test/API/tools/lldb-vscode/launch/TestVSCode_launch.py", line 175, in test_disableSTDIO disableSTDIO=True) File "/Users/buildslave/jenkins/workspace/lldb-cmake-matrix/llvm-project/lldb/packages/Python/lldbsuite/test/tools/lldb-vscode/lldbvscode_testcase.py", line 346, in build_and_launch terminateCommands, sourcePath, debuggerRoot, runInTerminal=runInTerminal) File "/Users/buildslave/jenkins/workspace/lldb-cmake-matrix/llvm-project/lldb/packages/Python/lldbsuite/test/tools/lldb-vscode/lldbvscode_testcase.py", line 323, in launch 'launch failed (%s)' % (response['message'])) AssertionError: False is not True : launch failed (process exited with status -1 (tried to attach to process already being debugged)) Config=x86_64-/Users/buildslave/jenkins/workspace/lldb-cmake-matrix/lldb-build/bin/clang ---------------------------------------------------------------------- Ran 14 tests in 16.688s

Hide Details

RESULT: FAILED (11 passes, 1 failures, 0 errors, 2 skipped, 0 expected failures, 0 unexpected successes)

Hide Details

--

Hide Details

******************** PASS: lldb-unit :: Expression/./ExpressionTests/DiagnosticManagerTest.AppendMessageNoDiag (869 of 2167) PASS: lldb-api :: lang/c/enum_types/TestEnumTypes.py (870 of 2167) UNSUPPORTED: lldb-api :: functionalities/thread/break_after_join/TestBreakAfterJoin.py (871 of 2167) PASS: lldb-unit :: Symbol/./SymbolTests/TestTypeSystemClang.TestUnifyAccessSpecifiers (872 of 2167) PASS: lldb-api :: commands/expression/completion-in-lambda-and-unnamed-class/TestCompletionInLambdaAndUnnamedClass.py (873 of 2167) PASS: lldb-shell :: Reproducer/TestPythonImport.test (874 of 2167) UNSUPPORTED: lldb-shell :: SymbolFile/PDB/udt-layout.test (875 of 2167) PASS: lldb-api :: commands/frame/diagnose/complicated-expression/TestComplicatedExpression.py (876 of 2167) PASS: lldb-unit :: Host/./HostTests/NativeProcessProtocolTest.ReadMemoryWithoutTrap (877 of 2167) PASS: lldb-unit :: Utility/./UtilityTests/Flags.GetBitSize (878 of 2167) UNSUPPORTED: lldb-api :: lang/objc/modules-update/TestClangModulesUpdate.py (879 of 2167) UNSUPPORTED: lldb-shell :: SymbolFile/DWARF/dir-separator-posix.s (880 of 2167) PASS: lldb-unit :: Language/Highlighting/./HighlighterTests/HighlighterTest.ClangCursorOutOfBounds (881 of 2167) UNSUPPORTED: lldb-api :: functionalities/thread/concurrent_events/TestConcurrentTwoWatchpointsOneBreakpoint.py (882 of 2167) PASS: lldb-api :: lang/cpp/this_class_type_mixing/TestThisClassTypeMixing.py (883 of 2167) PASS: lldb-unit :: Process/minidump/./LLDBMinidumpTests/MinidumpParserTest.FindMemoryRangeWithFullMemoryMinidump (884 of 2167) PASS: lldb-unit :: Utility/./UtilityTests/UriParserTest.PortOverflow (885 of 2167) PASS: lldb-unit :: Utility/./UtilityTests/SubsystemRAIITest.SubsystemWithErrorSuccess (886 of 2167) PASS: lldb-api :: lang/cpp/scope/TestCppScope.py (887 of 2167) PASS: lldb-unit :: Utility/./UtilityTests/StreamTest.ChangingByteOrder (888 of 2167) UNSUPPORTED: lldb-api :: commands/watchpoints/hello_watchlocation/TestWatchLocation.py (889 of 2167) PASS: lldb-unit :: Process/minidump/./LLDBMinidumpTests/MinidumpParserTest.MinidumpDuplicateModuleMappedSecond (890 of 2167) PASS: lldb-api :: functionalities/step_scripted/TestStepScripted.py (891 of 2167) PASS: lldb-unit :: ScriptInterpreter/Python/./ScriptInterpreterPythonTests/PythonDataObjectsTest.TestPythonIntegerToStr (892 of 2167) PASS: lldb-unit :: SymbolFile/DWARF/./SymbolFileDWARFTests/SymbolFileDWARFTests.TestAbbrevOrder1Start1 (893 of 2167) PASS: lldb-unit :: Utility/./UtilityTests/CompletionRequest.TryCompleteCurrentArgBad (894 of 2167) PASS: lldb-unit :: Utility/./UtilityTests/XcodeSDKTest.ParseTest (895 of 2167) PASS: lldb-unit :: ObjectFile/Breakpad/./ObjectFileBreakpadTests/ModuleRecord.parse (896 of 2167) PASS: lldb-unit :: Utility/./UtilityTests/DataExtractorTest.GetDoubleUnaligned (897 of 2167) PASS: lldb-shell :: SymbolFile/DWARF/DW_AT_location-DW_AT_const_value.s (898 of 2167) PASS: lldb-api :: functionalities/data-formatter/builtin-formats/TestBuiltinFormats.py (899 of 2167) PASS: lldb-unit :: Utility/./UtilityTests/OptionsWithRawTest.QuotedSuffix (900 of 2167) UNSUPPORTED: lldb-api :: functionalities/darwin_log/source/info/TestDarwinLogSourceInfo.py (901 of 2167) PASS: lldb-api :: lang/c/step-target/TestStepTarget.py (902 of 2167) PASS: lldb-api :: functionalities/thread/exit_during_step/TestExitDuringStep.py (903 of 2167) PASS: lldb-api :: commands/source/info/TestSourceInfo.py (904 of 2167) UNSUPPORTED: lldb-api :: commands/register/register/intel_xtended_registers/mpx_bound_violation/TestBoundViolation.py (905 of 2167) PASS: lldb-unit :: Utility/./UtilityTests/ScalarTest.LongLongAssigmentOperator (906 of 2167) UNSUPPORTED: lldb-api :: benchmarks/stepping/TestSteppingSpeed.py (907 of 2167) PASS: lldb-unit :: Target/./TargetTests/PathMappingListTest.AbsoluteTests (908 of 2167) PASS: lldb-unit :: Symbol/./SymbolTests/TestTypeSystemClang.TestOwningModule (909 of 2167) UNSUPPORTED: lldb-shell :: SymbolFile/DWARF/find-basic-variable.cpp (910 of 2167) UNSUPPORTED: lldb-api :: functionalities/darwin_log/filter/exact_match/category/TestDarwinLogFilterMatchCategory.py (911 of 2167) PASS: lldb-shell :: SymbolFile/DWARF/DW_TAG_basic_type_DW_ATE_UTF_nonC.ll (912 of 2167) PASS: lldb-shell :: ObjectFile/ELF/PT_LOAD-overlap-section.yaml (913 of 2167) PASS: lldb-unit :: Utility/./UtilityTests/StringListTest.GetMaxStringLengthDecreasingSize (914 of 2167) PASS: lldb-unit :: Expression/./ExpressionTests/DiagnosticManagerTest.PutString (915 of 2167) PASS: lldb-unit :: UnwindAssembly/x86/./UnwindAssemblyx86Tests/Testx86AssemblyInspectionEngine.TestPushR14 (916 of 2167) UNSUPPORTED: lldb-shell :: ScriptInterpreter/Lua/convenience_variables.test (917 of 2167) UNSUPPORTED: lldb-api :: functionalities/data-formatter/data-formatter-stl/libstdcpp/smart_ptr/TestDataFormatterStdSmartPtr.py (918 of 2167) PASS: lldb-unit :: Core/./LLDBCoreTests/RichManglingContextTest.SwitchProvider (919 of 2167) PASS: lldb-unit :: Utility/./UtilityTests/ArgsTest.TestTrailingBackslash (920 of 2167) PASS: lldb-unit :: Utility/./UtilityTests/OptionsWithRawTest.EmptyInput (921 of 2167) PASS: lldb-api :: functionalities/postmortem/netbsd-core/TestNetBSDCore.py (922 of 2167) PASS: lldb-unit :: Language/Highlighting/./HighlighterTests/HighlighterTest.ClangUnterminatedString (923 of 2167) PASS: lldb-unit :: Utility/./UtilityTests/Flags.AllSet (924 of 2167) PASS: lldb-unit :: Utility/./UtilityTests/VMRange.ContainsAddr (925 of 2167) PASS: lldb-api :: lang/objc/self/TestObjCSelf.py (926 of 2167) PASS: lldb-api :: lang/objc/modules-auto-import/TestModulesAutoImport.py (927 of 2167) PASS: lldb-api :: functionalities/postmortem/elf-core/thread_crash/TestLinuxCoreThreads.py (928 of 2167) PASS: lldb-unit :: Utility/./UtilityTests/StreamTest.PutULEB128 (929 of 2167) PASS: lldb-api :: lang/c/function_types/TestFunctionTypes.py (930 of 2167) PASS: lldb-api :: lang/cpp/operators/TestCppOperators.py (931 of 2167) UNSUPPORTED: lldb-shell :: SymbolFile/NativePDB/break-by-line.cpp (932 of 2167) PASS: lldb-unit :: Host/./HostTests/SocketTests/SocketTest.TCPListen0ConnectAccept/ipv4 (933 of 2167) PASS: lldb-shell :: ObjectFile/ELF/base-address.yaml (934 of 2167) PASS: lldb-api :: python_api/frame/inlines/TestInlinedFrame.py (935 of 2167) PASS: lldb-unit :: Core/./LLDBCoreTests/MangledTest.NameIndexes_FindFunctionSymbols (936 of 2167) PASS: lldb-unit :: Utility/./UtilityTests/StreamTest.AddressNoSuffix (937 of 2167) PASS: lldb-shell :: SymbolFile/Breakpad/symtab-macho.test (938 of 2167) UNSUPPORTED: lldb-shell :: ObjectFile/ELF/minidebuginfo-no-lzma.yaml (939 of 2167) PASS: lldb-api :: commands/expression/scoped_enums/TestScopedEnumType.py (940 of 2167) PASS: lldb-api :: python_api/objc_type/TestObjCType.py (941 of 2167) PASS: lldb-api :: commands/expression/issue_11588/Test11588.py (942 of 2167) PASS: lldb-unit :: Utility/./UtilityTests/FileSpecTest.RemoveLastPathComponent (943 of 2167) PASS: lldb-api :: lang/cpp/type_lookup/TestCppTypeLookup.py (944 of 2167) PASS: lldb-unit :: Utility/./UtilityTests/LogTest.Register (945 of 2167) PASS: lldb-api :: functionalities/breakpoint/comp_dir_symlink/TestCompDirSymLink.py (946 of 2167) PASS: lldb-shell :: Settings/TestSettingsWrite.test (947 of 2167) PASS: lldb-api :: macosx/lc-note/firmware-corefile/TestFirmwareCorefiles.py (948 of 2167) PASS: lldb-unit :: Utility/./UtilityTests/ArgsTest.TestSingleArg (949 of 2167) PASS: lldb-api :: functionalities/data-formatter/data-formatter-stl/libcxx/list/loop/TestDataFormatterLibcxxListLoop.py (950 of 2167) PASS: lldb-shell :: ObjectFile/Breakpad/sections-trailing-func.test (951 of 2167) PASS: lldb-unit :: Symbol/./SymbolTests/TestTypeSystemClang.TestGetTypeClassNested (952 of 2167) PASS: lldb-unit :: Symbol/./SymbolTests/TestClangASTImporter.MetadataPropagationAfterCopying (953 of 2167) PASS: lldb-unit :: ScriptInterpreter/Python/./ScriptInterpreterPythonTests/PythonDataObjectsTest.TestPythonStringToStructuredString (954 of 2167) PASS: lldb-shell :: ObjectFile/Breakpad/sections.test (955 of 2167) PASS: lldb-unit :: Utility/./UtilityTests/ListenerTest.GetEventImmediate (956 of 2167) UNSUPPORTED: lldb-shell :: Breakpoint/case-insensitive.test (957 of 2167) PASS: lldb-unit :: Utility/./UtilityTests/StreamTest.Indent (958 of 2167) PASS: lldb-shell :: Breakpoint/implicit_const_form_support.test (959 of 2167) PASS: lldb-api :: functionalities/data-formatter/data-formatter-smart-array/TestDataFormatterSmartArray.py (960 of 2167) PASS: lldb-unit :: Utility/./UtilityTests/StringLexerTest.NextIf (961 of 2167) PASS: lldb-unit :: Utility/./UtilityTests/ScalarTest.ComparisonFloat (962 of 2167) PASS: lldb-shell :: ObjectFile/PECOFF/section-types.yaml (963 of 2167) PASS: lldb-api :: tools/lldb-server/TestLldbGdbServer.py (964 of 2167) UNSUPPORTED: lldb-api :: functionalities/darwin_log/filter/exact_match/message/TestDarwinLogFilterMatchMessage.py (965 of 2167) UNSUPPORTED: lldb-shell :: SymbolFile/PDB/typedefs.test (966 of 2167) PASS: lldb-unit :: Symbol/./SymbolTests/LineEntryTest.GetSameLineContiguousAddressRangeOneInline (967 of 2167) UNSUPPORTED: lldb-shell :: SymbolFile/PDB/function-nested-block.test (968 of 2167) PASS: lldb-api :: iohandler/autosuggestion/TestAutosuggestion.py (969 of 2167) PASS: lldb-shell :: SymbolFile/DWARF/DW_AT_declaration-with-children.s (970 of 2167) PASS: lldb-shell :: ObjectFile/ELF/PT_LOAD-empty.yaml (971 of 2167) PASS: lldb-api :: functionalities/testid/TestTestId.py (972 of 2167) UNSUPPORTED: lldb-shell :: SymbolFile/PDB/variables.test (973 of 2167) PASS: lldb-unit :: Utility/./UtilityTests/ArgsTest.EscapeLLDBCommandArgument (974 of 2167) PASS: lldb-api :: lang/cpp/unique-types/TestUniqueTypes.py (975 of 2167) UNSUPPORTED: lldb-shell :: SymbolFile/PDB/vbases.test (976 of 2167) PASS: lldb-unit :: Utility/./UtilityTests/SerializationRountripTest.SerializeDeserializePodReferences (977 of 2167) PASS: lldb-unit :: Host/./HostTests/NativeProcessProtocolTest.SetBreakpoint (978 of 2167) UNSUPPORTED: lldb-api :: commands/target/auto-install-main-executable/TestAutoInstallMainExecutable.py (979 of 2167) UNSUPPORTED: lldb-api :: lang/cpp/static_members/TestCPPStaticMembers.py (980 of 2167) PASS: lldb-unit :: Utility/./UtilityTests/XcodeSDKTest.SDKSupportsSwift (981 of 2167) UNSUPPORTED: lldb-shell :: SymbolFile/PDB/class-layout.test (982 of 2167) PASS: lldb-api :: functionalities/postmortem/wow64_minidump/TestWow64MiniDump.py (983 of 2167) PASS: lldb-unit :: Host/./HostTests/SocketAddressTest.Set (984 of 2167) PASS: lldb-unit :: Utility/./UtilityTests/ProcessInstanceInfo.DumpTable_invalidUID (985 of 2167) PASS: lldb-api :: commands/session/history/TestSessionHistory.py (986 of 2167) PASS: lldb-unit :: Utility/./UtilityTests/VMRange.ContainsRange (987 of 2167) UNSUPPORTED: lldb-api :: benchmarks/expression/TestExpressionCmd.py (988 of 2167) PASS: lldb-api :: functionalities/thread/ignore_suspended/TestIgnoreSuspendedThread.py (989 of 2167) PASS: lldb-unit :: Utility/./UtilityTests/BinaryStreamTest.PutULEB128FiveBytes (990 of 2167) PASS: lldb-shell :: SymbolFile/DWARF/DW_AT_low_pc-addrx.s (991 of 2167) PASS: lldb-unit :: Platform/./LLDBPlatformTests/PlatformDarwinTest.FindComponentInPath (992 of 2167) PASS: lldb-unit :: UnwindAssembly/x86/./UnwindAssemblyx86Tests/Testx86AssemblyInspectionEngine.TestPushR13 (993 of 2167) UNSUPPORTED: lldb-shell :: ObjectFile/ELF/minidebuginfo-set-and-hit-breakpoint.test (994 of 2167) PASS: lldb-unit :: Utility/./UtilityTests/RangeTest.DoesIntersect (995 of 2167) PASS: lldb-shell :: ObjectFile/ELF/PT_LOAD-overlap-PT_TLS.yaml (996 of 2167) PASS: lldb-unit :: Utility/./UtilityTests/ArchSpecTest.TripleComponentsWereSpecified (997 of 2167) PASS: lldb-api :: lang/cpp/exceptions/TestCPPExceptionBreakpoints.py (998 of 2167) PASS: lldb-api :: lang/c/tls_globals/TestTlsGlobals.py (999 of 2167) PASS: lldb-unit :: Symbol/./SymbolTests/Type.GetTypeScopeAndBasename (1000 of 2167) PASS: lldb-unit :: Utility/./UtilityTests/ScalarTest.Division (1001 of 2167) PASS: lldb-api :: functionalities/inferior-assert/TestInferiorAssert.py (1002 of 2167) PASS: lldb-api :: commands/gui/viewlarge/TestGuiViewLarge.py (1003 of 2167) PASS: lldb-unit :: Host/./HostTests/SocketTests/SocketTest.DomainListenConnectAccept/ipv4 (1004 of 2167) UNSUPPORTED: lldb-shell :: Register/x86-zmm-write.test (1005 of 2167) UNSUPPORTED: lldb-shell :: SymbolFile/NativePDB/disassembly.cpp (1006 of 2167) PASS: lldb-unit :: Utility/./UtilityTests/PassiveReplayTest.InstrumentedBar (1007 of 2167) PASS: lldb-unit :: Utility/./UtilityTests/StringListTest.CopyList (1008 of 2167) PASS: lldb-shell :: Driver/TestNoUseColor.test (1009 of 2167) PASS: lldb-unit :: Utility/./UtilityTests/BinaryStreamTest.PutSLEB128FourBytes (1010 of 2167) PASS: lldb-unit :: Utility/./UtilityTests/AnsiTerminal.Incomplete (1011 of 2167) UNSUPPORTED: lldb-api :: functionalities/tty/TestTerminal.py (1012 of 2167) PASS: lldb-api :: lang/cpp/function-qualifiers/TestCppFunctionQualifiers.py (1013 of 2167) PASS: lldb-api :: lang/cpp/dynamic-value/TestDynamicValue.py (1014 of 2167) PASS: lldb-shell :: Commands/command-breakpoint-col.test (1015 of 2167) PASS: lldb-unit :: SymbolFile/NativePDB/./SymbolFileNativePDBTests/PDBFPOProgramToDWARFExpressionTests.InvalidOpUnary (1016 of 2167) PASS: lldb-api :: lang/c/find_struct_type/TestFindStructTypes.py (1017 of 2167) UNSUPPORTED: lldb-shell :: SymbolFile/NativePDB/ast-functions-msvc.cpp (1018 of 2167) PASS: lldb-api :: lang/objc/foundation/TestObjCMethodsString.py (1019 of 2167) PASS: lldb-api :: lang/cpp/template/TestTemplateArgs.py (1020 of 2167) PASS: lldb-unit :: DataFormatter/./LLDBFormatterTests/StringPrinterTests.CxxUTF8 (1021 of 2167) PASS: lldb-unit :: Utility/./UtilityTests/FileSpecTest.EqualDotsPosix (1022 of 2167) PASS: lldb-api :: functionalities/postmortem/minidump-new/TestMiniDumpUUID.py (1023 of 2167) PASS: lldb-unit :: Utility/./UtilityTests/StreamTest.AddressPrefix (1024 of 2167) PASS: lldb-shell :: Register/x86-multithread-read.test (1025 of 2167) PASS: lldb-unit :: debugserver/./debugserverTests/RNBSocket.LoopBackConnectIPv4 (1026 of 2167) UNSUPPORTED: lldb-api :: commands/watchpoints/watchpoint_size/TestWatchpointSizes.py (1027 of 2167) PASS: lldb-api :: commands/expression/import-std-module/vector-bool/TestVectorBoolFromStdModule.py (1028 of 2167) PASS: lldb-api :: functionalities/plugins/python_os_plugin/TestPythonOSPlugin.py (1029 of 2167) UNSUPPORTED: lldb-api :: tools/lldb-server/TestGdbRemoteAuxvSupport.py (1030 of 2167) PASS: lldb-api :: functionalities/data-formatter/ptr_ref_typedef/TestPtrRef2Typedef.py (1031 of 2167) UNSUPPORTED: lldb-shell :: SymbolFile/DWARF/debug-names-compressed.cpp (1032 of 2167) PASS: lldb-unit :: Interpreter/./InterpreterTests/OptionArgParserTest.toScriptLanguage (1033 of 2167) PASS: lldb-api :: functionalities/set-data/TestSetData.py (1034 of 2167) PASS: lldb-shell :: Driver/TestSingleQuote.test (1035 of 2167) UNSUPPORTED: lldb-api :: commands/register/register/intel_xtended_registers/mpx_offset_intersection/TestMPXOffsetIntersection.py (1036 of 2167) PASS: lldb-shell :: Settings/TestLineMarkerColor.test (1037 of 2167) UNSUPPORTED: lldb-api :: commands/watchpoints/watchpoint_on_vectors/TestValueOfVectorVariable.py (1038 of 2167) PASS: lldb-api :: commands/gui/basic/TestGuiBasic.py (1039 of 2167) PASS: lldb-unit :: UnwindAssembly/x86/./UnwindAssemblyx86Tests/Testx86AssemblyInspectionEngine.TestPopEDI (1040 of 2167) PASS: lldb-unit :: Process/minidump/./LLDBMinidumpTests/MinidumpParserTest.GetPidWow64 (1041 of 2167) UNSUPPORTED: lldb-shell :: SymbolFile/target-symbols-add-unwind.test (1042 of 2167) PASS: lldb-api :: python_api/interpreter/TestCommandInterpreterAPI.py (1043 of 2167) UNSUPPORTED: lldb-api :: tools/lldb-server/libraries-svr4/TestGdbRemoteLibrariesSvr4Support.py (1044 of 2167) PASS: lldb-api :: python_api/lldbutil/iter/TestLLDBIterator.py (1045 of 2167) PASS: lldb-api :: commands/expression/ir-interpreter-phi-nodes/TestIRInterpreterPHINodes.py (1046 of 2167) PASS: lldb-unit :: Core/./LLDBCoreTests/StreamCallbackTest.Callback (1047 of 2167) PASS: lldb-unit :: Symbol/./SymbolTests/TestClangASTImporter.CopyTypeTagDecl (1048 of 2167) PASS: lldb-unit :: Utility/./UtilityTests/StringExtractorTest.GetHexBytesAvail_Partial (1049 of 2167) PASS: lldb-unit :: Utility/./UtilityTests/CompletionRequest.TestCompletionOwnership (1050 of 2167) PASS: lldb-api :: macosx/indirect_symbol/TestIndirectSymbols.py (1051 of 2167) PASS: lldb-unit :: Utility/./UtilityTests/StringListTest.JoinSingle (1052 of 2167) PASS: lldb-unit :: Expression/./ExpressionTests/DiagnosticManagerTest.GetStringPreserveOrder (1053 of 2167) PASS: lldb-api :: functionalities/memory/find/TestMemoryFind.py (1054 of 2167) PASS: lldb-api :: python_api/lldbutil/TestSwigVersion.py (1055 of 2167) PASS: lldb-unit :: ObjectFile/Breakpad/./ObjectFileBreakpadTests/StackWinRecord.parse (1056 of 2167) PASS: lldb-unit :: Utility/./UtilityTests/ScalarTest.ExtractBitfield (1057 of 2167) UNSUPPORTED: lldb-shell :: SymbolFile/DWARF/dir-separator-no-comp-dir-relative-name.s (1058 of 2167) UNSUPPORTED: lldb-shell :: SymbolFile/DWARF/dwarf5_locations.s (1059 of 2167) PASS: lldb-unit :: Utility/./UtilityTests/OptionsWithRawTest.EmptySuffixSingleWhitespace (1060 of 2167) UNSUPPORTED: lldb-api :: lang/cpp/gmodules/TestWithModuleDebugging.py (1061 of 2167) UNSUPPORTED: lldb-api :: python_api/watchpoint/watchlocation/TestSetWatchlocation.py (1062 of 2167) PASS: lldb-api :: functionalities/breakpoint/breakpoint_names/TestBreakpointNames.py (1063 of 2167) PASS: lldb-api :: functionalities/data-formatter/compactvectors/TestCompactVectors.py (1064 of 2167) PASS: lldb-unit :: Utility/./UtilityTests/RangeTest.ContainsAddrInvalid (1065 of 2167) PASS: lldb-unit :: Utility/./UtilityTests/StringExtractorTest.GetNameColonValueContainsColon (1066 of 2167) PASS: lldb-unit :: Process/minidump/./LLDBMinidumpTests/MinidumpParserTest.MinidumpDuplicateModuleMinAddress (1067 of 2167) PASS: lldb-api :: lang/cpp/char1632_t/TestChar1632T.py (1068 of 2167) PASS: lldb-unit :: SymbolFile/NativePDB/./SymbolFileNativePDBTests/PDBFPOProgramToDWARFExpressionTests.InvalidAssignmentSingle (1069 of 2167) PASS: lldb-unit :: Core/./LLDBCoreTests/RichManglingContextTest.IPDRealloc (1070 of 2167) PASS: lldb-api :: commands/expression/diagnostics/TestExprDiagnostics.py (1071 of 2167) PASS: lldb-unit :: Process/gdb-remote/./ProcessGdbRemoteTests/GDBRemoteCommunicationClientTest.WriteRegisterNoSuffix (1072 of 2167) UNSUPPORTED: lldb-shell :: SymbolFile/NativePDB/nested-types.cpp (1073 of 2167) PASS: lldb-api :: functionalities/multiword-commands/TestMultiWordCommands.py (1074 of 2167) UNSUPPORTED: lldb-shell :: Unwind/eh-frame-augment-noop.test (1075 of 2167) PASS: lldb-api :: commands/expression/completion-crash-incomplete-record/TestCompletionCrashIncompleteRecord.py (1076 of 2167) PASS: lldb-unit :: Utility/./UtilityTests/UUIDTest.SetFromStringRef (1077 of 2167) PASS: lldb-unit :: Utility/./UtilityTests/RangeTest.ContainsAddr (1078 of 2167) PASS: lldb-shell :: SymbolFile/DWARF/DW_AT_const_value-bitfields.s (1079 of 2167) PASS: lldb-unit :: Utility/./UtilityTests/RecordReplayTest.InstrumentedBarRef (1080 of 2167) PASS: lldb-api :: commands/frame/diagnose/inheritance/TestDiagnoseInheritance.py (1081 of 2167) PASS: lldb-api :: macosx/profile_vrs_detach/TestDetachVrsProfile.py (1082 of 2167) PASS: lldb-shell :: ObjectFile/ELF/duplicate-section.yaml (1083 of 2167) PASS: lldb-api :: commands/settings/use_source_cache/TestUseSourceCache.py (1084 of 2167) PASS: lldb-api :: driver/batch_mode/TestBatchMode.py (1085 of 2167) PASS: lldb-shell :: Reproducer/TestFinalize.test (1086 of 2167) PASS: lldb-api :: functionalities/gdb_remote_client/TestGDBRemoteClient.py (1087 of 2167) PASS: lldb-unit :: Utility/./UtilityTests/EnvironmentTest.EnvpConversion (1088 of 2167) PASS: lldb-api :: macosx/find-app-in-bundle/TestFindAppInBundle.py (1089 of 2167) UNSUPPORTED: lldb-shell :: SymbolFile/DWARF/debug-types-dwo-cross-reference.cpp (1090 of 2167) PASS: lldb-api :: tools/lldb-vscode/breakpoint-events/TestVSCode_breakpointEvents.py (1091 of 2167) PASS: lldb-shell :: SymbolFile/Breakpad/line-table-discontinuous-file-ids.test (1092 of 2167) PASS: lldb-unit :: Process/gdb-remote/./ProcessGdbRemoteTests/GDBRemoteCommunicationClientTest.GetMemoryRegionInfoInvalidResponse (1093 of 2167) PASS: lldb-unit :: SymbolFile/DWARF/./SymbolFileDWARFTests/SymbolFileDWARFTests.ParseAranges (1094 of 2167) PASS: lldb-api :: functionalities/return-value/TestReturnValue.py (1095 of 2167) PASS: lldb-unit :: Utility/./UtilityTests/LogChannelTest.List (1096 of 2167) PASS: lldb-unit :: Symbol/./SymbolTests/TestTypeSystemClang.TestBuiltinTypeForEncodingAndBitSize (1097 of 2167) PASS: lldb-unit :: Utility/./UtilityTests/StringExtractorTest.GetHexBytes_OddPair2 (1098 of 2167) PASS: lldb-unit :: Platform/Android/./AdbClientTests/AdbClientTest.CreateByDeviceId (1099 of 2167) PASS: lldb-shell :: Reproducer/TestDiscard.test (1100 of 2167) PASS: lldb-unit :: Utility/./UtilityTests/TimerTest.CategoryTimes2 (1101 of 2167) PASS: lldb-api :: macosx/find-dsym/bundle-with-dot-in-filename/TestBundleWithDotInFilename.py (1102 of 2167) PASS: lldb-unit :: Host/./HostTests/MainLoopTest.ReadObject (1103 of 2167) UNSUPPORTED: lldb-api :: functionalities/darwin_log/filter/exact_match/activity-chain/TestDarwinLogFilterMatchActivityChain.py (1104 of 2167) PASS: lldb-unit :: Utility/./UtilityTests/StreamTest.AddressRange (1105 of 2167) UNSUPPORTED: lldb-shell :: ScriptInterpreter/Lua/breakpoint_callback.test (1106 of 2167) PASS: lldb-unit :: Utility/./UtilityTests/UUIDTest.RelationalOperators (1107 of 2167) PASS: lldb-unit :: ScriptInterpreter/Python/./ScriptInterpreterPythonTests/PythonDataObjectsTest.TestOwnedReferences (1108 of 2167) PASS: lldb-unit :: Symbol/./SymbolTests/TestTypeSystemClang.TestDeletingImplicitCopyCstrDueToMoveCStr (1109 of 2167) UNSUPPORTED: lldb-shell :: SymbolFile/DWARF/find-basic-function.cpp (1110 of 2167) PASS: lldb-api :: lang/c/complex_int/TestComplexInt.py (1111 of 2167) PASS: lldb-unit :: Interpreter/./InterpreterTests/OptionArgParserTest.toBoolean (1112 of 2167) PASS: lldb-unit :: SymbolFile/NativePDB/./SymbolFileNativePDBTests/PDBFPOProgramToDWARFExpressionTests.InvalidAssignmentMultiple (1113 of 2167) PASS: lldb-unit :: Utility/./UtilityTests/BinaryStreamTest.PutULEB128ThreeBytes (1114 of 2167) PASS: lldb-unit :: Utility/./UtilityTests/StringListTest.ShiftMove (1115 of 2167) PASS: lldb-api :: lang/objc/foundation/TestObjectDescriptionAPI.py (1116 of 2167) PASS: lldb-api :: functionalities/data-formatter/data-formatter-synth/TestDataFormatterSynth.py (1117 of 2167) PASS: lldb-unit :: Utility/./UtilityTests/ReproducerTest.SetCapture (1118 of 2167) PASS: lldb-api :: commands/expression/test/TestExprs2.py (1119 of 2167) UNSUPPORTED: lldb-api :: tools/lldb-server/registers-target-xml-reading/TestGdbRemoteTargetXmlPacket.py (1120 of 2167) PASS: lldb-unit :: Utility/./UtilityTests/UUIDTest.Validity (1121 of 2167) PASS: lldb-unit :: Utility/./UtilityTests/RangeDataVector.FindEntryIndexesThatContain_Overlap (1122 of 2167) PASS: lldb-api :: lang/cpp/member-and-local-vars-with-same-name/TestMembersAndLocalsWithSameName.py (1123 of 2167) PASS: lldb-shell :: Driver/LocalLLDBInit.test (1124 of 2167) PASS: lldb-api :: functionalities/thread/state_after_expression/TestStateAfterExpression.py (1125 of 2167) PASS: lldb-shell :: ObjectFile/PECOFF/basic-info-arm64.yaml (1126 of 2167) PASS: lldb-unit :: Utility/./UtilityTests/RangeTest.ContainsRange (1127 of 2167) PASS: lldb-api :: sanity/TestModuleCacheSanity.py (1128 of 2167) PASS: lldb-unit :: Process/minidump/./LLDBMinidumpTests/MinidumpParserTest.GetExceptionStream (1129 of 2167) PASS: lldb-api :: functionalities/data-formatter/data-formatter-objc/TestDataFormatterObjCKVO.py (1130 of 2167) PASS: lldb-unit :: Utility/./UtilityTests/ScalarTest.Equality (1131 of 2167) PASS: lldb-unit :: Host/./HostTests/SocketTests/SocketTest.UDPConnect/ipv4 (1132 of 2167) PASS: lldb-unit :: Language/Highlighting/./HighlighterTests/HighlighterTest.ClangIdentifiers (1133 of 2167) PASS: lldb-unit :: UnwindAssembly/x86/./UnwindAssemblyx86Tests/Testx86AssemblyInspectionEngine.TestStackRealign8BitDisp_i386 (1134 of 2167) PASS: lldb-unit :: Symbol/./SymbolTests/TestTypeSystemClang.TestDisplayName (1135 of 2167) PASS: lldb-shell :: ObjectFile/ELF/build-id-case.yaml (1136 of 2167) PASS: lldb-api :: commands/command/script/import/TestImport.py (1137 of 2167) PASS: lldb-unit :: Utility/./UtilityTests/ScalarTest.GetBytes (1138 of 2167) PASS: lldb-api :: lang/cpp/this/TestCPPThis.py (1139 of 2167) PASS: lldb-unit :: Symbol/./SymbolTests/TestTypeSystemClang.TestConvertAccessTypeToAccessSpecifier (1140 of 2167) UNSUPPORTED: lldb-shell :: SymbolFile/PDB/enums-layout.test (1141 of 2167) PASS: lldb-unit :: Expression/./ExpressionTests/DiagnosticManagerTest.GetStringNoDiags (1142 of 2167) PASS: lldb-api :: lang/objc/real-definition/TestRealDefinition.py (1143 of 2167) PASS: lldb-api :: commands/frame/var-scope/TestFrameVariableScope.py (1144 of 2167) PASS: lldb-unit :: Utility/./UtilityTests/UriParserTest.SchemeHostSeparator2 (1145 of 2167) PASS: lldb-unit :: UnwindAssembly/x86/./UnwindAssemblyx86Tests/Testx86AssemblyInspectionEngine.TestPopR13 (1146 of 2167) PASS: lldb-api :: functionalities/data-formatter/data-formatter-objc/nsstring/TestDataFormatterNSString.py (1147 of 2167) UNSUPPORTED: lldb-api :: functionalities/thread/concurrent_events/TestConcurrentCrashWithWatchpoint.py (1148 of 2167) PASS: lldb-shell :: SymbolFile/DWARF/dwp-debug-types.s (1149 of 2167) PASS: lldb-unit :: Utility/./UtilityTests/AnsiTerminal.AtStart (1150 of 2167) PASS: lldb-api :: commands/breakpoint/set/func-regex/TestBreakpointRegexError.py (1151 of 2167) PASS: lldb-api :: lang/cpp/elaborated-types/TestElaboratedTypes.py (1152 of 2167) UNSUPPORTED: lldb-shell :: Register/aarch64-gp-read.test (1153 of 2167) PASS: lldb-api :: functionalities/memory/read/TestMemoryRead.py (1154 of 2167) PASS: lldb-unit :: Utility/./UtilityTests/StringExtractorTest.GetHexU8_Exact (1155 of 2167) PASS: lldb-shell :: ObjectFile/ELF/gnu-debuglink.yaml (1156 of 2167) PASS: lldb-api :: functionalities/type_lookup/TestTypeLookup.py (1157 of 2167) PASS: lldb-unit :: Utility/./UtilityTests/StringListTest.InsertStringAtIndexStart (1158 of 2167) PASS: lldb-unit :: ScriptInterpreter/Python/./ScriptInterpreterPythonTests/PythonDataObjectsTest.TestPythonInteger (1159 of 2167) PASS: lldb-unit :: Utility/./UtilityTests/StructuredDataTest.StringDump (1160 of 2167) PASS: lldb-shell :: ObjectFile/ELF/PT_LOAD-overlap-PT_INTERP.yaml (1161 of 2167) PASS: lldb-unit :: Utility/./UtilityTests/LogChannelTest.Enable (1162 of 2167) PASS: lldb-unit :: Process/gdb-remote/./ProcessGdbRemoteTests/GDBRemoteCommunicationClientTest.ReadRegister (1163 of 2167) UNSUPPORTED: lldb-shell :: BuildScript/toolchain-clang-cl.test (1164 of 2167) PASS: lldb-api :: commands/expression/import-std-module/sysroot/TestStdModuleSysroot.py (1165 of 2167) PASS: lldb-api :: commands/expression/multiline-completion/TestMultilineCompletion.py (1166 of 2167) PASS: lldb-unit :: Interpreter/./InterpreterTests/CompletionTest.FileCompletionAbsolute (1167 of 2167) PASS: lldb-api :: functionalities/data-formatter/array_typedef/TestArrayTypedef.py (1168 of 2167) PASS: lldb-unit :: Utility/./UtilityTests/ScalarTest.CastOperations (1169 of 2167) PASS: lldb-unit :: Utility/./UtilityTests/Predicate.WaitForValueEqualTo (1170 of 2167) PASS: lldb-api :: functionalities/data-formatter/ostypeformatting/TestFormattersOsType.py (1171 of 2167) PASS: lldb-api :: functionalities/thread/concurrent_events/TestConcurrentTwoBreakpointsOneDelaySignal.py (1172 of 2167) PASS: lldb-unit :: UnwindAssembly/x86/./UnwindAssemblyx86Tests/Testx86AssemblyInspectionEngine.TestPopR14 (1173 of 2167) UNSUPPORTED: lldb-shell :: SymbolFile/NativePDB/stack_unwinding01.cpp (1174 of 2167) PASS: lldb-unit :: Utility/./UtilityTests/UriParserTest.SchemeHostSeparator4 (1175 of 2167) PASS: lldb-api :: python_api/sbstructureddata/TestStructuredDataAPI.py (1176 of 2167) PASS: lldb-unit :: Utility/./UtilityTests/NameMatchesTest.Ignore (1177 of 2167) PASS: lldb-shell :: Settings/TestEchoCommands.test (1178 of 2167) PASS: lldb-unit :: UnwindAssembly/x86/./UnwindAssemblyx86Tests/Testx86AssemblyInspectionEngine.TestSubRSP (1179 of 2167) PASS: lldb-unit :: SymbolFile/NativePDB/./SymbolFileNativePDBTests/PDBFPOProgramToDWARFExpressionTests.MultipleDependentAssignments (1180 of 2167) PASS: lldb-shell :: SymbolFile/DWARF/debug_loclists-dwo.s (1181 of 2167) PASS: lldb-api :: commands/expression/po_verbosity/TestPoVerbosity.py (1182 of 2167) PASS: lldb-api :: functionalities/tail_call_frames/thread_step_out_or_return/TestSteppingOutWithArtificialFrames.py (1183 of 2167) PASS: lldb-api :: functionalities/data-formatter/data-formatter-objc/TestDataFormatterObjCCF.py (1184 of 2167) PASS: lldb-api :: commands/command/nested_alias/TestNestedAlias.py (1185 of 2167) UNSUPPORTED: lldb-api :: commands/watchpoints/watchpoint_commands/TestWatchpointCommands.py (1186 of 2167) UNSUPPORTED: lldb-api :: lang/cpp/function-template-parameter-pack/TestFunctionTemplateParameterPack.py (1187 of 2167) PASS: lldb-unit :: Process/minidump/./LLDBMinidumpTests/MinidumpParserTest.GetPid (1188 of 2167) PASS: lldb-unit :: ScriptInterpreter/Python/./ScriptInterpreterPythonTests/PythonDataObjectsTest.TestPythonDictionaryManipulation (1189 of 2167) PASS: lldb-unit :: Process/minidump/./LLDBMinidumpTests/RegisterContextMinidump.CheckRegisterContextMinidump_ARM (1190 of 2167) PASS: lldb-api :: functionalities/fat_archives/TestFatArchives.py (1191 of 2167) PASS: lldb-shell :: Commands/command-source.test (1192 of 2167) PASS: lldb-api :: lang/cpp/inlines/TestInlines.py (1193 of 2167) PASS: lldb-unit :: Utility/./UtilityTests/RangeTest.NotEqual (1194 of 2167) PASS: lldb-unit :: Host/./HostTests/MainLoopTest.DetectsEOF (1195 of 2167) PASS: lldb-unit :: UnwindAssembly/x86/./UnwindAssemblyx86Tests/Testx86AssemblyInspectionEngine.TestPushR12 (1196 of 2167) UNSUPPORTED: lldb-shell :: SymbolFile/DWARF/find-basic-type.cpp (1197 of 2167) PASS: lldb-unit :: Host/./HostTests/FileSystemTest.GetByteSize (1198 of 2167) PASS: lldb-api :: lang/c/array_types/TestArrayTypes.py (1199 of 2167) PASS: lldb-unit :: Utility/./UtilityTests/StringListTest.LongestCommonPrefixNoPrefix (1200 of 2167) PASS: lldb-api :: types/TestFloatTypes.py (1201 of 2167) PASS: lldb-api :: functionalities/breakpoint/breakpoint_command/TestBreakpointCommandsFromPython.py (1202 of 2167) PASS: lldb-unit :: Utility/./UtilityTests/StringExtractorTest.GetHexBytesAvail_OddPair2 (1203 of 2167) PASS: lldb-unit :: Process/minidump/./LLDBMinidumpTests/MinidumpParserTest.GetArchitecture (1204 of 2167) PASS: lldb-unit :: Thread/./ThreadTests/ThreadTest.SetStopInfo (1205 of 2167) PASS: lldb-api :: commands/expression/regression-access-function-template-in-record/TestRegressionAccessFunctionTemplateInRecord.py (1206 of 2167) PASS: lldb-unit :: Symbol/./SymbolTests/TestClangASTImporter.CopyDeclTagDecl (1207 of 2167) PASS: lldb-api :: tools/lldb-vscode/variables/TestVSCode_variables.py (1208 of 2167) PASS: lldb-unit :: UnwindAssembly/x86/./UnwindAssemblyx86Tests/Testx86AssemblyInspectionEngine.TestPushRBX (1209 of 2167) PASS: lldb-api :: lang/objc/objc-checker/TestObjCCheckers.py (1210 of 2167) PASS: lldb-unit :: UnwindAssembly/x86/./UnwindAssemblyx86Tests/Testx86AssemblyInspectionEngine.TestPopR12 (1211 of 2167) PASS: lldb-api :: tools/lldb-vscode/attach/TestVSCode_attach.py (1212 of 2167) PASS: lldb-api :: tools/lldb-vscode/console/TestVSCode_console.py (1213 of 2167) PASS: lldb-unit :: Utility/./UtilityTests/Predicate.WaitForValueNotEqualTo (1214 of 2167) PASS: lldb-api :: functionalities/thread/step_until/TestStepUntil.py (1215 of 2167) PASS: lldb-shell :: Reproducer/TestMultipleTargets.test (1216 of 2167) PASS: lldb-unit :: Utility/./UtilityTests/UriParserTest.BadPort (1217 of 2167) PASS: lldb-api :: functionalities/thread/exit_during_break/TestExitDuringBreak.py (1218 of 2167) PASS: lldb-api :: commands/expression/save_jit_objects/TestSaveJITObjects.py (1219 of 2167) PASS: lldb-unit :: Process/gdb-remote/./ProcessGdbRemoteTests/GDBRemoteCommunicationServerTest.SendErrorResponse_ErrorList (1220 of 2167) PASS: lldb-api :: functionalities/completion/TestCompletion.py (1221 of 2167) PASS: lldb-shell :: ObjectFile/Breakpad/uuid-matching-mac.test (1222 of 2167) PASS: lldb-unit :: Utility/./UtilityTests/ProcessInstanceInfoList.Yaml (1223 of 2167) PASS: lldb-unit :: Utility/./UtilityTests/AnsiTerminal.Empty (1224 of 2167) PASS: lldb-shell :: SymbolFile/DWARF/DW_AT_data_bit_offset-DW_OP_stack_value.s (1225 of 2167) PASS: lldb-unit :: Utility/./UtilityTests/StreamTest.PutCString (1226 of 2167) PASS: lldb-shell :: ObjectFile/ELF/netbsd-core-amd64.test (1227 of 2167) PASS: lldb-unit :: UnwindAssembly/x86/./UnwindAssemblyx86Tests/Testx86AssemblyInspectionEngine.TestReturnDetect (1228 of 2167) PASS: lldb-shell :: Minidump/no-process-id.yaml (1229 of 2167) PASS: lldb-api :: api/listeners/TestListener.py (1230 of 2167) PASS: lldb-api :: lang/cpp/unicode-literals/TestUnicodeLiterals.py (1231 of 2167) PASS: lldb-unit :: Symbol/./SymbolTests/DWARFCallFrameInfoTest.Basic_dwarf4 (1232 of 2167) PASS: lldb-api :: tools/lldb-server/TestGdbRemoteRegisterState.py (1233 of 2167) PASS: lldb-unit :: Process/minidump/./LLDBMinidumpTests/MinidumpParserTest.GetFilteredModuleList (1234 of 2167) PASS: lldb-api :: lang/objc/variadic_methods/TestVariadicMethods.py (1235 of 2167) PASS: lldb-unit :: Utility/./UtilityTests/UriParserTest.Empty (1236 of 2167) PASS: lldb-api :: lang/objc/objc-stepping/TestObjCStepping.py (1237 of 2167) PASS: lldb-unit :: Utility/./UtilityTests/AnsiTerminal.Basic (1238 of 2167) PASS: lldb-api :: lang/cpp/function_refs/TestFunctionRefs.py (1239 of 2167) PASS: lldb-unit :: ScriptInterpreter/Python/./ScriptInterpreterPythonTests/PythonDataObjectsTest.TestBorrowedReferences (1240 of 2167) PASS: lldb-shell :: SymbolFile/Breakpad/line-table.test (1241 of 2167) PASS: lldb-api :: lang/objc/objc-ivar-stripped/TestObjCIvarStripped.py (1242 of 2167) PASS: lldb-api :: lang/objc/objc-runtime-ivars/TestRuntimeIvars.py (1243 of 2167) PASS: lldb-unit :: Utility/./UtilityTests/StringListTest.Assignment (1244 of 2167) PASS: lldb-unit :: Utility/./UtilityTests/NameMatchesTest.Contains (1245 of 2167) PASS: lldb-unit :: SymbolFile/NativePDB/./SymbolFileNativePDBTests/PDBFPOProgramToDWARFExpressionTests.UnsupportedRASearch (1246 of 2167) PASS: lldb-api :: functionalities/non-overlapping-index-variable-i/TestIndexVariable.py (1247 of 2167) PASS: lldb-unit :: Utility/./UtilityTests/ScalarTest.Getters (1248 of 2167) PASS: lldb-unit :: Utility/./UtilityTests/VMRange.Clear (1249 of 2167) PASS: lldb-unit :: Utility/./UtilityTests/StringLexerTest.GetUnlexed (1250 of 2167) UNSUPPORTED: lldb-shell :: SymbolFile/DWARF/debug-line-basic.s (1251 of 2167) PASS: lldb-unit :: Utility/./UtilityTests/RangeTest.Slide (1252 of 2167) PASS: lldb-unit :: Symbol/./SymbolTests/TestTypeSystemClang.TestFunctionTemplateConstruction (1253 of 2167) PASS: lldb-shell :: Expr/TestIRMemoryMap.test (1254 of 2167) PASS: lldb-api :: lang/c/step_over_no_deadlock/TestStepOverDoesntBlock.py (1255 of 2167) PASS: lldb-api :: functionalities/thread/thread_exit/TestThreadExit.py (1256 of 2167) PASS: lldb-api :: lang/cpp/extern_c/TestExternCSymbols.py (1257 of 2167) PASS: lldb-api :: terminal/TestSTTYBeforeAndAfter.py (1258 of 2167) PASS: lldb-unit :: ObjectFile/ELF/./ObjectFileELFTests/ObjectFileELFTest.GetModuleSpecifications_EarlySectionHeaders (1259 of 2167) PASS: lldb-api :: functionalities/target-new-solib-notifications/TestModuleLoadedNotifys.py (1260 of 2167) PASS: lldb-shell :: Quit/TestQuitExitCode0.test (1261 of 2167) PASS: lldb-unit :: Host/./HostTests/FileSystemTest.GetPermissions (1262 of 2167) PASS: lldb-api :: macosx/version_zero/TestGetVersionZeroVersion.py (1263 of 2167) UNSUPPORTED: lldb-api :: functionalities/thread/concurrent_events/TestConcurrentSignalWatch.py (1264 of 2167) PASS: lldb-api :: functionalities/thread/jump/TestThreadJump.py (1265 of 2167) PASS: lldb-api :: python_api/sbplatform/TestSBPlatform.py (1266 of 2167) UNSUPPORTED: lldb-api :: benchmarks/libcxxlist/TestBenchmarkLibcxxList.py (1267 of 2167) PASS: lldb-api :: functionalities/thread/crash_during_step/TestCrashDuringStep.py (1268 of 2167) PASS: lldb-api :: commands/expression/import-std-module/weak_ptr/TestWeakPtrFromStdModule.py (1269 of 2167) PASS: lldb-unit :: Utility/./UtilityTests/StringListTest.JoinNonSpace (1270 of 2167) PASS: lldb-unit :: ScriptInterpreter/Python/./ScriptInterpreterPythonTests/PythonDataObjectsTest.TestPythonTupleInitializerList2 (1271 of 2167) PASS: lldb-shell :: ObjectFile/ELF/PT_TLS-overlap-PT_LOAD.yaml (1272 of 2167) PASS: lldb-unit :: Utility/./UtilityTests/TimerTest.CategoryTimesStats (1273 of 2167) PASS: lldb-api :: functionalities/data-formatter/synthcapping/TestSyntheticCapping.py (1274 of 2167) PASS: lldb-api :: types/TestDoubleTypesExpr.py (1275 of 2167) PASS: lldb-unit :: Symbol/./SymbolTests/TestTypeSystemClang.TemplateArguments (1276 of 2167) PASS: lldb-unit :: Utility/./UtilityTests/RangeTest.ContainsRangeStartingFromZero (1277 of 2167) UNSUPPORTED: lldb-shell :: Register/x86-64-gp-write.test (1278 of 2167) PASS: lldb-shell :: Breakpoint/jitbp_elf.test (1279 of 2167) PASS: lldb-api :: functionalities/data-formatter/setvaluefromcstring/TestSetValueFromCString.py (1280 of 2167) PASS: lldb-unit :: Utility/./UtilityTests/RecordReplayTest.InstrumentedBar (1281 of 2167) PASS: lldb-unit :: UnwindAssembly/x86/./UnwindAssemblyx86Tests/Testx86AssemblyInspectionEngine.TestSimplei386ugmented (1282 of 2167) PASS: lldb-api :: functionalities/data-formatter/cstring-utf8-summary/TestCstringUnicode.py (1283 of 2167) PASS: lldb-shell :: Commands/command-backtrace.test (1284 of 2167) PASS: lldb-unit :: Utility/./UtilityTests/StringListTest.AppendStringCString (1285 of 2167) PASS: lldb-unit :: Host/./HostTests/FileSystemTest.FileAndDirectoryComponents (1286 of 2167) PASS: lldb-api :: functionalities/thread/thread_specific_break/TestThreadSpecificBreakpoint.py (1287 of 2167) PASS: lldb-api :: commands/platform/process/list/TestProcessList.py (1288 of 2167) PASS: lldb-api :: functionalities/gdb_remote_client/TestJLink6Armv7RegisterDefinition.py (1289 of 2167) UNSUPPORTED: lldb-shell :: SymbolFile/PDB/ast-restore.test (1290 of 2167) PASS: lldb-unit :: SymbolFile/NativePDB/./SymbolFileNativePDBTests/PDBFPOProgramToDWARFExpressionTests.UnresolvedRegisterAssignmentReference (1291 of 2167) PASS: lldb-api :: lang/c/anonymous/TestAnonymous.py (1292 of 2167) PASS: lldb-unit :: Host/./HostTests/MainLoopTest.Signal (1293 of 2167) PASS: lldb-api :: commands/expression/import-std-module/queue/TestQueueFromStdModule.py (1294 of 2167) PASS: lldb-unit :: Process/gdb-remote/./ProcessGdbRemoteTests/GDBRemoteCommunicationClientTest.GetModulesInfo_UUID20 (1295 of 2167) PASS: lldb-unit :: Utility/./UtilityTests/BinaryStreamTest.PutSLEB128One (1296 of 2167) PASS: lldb-unit :: Utility/./UtilityTests/StringListTest.SplitIntoLines (1297 of 2167) PASS: lldb-api :: python_api/symbol-context/TestSymbolContext.py (1298 of 2167) PASS: lldb-api :: commands/expression/call-function/TestCallBuiltinFunction.py (1299 of 2167) PASS: lldb-api :: functionalities/postmortem/elf-core/TestLinuxCore.py (1300 of 2167) PASS: lldb-api :: functionalities/data-formatter/data-formatter-stl/libcxx/list/TestDataFormatterLibcxxList.py (1301 of 2167) PASS: lldb-shell :: SymbolFile/DWARF/DW_AT_loclists_base.s (1302 of 2167) PASS: lldb-unit :: Utility/./UtilityTests/NameMatchesTest.Equals (1303 of 2167) PASS: lldb-unit :: Process/gdb-remote/./ProcessGdbRemoteTests/GDBRemoteClientBaseTest.SendContinueAndAsyncSignal (1304 of 2167) UNSUPPORTED: lldb-api :: benchmarks/frame_variable/TestFrameVariableResponse.py (1305 of 2167) PASS: lldb-api :: lang/objc/objc-struct-argument/TestObjCStructArgument.py (1306 of 2167) PASS: lldb-unit :: Host/./HostTests/NativeProcessProtocolTest.ReadCStringFromMemory (1307 of 2167) PASS: lldb-api :: tools/lldb-server/inferior-crash/TestGdbRemoteAbort.py (1308 of 2167) PASS: lldb-api :: functionalities/step-avoids-no-debug/TestStepNoDebug.py (1309 of 2167) PASS: lldb-shell :: SymbolFile/Breakpad/line-table-mixed-path-styles.test (1310 of 2167) PASS: lldb-api :: functionalities/inline-stepping/TestInlineStepping.py (1311 of 2167) PASS: lldb-api :: commands/expression/dont_allow_jit/TestAllowJIT.py (1312 of 2167) PASS: lldb-api :: commands/expression/two-files/TestObjCTypeQueryFromOtherCompileUnit.py (1313 of 2167) PASS: lldb-api :: source-manager/TestSourceManager.py (1314 of 2167) PASS: lldb-api :: types/TestShortTypeExpr.py (1315 of 2167) UNSUPPORTED: lldb-api :: benchmarks/expression/TestRepeatedExprs.py (1316 of 2167) PASS: lldb-api :: lang/objc/direct-dispatch-step/TestObjCDirectDispatchStepping.py (1317 of 2167) PASS: lldb-shell :: Reproducer/TestRelativePath.test (1318 of 2167) PASS: lldb-api :: python_api/default-constructor/TestDefaultConstructorForAPIObjects.py (1319 of 2167) PASS: lldb-unit :: Utility/./UtilityTests/XcodeSDKTest.MergeTest (1320 of 2167) PASS: lldb-unit :: Utility/./UtilityTests/UriParserTest.SchemeHostSeparator3 (1321 of 2167) PASS: lldb-unit :: Utility/./UtilityTests/ScalarTest.APIntConstructor (1322 of 2167) PASS: lldb-api :: functionalities/signal/handle-abrt/TestHandleAbort.py (1323 of 2167) PASS: lldb-api :: macosx/function-starts/TestFunctionStarts.py (1324 of 2167) PASS: lldb-api :: commands/frame/diagnose/bad-reference/TestBadReference.py (1325 of 2167) PASS: lldb-unit :: Process/minidump/./LLDBMinidumpTests/MinidumpParserTest.GetPidWindows (1326 of 2167) PASS: lldb-api :: lang/cpp/class_types/TestClassTypesDisassembly.py (1327 of 2167) PASS: lldb-api :: tools/lldb-vscode/module/TestVSCode_module.py (1328 of 2167) PASS: lldb-api :: functionalities/data-formatter/pyobjsynthprovider/TestPyObjSynthProvider.py (1329 of 2167) UNSUPPORTED: lldb-shell :: Watchpoint/netbsd-nouserdbregs.test (1330 of 2167) PASS: lldb-unit :: Platform/./LLDBPlatformTests/PlatformDarwinTest.TestParseVersionBuildDir (1331 of 2167) PASS: lldb-unit :: Symbol/./SymbolTests/Type.CompilerContextPattern (1332 of 2167) PASS: lldb-unit :: Language/Highlighting/./HighlighterTests/HighlighterTest.ClangScalarLiterals (1333 of 2167) PASS: lldb-unit :: ScriptInterpreter/Python/./ScriptInterpreterPythonTests/PythonDataObjectsTest.TestCallable (1334 of 2167) PASS: lldb-api :: functionalities/data-formatter/data-formatter-globals/TestDataFormatterGlobals.py (1335 of 2167) UNSUPPORTED: lldb-api :: commands/watchpoints/watchpoint_set_command/TestWatchLocationWithWatchSet.py (1336 of 2167) PASS: lldb-unit :: Utility/./UtilityTests/DataExtractorTest.UncommonAddressSize (1337 of 2167) PASS: lldb-api :: functionalities/lazy-loading/TestLazyLoading.py (1338 of 2167) PASS: lldb-api :: python_api/process/read-mem-cstring/TestReadMemCString.py (1339 of 2167) PASS: lldb-shell :: Reproducer/TestDriverOptions.test (1340 of 2167) PASS: lldb-api :: functionalities/process_crash_info/TestProcessCrashInfo.py (1341 of 2167) UNSUPPORTED: lldb-api :: functionalities/thread/concurrent_events/TestConcurrentWatchBreakDelay.py (1342 of 2167) PASS: lldb-unit :: Utility/./UtilityTests/RangeTest.DoesAdjoinOrIntersect (1343 of 2167) PASS: lldb-api :: functionalities/data-formatter/nsarraysynth/TestNSArraySynthetic.py (1344 of 2167) UNSUPPORTED: lldb-api :: functionalities/process_save_core/TestProcessSaveCore.py (1345 of 2167) PASS: lldb-api :: lang/cpp/chained-calls/TestCppChainedCalls.py (1346 of 2167) PASS: lldb-unit :: Utility/./UtilityTests/StreamTest.PutBytesAsRawHex8ToMixedEndian (1347 of 2167) PASS: lldb-unit :: Target/./TargetTests/ModuleCacheTest.GetAndPutStrangeHostname (1348 of 2167) PASS: lldb-api :: python_api/breakpoint/TestBreakpointAPI.py (1349 of 2167) PASS: lldb-api :: functionalities/gdb_remote_client/TestNoGPacketSupported.py (1350 of 2167) PASS: lldb-api :: functionalities/data-formatter/frameformat_smallstruct/TestFrameFormatSmallStruct.py (1351 of 2167) PASS: lldb-unit :: Utility/./UtilityTests/StringListTest.LongestCommonPrefixDuplicateElement (1352 of 2167) PASS: lldb-api :: commands/frame/diagnose/local-variable/TestLocalVariable.py (1353 of 2167) PASS: lldb-api :: lang/objc/foundation/TestSymbolTable.py (1354 of 2167) PASS: lldb-unit :: Utility/./UtilityTests/ConstStringTest.FromMidOfBufferStringRef (1355 of 2167) PASS: lldb-api :: lang/cpp/namespace_conflicts/TestNamespaceConflicts.py (1356 of 2167) UNSUPPORTED: lldb-api :: functionalities/darwin_log/filter/regex/subsystem/TestDarwinLogFilterRegexSubsystem.py (1357 of 2167) PASS: lldb-shell :: SymbolFile/DWARF/debug_aranges-empty-section.s (1358 of 2167) PASS: lldb-api :: lang/objc/orderedset/TestOrderedSet.py (1359 of 2167) PASS: lldb-api :: commands/expression/no-deadlock/TestExprDoesntBlock.py (1360 of 2167) PASS: lldb-unit :: Utility/./UtilityTests/StringExtractorTest.GetU64BigEndian (1361 of 2167) UNSUPPORTED: lldb-shell :: SymbolFile/PDB/function-level-linking.test (1362 of 2167) PASS: lldb-unit :: Utility/./UtilityTests/StringExtractorTest.InitEmpty (1363 of 2167) PASS: lldb-unit :: DataFormatter/./LLDBFormatterTests/TypeMatcherTests.CreatedBySameMatchStringExactNamePrefixes (1364 of 2167) PASS: lldb-api :: python_api/get-value-32bit-int/TestGetValue32BitInt.py (1365 of 2167) PASS: lldb-shell :: SymbolFile/DWARF/parallel-indexing-stress.s (1366 of 2167) PASS: lldb-unit :: Symbol/./SymbolTests/TestClangASTImporter.DeportDeclTagDecl (1367 of 2167) PASS: lldb-api :: lang/objc/modules/TestObjCModules.py (1368 of 2167) PASS: lldb-api :: functionalities/breakpoint/breakpoint_ids/TestBreakpointIDs.py (1369 of 2167) UNSUPPORTED: lldb-shell :: SymbolFile/DWARF/split-dwarf-expression-eval-bug.cpp (1370 of 2167) PASS: lldb-unit :: Utility/./UtilityTests/EventTest.DumpEventDataBytes (1371 of 2167) PASS: lldb-unit :: Utility/./UtilityTests/RegularExpression.Empty (1372 of 2167) PASS: lldb-unit :: Host/./HostTests/Host.WaitStatusFormat (1373 of 2167) PASS: lldb-unit :: Host/./HostTests/NativeProcessProtocolTest.SetBreakpointFailWrite (1374 of 2167) PASS: lldb-api :: functionalities/target_var/no_vars/TestTargetVarNoVars.py (1375 of 2167) PASS: lldb-unit :: SymbolFile/DWARF/./SymbolFileDWARFTests/SymbolFileDWARFTests.TestAbilitiesForDWARF (1376 of 2167) PASS: lldb-unit :: Symbol/./SymbolTests/TestClangASTImporter.RecordLayout (1377 of 2167) PASS: lldb-shell :: SymbolFile/Breakpad/unwind-via-stack-win-no-memory-info.yaml (1378 of 2167) PASS: lldb-api :: functionalities/data-formatter/data-formatter-named-summaries/TestDataFormatterNamedSummaries.py (1379 of 2167) PASS: lldb-api :: commands/process/attach/attach_denied/TestAttachDenied.py (1380 of 2167) PASS: lldb-api :: lang/objc/modules-cache/TestClangModulesCache.py (1381 of 2167) PASS: lldb-shell :: BuildScript/compiler-full-path.test (1382 of 2167) PASS: lldb-shell :: ScriptInterpreter/Python/crashlog.test (1383 of 2167) PASS: lldb-api :: lang/objc/objc-baseclass-sbtype/TestObjCBaseClassSBType.py (1384 of 2167) PASS: lldb-api :: macosx/DBGSourcePathRemapping/TestDSYMSourcePathRemapping.py (1385 of 2167) PASS: lldb-api :: lang/cpp/operator-overload/TestOperatorOverload.py (1386 of 2167) PASS: lldb-unit :: debugserver/./debugserverTests/JSON.Parse (1387 of 2167) PASS: lldb-api :: commands/expression/dollar-in-variable/TestDollarInVariable.py (1388 of 2167) PASS: lldb-unit :: ScriptInterpreter/Python/./ScriptInterpreterPythonTests/PythonDataObjectsTest.TestGlobalNameResolutionWithDot (1389 of 2167) PASS: lldb-unit :: Expression/./ExpressionTests/DWARFExpression.DW_OP_implicit_value (1390 of 2167) PASS: lldb-unit :: Utility/./UtilityTests/UriParserTest.SchemeHostSeparator (1391 of 2167) UNSUPPORTED: lldb-api :: commands/watchpoints/watchpoint_count/TestWatchpointCount.py (1392 of 2167) PASS: lldb-unit :: Utility/./UtilityTests/FileSpecTest.AppendPathComponent (1393 of 2167) PASS: lldb-unit :: UnwindAssembly/x86/./UnwindAssemblyx86Tests/Testx86AssemblyInspectionEngine.TestPushEBP (1394 of 2167) PASS: lldb-unit :: Expression/./ExpressionTests/DWARFExpression.DW_OP_convert (1395 of 2167) PASS: lldb-api :: functionalities/pointer_num_children/TestPointerNumChildren.py (1396 of 2167) UNSUPPORTED: lldb-api :: commands/watchpoints/watchpoint_commands/condition/TestWatchpointConditionCmd.py (1397 of 2167) PASS: lldb-unit :: Utility/./UtilityTests/StringExtractorTest.GetHexU8_Exact_NoEof (1398 of 2167) PASS: lldb-unit :: Utility/./UtilityTests/PassiveReplayTest.InstrumentedFooInvalid (1399 of 2167) PASS: lldb-unit :: Utility/./UtilityTests/UriParserTest.TypicalPortPathIPv4 (1400 of 2167) PASS: lldb-api :: lang/objc/objc-builtin-types/TestObjCBuiltinTypes.py (1401 of 2167) PASS: lldb-unit :: Utility/./UtilityTests/LogChannelTest.Disable (1402 of 2167) PASS: lldb-unit :: Process/./ProcessEventDataTests/ProcessEventDataTest.ShouldStop (1403 of 2167) PASS: lldb-api :: lang/objc/objc_direct-methods/TestObjCDirectMethods.py (1404 of 2167) PASS: lldb-api :: commands/expression/import_base_class_when_class_has_derived_member/TestImportBaseClassWhenClassHasDerivedMember.py (1405 of 2167) PASS: lldb-api :: commands/expression/expr-in-syscall/TestExpressionInSyscall.py (1406 of 2167) PASS: lldb-unit :: Utility/./UtilityTests/DeserializerTest.HasData (1407 of 2167) PASS: lldb-unit :: SymbolFile/NativePDB/./SymbolFileNativePDBTests/PDBFPOProgramToDWARFExpressionTests.DependencyChain (1408 of 2167) PASS: lldb-api :: lang/c/stepping/TestThreadStepping.py (1409 of 2167) PASS: lldb-api :: functionalities/thread/concurrent_events/TestConcurrentCrashWithSignal.py (1410 of 2167) UNSUPPORTED: lldb-shell :: SymbolFile/DWARF/dir-separator-windows.s (1411 of 2167) PASS: lldb-unit :: Host/./HostTests/SocketTests/SocketTest.DecodeHostAndPort/ipv6 (1412 of 2167) PASS: lldb-api :: lang/c/strings/TestCStrings.py (1413 of 2167) PASS: lldb-unit :: Symbol/./SymbolTests/TestTypeSystemClang.TestIsClangType (1414 of 2167) PASS: lldb-unit :: Host/./HostTests/SocketTests/SocketTest.DomainGetConnectURI/ipv4 (1415 of 2167) PASS: lldb-unit :: Core/./LLDBCoreTests/ModuleSpecTest.InvalidInMemoryBufferValidFile (1416 of 2167) PASS: lldb-api :: lang/cpp/namespace/TestNamespaceLookup.py (1417 of 2167) PASS: lldb-unit :: Utility/./UtilityTests/StringListTest.DefaultConstructor (1418 of 2167) UNSUPPORTED: lldb-api :: functionalities/tsan/cpp_global_location/TestTsanCPPGlobalLocation.py (1419 of 2167) PASS: lldb-api :: commands/command/source/TestCommandSource.py (1420 of 2167) PASS: lldb-unit :: UnwindAssembly/x86/./UnwindAssemblyx86Tests/Testx86AssemblyInspectionEngine.TestPopRBP (1421 of 2167) PASS: lldb-api :: functionalities/target_var/TestTargetVar.py (1422 of 2167) PASS: lldb-unit :: Utility/./UtilityTests/CompletionRequest.Constructor (1423 of 2167) PASS: lldb-api :: functionalities/data-formatter/nsdictionarysynth/TestNSDictionarySynthetic.py (1424 of 2167) UNSUPPORTED: lldb-api :: functionalities/signal/handle-segv/TestHandleSegv.py (1425 of 2167) PASS: lldb-api :: functionalities/unwind/noreturn/TestNoreturnUnwind.py (1426 of 2167) PASS: lldb-api :: python_api/disassemble-raw-data/TestDisassembleRawData.py (1427 of 2167) PASS: lldb-unit :: Language/CLanguages/./LanguageCLanguagesTests/CLanguages.LookupCLanguagesByLanguageType (1428 of 2167) PASS: lldb-unit :: Utility/./UtilityTests/TimeoutTest.Format (1429 of 2167) UNSUPPORTED: lldb-api :: functionalities/tsan/basic/TestTsanBasic.py (1430 of 2167) UNSUPPORTED: lldb-api :: commands/watchpoints/hello_watchpoint/TestMyFirstWatchpoint.py (1431 of 2167) PASS: lldb-unit :: Utility/./UtilityTests/StreamTest.AddressRangeInvalidRange (1432 of 2167) PASS: lldb-unit :: ScriptInterpreter/Python/./ScriptInterpreterPythonTests/PythonDataObjectsTest.TestPythonTupleSize (1433 of 2167) UNSUPPORTED: lldb-shell :: Register/x86-ymm-read.test (1434 of 2167) PASS: lldb-api :: lang/objc/rdar-11355592/TestRdar11355592.py (1435 of 2167) PASS: lldb-unit :: Utility/./UtilityTests/BinaryStreamTest.PutULEB128NineBytes (1436 of 2167) PASS: lldb-unit :: Target/./TargetTests/MemoryRegionInfoTest.Formatv (1437 of 2167) PASS: lldb-api :: macosx/nslog/TestDarwinNSLogOutput.py (1438 of 2167) PASS: lldb-api :: commands/register/register/register_command/TestRegisters.py (1439 of 2167) PASS: lldb-unit :: SymbolFile/NativePDB/./SymbolFileNativePDBTests/PDBFPOProgramToDWARFExpressionTests.MissingTargetRegister (1440 of 2167) PASS: lldb-unit :: Utility/./UtilityTests/GeneratorTest.Create (1441 of 2167) PASS: lldb-unit :: SymbolFile/DWARF/./SymbolFileDWARFTests/SymbolFileDWARFTests.TestAbbrevNullAttrValidForm (1442 of 2167) PASS: lldb-unit :: Utility/./UtilityTests/ScalarTest.Promotion (1443 of 2167) PASS: lldb-api :: tools/lldb-server/TestGdbRemoteKill.py (1444 of 2167) PASS: lldb-unit :: debugserver/./debugserverTests/RNBSocket.LoopBackListenIPv6 (1445 of 2167) PASS: lldb-shell :: ObjectFile/MachO/lc_build_version.yaml (1446 of 2167) PASS: lldb-api :: functionalities/tail_call_frames/disambiguate_paths_to_common_sink/TestDisambiguatePathsToCommonSink.py (1447 of 2167) UNSUPPORTED: lldb-api :: tools/lldb-server/thread-name/TestGdbRemoteThreadName.py (1448 of 2167) PASS: lldb-unit :: Utility/./UtilityTests/AnsiTerminal.WhiteSpace (1449 of 2167) PASS: lldb-unit :: API/./APITests/SBCommandInterpreterTest.MultiWordCommand (1450 of 2167) PASS: lldb-api :: lang/cpp/alignas_base_class/TestAlignAsBaseClass.py (1451 of 2167) UNSUPPORTED: lldb-shell :: SymbolFile/NativePDB/s_constant.cpp (1452 of 2167) PASS: lldb-api :: functionalities/thread/concurrent_events/TestConcurrentSignalDelayBreak.py (1453 of 2167) PASS: lldb-unit :: Utility/./UtilityTests/UriParserTest.BracketedHostnameWithColon (1454 of 2167) PASS: lldb-api :: lang/objc/objc-foundation-dictionary-empty/TestNSDictionary0.py (1455 of 2167) PASS: lldb-unit :: Utility/./UtilityTests/RangeTest.ContainsEndInclusiveInvalid (1456 of 2167) PASS: lldb-unit :: Host/./HostTests/SocketTests/SocketTest.TCPListen0GetPort/ipv6 (1457 of 2167) PASS: lldb-api :: macosx/dyld-trie-symbols/TestDyldTrieSymbols.py (1458 of 2167) PASS: lldb-unit :: Expression/./ExpressionTests/CppModuleConfigurationTest.Linux (1459 of 2167) XFAIL: lldb-shell :: Register/x86-64-write.test (1460 of 2167) PASS: lldb-api :: lang/objc/rdar-10967107/TestRdar10967107.py (1461 of 2167) PASS: lldb-api :: arm/emulation/TestEmulations.py (1462 of 2167) PASS: lldb-api :: functionalities/breakpoint/breakpoint_callback_command_source/TestBreakpointCallbackCommandSource.py (1463 of 2167) PASS: lldb-api :: types/TestFloatTypesExpr.py (1464 of 2167) UNSUPPORTED: lldb-api :: functionalities/thread/concurrent_events/TestConcurrentWatchpointWithDelayWatchpointThreads.py (1465 of 2167) PASS: lldb-unit :: DataFormatter/./LLDBFormatterTests/TypeMatcherTests.GetMatchStringRegex (1466 of 2167) PASS: lldb-unit :: Host/./HostTests/MainLoopTest.UnmonitoredSignal (1467 of 2167) PASS: lldb-api :: functionalities/show_location/TestShowLocationDwarf5.py (1468 of 2167) PASS: lldb-shell :: SymbolFile/DWARF/find-qualified-variable.cpp (1469 of 2167) PASS: lldb-unit :: ObjectFile/Breakpad/./ObjectFileBreakpadTests/StackCFIRecord.parse (1470 of 2167) PASS: lldb-unit :: Utility/./UtilityTests/StreamTest.PutPtr (1471 of 2167) UNSUPPORTED: lldb-shell :: SymbolFile/DWARF/dwp-separate-debug-file.cpp (1472 of 2167) PASS: lldb-unit :: Utility/./UtilityTests/ScalarTest.SetValueFromData (1473 of 2167) PASS: lldb-api :: sample_test/TestSampleTest.py (1474 of 2167) PASS: lldb-unit :: Utility/./UtilityTests/OptionsWithRawTest.EmptyArgsOnlySuffix (1475 of 2167) PASS: lldb-shell :: ObjectFile/PECOFF/sections.yaml (1476 of 2167) PASS: lldb-unit :: Utility/./UtilityTests/RangeDataVector.FindEntryThatContains_Overlap (1477 of 2167) PASS: lldb-unit :: Utility/./UtilityTests/OptionsWithRawTest.TerminatedQuote (1478 of 2167) PASS: lldb-unit :: Utility/./UtilityTests/FileSpecTest.Equal (1479 of 2167) PASS: lldb-api :: macosx/save_crashlog/TestSaveCrashlog.py (1480 of 2167) PASS: lldb-api :: iohandler/unicode/TestUnicode.py (1481 of 2167) PASS: lldb-unit :: Utility/./UtilityTests/TimerTest.CategoryTimesNested (1482 of 2167) PASS: lldb-api :: commands/expression/call-throws/TestCallThatThrows.py (1483 of 2167) PASS: lldb-unit :: Utility/./UtilityTests/StringExtractorTest.GetHexU8_Underflow2 (1484 of 2167) PASS: lldb-unit :: Utility/./UtilityTests/StringExtractorTest.GetHexU8_Underflow2_NoEof (1485 of 2167) PASS: lldb-unit :: Utility/./UtilityTests/ArgsTest.TestUnknownEscape (1486 of 2167) PASS: lldb-unit :: Utility/./UtilityTests/RangeDataVector.FindEntryIndexesThatContain (1487 of 2167) PASS: lldb-api :: lang/c/unions/TestUnionMembers.py (1488 of 2167) PASS: lldb-api :: functionalities/breakpoint/debugbreak/TestDebugBreak.py (1489 of 2167) PASS: lldb-unit :: Host/./HostTests/SocketTests/SocketTest.TCPListen0GetPort/ipv4 (1490 of 2167) PASS: lldb-api :: commands/add-dsym/uuid/TestAddDsymCommand.py (1491 of 2167) PASS: lldb-unit :: Utility/./UtilityTests/VASprintfTest.NoBufferResize (1492 of 2167) PASS: lldb-api :: python_api/value_var_update/TestValueVarUpdate.py (1493 of 2167) UNSUPPORTED: lldb-api :: functionalities/data-formatter/data-formatter-stl/libstdcpp/vbool/TestDataFormatterStdVBool.py (1494 of 2167) PASS: lldb-shell :: SymbolFile/DWARF/childless-compile-unit.s (1495 of 2167) PASS: lldb-unit :: ObjectFile/ELF/./ObjectFileELFTests/ObjectFileELFTest.GetSymtab_NoSymEntryPointArmThumbAddressClass (1496 of 2167) PASS: lldb-unit :: Expression/./ExpressionTests/CppModuleConfigurationTest.AmbiguousCLib (1497 of 2167) PASS: lldb-api :: functionalities/pre_run_dylibs/TestPreRunDylibs.py (1498 of 2167) PASS: lldb-api :: commands/thread/select/TestThreadSelect.py (1499 of 2167) PASS: lldb-unit :: Utility/./UtilityTests/StringListTest.RemoveBlankLines (1500 of 2167) UNSUPPORTED: lldb-api :: tools/lldb-server/memory-allocation/TestGdbRemoteMemoryAllocation.py (1501 of 2167) PASS: lldb-unit :: Symbol/./SymbolTests/TestTypeSystemClang.TestGetTypeClassTypeOf (1502 of 2167) PASS: lldb-shell :: Reproducer/Functionalities/TestImageList.test (1503 of 2167) UNSUPPORTED: lldb-api :: functionalities/thread/concurrent_events/TestConcurrentManySignals.py (1504 of 2167) PASS: lldb-shell :: SymbolFile/DWARF/module-ownership.mm (1505 of 2167) PASS: lldb-api :: lang/cpp/template-specialization-type/TestTemplateSpecializationType.py (1506 of 2167) UNSUPPORTED: lldb-shell :: SymbolFile/DWARF/debug-types-expressions.test (1507 of 2167) PASS: lldb-shell :: ScriptInterpreter/Python/sb_address_exception.test (1508 of 2167) PASS: lldb-unit :: ObjectFile/PECOFF/./ObjectFilePECOFFTests/PECallFrameInfoTest.Chained_eh (1509 of 2167) PASS: lldb-shell :: SymbolFile/Breakpad/unwind-via-stack-win.test (1510 of 2167) PASS: lldb-unit :: Utility/./UtilityTests/StringExtractorTest.DecodeHexU8_Extra (1511 of 2167) PASS: lldb-shell :: ObjectFile/ELF/avr-basic-info.yaml (1512 of 2167) PASS: lldb-api :: lang/cpp/template-function/TestTemplateFunctions.py (1513 of 2167) PASS: lldb-api :: tools/lldb-vscode/coreFile/TestVSCode_coreFile.py (1514 of 2167) UNSUPPORTED: lldb-shell :: SymbolFile/DWARF/dir-separator-no-comp-dir.s (1515 of 2167) PASS: lldb-unit :: Utility/./UtilityTests/DataExtractorTest.GetMaxS64 (1516 of 2167) PASS: lldb-api :: tools/lldb-server/register-reading/TestGdbRemoteGPacket.py (1517 of 2167) PASS: lldb-unit :: Utility/./UtilityTests/RangeTest.SlideZero (1518 of 2167) UNSUPPORTED: lldb-shell :: SymbolFile/NativePDB/break-by-function.cpp (1519 of 2167) PASS: lldb-unit :: Utility/./UtilityTests/DataExtractorTest.GetULEB128_bit63 (1520 of 2167) PASS: lldb-unit :: Target/./TargetTests/StackFrameRecognizerTest.NullModuleRegex (1521 of 2167) PASS: lldb-unit :: Process/minidump/./LLDBMinidumpTests/MinidumpParserTest.MinidumpDuplicateModuleSeparateCode (1522 of 2167) PASS: lldb-api :: lang/objc/objc-new-syntax/TestObjCNewSyntaxArray.py (1523 of 2167) PASS: lldb-unit :: Symbol/./SymbolTests/LineEntryTest.GetSameLineContiguousAddressRangeNoInlines (1524 of 2167) PASS: lldb-unit :: Host/./HostTests/SocketTests/SocketTest.TCPListen0ConnectAccept/ipv6 (1525 of 2167) PASS: lldb-api :: functionalities/gdb_remote_client/TestArmRegisterDefinition.py (1526 of 2167) PASS: lldb-unit :: Utility/./UtilityTests/StringExtractorTest.DecodeHexU8_Exact (1527 of 2167) PASS: lldb-api :: lang/objc/foundation/TestFoundationDisassembly.py (1528 of 2167) PASS: lldb-shell :: ObjectFile/ELF/aarch64-relocations.yaml (1529 of 2167) PASS: lldb-unit :: Process/minidump/./LLDBMinidumpTests/MinidumpParserTest.GetMemoryRegionInfo (1530 of 2167) PASS: lldb-unit :: Process/gdb-remote/./ProcessGdbRemoteTests/GDBRemoteCommunicationServerTest.SendErrorResponse_ErrorNumber (1531 of 2167) PASS: lldb-unit :: ScriptInterpreter/Python/./ScriptInterpreterPythonTests/PythonDataObjectsTest.TestPythonCallableCheck (1532 of 2167) UNSUPPORTED: lldb-api :: functionalities/thread/concurrent_events/TestConcurrentSignalDelayWatch.py (1533 of 2167) PASS: lldb-api :: commands/expression/xvalue/TestXValuePrinting.py (1534 of 2167) PASS: lldb-unit :: Utility/./UtilityTests/StreamTeeTest.Flush (1535 of 2167) UNSUPPORTED: lldb-api :: macosx/macCatalystAppMacOSFramework/TestMacCatalystAppWithMacOSFramework.py (1536 of 2167) PASS: lldb-api :: commands/expression/argument_passing_restrictions/TestArgumentPassingRestrictions.py (1537 of 2167) PASS: lldb-api :: functionalities/data-formatter/synthupdate/TestSyntheticFilterRecompute.py (1538 of 2167) PASS: lldb-unit :: Process/minidump/./LLDBMinidumpTests/MinidumpParserTest.InvalidMinidump (1539 of 2167) UNSUPPORTED: lldb-api :: commands/watchpoints/variable_out_of_scope/TestWatchedVarHitWhenInScope.py (1540 of 2167) PASS: lldb-api :: functionalities/thread_plan/TestThreadPlanCommands.py (1541 of 2167) PASS: lldb-unit :: Process/gdb-remote/./ProcessGdbRemoteTests/GDBRemoteCommunicationClientTest.SendStartTracePacket (1542 of 2167) PASS: lldb-shell :: BuildScript/toolchain-clang.test (1543 of 2167) PASS: lldb-api :: functionalities/memory/cache/TestMemoryCache.py (1544 of 2167) PASS: lldb-shell :: Reproducer/TestDebugSymbols.test (1545 of 2167) UNSUPPORTED: lldb-api :: functionalities/darwin_log/filter/regex/activity/TestDarwinLogFilterRegexActivity.py (1546 of 2167) PASS: lldb-api :: python_api/frame/get-variables/TestGetVariables.py (1547 of 2167) PASS: lldb-unit :: Utility/./UtilityTests/StreamTest.AddressSize (1548 of 2167) PASS: lldb-unit :: Interpreter/./InterpreterTests/CompletionTest.DirCompletionAbsolute (1549 of 2167) PASS: lldb-unit :: UnwindAssembly/x86/./UnwindAssemblyx86Tests/Testx86AssemblyInspectionEngine.Test64bitFramelessSmallStackFrame (1550 of 2167) PASS: lldb-api :: commands/target/create-no-such-arch/TestNoSuchArch.py (1551 of 2167) PASS: lldb-unit :: Utility/./UtilityTests/StringExtractorTest.GetHexBytes_Partial (1552 of 2167) PASS: lldb-unit :: Utility/./UtilityTests/OptionsWithRawTest.MultiWordSuffix (1553 of 2167) UNSUPPORTED: lldb-api :: functionalities/data-formatter/data-formatter-stl/libstdcpp/iterator/TestDataFormatterStdIterator.py (1554 of 2167) PASS: lldb-api :: commands/expression/import-std-module/unique_ptr-dbg-info-content/TestUniquePtrDbgInfoContent.py (1555 of 2167) PASS: lldb-unit :: Utility/./UtilityTests/ArchSpecTest.TestParseMachCPUDashSubtypeTripleExtra (1556 of 2167) UNSUPPORTED: lldb-api :: functionalities/thread/concurrent_events/TestConcurrentDelayedCrashWithBreakpointWatchpoint.py (1557 of 2167) PASS: lldb-api :: functionalities/archives/TestBSDArchives.py (1558 of 2167) UNSUPPORTED: lldb-shell :: SymbolFile/DWARF/find-inline-method.s (1559 of 2167) PASS: lldb-api :: commands/expression/import-std-module/list-dbg-info-content/TestDbgInfoContentListFromStdModule.py (1560 of 2167) PASS: lldb-api :: lang/objc/objc-struct-return/TestObjCStructReturn.py (1561 of 2167) PASS: lldb-unit :: Signals/./SignalsTests/UnixSignalsTest.GetInfo (1562 of 2167) PASS: lldb-api :: api/log/TestAPILog.py (1563 of 2167) PASS: lldb-unit :: Utility/./UtilityTests/ArchSpecTest.YAML (1564 of 2167) UNSUPPORTED: lldb-api :: functionalities/thread/concurrent_events/TestConcurrentNWatchNBreak.py (1565 of 2167) UNSUPPORTED: lldb-api :: python_api/watchpoint/condition/TestWatchpointConditionAPI.py (1566 of 2167) PASS: lldb-api :: functionalities/abbreviation/TestCommonShortSpellings.py (1567 of 2167) PASS: lldb-unit :: Utility/./UtilityTests/ConstStringTest.YAML (1568 of 2167) PASS: lldb-api :: lang/cpp/diamond/TestDiamond.py (1569 of 2167) PASS: lldb-unit :: Language/Highlighting/./HighlighterTests/HighlighterTest.ClangPPDirectives (1570 of 2167) PASS: lldb-unit :: Expression/./ExpressionTests/DWARFExpression.DW_OP_stack_value (1571 of 2167) PASS: lldb-api :: functionalities/tail_call_frames/thread_step_out_message/TestArtificialFrameStepOutMessage.py (1572 of 2167) PASS: lldb-api :: lang/cpp/global_operators/TestCppGlobalOperators.py (1573 of 2167) UNSUPPORTED: lldb-api :: functionalities/unwind/ehframe/TestEhFrameUnwind.py (1574 of 2167) UNSUPPORTED: lldb-api :: functionalities/asan/TestMemoryHistory.py (1575 of 2167) UNSUPPORTED: lldb-api :: functionalities/thread/concurrent_events/TestConcurrentManyWatchpoints.py (1576 of 2167) PASS: lldb-unit :: ScriptInterpreter/Python/./ScriptInterpreterPythonTests/PythonDataObjectsTest.TestExtractingUInt64ThroughStructuredData (1577 of 2167) PASS: lldb-api :: functionalities/unwind/sigtramp/TestSigtrampUnwind.py (1578 of 2167) PASS: lldb-api :: python_api/exprpath_synthetic/TestExprPathSynthetic.py (1579 of 2167) PASS: lldb-api :: lang/c/local_types/TestUseClosestType.py (1580 of 2167) PASS: lldb-shell :: Driver/TestCommands.test (1581 of 2167) UNSUPPORTED: lldb-api :: commands/expression/call-restarts/TestCallThatRestarts.py (1582 of 2167) PASS: lldb-api :: functionalities/optimized_code/TestNoASanExceptionAfterEvalOP_piece.py (1583 of 2167) PASS: lldb-api :: macosx/load-kext/TestLoadKext.py (1584 of 2167) PASS: lldb-shell :: Reproducer/TestCaptureEnvOverride.test (1585 of 2167) PASS: lldb-api :: commands/command/script/TestCommandScript.py (1586 of 2167) PASS: lldb-shell :: ObjectFile/ELF/minidebuginfo-corrupt-xz.yaml (1587 of 2167) UNSUPPORTED: lldb-api :: lang/objc/objc-dynamic-value/TestObjCDynamicValue.py (1588 of 2167) PASS: lldb-unit :: Utility/./UtilityTests/UriParserTest.BracketedHostname (1589 of 2167) PASS: lldb-api :: python_api/formatters/TestFormattersSBAPI.py (1590 of 2167) UNSUPPORTED: lldb-shell :: ScriptInterpreter/Lua/watchpoint_callback.test (1591 of 2167) PASS: lldb-unit :: Utility/./UtilityTests/StringLexerTest.NextIfList (1592 of 2167) PASS: lldb-unit :: Process/minidump/./LLDBMinidumpTests/MinidumpParserTest.GetMiscInfoWindows (1593 of 2167) UNSUPPORTED: lldb-api :: functionalities/ubsan/basic/TestUbsanBasic.py (1594 of 2167) PASS: lldb-unit :: Expression/./ExpressionTests/ClangExpressionDeclMapTest.TestPersistentDeclLookup (1595 of 2167) UNSUPPORTED: lldb-api :: arm/breakpoint-thumb-codesection/TestBreakpointThumbCodesection.py (1596 of 2167) PASS: lldb-shell :: SymbolFile/DWARF/debug_rnglists.s (1597 of 2167) PASS: lldb-api :: lang/objc/objc-ivar-offsets/TestObjCIvarOffsets.py (1598 of 2167) PASS: lldb-shell :: SymbolFile/DWARF/debug-types-missing-signature.test (1599 of 2167) PASS: lldb-unit :: Symbol/./SymbolTests/TestTypeSystemClang.TestGetBasicTypeFromName (1600 of 2167) PASS: lldb-api :: macosx/add-dsym/TestAddDsymMidExecutionCommand.py (1601 of 2167) PASS: lldb-unit :: Utility/./UtilityTests/StreamTest.PutHex16ByteOrderBig (1602 of 2167) PASS: lldb-api :: functionalities/plugins/python_os_plugin/stepping_plugin_threads/TestOSPluginStepping.py (1603 of 2167) PASS: lldb-unit :: Utility/./UtilityTests/FileSpecTest.GetPath (1604 of 2167) PASS: lldb-unit :: Process/minidump/./LLDBMinidumpTests/RegisterContextMinidump.ConvertMinidumpContext_x86_64 (1605 of 2167) PASS: lldb-unit :: UnwindAssembly/x86/./UnwindAssemblyx86Tests/Testx86AssemblyInspectionEngine.Testi386IgnoredRegisters (1606 of 2167) PASS: lldb-unit :: Utility/./UtilityTests/StatusTest.ErrorCodeConstructor (1607 of 2167) PASS: lldb-unit :: Utility/./UtilityTests/StreamTest.AddressSuffix (1608 of 2167) PASS: lldb-api :: tools/lldb-vscode/breakpoint/TestVSCode_setFunctionBreakpoints.py (1609 of 2167) UNSUPPORTED: lldb-api :: functionalities/thread/concurrent_events/TestConcurrentSignalWatchBreak.py (1610 of 2167) PASS: lldb-unit :: Utility/./UtilityTests/StreamTest.PutRawBytesToBigEndian (1611 of 2167) PASS: lldb-unit :: UnwindAssembly/x86/./UnwindAssemblyx86Tests/Testx86AssemblyInspectionEngine.TestPushRBP (1612 of 2167) PASS: lldb-api :: commands/expression/import-std-module/shared_ptr/TestSharedPtrFromStdModule.py (1613 of 2167) PASS: lldb-unit :: Symbol/./SymbolTests/TestClangASTImporter.CanImportInvalidType (1614 of 2167) PASS: lldb-unit :: Utility/./UtilityTests/StringExtractorTest.GetU64LittleEndian (1615 of 2167) PASS: lldb-unit :: Utility/./UtilityTests/NameMatchesTest.EndsWith (1616 of 2167) PASS: lldb-unit :: ScriptInterpreter/Python/./ScriptInterpreterPythonTests/PythonDataObjectsTest.TestPythonString (1617 of 2167) PASS: lldb-unit :: Utility/./UtilityTests/BinaryStreamTest.PutSLEB128MaxValue (1618 of 2167) PASS: lldb-unit :: Symbol/./SymbolTests/TestTypeSystemClang.TestRemoveFastQualifiers (1619 of 2167) PASS: lldb-api :: commands/frame/select/TestFrameSelect.py (1620 of 2167) PASS: lldb-unit :: Host/./HostTests/FileSystemTest.MakeAbsolute (1621 of 2167) XFAIL: lldb-shell :: Register/x86-mm-xmm-read.test (1622 of 2167) PASS: lldb-unit :: Host/./HostTests/SocketTests/SocketTest.UDPGetConnectURI/ipv4 (1623 of 2167) PASS: lldb-shell :: Register/x86-64-read.test (1624 of 2167) PASS: lldb-unit :: Utility/./UtilityTests/StreamTeeTest.CopyConstructor (1625 of 2167) PASS: lldb-shell :: ObjectFile/PECOFF/basic-info-arm.yaml (1626 of 2167) PASS: lldb-api :: python_api/sbvalue_persist/TestSBValuePersist.py (1627 of 2167) PASS: lldb-unit :: Process/./ProcessEventDataTests/ProcessEventDataTest.DoOnRemoval (1628 of 2167) PASS: lldb-shell :: Register/x86-64-gp-read.test (1629 of 2167) PASS: lldb-unit :: Utility/./UtilityTests/VMRange.Reset (1630 of 2167) PASS: lldb-api :: lang/cpp/nested-class-other-compilation-unit/TestNestedClassWithParentInAnotherCU.py (1631 of 2167) PASS: lldb-unit :: Language/Highlighting/./HighlighterTests/HighlighterTest.ClangSquareBrackets (1632 of 2167) UNSUPPORTED: lldb-api :: functionalities/data-formatter/data-formatter-stl/libstdcpp/tuple/TestDataFormatterStdTuple.py (1633 of 2167) PASS: lldb-unit :: Target/./TargetTests/ExecutionContextTest.GetByteOrder (1634 of 2167) PASS: lldb-shell :: Driver/TestRepl.test (1635 of 2167) PASS: lldb-unit :: Utility/./UtilityTests/StreamTest.PutSLEB128 (1636 of 2167) UNSUPPORTED: lldb-api :: functionalities/darwin_log/basic/TestDarwinLogBasic.py (1637 of 2167) UNSUPPORTED: lldb-api :: tools/lldb-server/signal-filtering/TestGdbRemote_QPassSignals.py (1638 of 2167) PASS: lldb-api :: python_api/frame/TestFrames.py (1639 of 2167) UNSUPPORTED: lldb-shell :: BuildScript/toolchain-msvc.test (1640 of 2167) PASS: lldb-unit :: SymbolFile/NativePDB/./SymbolFileNativePDBTests/PDBFPOProgramToDWARFExpressionTests.UnresolvedDependentCyclicRegisterAssignmentReference (1641 of 2167) PASS: lldb-unit :: Utility/./UtilityTests/DataExtractorTest.GetBitfield (1642 of 2167) PASS: lldb-api :: python_api/value/empty_class/TestValueAPIEmptyClass.py (1643 of 2167) UNSUPPORTED: lldb-shell :: SymbolFile/PDB/compilands.test (1644 of 2167) PASS: lldb-api :: functionalities/data-formatter/varscript_formatting/TestDataFormatterVarScriptFormatting.py (1645 of 2167) PASS: lldb-unit :: ObjectFile/ELF/./ObjectFileELFTests/ObjectFileELFTest.SectionsResolveConsistently (1646 of 2167) PASS: lldb-unit :: Language/Highlighting/./HighlighterTests/HighlighterTest.ClangTrailingBackslashWithWhitespace (1647 of 2167) PASS: lldb-unit :: Symbol/./SymbolTests/TestClangASTImporter.ImportInvalidType (1648 of 2167) PASS: lldb-api :: commands/expression/call-function/TestCallStopAndContinue.py (1649 of 2167) PASS: lldb-unit :: Utility/./UtilityTests/XcodeSDKTest.GetSDKTypeForTriple (1650 of 2167) PASS: lldb-api :: lang/objc/conflicting-definition/TestConflictingDefinition.py (1651 of 2167) PASS: lldb-unit :: Process/gdb-remote/./ProcessGdbRemoteTests/GDBRemoteClientBaseTest.InterruptNoResponse (1652 of 2167) PASS: lldb-unit :: Utility/./UtilityTests/ArgsTest.BareSingleQuote (1653 of 2167) PASS: lldb-api :: functionalities/data-formatter/data-formatter-stl/libcxx/optional/TestDataFormatterLibcxxOptional.py (1654 of 2167) PASS: lldb-shell :: Reproducer/TestVersionCheck.test (1655 of 2167) PASS: lldb-api :: commands/statistics/basic/TestStats.py (1656 of 2167) UNSUPPORTED: lldb-shell :: Register/arm-fp-read.test (1657 of 2167) PASS: lldb-unit :: SymbolFile/DWARF/./SymbolFileDWARFTests/SymbolFileDWARFTests.TestAbbrevInvalidNULLTag (1658 of 2167) PASS: lldb-api :: functionalities/data-formatter/data-formatter-objc/nsindexpath/TestDataFormatterNSIndexPath.py (1659 of 2167) PASS: lldb-api :: commands/gui/basicdebug/TestGuiBasicDebug.py (1660 of 2167) PASS: lldb-api :: lang/objc/foundation/TestObjCMethods.py (1661 of 2167) PASS: lldb-unit :: Symbol/./SymbolTests/TestTypeSystemClang.TestGetBasicTypeFromEnum (1662 of 2167) PASS: lldb-api :: types/TestDoubleTypes.py (1663 of 2167) PASS: lldb-api :: functionalities/tail_call_frames/cross_object/TestCrossObjectTailCalls.py (1664 of 2167) XFAIL: lldb-shell :: Register/x86-multithread-write.test (1665 of 2167) PASS: lldb-unit :: Utility/./UtilityTests/DataExtractorTest.PeekData (1666 of 2167) PASS: lldb-shell :: Process/UnsupportedLanguage.test (1667 of 2167) PASS: lldb-unit :: Process/gdb-remote/./ProcessGdbRemoteTests/GDBRemoteCommunicationClientTest.GetQOffsets (1668 of 2167) PASS: lldb-api :: lang/c/set_values/TestSetValues.py (1669 of 2167) PASS: lldb-unit :: Utility/./UtilityTests/NameMatchesTest.StartsWith (1670 of 2167) PASS: lldb-shell :: Breakpoint/single-file-split-dwarf.test (1671 of 2167) PASS: lldb-unit :: Utility/./UtilityTests/ConstStringTest.CompareConstString (1672 of 2167) PASS: lldb-unit :: Utility/./UtilityTests/StringExtractorTest.GetHexBytes (1673 of 2167) PASS: lldb-api :: functionalities/inferior-crashing/TestInferiorCrashing.py (1674 of 2167) PASS: lldb-api :: commands/expression/context-object/TestContextObject.py (1675 of 2167) PASS: lldb-api :: lang/objc/foundation/TestRuntimeTypes.py (1676 of 2167) UNSUPPORTED: lldb-api :: tools/lldb-server/platform-process-connect/TestPlatformProcessConnect.py (1677 of 2167) UNSUPPORTED: lldb-api :: functionalities/tsan/multiple/TestTsanMultiple.py (1678 of 2167) UNSUPPORTED: lldb-api :: commands/expression/import_builtin_fileid/TestImportBuiltinFileID.py (1679 of 2167) PASS: lldb-unit :: Process/gdb-remote/./ProcessGdbRemoteTests/GDBRemoteCommunicationClientTest.WriteRegister (1680 of 2167) PASS: lldb-shell :: Quit/TestQuitExitCodeTooManyArgs.test (1681 of 2167) PASS: lldb-unit :: Utility/./UtilityTests/StringListTest.AppendListCStringArray (1682 of 2167) PASS: lldb-api :: functionalities/data-formatter/data-formatter-stl/libcxx/map/TestDataFormatterLibccMap.py (1683 of 2167) PASS: lldb-api :: python_api/sbenvironment/TestSBEnvironment.py (1684 of 2167) PASS: lldb-shell :: SymbolFile/DWARF/anon_class_w_and_wo_export_symbols.ll (1685 of 2167) PASS: lldb-unit :: Process/minidump/./LLDBMinidumpTests/MinidumpParserTest.GetMemoryRegionInfoFromMemory64List (1686 of 2167) UNSUPPORTED: lldb-shell :: SymbolFile/DWARF/limit-debug-info.s (1687 of 2167) PASS: lldb-unit :: Host/./HostTests/NativeProcessProtocolTest.SetBreakpointFailRead (1688 of 2167) PASS: lldb-api :: lang/c/conflicting-symbol/TestConflictingSymbol.py (1689 of 2167) PASS: lldb-api :: lang/c/global_variables/TestGlobalVariables.py (1690 of 2167) PASS: lldb-unit :: Expression/./ExpressionTests/DWARFExpression.DW_OP_piece (1691 of 2167) PASS: lldb-api :: functionalities/breakpoint/breakpoint_by_line_and_column/TestBreakpointByLineAndColumn.py (1692 of 2167) PASS: lldb-unit :: Utility/./UtilityTests/BinaryStreamTest.PutULEB128Zero (1693 of 2167) PASS: lldb-api :: python_api/lldbutil/iter/TestRegistersIterator.py (1694 of 2167) PASS: lldb-shell :: SymbolFile/DWARF/dwp.s (1695 of 2167) PASS: lldb-api :: lang/cpp/trivial_abi/TestTrivialABI.py (1696 of 2167) PASS: lldb-unit :: ScriptInterpreter/Python/./ScriptInterpreterPythonTests/PythonDataObjectsTest.TestObjectAttributes (1697 of 2167) PASS: lldb-api :: functionalities/data-formatter/dump_dynamic/TestDumpDynamic.py (1698 of 2167) PASS: lldb-unit :: Utility/./UtilityTests/OptionsWithRawTest.UnterminatedQuote (1699 of 2167) UNSUPPORTED: lldb-shell :: SymbolFile/NativePDB/ast-methods.cpp (1700 of 2167) UNSUPPORTED: lldb-shell :: Unwind/basic-block-sections.test (1701 of 2167) PASS: lldb-unit :: Utility/./UtilityTests/ArgsTest.GetShellSafeArgument (1702 of 2167) PASS: lldb-shell :: Settings/TestDisassemblyFormat.test (1703 of 2167) PASS: lldb-unit :: Utility/./UtilityTests/BinaryStreamTest.PutULEB128TwoBytes (1704 of 2167) PASS: lldb-unit :: ScriptInterpreter/Python/./ScriptInterpreterPythonTests/PythonDataObjectsTest.TestExceptions (1705 of 2167) PASS: lldb-unit :: Utility/./UtilityTests/StateTest.Formatv (1706 of 2167) PASS: lldb-api :: commands/target/stop-hook/disable/TestTargetStopHookDisable.py (1707 of 2167) PASS: lldb-shell :: SymbolFile/DWARF/static_scope.s (1708 of 2167) PASS: lldb-unit :: Utility/./UtilityTests/StreamTest.PutMaxHex64ByteOrderLittle (1709 of 2167) PASS: lldb-unit :: Host/./HostTests/SocketAddressTest.GetAddressInfo (1710 of 2167) PASS: lldb-unit :: DataFormatter/./LLDBFormatterTests/TypeMatcherTests.GetMatchStringExactName (1711 of 2167) PASS: lldb-unit :: Utility/./UtilityTests/ProcessInstanceInfo.DumpTable (1712 of 2167) PASS: lldb-unit :: Process/gdb-remote/./ProcessGdbRemoteTests/GDBRemoteClientBaseTest.SendContinueAndInterrupt2PacketBug (1713 of 2167) PASS: lldb-unit :: Utility/./UtilityTests/StringListTest.Join (1714 of 2167) PASS: lldb-unit :: Process/gdb-remote/./ProcessGdbRemoteTests/GDBRemoteCommunicationClientTest.SendStopTracePacket (1715 of 2167) PASS: lldb-unit :: UnwindAssembly/x86/./UnwindAssemblyx86Tests/Testx86AssemblyInspectionEngine.TestAddESP (1716 of 2167) PASS: lldb-api :: commands/expression/radar_9531204/TestPrintfAfterUp.py (1717 of 2167) PASS: lldb-unit :: Utility/./UtilityTests/FileSpecTest.CopyByAppendingPathComponent (1718 of 2167) PASS: lldb-unit :: Utility/./UtilityTests/ArgsTest.TestQuotedUnknownEscape (1719 of 2167) PASS: lldb-unit :: Utility/./UtilityTests/StreamTest.PutCharNull (1720 of 2167) UNSUPPORTED: lldb-api :: functionalities/darwin_log/source/debug/TestDarwinLogSourceDebug.py (1721 of 2167) PASS: lldb-api :: functionalities/thread/concurrent_events/TestConcurrentDelayedCrashWithBreakpointSignal.py (1722 of 2167) PASS: lldb-api :: lang/objc/objc++/TestObjCXX.py (1723 of 2167) PASS: lldb-unit :: Utility/./UtilityTests/StringExtractorTest.GetHexU8_Extra (1724 of 2167) PASS: lldb-unit :: Language/Highlighting/./HighlighterTests/HighlighterTest.ClangCursorPosAfterOtherToken (1725 of 2167) PASS: lldb-api :: functionalities/data-formatter/data-formatter-cpp/TestDataFormatterCpp.py (1726 of 2167) PASS: lldb-unit :: Process/minidump/./LLDBMinidumpTests/MinidumpParserTest.GetMemoryRegionInfoFromMemoryList (1727 of 2167) PASS: lldb-unit :: Host/./HostTests/HostInfoTest.GetHostname (1728 of 2167) PASS: lldb-unit :: tools/lldb-server/tests/./LLDBServerTests/TestBase.DebugserverEnv (1729 of 2167) PASS: lldb-shell :: SymbolFile/DWARF/debug_line-relative_path.s (1730 of 2167) PASS: lldb-api :: lang/objcxx/objcxx-ivar-vector/TestIvarVector.py (1731 of 2167) PASS: lldb-unit :: Host/./HostTests/ConnectionFileDescriptorTest.TCPGetURIv6 (1732 of 2167) PASS: lldb-unit :: Target/./TargetTests/ExecutionContextTest.GetByteOrderTarget (1733 of 2167) UNSUPPORTED: lldb-api :: functionalities/data-formatter/data-formatter-stl/libstdcpp/string/TestDataFormatterStdString.py (1734 of 2167) PASS: lldb-api :: functionalities/breakpoint/breakpoint_hit_count/TestBreakpointHitCount.py (1735 of 2167) PASS: lldb-shell :: Driver/TestPositionalArgs.test (1736 of 2167) PASS: lldb-api :: commands/target/select/TestTargetSelect.py (1737 of 2167) PASS: lldb-api :: lang/cpp/virtual-functions/TestCppVirtualFunctions.py (1738 of 2167) PASS: lldb-unit :: Core/./LLDBCoreTests/MangledTest.ResultForValidName (1739 of 2167) PASS: lldb-unit :: Utility/./UtilityTests/RegularExpression.Invalid (1740 of 2167) PASS: lldb-api :: tools/lldb-server/TestAppleSimulatorOSType.py (1741 of 2167) PASS: lldb-api :: lang/cpp/class_static/TestStaticVariables.py (1742 of 2167) PASS: lldb-unit :: Utility/./UtilityTests/RegularExpression.CopyAssignment (1743 of 2167) PASS: lldb-unit :: debugserver/./debugserverTests/RNBSocket.AnyListen (1744 of 2167) PASS: lldb-api :: commands/expression/result_numbering/TestResultNumbering.py (1745 of 2167) PASS: lldb-unit :: Thread/./ThreadTests/ThreadTest.GetPrivateStopInfo (1746 of 2167) PASS: lldb-shell :: ObjectFile/ELF/compressed-sections.yaml (1747 of 2167) PASS: lldb-shell :: ObjectFile/ELF/short-build-id.yaml (1748 of 2167) PASS: lldb-unit :: Utility/./UtilityTests/StringListTest.AppendStringStdString (1749 of 2167) UNSUPPORTED: lldb-shell :: Register/x86-64-ymm16-write.test (1750 of 2167) PASS: lldb-api :: commands/expression/weak_symbols/TestWeakSymbols.py (1751 of 2167) PASS: lldb-unit :: Utility/./UtilityTests/StringListTest.GetMaxStringLengthEqualSize (1752 of 2167) PASS: lldb-unit :: Utility/./UtilityTests/ArgsTest.TestSingleQuotedArgWithSpace (1753 of 2167) UNSUPPORTED: lldb-shell :: ObjectFile/ELF/basic-info.yaml (1754 of 2167) PASS: lldb-unit :: Utility/./UtilityTests/StringListTest.AppendStringMove (1755 of 2167) PASS: lldb-unit :: Process/minidump/./LLDBMinidumpTests/MinidumpParserTest.GetLinuxProcStatus_no_stream (1756 of 2167) PASS: lldb-unit :: debugserver/./debugserverTests/RNBSocket.LoopBackListenIPv4 (1757 of 2167) PASS: lldb-unit :: Utility/./UtilityTests/LogChannelTest.EnableOptions (1758 of 2167) PASS: lldb-unit :: Utility/./UtilityTests/StructuredDataTest.ParseJSONFromFile (1759 of 2167) PASS: lldb-unit :: ScriptInterpreter/Python/./ScriptInterpreterPythonTests/PythonDataObjectsTest.TestPythonStringToStr (1760 of 2167) PASS: lldb-unit :: Utility/./UtilityTests/StringListTest.JoinEmpty (1761 of 2167) PASS: lldb-unit :: Utility/./UtilityTests/StringListTest.SetSize (1762 of 2167) PASS: lldb-api :: lang/cpp/gmodules-templates/TestGModules.py (1763 of 2167) PASS: lldb-api :: types/TestIntegerType.py (1764 of 2167) PASS: lldb-unit :: UnwindAssembly/x86/./UnwindAssemblyx86Tests/Testx86AssemblyInspectionEngine.TestPushRBPWithREX (1765 of 2167) PASS: lldb-unit :: ObjectFile/ELF/./ObjectFileELFTests/ObjectFileELFTest.GetSymtab_NoSymEntryPointArmAddressClass (1766 of 2167) PASS: lldb-unit :: Utility/./UtilityTests/RegisterValueTest.GetSet8 (1767 of 2167) UNSUPPORTED: lldb-shell :: SymbolFile/NativePDB/ast-types.cpp (1768 of 2167) PASS: lldb-unit :: Utility/./UtilityTests/ArgsTest.TestQuotedTrailingBackslash (1769 of 2167) PASS: lldb-unit :: Utility/./UtilityTests/ConstStringTest.NullAndEmptyStates (1770 of 2167) PASS: lldb-shell :: SymbolFile/DWARF/dwarf5-atomic.s (1771 of 2167) UNSUPPORTED: lldb-shell :: Register/x86-64-xmm16-read.test (1772 of 2167) PASS: lldb-unit :: Utility/./UtilityTests/ArgsTest.TestMultipleArgs (1773 of 2167) UNSUPPORTED: lldb-shell :: Register/x86-64-xmm16-write.test (1774 of 2167) PASS: lldb-unit :: Utility/./UtilityTests/StringExtractorTest.GetHexU8_InvalidHex (1775 of 2167) UNSUPPORTED: lldb-api :: functionalities/darwin_log/filter/regex/message/TestDarwinLogFilterRegexMessage.py (1776 of 2167) PASS: lldb-shell :: Quit/TestQuitExitCode-30.test (1777 of 2167) PASS: lldb-unit :: Language/Highlighting/./HighlighterTests/HighlighterTest.ClangComments (1778 of 2167) PASS: lldb-shell :: ScriptInterpreter/None/none.test (1779 of 2167) PASS: lldb-shell :: Minidump/memory-region.yaml (1780 of 2167) PASS: lldb-api :: commands/expression/import-std-module/pair/TestPairFromStdModule.py (1781 of 2167) PASS: lldb-shell :: Minidump/Windows/broken-unwind.test (1782 of 2167) UNSUPPORTED: lldb-api :: commands/trace/TestTraceSchema.py (1783 of 2167) PASS: lldb-unit :: UnwindAssembly/x86/./UnwindAssemblyx86Tests/Testx86AssemblyInspectionEngine.TestDisassemblyMidFunctionEpilogues (1784 of 2167) PASS: lldb-api :: sanity/TestSettingSkipping.py (1785 of 2167) PASS: lldb-unit :: Utility/./UtilityTests/StringListTest.Clear (1786 of 2167) PASS: lldb-unit :: Utility/./UtilityTests/LogTest.LLDB_LOG_nullptr (1787 of 2167) PASS: lldb-unit :: ScriptInterpreter/Python/./ScriptInterpreterPythonTests/PythonDataObjectsTest.TestPythonBytes (1788 of 2167) PASS: lldb-unit :: Utility/./UtilityTests/AnsiTerminal.AtEnd (1789 of 2167) PASS: lldb-unit :: ObjectFile/Breakpad/./ObjectFileBreakpadTests/LineRecord.parse (1790 of 2167) UNSUPPORTED: lldb-shell :: SymbolFile/PDB/pointers.test (1791 of 2167) PASS: lldb-shell :: Breakpoint/split-dwarf5-debug-stroffsets.test (1792 of 2167) PASS: lldb-api :: functionalities/breakpoint/cpp/TestCPPBreakpointLocations.py (1793 of 2167) PASS: lldb-unit :: Utility/./UtilityTests/CompletionRequest.FakeLastArg (1794 of 2167) UNSUPPORTED: lldb-shell :: ScriptInterpreter/Lua/lua.test (1795 of 2167) PASS: lldb-api :: functionalities/breakpoint/serialize/TestBreakpointSerialization.py (1796 of 2167) PASS: lldb-unit :: Utility/./UtilityTests/TimeoutTest.Construction (1797 of 2167) PASS: lldb-shell :: Reproducer/Functionalities/TestStepping.test (1798 of 2167) PASS: lldb-api :: commands/expression/options/TestExprOptions.py (1799 of 2167) PASS: lldb-unit :: Utility/./UtilityTests/ArgsTest.TestOverwriteArgs (1800 of 2167) PASS: lldb-unit :: Utility/./UtilityTests/AnsiTerminal.Unknown (1801 of 2167) PASS: lldb-unit :: Utility/./UtilityTests/RangeTest.DefaultConstructor (1802 of 2167) PASS: lldb-shell :: SymbolFile/DWARF/clang-ast-from-dwarf-unamed-and-anon-structs.cpp (1803 of 2167) PASS: lldb-unit :: Host/./HostTests/HostInfoTest.GetXcodeSDK (1804 of 2167) PASS: lldb-unit :: Utility/./UtilityTests/StreamTest.PutBytesAsRawHex8ToLittleEndian (1805 of 2167) UNSUPPORTED: lldb-api :: functionalities/darwin_log/filter/exact_match/subsystem/TestDarwinLogFilterMatchSubsystem.py (1806 of 2167) PASS: lldb-unit :: Utility/./UtilityTests/StringListTest.ForRangeEmpty (1807 of 2167) PASS: lldb-unit :: Utility/./UtilityTests/GeneratorTest.YamlMultiProvider (1808 of 2167) PASS: lldb-unit :: Utility/./UtilityTests/DataExtractorTest.GetCStrEmpty (1809 of 2167) PASS: lldb-api :: lang/objc/objc-optimized/TestObjcOptimized.py (1810 of 2167) UNSUPPORTED: lldb-api :: functionalities/breakpoint/hardware_breakpoints/write_memory_with_hw_breakpoint/TestWriteMemoryWithHWBreakpoint.py (1811 of 2167) PASS: lldb-shell :: SymbolFile/DWARF/clang-ast-from-dwarf-objc-property.m (1812 of 2167) PASS: lldb-unit :: Utility/./UtilityTests/StringListTest.SplitIntoLinesEmpty (1813 of 2167) PASS: lldb-unit :: Process/minidump/./LLDBMinidumpTests/MinidumpParserTest.GetMiscInfo_no_stream (1814 of 2167) PASS: lldb-unit :: Expression/./ExpressionTests/ClangHostTest.ComputeClangResourceDirectory (1815 of 2167) PASS: lldb-shell :: Expr/TestMultilineExpr.test (1816 of 2167) UNSUPPORTED: lldb-shell :: Register/x86-zmm-read.test (1817 of 2167) PASS: lldb-unit :: Utility/./UtilityTests/ArgsTest.ReplaceArgumentAtIndexOutOfRange (1818 of 2167) PASS: lldb-api :: functionalities/data-formatter/var-in-aggregate-misuse/TestVarInAggregateMisuse.py (1819 of 2167) PASS: lldb-unit :: Utility/./UtilityTests/FileSpecTest.EqualSeparator (1820 of 2167) PASS: lldb-unit :: DataFormatter/./LLDBFormatterTests/TypeMatcherTests.CreatedBySameMatchString (1821 of 2167) PASS: lldb-unit :: UnwindAssembly/x86/./UnwindAssemblyx86Tests/Testx86AssemblyInspectionEngine.TestPushESI (1822 of 2167) PASS: lldb-api :: commands/log/basic/TestLogging.py (1823 of 2167) PASS: lldb-unit :: SymbolFile/NativePDB/./SymbolFileNativePDBTests/PDBFPOProgramToDWARFExpressionTests.MultipleIndependentAssignments (1824 of 2167) PASS: lldb-api :: commands/expression/formatters/TestFormatters.py (1825 of 2167) PASS: lldb-api :: commands/expression/import-std-module/unique_ptr/TestUniquePtrFromStdModule.py (1826 of 2167) PASS: lldb-unit :: Utility/./UtilityTests/BinaryStreamTest.PutSLEB128TwoBytes (1827 of 2167) PASS: lldb-unit :: Utility/./UtilityTests/UriParserTest.TypicalPortPathIPv6 (1828 of 2167) PASS: lldb-api :: commands/log/invalid-args/TestInvalidArgsLog.py (1829 of 2167) PASS: lldb-unit :: Utility/./UtilityTests/StreamTest.PutCStringWithStringRef (1830 of 2167) PASS: lldb-unit :: Utility/./UtilityTests/StringListTest.LongestCommonPrefixSingleElement (1831 of 2167) PASS: lldb-unit :: Utility/./UtilityTests/RangeDataVector.CustomSort (1832 of 2167) PASS: lldb-api :: python_api/lldbutil/frame/TestFrameUtils.py (1833 of 2167) PASS: lldb-unit :: SymbolFile/NativePDB/./SymbolFileNativePDBTests/PDBFPOProgramToDWARFExpressionTests.UnresolvedRegisterReference (1834 of 2167) PASS: lldb-api :: functionalities/data-formatter/data-formatter-stl/libcxx/tuple/TestDataFormatterLibcxxTuple.py (1835 of 2167) PASS: lldb-unit :: Utility/./UtilityTests/SubsystemRAIITest.NormalSubsystem (1836 of 2167) UNSUPPORTED: lldb-api :: tools/lldb-server/TestGdbRemoteModuleInfo.py (1837 of 2167) PASS: lldb-unit :: Language/CPlusPlus/./LanguageCPlusPlusTests/CPlusPlusLanguage.MethodNameParsing (1838 of 2167) PASS: lldb-api :: functionalities/data-formatter/language_category_updates/TestDataFormatterLanguageCategoryUpdates.py (1839 of 2167) PASS: lldb-unit :: Expression/./ExpressionTests/DiagnosticManagerTest.GetStringMultipleDiags (1840 of 2167) PASS: lldb-api :: commands/expression/unicode-in-variable/TestUnicodeInVariable.py (1841 of 2167) PASS: lldb-unit :: Utility/./UtilityTests/PassiveReplayTest.InstrumentedFoo (1842 of 2167) PASS: lldb-api :: commands/process/attach/TestProcessAttach.py (1843 of 2167) PASS: lldb-api :: lang/c/bitfields/TestBitfields.py (1844 of 2167) PASS: lldb-api :: functionalities/breakpoint/breakpoint_options/TestBreakpointOptions.py (1845 of 2167) PASS: lldb-shell :: Driver/TestConvenienceVariables.test (1846 of 2167) PASS: lldb-shell :: Driver/TestFile.test (1847 of 2167) PASS: lldb-api :: functionalities/gdb_remote_client/TestIOSSimulator.py (1848 of 2167) UNSUPPORTED: lldb-api :: functionalities/thread/create_during_step/TestCreateDuringStep.py (1849 of 2167) PASS: lldb-api :: commands/expression/call-function/TestCallUserDefinedFunction.py (1850 of 2167) PASS: lldb-unit :: Utility/./UtilityTests/DataExtractorTest.GetSLEB128_bit63 (1851 of 2167) UNSUPPORTED: lldb-api :: functionalities/thread/concurrent_events/TestConcurrentWatchBreak.py (1852 of 2167) PASS: lldb-unit :: Utility/./UtilityTests/StringExtractorTest.DecodeHexU8_InvalidHex (1853 of 2167) PASS: lldb-unit :: Utility/./UtilityTests/AnsiTerminal.Twice (1854 of 2167) UNSUPPORTED: lldb-shell :: SymbolFile/NativePDB/source-list.cpp (1855 of 2167) PASS: lldb-api :: commands/platform/basic/TestPlatformCommand.py (1856 of 2167) PASS: lldb-unit :: SymbolFile/DWARF/./SymbolFileDWARFTests/SymbolFileDWARFTests.TestAbbrevValidAttrNullForm (1857 of 2167) UNSUPPORTED: lldb-api :: lang/objc/modules-incomplete/TestIncompleteModules.py (1858 of 2167) PASS: lldb-unit :: Utility/./UtilityTests/UriParserTest.LongPath (1859 of 2167) PASS: lldb-api :: functionalities/gdb_remote_client/TestPlatformClient.py (1860 of 2167) PASS: lldb-unit :: ScriptInterpreter/Python/./ScriptInterpreterPythonTests/PythonDataObjectsTest.TestPythonTupleValues (1861 of 2167) PASS: lldb-unit :: Utility/./UtilityTests/BinaryStreamTest.PutULEB128FourBytes (1862 of 2167) PASS: lldb-api :: lang/objc/global_ptrs/TestGlobalObjects.py (1863 of 2167) PASS: lldb-unit :: Utility/./UtilityTests/VMRange.IsValid (1864 of 2167) PASS: lldb-api :: functionalities/data-formatter/data-formatter-objc/TestDataFormatterObjCNSDate.py (1865 of 2167) UNSUPPORTED: lldb-shell :: SymbolFile/NativePDB/function-types-builtins.cpp (1866 of 2167) XFAIL: lldb-shell :: Register/x86-64-ymm-write.test (1867 of 2167) PASS: lldb-unit :: Platform/./LLDBPlatformTests/PlatformAppleSimulatorTest.TestHostPlatformToSim (1868 of 2167) PASS: lldb-unit :: Utility/./UtilityTests/SerializationRountripTest.SerializeDeserializeObjectReference (1869 of 2167) PASS: lldb-api :: functionalities/stats_api/TestStatisticsAPI.py (1870 of 2167) PASS: lldb-unit :: Utility/./UtilityTests/UUIDTest.StringConverion (1871 of 2167) PASS: lldb-unit :: ScriptInterpreter/Python/./ScriptInterpreterPythonTests/PythonDataObjectsTest.TestPythonListValueEquality (1872 of 2167) PASS: lldb-unit :: Utility/./UtilityTests/DataExtractorTest.GetCStrUnterminated (1873 of 2167) PASS: lldb-api :: functionalities/plugins/command_plugin/TestPluginCommands.py (1874 of 2167) PASS: lldb-api :: lang/cpp/wchar_t/TestCxxWCharT.py (1875 of 2167) PASS: lldb-unit :: Utility/./UtilityTests/PassiveReplayTest.InstrumentedBarPtr (1876 of 2167) PASS: lldb-api :: lang/cpp/call-function/TestCallCPPFunction.py (1877 of 2167) PASS: lldb-api :: python_api/thread/TestThreadAPI.py (1878 of 2167) PASS: lldb-api :: commands/frame/diagnose/virtual-method-call/TestDiagnoseDereferenceVirtualMethodCall.py (1879 of 2167) PASS: lldb-unit :: Host/./HostTests/FileSystemTest.Readable (1880 of 2167) PASS: lldb-unit :: Utility/./UtilityTests/RangeTest.SizeTypes (1881 of 2167) PASS: lldb-shell :: ObjectFile/wasm/unified-debug-sections.yaml (1882 of 2167) PASS: lldb-unit :: Expression/./ExpressionTests/ClangExpressionDeclMapTest.TestUnknownIdentifierLookup (1883 of 2167) PASS: lldb-unit :: Utility/./UtilityTests/StringListTest.CopyListSingle (1884 of 2167) PASS: lldb-api :: commands/breakpoint/command/list/TestBreakpointCommandList.py (1885 of 2167) PASS: lldb-api :: lang/objc/foundation/TestObjCMethods2.py (1886 of 2167) UNSUPPORTED: lldb-api :: commands/watchpoints/watchpoint_commands/command/TestWatchpointCommandLLDB.py (1887 of 2167) PASS: lldb-unit :: Host/./HostTests/SocketTests/SocketTest.TCPGetConnectURI/ipv4 (1888 of 2167) PASS: lldb-shell :: ObjectFile/MachO/subsections.yaml (1889 of 2167) PASS: lldb-unit :: Utility/./UtilityTests/UriParserTest.BracketedHostnamePort (1890 of 2167) PASS: lldb-shell :: Watchpoint/SetErrorCases.test (1891 of 2167) PASS: lldb-api :: functionalities/gdb_remote_client/TestRecognizeBreakpoint.py (1892 of 2167) PASS: lldb-shell :: Commands/command-thread-select.test (1893 of 2167) PASS: lldb-api :: lang/objc/objc-ivar-protocols/TestIvarProtocols.py (1894 of 2167) PASS: lldb-unit :: Utility/./UtilityTests/ArchSpecTest.TestParseMachCPUDashSubtypeTripleSimple (1895 of 2167) UNSUPPORTED: lldb-api :: commands/watchpoints/multi_watchpoint_slots/TestWatchpointMultipleSlots.py (1896 of 2167) PASS: lldb-unit :: Process/gdb-remote/./ProcessGdbRemoteTests/GDBRemoteClientBaseTest.SendPacketAndReceiveResponseWithOutputSupport (1897 of 2167) UNSUPPORTED: lldb-shell :: SymbolFile/DWARF/find-basic-namespace.cpp (1898 of 2167) PASS: lldb-shell :: ObjectFile/ELF/section-permissions.yaml (1899 of 2167) UNSUPPORTED: lldb-api :: functionalities/gdb_remote_client/TestQemuAArch64TargetXml.py (1900 of 2167) PASS: lldb-unit :: Symbol/./SymbolTests/TestTypeSystemClang.TestDisplayNameEmpty (1901 of 2167) PASS: lldb-unit :: Target/./TargetTests/PathMappingListTest.RelativeTests (1902 of 2167) PASS: lldb-api :: functionalities/tail_call_frames/disambiguate_tail_call_seq/TestDisambiguateTailCallSeq.py (1903 of 2167) PASS: lldb-unit :: Utility/./UtilityTests/StringExtractorTest.GetNameColonValueSuccess (1904 of 2167) UNSUPPORTED: lldb-api :: commands/expression/namespace_local_var_same_name_obj_c/TestNamespaceLocalVarSameNameObjC.py (1905 of 2167) PASS: lldb-unit :: Expression/./ExpressionTests/CppModuleConfigurationTest.Sysroot (1906 of 2167) PASS: lldb-shell :: SymbolFile/DWARF/DW_OP_piece-smaller-than-struct.s (1907 of 2167) UNSUPPORTED: lldb-shell :: SymbolFile/PDB/variables-locations.test (1908 of 2167) UNSUPPORTED: lldb-api :: benchmarks/continue/TestBenchmarkContinue.py (1909 of 2167) PASS: lldb-unit :: Symbol/./SymbolTests/DWARFCallFrameInfoTest.Basic_dwarf3 (1910 of 2167) PASS: lldb-unit :: ObjectFile/PECOFF/./ObjectFilePECOFFTests/PECallFrameInfoTest.Basic_eh (1911 of 2167) PASS: lldb-api :: commands/expression/entry-bp/TestExprEntryBP.py (1912 of 2167) PASS: lldb-api :: lang/cpp/unsigned_types/TestUnsignedTypes.py (1913 of 2167) PASS: lldb-shell :: Reproducer/Functionalities/TestDataFormatter.test (1914 of 2167) PASS: lldb-api :: lang/objc/forward-decl/TestForwardDecl.py (1915 of 2167) PASS: lldb-unit :: Expression/./ExpressionTests/DiagnosticManagerTest.GetStringBasic (1916 of 2167) PASS: lldb-api :: functionalities/gdb_remote_client/TestGDBRemoteDiskFileCompletion.py (1917 of 2167) PASS: lldb-api :: functionalities/history/TestHistoryRecall.py (1918 of 2167) PASS: lldb-unit :: Utility/./UtilityTests/DataExtractorTest.GetFloatUnaligned (1919 of 2167) PASS: lldb-unit :: Utility/./UtilityTests/RecordReplayTest.InstrumentedFoo (1920 of 2167) PASS: lldb-unit :: tools/lldb-server/tests/./LLDBServerTests/StandardStartupTest.TestStopReplyContainsThreadPcs (1921 of 2167) PASS: lldb-api :: commands/frame/var/TestFrameVar.py (1922 of 2167) PASS: lldb-api :: functionalities/postmortem/minidump-new/TestMiniDumpNew.py (1923 of 2167) PASS: lldb-unit :: Utility/./UtilityTests/StringListTest.InsertStringAtIndexEnd (1924 of 2167) PASS: lldb-api :: functionalities/thread/exit_during_expression/TestExitDuringExpression.py (1925 of 2167) UNSUPPORTED: lldb-api :: commands/trace/TestTraceLoad.py (1926 of 2167) PASS: lldb-unit :: ObjectFile/Breakpad/./ObjectFileBreakpadTests/FuncRecord.parse (1927 of 2167) PASS: lldb-api :: functionalities/gdb_remote_client/TestNoWatchpointSupportInfo.py (1928 of 2167) PASS: lldb-unit :: Host/./HostTests/NativeProcessProtocolTest.ReadCStringFromMemory_MaxSize (1929 of 2167) PASS: lldb-api :: functionalities/data-formatter/poarray/TestPrintObjectArray.py (1930 of 2167) UNSUPPORTED: lldb-api :: tools/lldb-vscode/completions/TestVSCode_completions.py (1931 of 2167) PASS: lldb-unit :: Utility/./UtilityTests/ArchSpecTest.TestSetTriple (1932 of 2167) PASS: lldb-unit :: Utility/./UtilityTests/ArgsTest.DoubleQuotedItem (1933 of 2167) PASS: lldb-unit :: Utility/./UtilityTests/BroadcasterTest.BroadcastEvent (1934 of 2167) PASS: lldb-api :: commands/gui/invalid-args/TestInvalidArgsGui.py (1935 of 2167) PASS: lldb-unit :: Process/gdb-remote/./ProcessGdbRemoteTests/GDBRemoteCommunicationServerTest.SendErrorResponse_StringError (1936 of 2167) PASS: lldb-api :: functionalities/object-file/TestImageListMultiArchitecture.py (1937 of 2167) PASS: lldb-shell :: Minidump/dump-all.test (1938 of 2167) PASS: lldb-api :: commands/expression/invalid-args/TestInvalidArgsExpression.py (1939 of 2167) PASS: lldb-shell :: ObjectFile/PECOFF/symbol.yaml (1940 of 2167) PASS: lldb-shell :: Minidump/memory-region-from-module.yaml (1941 of 2167) PASS: lldb-api :: tools/lldb-vscode/breakpoint/TestVSCode_setExceptionBreakpoints.py (1942 of 2167) PASS: lldb-unit :: Language/Highlighting/./HighlighterTests/HighlighterTest.ClangOperators (1943 of 2167) PASS: lldb-api :: functionalities/gdb_remote_client/TestqOffsets.py (1944 of 2167) PASS: lldb-unit :: UnwindAssembly/x86/./UnwindAssemblyx86Tests/Testx86AssemblyInspectionEngine.TestSimple32bitFrameFunction (1945 of 2167) UNSUPPORTED: lldb-shell :: SymbolFile/NativePDB/tag-types.cpp (1946 of 2167) PASS: lldb-api :: functionalities/data-formatter/data-formatter-caching/TestDataFormatterCaching.py (1947 of 2167) PASS: lldb-unit :: Utility/./UtilityTests/ProcessInfoTest.Constructor (1948 of 2167) PASS: lldb-api :: lang/cpp/frame-var-anon-unions/TestFrameVariableAnonymousUnions.py (1949 of 2167) PASS: lldb-api :: lang/cpp/breakpoint-commands/TestCPPBreakpointCommands.py (1950 of 2167) PASS: lldb-unit :: Process/gdb-remote/./ProcessGdbRemoteTests/GDBRemoteCommunicationClientTest.SendGetTraceConfigPacket (1951 of 2167) PASS: lldb-api :: lang/cpp/const_this/TestConstThis.py (1952 of 2167) PASS: lldb-api :: commands/expression/persistent_types/TestPersistentTypes.py (1953 of 2167) PASS: lldb-unit :: UnwindAssembly/x86/./UnwindAssemblyx86Tests/Testx86AssemblyInspectionEngine.TestPushECX (1954 of 2167) UNSUPPORTED: lldb-api :: functionalities/thread/state/TestThreadStates.py (1955 of 2167) PASS: lldb-unit :: Utility/./UtilityTests/StreamTest.PutHex32ByteOrderBig (1956 of 2167) PASS: lldb-api :: lang/mixed/TestMixedLanguages.py (1957 of 2167) PASS: lldb-api :: commands/expression/multiline-navigation/TestMultilineNavigation.py (1958 of 2167) PASS: lldb-unit :: Utility/./UtilityTests/VASprintfTest.EncodingError (1959 of 2167) PASS: lldb-api :: functionalities/data-formatter/data-formatter-stl/libcxx/multiset/TestDataFormatterLibcxxMultiSet.py (1960 of 2167) PASS: lldb-shell :: Breakpoint/debug_rnglist_basic.test (1961 of 2167) PASS: lldb-api :: lang/objc/ivar-IMP/TestObjCiVarIMP.py (1962 of 2167) PASS: lldb-api :: functionalities/data-formatter/type_summary_list_script/TestTypeSummaryListScript.py (1963 of 2167) UNSUPPORTED: lldb-api :: python_api/event/TestEvents.py (1964 of 2167) PASS: lldb-unit :: Utility/./UtilityTests/StringExtractorTest.GetHexBytes_FullString (1965 of 2167) PASS: lldb-unit :: Utility/./UtilityTests/SerializationRountripTest.SerializeDeserializeCStringArrayNullptrElem (1966 of 2167) PASS: lldb-api :: tools/lldb-vscode/stackTrace/TestVSCode_stackTrace.py (1967 of 2167) PASS: lldb-api :: lang/c/record_decl_in_expr/TestRecordDeclInExpr.py (1968 of 2167) PASS: lldb-unit :: Utility/./UtilityTests/DataExtractorTest.GetMaxU64_unchecked (1969 of 2167) PASS: lldb-unit :: Utility/./UtilityTests/FileSpecTest.FormatFileSpec (1970 of 2167) UNSUPPORTED: lldb-api :: commands/expression/macros/TestMacros.py (1971 of 2167) PASS: lldb-unit :: UnwindAssembly/x86/./UnwindAssemblyx86Tests/Testx86AssemblyInspectionEngine.TestStackRealign32BitDisp_x86_64 (1972 of 2167) PASS: lldb-shell :: Driver/TestTarget.test (1973 of 2167) PASS: lldb-unit :: Utility/./UtilityTests/ConstStringTest.MangledCounterpart (1974 of 2167) PASS: lldb-unit :: Utility/./UtilityTests/ScalarTest.Comparison (1975 of 2167) PASS: lldb-api :: functionalities/reproducers/attach/TestReproducerAttach.py (1976 of 2167) UNSUPPORTED: lldb-api :: benchmarks/turnaround/TestCompileRunToBreakpointTurnaround.py (1977 of 2167) PASS: lldb-api :: commands/frame/diagnose/dereference-argument/TestDiagnoseDereferenceArgument.py (1978 of 2167) PASS: lldb-unit :: UnwindAssembly/x86/./UnwindAssemblyx86Tests/Testx86AssemblyInspectionEngine.Test32bitFramelessSmallStackFrame (1979 of 2167) UNSUPPORTED: lldb-shell :: ScriptInterpreter/Lua/persistent_state.test (1980 of 2167) UNSUPPORTED: lldb-shell :: SymbolFile/DWARF/dwarf5-partial-index.cpp (1981 of 2167) PASS: lldb-api :: lang/cpp/lambdas/TestLambdas.py (1982 of 2167) PASS: lldb-unit :: Utility/./UtilityTests/CompletionRequest.TryCompleteCurrentArgGood (1983 of 2167) PASS: lldb-api :: functionalities/data-formatter/data-formatter-stl/libstdcpp/unique_ptr/invalid/TestDataFormatterInvalidStdUniquePtr.py (1984 of 2167) PASS: lldb-unit :: Host/./HostTests/SocketTests/SocketTest.UDPGetConnectURI/ipv6 (1985 of 2167) PASS: lldb-unit :: Utility/./UtilityTests/LogTest.Unregister (1986 of 2167) PASS: lldb-api :: commands/expression/ir-interpreter/TestIRInterpreter.py (1987 of 2167) PASS: lldb-api :: functionalities/gdb_remote_client/TestGDBRemoteLoad.py (1988 of 2167) PASS: lldb-api :: functionalities/breakpoint/breakpoint_set_restart/TestBreakpointSetRestart.py (1989 of 2167) PASS: lldb-api :: commands/expression/class_template_specialization_empty_pack/TestClassTemplateSpecializationParametersHandling.py (1990 of 2167) PASS: lldb-unit :: Utility/./UtilityTests/ArgsTest.AppendArguments (1991 of 2167) PASS: lldb-api :: functionalities/data-formatter/data-formatter-objc/cmtime/TestDataFormatterCMTime.py (1992 of 2167) PASS: lldb-unit :: SymbolFile/DWARF/./SymbolFileDWARFTests/SymbolFileDWARFTests.TestAbbrevMissingTerminator (1993 of 2167) PASS: lldb-unit :: Process/minidump/./LLDBMinidumpTests/MinidumpParserTest.GetMemory (1994 of 2167) UNSUPPORTED: lldb-shell :: SymbolFile/DWARF/debug-types-signature-loop.s (1995 of 2167) UNSUPPORTED: lldb-shell :: Register/x86-64-ymm16-read.test (1996 of 2167) UNSUPPORTED: lldb-api :: linux/thread/create_during_instruction_step/TestCreateDuringInstructionStep.py (1997 of 2167) PASS: lldb-api :: functionalities/data-formatter/data-formatter-python-synth/TestDataFormatterPythonSynth.py (1998 of 2167) PASS: lldb-api :: commands/target/stop-hooks/TestStopHookScripted.py (1999 of 2167) PASS: lldb-unit :: SymbolFile/NativePDB/./SymbolFileNativePDBTests/PDBFPOProgramToDWARFExpressionTests.SingleAssignmentRegisterRef (2000 of 2167) UNSUPPORTED: lldb-shell :: ScriptInterpreter/Lua/bindings.test (2001 of 2167) PASS: lldb-unit :: Utility/./UtilityTests/StreamTest.PutCharWhitespace (2002 of 2167) UNSUPPORTED: lldb-api :: functionalities/tsan/global_location/TestTsanGlobalLocation.py (2003 of 2167) PASS: lldb-unit :: Utility/./UtilityTests/IndexToObjectTest.ObjectForIndex (2004 of 2167) PASS: lldb-unit :: Symbol/./SymbolTests/PostfixExpression.ToDWARF (2005 of 2167) PASS: lldb-unit :: ObjectFile/MachO/./ObjectFileMachOTests/ObjectFileMachOTest.ModuleFromSharedCacheInfo (2006 of 2167) PASS: lldb-unit :: Language/Highlighting/./HighlighterTests/HighlighterTest.ClangEmptyInput (2007 of 2167) UNSUPPORTED: lldb-api :: lang/cpp/breakpoint_in_member_func_w_non_primitive_params/TestBreakpointInMemberFuncWNonPrimitiveParams.py (2008 of 2167) PASS: lldb-api :: commands/apropos/basic/TestApropos.py (2009 of 2167) PASS: lldb-unit :: ScriptInterpreter/Python/./ScriptInterpreterPythonTests/PythonDataObjectsTest.TestPythonDictionaryToStructuredDictionary (2010 of 2167) PASS: lldb-api :: functionalities/data-formatter/data-formatter-synthtype/TestDataFormatterSynthType.py (2011 of 2167) PASS: lldb-unit :: Utility/./UtilityTests/ScalarTest.RightShiftOperator (2012 of 2167) PASS: lldb-unit :: Utility/./UtilityTests/XcodeSDKTest.GetCanonicalNameAndConstruct (2013 of 2167) PASS: lldb-api :: commands/expression/top-level/TestTopLevelExprs.py (2014 of 2167) PASS: lldb-unit :: Host/./HostTests/MainLoopTest.TerminatesImmediately (2015 of 2167) PASS: lldb-api :: tools/lldb-server/inferior-crash/TestGdbRemoteSegFault.py (2016 of 2167) UNSUPPORTED: lldb-shell :: ExecControl/StopHook/stop-hook-threads.test (2017 of 2167) PASS: lldb-unit :: Utility/./UtilityTests/OptionsWithRawTest.ArgsButNoDelimiter (2018 of 2167) PASS: lldb-api :: commands/expression/import-std-module/no-std-module/TestMissingStdModule.py (2019 of 2167) PASS: lldb-unit :: Core/./LLDBCoreTests/RichManglingContextTest.FromCxxMethodName (2020 of 2167) PASS: lldb-unit :: Process/gdb-remote/./ProcessGdbRemoteTests/GDBRemoteCommunicationClientTest.GetModulesInfoInvalidResponse (2021 of 2167) PASS: lldb-unit :: UnwindAssembly/x86/./UnwindAssemblyx86Tests/Testx86AssemblyInspectionEngine.TestStackRealignMSVC_i386 (2022 of 2167) PASS: lldb-api :: api/multiple-targets/TestMultipleTargets.py (2023 of 2167) PASS: lldb-unit :: UnwindAssembly/x86/./UnwindAssemblyx86Tests/Testx86AssemblyInspectionEngine.TestPopESI (2024 of 2167) PASS: lldb-unit :: ScriptInterpreter/Python/./ScriptInterpreterPythonTests/PythonDataObjectsTest.TestResetting (2025 of 2167) PASS: lldb-api :: commands/expression/pr35310/TestExprsBug35310.py (2026 of 2167) PASS: lldb-api :: functionalities/data-formatter/vector-types/TestVectorTypesFormatting.py (2027 of 2167) PASS: lldb-shell :: SymbolFile/Breakpad/unwind-via-stack-cfi.test (2028 of 2167) PASS: lldb-api :: tools/lldb-server/TestGdbRemoteExitCode.py (2029 of 2167) PASS: lldb-api :: lang/cpp/stl/TestSTL.py (2030 of 2167) PASS: lldb-api :: functionalities/data-formatter/type_summary_list_arg/TestTypeSummaryListArg.py (2031 of 2167) PASS: lldb-shell :: Reproducer/TestProcessList.test (2032 of 2167) PASS: lldb-api :: python_api/module_section/TestModuleAndSection.py (2033 of 2167) PASS: lldb-unit :: Utility/./UtilityTests/VMRange.Ordering (2034 of 2167) PASS: lldb-api :: lang/objc/radar-9691614/TestObjCMethodReturningBOOL.py (2035 of 2167) PASS: lldb-unit :: Utility/./UtilityTests/BinaryStreamTest.PutSLEB128NineBytes (2036 of 2167) PASS: lldb-unit :: Utility/./UtilityTests/Flags.Clear (2037 of 2167) PASS: lldb-unit :: Utility/./UtilityTests/ArgsTest.GetQuotedCommandString (2038 of 2167) PASS: lldb-api :: commands/platform/file/close/TestPlatformFileClose.py (2039 of 2167) PASS: lldb-unit :: Host/./HostTests/NativeProcessProtocolTest.SetBreakpointFailVerify (2040 of 2167) PASS: lldb-unit :: UnwindAssembly/x86/./UnwindAssemblyx86Tests/Testx86AssemblyInspectionEngine.TestPopR15 (2041 of 2167) PASS: lldb-unit :: Host/./HostTests/FileSystemTest.OpenErrno (2042 of 2167) PASS: lldb-api :: functionalities/avoids-fd-leak/TestFdLeak.py (2043 of 2167) PASS: lldb-api :: functionalities/wrong_commands/TestWrongCommands.py (2044 of 2167) PASS: lldb-api :: tools/lldb-server/commandline/TestStubReverseConnect.py (2045 of 2167) PASS: lldb-api :: functionalities/abbreviation/TestAbbreviations.py (2046 of 2167) PASS: lldb-api :: functionalities/data-formatter/data-formatter-stl/libcxx/vbool/TestDataFormatterLibcxxVBool.py (2047 of 2167) PASS: lldb-api :: functionalities/breakpoint/hardware_breakpoints/require_hw_breakpoints/TestRequireHWBreakpoints.py (2048 of 2167) PASS: lldb-unit :: Utility/./UtilityTests/RecordReplayTest.InstrumentedFooSameThis (2049 of 2167) PASS: lldb-unit :: DataFormatter/./LLDBFormatterTests/FormatManagerTests.CompatibleLangs (2050 of 2167) PASS: lldb-unit :: Utility/./UtilityTests/StreamTest.PutHex64ByteOrderBig (2051 of 2167) PASS: lldb-api :: commands/expression/persistent_variables/TestPersistentVariables.py (2052 of 2167) PASS: lldb-api :: commands/disassemble/basic/TestDisassembleBreakpoint.py (2053 of 2167) PASS: lldb-api :: commands/version/TestVersion.py (2054 of 2167) PASS: lldb-shell :: ObjectFile/wasm/embedded-debug-sections.yaml (2055 of 2167) PASS: lldb-unit :: Utility/./UtilityTests/DataExtractorTest.GetCStrAtNullOffset (2056 of 2167) PASS: lldb-unit :: Expression/./ExpressionTests/DWARFExpression.DW_OP_unknown (2057 of 2167) PASS: lldb-api :: functionalities/data-formatter/nssetsynth/TestNSSetSynthetic.py (2058 of 2167) PASS: lldb-unit :: Utility/./UtilityTests/SerializationRountripTest.SerializeDeserializeCStringNull (2059 of 2167) PASS: lldb-api :: functionalities/data-formatter/data-formatter-objc/TestDataFormatterObjCNSData.py (2060 of 2167) PASS: lldb-unit :: Utility/./UtilityTests/StringListTest.InsertStringAtIndexMove (2061 of 2167) UNSUPPORTED: lldb-shell :: Register/x86-64-zmm-read.test (2062 of 2167) PASS: lldb-api :: commands/expression/radar_9673664/TestExprHelpExamples.py (2063 of 2167) UNSUPPORTED: lldb-shell :: Minidump/Windows/arm-fp-unwind.test (2064 of 2167) PASS: lldb-unit :: Utility/./UtilityTests/StreamTeeTest.SetStreamAtIndexOverwrite (2065 of 2167) PASS: lldb-api :: lang/cpp/auto/TestCPPAuto.py (2066 of 2167) PASS: lldb-api :: functionalities/gdb_remote_client/TestStopPCs.py (2067 of 2167) PASS: lldb-unit :: UnwindAssembly/x86/./UnwindAssemblyx86Tests/Testx86AssemblyInspectionEngine.TestSimplex86_64Augmented (2068 of 2167) PASS: lldb-api :: functionalities/tail_call_frames/disambiguate_call_site/TestDisambiguateCallSite.py (2069 of 2167) UNSUPPORTED: lldb-shell :: Register/x86-fp-write.test (2070 of 2167) PASS: lldb-unit :: Utility/./UtilityTests/StreamTest.PutChar (2071 of 2167) PASS: lldb-unit :: Host/./HostTests/SocketTests/SocketTest.TCPGetAddress/ipv6 (2072 of 2167) PASS: lldb-api :: tools/lldb-vscode/breakpoint/TestVSCode_setBreakpoints.py (2073 of 2167) PASS: lldb-unit :: Utility/./UtilityTests/VMRange.SetEndAddress (2074 of 2167) PASS: lldb-api :: commands/reproducer/invalid-args/TestInvalidArgsReproducer.py (2075 of 2167) PASS: lldb-api :: functionalities/data-formatter/data-formatter-categories/TestDataFormatterCategories.py (2076 of 2167) PASS: lldb-api :: functionalities/thread/concurrent_events/TestConcurrentTwoBreakpointThreads.py (2077 of 2167) PASS: lldb-api :: functionalities/data-formatter/data-formatter-proper-plurals/TestFormattersOneIsSingular.py (2078 of 2167) PASS: lldb-unit :: Utility/./UtilityTests/StringExtractorTest.GetHexBytesAvail_OddPair (2079 of 2167) PASS: lldb-unit :: Utility/./UtilityTests/SerializationRountripTest.SerializeDeserializeObjectPointer (2080 of 2167) PASS: lldb-shell :: lldb-server/TestErrorMessages.test (2081 of 2167) UNSUPPORTED: lldb-api :: lang/objc/modules-app-update/TestClangModulesAppUpdate.py (2082 of 2167) PASS: lldb-unit :: Utility/./UtilityTests/FileSpecTest.EqualDotsPosixRoot (2083 of 2167) PASS: lldb-shell :: Unwind/thread-step-out-ret-addr-check.test (2084 of 2167) PASS: lldb-api :: lang/cpp/dynamic-value-same-basename/TestDynamicValueSameBase.py (2085 of 2167) PASS: lldb-shell :: ObjectFile/PECOFF/sections-names.yaml (2086 of 2167) UNSUPPORTED: lldb-api :: lang/objc/modules-hash-mismatch/TestClangModulesHashMismatch.py (2087 of 2167) UNSUPPORTED: lldb-api :: functionalities/darwin_log/filter/regex/activity-chain/TestDarwinLogFilterRegexActivityChain.py (2088 of 2167) PASS: lldb-api :: lang/c/stepping/TestStepAndBreakpoints.py (2089 of 2167) PASS: lldb-api :: lang/cpp/offsetof/TestOffsetofCpp.py (2090 of 2167) PASS: lldb-unit :: Utility/./UtilityTests/RangeTest.SetRangeBase (2091 of 2167) PASS: lldb-api :: lang/cpp/subst_template_type_param/TestSubstTemplateTypeParam.py (2092 of 2167) UNSUPPORTED: lldb-api :: python_api/watchpoint/TestWatchpointIter.py (2093 of 2167) PASS: lldb-unit :: Utility/./UtilityTests/UriParserTest.MinimalPortPath (2094 of 2167) PASS: lldb-api :: assert_messages_test/TestAssertMessages.py (2095 of 2167) PASS: lldb-unit :: Utility/./UtilityTests/StreamTest.ShiftOperatorStrings (2096 of 2167) PASS: lldb-unit :: Utility/./UtilityTests/FileSpecTest.FileAndDirectoryComponents (2097 of 2167) PASS: lldb-unit :: Signals/./SignalsTests/UnixSignalsTest.Iteration (2098 of 2167) PASS: lldb-shell :: Minidump/breakpad-symbols.test (2099 of 2167) PASS: lldb-api :: lang/cpp/std-function-step-into-callable/TestStdFunctionStepIntoCallable.py (2100 of 2167) PASS: lldb-shell :: SymbolFile/DWARF/debug_ranges-missing-section.s (2101 of 2167) PASS: lldb-api :: functionalities/data-formatter/data-formatter-objc/TestDataFormatterObjCNSURL.py (2102 of 2167) PASS: lldb-unit :: Core/./LLDBCoreTests/ModuleSpecTest.TestCOFFFile (2103 of 2167) UNSUPPORTED: lldb-api :: lang/cpp/printf/TestPrintf.py (2104 of 2167) PASS: lldb-unit :: Utility/./UtilityTests/TimerTest.CategoryTimes (2105 of 2167) PASS: lldb-unit :: Utility/./UtilityTests/StringListTest.GetMaxStringLengthIncreasingSize (2106 of 2167) PASS: lldb-shell :: Commands/command-regex-unalias.test (2107 of 2167) PASS: lldb-unit :: Utility/./UtilityTests/Flags.Test (2108 of 2167) PASS: lldb-api :: lang/cpp/llvm-style/TestLLVMStyle.py (2109 of 2167) UNSUPPORTED: lldb-shell :: SymbolFile/NativePDB/global-classes.cpp (2110 of 2167) PASS: lldb-unit :: ScriptInterpreter/Python/./ScriptInterpreterPythonTests/PythonDataObjectsTest.TestInstanceNameResolutionNoDot (2111 of 2167) PASS: lldb-api :: functionalities/data-formatter/typedef_array/TestTypedefArray.py (2112 of 2167) UNSUPPORTED: lldb-shell :: SymbolFile/DWARF/DW_TAG_GNU_call_site-DW_AT_low_pc.s (2113 of 2167) PASS: lldb-api :: commands/expression/function_template_specialization_temp_args/TestFunctionTemplateSpecializationTempArgs.py (2114 of 2167) PASS: lldb-shell :: SymbolFile/DWARF/debug-types-dwarf5.s (2115 of 2167) PASS: lldb-api :: lang/cpp/incomplete-types/TestCppIncompleteTypes.py (2116 of 2167) PASS: lldb-unit :: Utility/./UtilityTests/CompletionRequest.ShiftArguments (2117 of 2167) PASS: lldb-unit :: Utility/./UtilityTests/StringListTest.CopyListEmpty (2118 of 2167) PASS: lldb-api :: lang/cpp/char8_t/TestCxxChar8_t.py (2119 of 2167) UNSUPPORTED: lldb-shell :: SymbolFile/DWARF/win-i386-line-table.s (2120 of 2167) PASS: lldb-unit :: UnwindAssembly/x86/./UnwindAssemblyx86Tests/Testx86AssemblyInspectionEngine.Test32BitOnlyInstruction (2121 of 2167) PASS: lldb-unit :: UnwindAssembly/x86/./UnwindAssemblyx86Tests/Testx86AssemblyInspectionEngine.TestPopRBPWithREX (2122 of 2167) PASS: lldb-shell :: Commands/command-stop-hook-output.test (2123 of 2167) PASS: lldb-unit :: Expression/./ExpressionTests/DWARFExpression.DW_OP_pick (2124 of 2167) PASS: lldb-api :: lang/objc/objc-static-method/TestObjCStaticMethod.py (2125 of 2167) PASS: lldb-api :: lang/objc/objc-class-method/TestObjCClassMethod.py (2126 of 2167) PASS: lldb-unit :: Utility/./UtilityTests/ProcessInstanceInfo.Dump (2127 of 2167) PASS: lldb-shell :: SymbolFile/DWARF/gnu-style-compression.cpp (2128 of 2167) PASS: lldb-unit :: SymbolFile/DWARF/./SymbolFileDWARFTests/SymbolFileDWARFTests.ParseArangesNonzeroSegmentSize (2129 of 2167) UNSUPPORTED: lldb-api :: commands/watchpoints/watchpoint_events/TestWatchpointEvents.py (2130 of 2167) PASS: lldb-api :: functionalities/data-formatter/data-formatter-stl/libcxx/deque/TestDataFormatterLibcxxDeque.py (2131 of 2167) PASS: lldb-unit :: Utility/./UtilityTests/ProcessInstanceInfoMatch.Name (2132 of 2167) PASS: lldb-shell :: Breakpoint/case-sensitive.test (2133 of 2167) PASS: lldb-unit :: Process/minidump/./LLDBMinidumpTests/MinidumpParserTest.GetArchitectureWindows (2134 of 2167) PASS: lldb-api :: commands/expression/import-std-module/empty-module/TestEmptyStdModule.py (2135 of 2167) PASS: lldb-shell :: Minidump/Windows/Sigsegv/sigsegv.test (2136 of 2167) XFAIL: lldb-shell :: Register/x86-mm-xmm-write.test (2137 of 2167) PASS: lldb-shell :: ObjectFile/ELF/minidebuginfo-find-symbols.yaml (2138 of 2167) UNSUPPORTED: lldb-api :: tools/lldb-server/TestGdbRemoteCompletion.py (2139 of 2167) PASS: lldb-unit :: SymbolFile/DWARF/./SymbolFileDWARFTests/SymbolFileDWARFTests.TestAbbrevOrder1Start5 (2140 of 2167) PASS: lldb-api :: functionalities/breakpoint/breakpoint_language/TestBreakpointLanguage.py (2141 of 2167) UNSUPPORTED: lldb-api :: python_api/disassemble-raw-data/TestDisassemble_VST1_64.py (2142 of 2167) PASS: lldb-api :: commands/frame/recognizer/TestFrameRecognizer.py (2143 of 2167) PASS: lldb-unit :: Utility/./UtilityTests/StreamTest.PutHex32ByteOrderLittle (2144 of 2167) PASS: lldb-api :: lang/c/shared_lib/TestSharedLib.py (2145 of 2167) PASS: lldb-api :: functionalities/data-formatter/data-formatter-stl/libcxx/string/TestDataFormatterLibcxxString.py (2146 of 2167) PASS: lldb-api :: lang/objc/objc-dyn-sbtype/TestObjCDynamicSBType.py (2147 of 2167) PASS: lldb-unit :: Utility/./UtilityTests/FileSpecTest.Yaml (2148 of 2167) PASS: lldb-shell :: Driver/TestError.test (2149 of 2167) PASS: lldb-api :: functionalities/conditional_break/TestConditionalBreak.py (2150 of 2167) UNSUPPORTED: lldb-shell :: SymbolFile/PDB/func-symbols.test (2151 of 2167) PASS: lldb-unit :: Utility/./UtilityTests/RecordReplayTest.InstrumentedBarPtr (2152 of 2167) PASS: lldb-unit :: Language/Highlighting/./HighlighterTests/HighlighterTest.ClangCursorPosBeforeOtherToken (2153 of 2167) PASS: lldb-api :: python_api/sblaunchinfo/TestSBLaunchInfo.py (2154 of 2167) PASS: lldb-api :: functionalities/unwind/zeroth_frame/TestZerothFrame.py (2155 of 2167) PASS: lldb-api :: lang/objc/modules-inline-functions/TestModulesInlineFunctions.py (2156 of 2167) PASS: lldb-api :: python_api/value/TestValueAPI.py (2157 of 2167) PASS: lldb-api :: commands/expression/import-std-module/forward_list-dbg-info-content/TestDbgInfoContentForwardListFromStdModule.py (2158 of 2167) PASS: lldb-api :: functionalities/gdb_remote_client/TestRestartBug.py (2159 of 2167) PASS: lldb-api :: commands/target/basic/TestTargetCommand.py (2160 of 2167) PASS: lldb-api :: python_api/sbtype_typeclass/TestSBTypeTypeClass.py (2161 of 2167) PASS: lldb-api :: lang/objc/exceptions/TestObjCExceptions.py (2162 of 2167) PASS: lldb-api :: functionalities/thread/backtrace_all/TestBacktraceAll.py (2163 of 2167) PASS: lldb-api :: tools/lldb-server/TestGdbRemote_vCont.py (2164 of 2167) PASS: lldb-api :: lang/objc/objc-new-syntax/TestObjCNewSyntaxDictionary.py (2165 of 2167) PASS: lldb-api :: macosx/simulator/TestSimulatorPlatform.py (2166 of 2167) Cancelling nested steps due to timeout Sending interrupt signal to process ninja: build stopped: interrupted by user. script returned exit code 143 [Pipeline] } [Pipeline] // timeout [Pipeline] } [Pipeline] // stage [Pipeline] stage [Pipeline] { (Build Clang 9.0.0) Stage "Build Clang 9.0.0" skipped due to earlier failure(s) [Pipeline] } [Pipeline] // stage [Pipeline] stage [Pipeline] { (Test Clang 9.0.0) Stage "Test Clang 9.0.0" skipped due to earlier failure(s) [Pipeline] } [Pipeline] // stage [Pipeline] } [Pipeline] // withEnv [Pipeline] } [Pipeline] // node [Pipeline] End of Pipeline [Checks API] No suitable checks publisher found. Timeout has been exceeded Finished: ABORTED