UnstableConsole Output

Skipping 79,568 KB.. Full Log
to debug monitor: {}; ignoring".format(
                            sys.exc_info()[0]))

Hide Details

try: sock.close() except: logger.warning( "failed to close socket to debug monitor: {}; ignoring".format( sys.exc_info()[0]))

Hide Details

Hide Details

Executing tearDown hook: def shutdown_named_pipe(): # Close the pipe. try: named_pipe.close() except: print("failed to close named pipe") None

Hide Details

# Delete the pipe. try: os.remove(named_pipe_path) except: print("failed to delete named pipe: {}".format(named_pipe_path)) None

Hide Details

# Delete the temp directory. try: os.rmdir(temp_dir) except: print( "failed to delete temp dir: {}, directory contents: '{}'".format( temp_dir, os.listdir(temp_dir))) None

Hide Details

Hide Details

PASS: LLDB (/Users/buildslave/jenkins/workspace/lldb-cmake-matrix/lldb-build/bin/clang-x86_64) :: test_qRegisterInfo_contains_required_generics_debugserver (TestLldbGdbServer.LldbGdbServerTestCase) runCmd: settings clear -all output:

Hide Details

runCmd: settings set symbols.enable-external-lookup false output:

Hide Details

runCmd: settings set target.inherit-tcc true output:

Hide Details

runCmd: settings set target.auto-apply-fixits false output:

Hide Details

runCmd: settings set plugin.process.gdb-remote.packet-timeout 60 output:

Hide Details

runCmd: settings set symbols.clang-modules-cache-path "/Users/buildslave/jenkins/workspace/lldb-cmake-matrix/lldb-build/lldb-test-build.noindex/module-cache-lldb/lldb-api" output:

Hide Details

runCmd: settings set use-color false output:

Hide Details

runCmd: setting set target.prefer-dynamic-value no-dynamic-values output:

Hide Details

UNSUPPORTED: LLDB (/Users/buildslave/jenkins/workspace/lldb-cmake-matrix/lldb-build/bin/clang-x86_64) :: test_qRegisterInfo_contains_required_generics_llgs (TestLldbGdbServer.LldbGdbServerTestCase) (llgs tests) runCmd: settings clear -all output:

Hide Details

runCmd: settings set symbols.enable-external-lookup false output:

Hide Details

runCmd: settings set target.inherit-tcc true output:

Hide Details

runCmd: settings set target.auto-apply-fixits false output:

Hide Details

runCmd: settings set plugin.process.gdb-remote.packet-timeout 60 output:

Hide Details

runCmd: settings set symbols.clang-modules-cache-path "/Users/buildslave/jenkins/workspace/lldb-cmake-matrix/lldb-build/lldb-test-build.noindex/module-cache-lldb/lldb-api" output:

Hide Details

runCmd: settings set use-color false output:

Hide Details

runCmd: setting set target.prefer-dynamic-value no-dynamic-values output:

Hide Details

Adding tearDown hook: def shutdown_named_pipe(): # Close the pipe. try: named_pipe.close() except: print("failed to close named pipe") None

Hide Details

# Delete the pipe. try: os.remove(named_pipe_path) except: print("failed to delete named pipe: {}".format(named_pipe_path)) None

Hide Details

# Delete the temp directory. try: os.rmdir(temp_dir) except: print( "failed to delete temp dir: {}, directory contents: '{}'".format( temp_dir, os.listdir(temp_dir))) None

Hide Details

Hide Details

Adding tearDown hook: def shutdown_socket(): if sock: try: # send the kill packet so lldb-server shuts down gracefully sock.sendall(GdbRemoteTestCaseBase._GDBREMOTE_KILL_PACKET) except: logger.warning( "failed to send kill packet to debug monitor: {}; ignoring".format( sys.exc_info()[0]))

Hide Details

try: sock.close() except: logger.warning( "failed to close socket to debug monitor: {}; ignoring".format( sys.exc_info()[0]))

Hide Details

Hide Details

Executing tearDown hook: def shutdown_socket(): if sock: try: # send the kill packet so lldb-server shuts down gracefully sock.sendall(GdbRemoteTestCaseBase._GDBREMOTE_KILL_PACKET) except: logger.warning( "failed to send kill packet to debug monitor: {}; ignoring".format( sys.exc_info()[0]))

Hide Details

try: sock.close() except: logger.warning( "failed to close socket to debug monitor: {}; ignoring".format( sys.exc_info()[0]))

Hide Details

Hide Details

Executing tearDown hook: def shutdown_named_pipe(): # Close the pipe. try: named_pipe.close() except: print("failed to close named pipe") None

Hide Details

# Delete the pipe. try: os.remove(named_pipe_path) except: print("failed to delete named pipe: {}".format(named_pipe_path)) None

Hide Details

# Delete the temp directory. try: os.rmdir(temp_dir) except: print( "failed to delete temp dir: {}, directory contents: '{}'".format( temp_dir, os.listdir(temp_dir))) None

Hide Details

Hide Details

PASS: LLDB (/Users/buildslave/jenkins/workspace/lldb-cmake-matrix/lldb-build/bin/clang-x86_64) :: test_qRegisterInfo_returns_all_valid_results_debugserver (TestLldbGdbServer.LldbGdbServerTestCase) runCmd: settings clear -all output:

Hide Details

runCmd: settings set symbols.enable-external-lookup false output:

Hide Details

runCmd: settings set target.inherit-tcc true output:

Hide Details

runCmd: settings set target.auto-apply-fixits false output:

Hide Details

runCmd: settings set plugin.process.gdb-remote.packet-timeout 60 output:

Hide Details

runCmd: settings set symbols.clang-modules-cache-path "/Users/buildslave/jenkins/workspace/lldb-cmake-matrix/lldb-build/lldb-test-build.noindex/module-cache-lldb/lldb-api" output:

Hide Details

runCmd: settings set use-color false output:

Hide Details

runCmd: setting set target.prefer-dynamic-value no-dynamic-values output:

Hide Details

UNSUPPORTED: LLDB (/Users/buildslave/jenkins/workspace/lldb-cmake-matrix/lldb-build/bin/clang-x86_64) :: test_qRegisterInfo_returns_all_valid_results_llgs (TestLldbGdbServer.LldbGdbServerTestCase) (llgs tests) runCmd: settings clear -all output:

Hide Details

runCmd: settings set symbols.enable-external-lookup false output:

Hide Details

runCmd: settings set target.inherit-tcc true output:

Hide Details

runCmd: settings set target.auto-apply-fixits false output:

Hide Details

runCmd: settings set plugin.process.gdb-remote.packet-timeout 60 output:

Hide Details

runCmd: settings set symbols.clang-modules-cache-path "/Users/buildslave/jenkins/workspace/lldb-cmake-matrix/lldb-build/lldb-test-build.noindex/module-cache-lldb/lldb-api" output:

Hide Details

runCmd: settings set use-color false output:

Hide Details

runCmd: setting set target.prefer-dynamic-value no-dynamic-values output:

Hide Details

Adding tearDown hook: def shutdown_named_pipe(): # Close the pipe. try: named_pipe.close() except: print("failed to close named pipe") None

Hide Details

# Delete the pipe. try: os.remove(named_pipe_path) except: print("failed to delete named pipe: {}".format(named_pipe_path)) None

Hide Details

# Delete the temp directory. try: os.rmdir(temp_dir) except: print( "failed to delete temp dir: {}, directory contents: '{}'".format( temp_dir, os.listdir(temp_dir))) None

Hide Details

Hide Details

Adding tearDown hook: def shutdown_socket(): if sock: try: # send the kill packet so lldb-server shuts down gracefully sock.sendall(GdbRemoteTestCaseBase._GDBREMOTE_KILL_PACKET) except: logger.warning( "failed to send kill packet to debug monitor: {}; ignoring".format( sys.exc_info()[0]))

Hide Details

try: sock.close() except: logger.warning( "failed to close socket to debug monitor: {}; ignoring".format( sys.exc_info()[0]))

Hide Details

Hide Details

Executing tearDown hook: def shutdown_socket(): if sock: try: # send the kill packet so lldb-server shuts down gracefully sock.sendall(GdbRemoteTestCaseBase._GDBREMOTE_KILL_PACKET) except: logger.warning( "failed to send kill packet to debug monitor: {}; ignoring".format( sys.exc_info()[0]))

Hide Details

try: sock.close() except: logger.warning( "failed to close socket to debug monitor: {}; ignoring".format( sys.exc_info()[0]))

Hide Details

Hide Details

Executing tearDown hook: def shutdown_named_pipe(): # Close the pipe. try: named_pipe.close() except: print("failed to close named pipe") None

Hide Details

# Delete the pipe. try: os.remove(named_pipe_path) except: print("failed to delete named pipe: {}".format(named_pipe_path)) None

Hide Details

# Delete the temp directory. try: os.rmdir(temp_dir) except: print( "failed to delete temp dir: {}, directory contents: '{}'".format( temp_dir, os.listdir(temp_dir))) None

Hide Details

Hide Details

PASS: LLDB (/Users/buildslave/jenkins/workspace/lldb-cmake-matrix/lldb-build/bin/clang-x86_64) :: test_qRegisterInfo_returns_one_valid_result_debugserver (TestLldbGdbServer.LldbGdbServerTestCase) runCmd: settings clear -all output:

Hide Details

runCmd: settings set symbols.enable-external-lookup false output:

Hide Details

runCmd: settings set target.inherit-tcc true output:

Hide Details

runCmd: settings set target.auto-apply-fixits false output:

Hide Details

runCmd: settings set plugin.process.gdb-remote.packet-timeout 60 output:

Hide Details

runCmd: settings set symbols.clang-modules-cache-path "/Users/buildslave/jenkins/workspace/lldb-cmake-matrix/lldb-build/lldb-test-build.noindex/module-cache-lldb/lldb-api" output:

Hide Details

runCmd: settings set use-color false output:

Hide Details

runCmd: setting set target.prefer-dynamic-value no-dynamic-values output:

Hide Details

UNSUPPORTED: LLDB (/Users/buildslave/jenkins/workspace/lldb-cmake-matrix/lldb-build/bin/clang-x86_64) :: test_qRegisterInfo_returns_one_valid_result_llgs (TestLldbGdbServer.LldbGdbServerTestCase) (llgs tests) runCmd: settings clear -all output:

Hide Details

runCmd: settings set symbols.enable-external-lookup false output:

Hide Details

runCmd: settings set target.inherit-tcc true output:

Hide Details

runCmd: settings set target.auto-apply-fixits false output:

Hide Details

runCmd: settings set plugin.process.gdb-remote.packet-timeout 60 output:

Hide Details

runCmd: settings set symbols.clang-modules-cache-path "/Users/buildslave/jenkins/workspace/lldb-cmake-matrix/lldb-build/lldb-test-build.noindex/module-cache-lldb/lldb-api" output:

Hide Details

runCmd: settings set use-color false output:

Hide Details

runCmd: setting set target.prefer-dynamic-value no-dynamic-values output:

Hide Details

Adding tearDown hook: def shutdown_named_pipe(): # Close the pipe. try: named_pipe.close() except: print("failed to close named pipe") None

Hide Details

# Delete the pipe. try: os.remove(named_pipe_path) except: print("failed to delete named pipe: {}".format(named_pipe_path)) None

Hide Details

# Delete the temp directory. try: os.rmdir(temp_dir) except: print( "failed to delete temp dir: {}, directory contents: '{}'".format( temp_dir, os.listdir(temp_dir))) None

Hide Details

Hide Details

Adding tearDown hook: def shutdown_socket(): if sock: try: # send the kill packet so lldb-server shuts down gracefully sock.sendall(GdbRemoteTestCaseBase._GDBREMOTE_KILL_PACKET) except: logger.warning( "failed to send kill packet to debug monitor: {}; ignoring".format( sys.exc_info()[0]))

Hide Details

try: sock.close() except: logger.warning( "failed to close socket to debug monitor: {}; ignoring".format( sys.exc_info()[0]))

Hide Details

Hide Details

Executing tearDown hook: def shutdown_socket(): if sock: try: # send the kill packet so lldb-server shuts down gracefully sock.sendall(GdbRemoteTestCaseBase._GDBREMOTE_KILL_PACKET) except: logger.warning( "failed to send kill packet to debug monitor: {}; ignoring".format( sys.exc_info()[0]))

Hide Details

try: sock.close() except: logger.warning( "failed to close socket to debug monitor: {}; ignoring".format( sys.exc_info()[0]))

Hide Details

Hide Details

Executing tearDown hook: def shutdown_named_pipe(): # Close the pipe. try: named_pipe.close() except: print("failed to close named pipe") None

Hide Details

# Delete the pipe. try: os.remove(named_pipe_path) except: print("failed to delete named pipe: {}".format(named_pipe_path)) None

Hide Details

# Delete the temp directory. try: os.rmdir(temp_dir) except: print( "failed to delete temp dir: {}, directory contents: '{}'".format( temp_dir, os.listdir(temp_dir))) None

Hide Details

Hide Details

PASS: LLDB (/Users/buildslave/jenkins/workspace/lldb-cmake-matrix/lldb-build/bin/clang-x86_64) :: test_qSupported_returns_known_stub_features_debugserver (TestLldbGdbServer.LldbGdbServerTestCase) runCmd: settings clear -all output:

Hide Details

runCmd: settings set symbols.enable-external-lookup false output:

Hide Details

runCmd: settings set target.inherit-tcc true output:

Hide Details

runCmd: settings set target.auto-apply-fixits false output:

Hide Details

runCmd: settings set plugin.process.gdb-remote.packet-timeout 60 output:

Hide Details

runCmd: settings set symbols.clang-modules-cache-path "/Users/buildslave/jenkins/workspace/lldb-cmake-matrix/lldb-build/lldb-test-build.noindex/module-cache-lldb/lldb-api" output:

Hide Details

runCmd: settings set use-color false output:

Hide Details

runCmd: setting set target.prefer-dynamic-value no-dynamic-values output:

Hide Details

UNSUPPORTED: LLDB (/Users/buildslave/jenkins/workspace/lldb-cmake-matrix/lldb-build/bin/clang-x86_64) :: test_qSupported_returns_known_stub_features_llgs (TestLldbGdbServer.LldbGdbServerTestCase) (llgs tests) runCmd: settings clear -all output:

Hide Details

runCmd: settings set symbols.enable-external-lookup false output:

Hide Details

runCmd: settings set target.inherit-tcc true output:

Hide Details

runCmd: settings set target.auto-apply-fixits false output:

Hide Details

runCmd: settings set plugin.process.gdb-remote.packet-timeout 60 output:

Hide Details

runCmd: settings set symbols.clang-modules-cache-path "/Users/buildslave/jenkins/workspace/lldb-cmake-matrix/lldb-build/lldb-test-build.noindex/module-cache-lldb/lldb-api" output:

Hide Details

runCmd: settings set use-color false output:

Hide Details

runCmd: setting set target.prefer-dynamic-value no-dynamic-values output:

Hide Details

Adding tearDown hook: def shutdown_named_pipe(): # Close the pipe. try: named_pipe.close() except: print("failed to close named pipe") None

Hide Details

# Delete the pipe. try: os.remove(named_pipe_path) except: print("failed to delete named pipe: {}".format(named_pipe_path)) None

Hide Details

# Delete the temp directory. try: os.rmdir(temp_dir) except: print( "failed to delete temp dir: {}, directory contents: '{}'".format( temp_dir, os.listdir(temp_dir))) None

Hide Details

Hide Details

Adding tearDown hook: def shutdown_socket(): if sock: try: # send the kill packet so lldb-server shuts down gracefully sock.sendall(GdbRemoteTestCaseBase._GDBREMOTE_KILL_PACKET) except: logger.warning( "failed to send kill packet to debug monitor: {}; ignoring".format( sys.exc_info()[0]))

Hide Details

try: sock.close() except: logger.warning( "failed to close socket to debug monitor: {}; ignoring".format( sys.exc_info()[0]))

Hide Details

Hide Details

Executing tearDown hook: def shutdown_socket(): if sock: try: # send the kill packet so lldb-server shuts down gracefully sock.sendall(GdbRemoteTestCaseBase._GDBREMOTE_KILL_PACKET) except: logger.warning( "failed to send kill packet to debug monitor: {}; ignoring".format( sys.exc_info()[0]))

Hide Details

try: sock.close() except: logger.warning( "failed to close socket to debug monitor: {}; ignoring".format( sys.exc_info()[0]))

Hide Details

Hide Details

Executing tearDown hook: def shutdown_named_pipe(): # Close the pipe. try: named_pipe.close() except: print("failed to close named pipe") None

Hide Details

# Delete the pipe. try: os.remove(named_pipe_path) except: print("failed to delete named pipe: {}".format(named_pipe_path)) None

Hide Details

# Delete the temp directory. try: os.rmdir(temp_dir) except: print( "failed to delete temp dir: {}, directory contents: '{}'".format( temp_dir, os.listdir(temp_dir))) None

Hide Details

Hide Details

PASS: LLDB (/Users/buildslave/jenkins/workspace/lldb-cmake-matrix/lldb-build/bin/clang-x86_64) :: test_qThreadInfo_contains_thread_attach_debugserver (TestLldbGdbServer.LldbGdbServerTestCase) runCmd: settings clear -all output:

Hide Details

runCmd: settings set symbols.enable-external-lookup false output:

Hide Details

runCmd: settings set target.inherit-tcc true output:

Hide Details

runCmd: settings set target.auto-apply-fixits false output:

Hide Details

runCmd: settings set plugin.process.gdb-remote.packet-timeout 60 output:

Hide Details

runCmd: settings set symbols.clang-modules-cache-path "/Users/buildslave/jenkins/workspace/lldb-cmake-matrix/lldb-build/lldb-test-build.noindex/module-cache-lldb/lldb-api" output:

Hide Details

runCmd: settings set use-color false output:

Hide Details

runCmd: setting set target.prefer-dynamic-value no-dynamic-values output:

Hide Details

UNSUPPORTED: LLDB (/Users/buildslave/jenkins/workspace/lldb-cmake-matrix/lldb-build/bin/clang-x86_64) :: test_qThreadInfo_contains_thread_attach_llgs (TestLldbGdbServer.LldbGdbServerTestCase) (llgs tests) runCmd: settings clear -all output:

Hide Details

runCmd: settings set symbols.enable-external-lookup false output:

Hide Details

runCmd: settings set target.inherit-tcc true output:

Hide Details

runCmd: settings set target.auto-apply-fixits false output:

Hide Details

runCmd: settings set plugin.process.gdb-remote.packet-timeout 60 output:

Hide Details

runCmd: settings set symbols.clang-modules-cache-path "/Users/buildslave/jenkins/workspace/lldb-cmake-matrix/lldb-build/lldb-test-build.noindex/module-cache-lldb/lldb-api" output:

Hide Details

runCmd: settings set use-color false output:

Hide Details

runCmd: setting set target.prefer-dynamic-value no-dynamic-values output:

Hide Details

Adding tearDown hook: def shutdown_named_pipe(): # Close the pipe. try: named_pipe.close() except: print("failed to close named pipe") None

Hide Details

# Delete the pipe. try: os.remove(named_pipe_path) except: print("failed to delete named pipe: {}".format(named_pipe_path)) None

Hide Details

# Delete the temp directory. try: os.rmdir(temp_dir) except: print( "failed to delete temp dir: {}, directory contents: '{}'".format( temp_dir, os.listdir(temp_dir))) None

Hide Details

Hide Details

Adding tearDown hook: def shutdown_socket(): if sock: try: # send the kill packet so lldb-server shuts down gracefully sock.sendall(GdbRemoteTestCaseBase._GDBREMOTE_KILL_PACKET) except: logger.warning( "failed to send kill packet to debug monitor: {}; ignoring".format( sys.exc_info()[0]))

Hide Details

try: sock.close() except: logger.warning( "failed to close socket to debug monitor: {}; ignoring".format( sys.exc_info()[0]))

Hide Details

Hide Details

Executing tearDown hook: def shutdown_socket(): if sock: try: # send the kill packet so lldb-server shuts down gracefully sock.sendall(GdbRemoteTestCaseBase._GDBREMOTE_KILL_PACKET) except: logger.warning( "failed to send kill packet to debug monitor: {}; ignoring".format( sys.exc_info()[0]))

Hide Details

try: sock.close() except: logger.warning( "failed to close socket to debug monitor: {}; ignoring".format( sys.exc_info()[0]))

Hide Details

Hide Details

Executing tearDown hook: def shutdown_named_pipe(): # Close the pipe. try: named_pipe.close() except: print("failed to close named pipe") None

Hide Details

# Delete the pipe. try: os.remove(named_pipe_path) except: print("failed to delete named pipe: {}".format(named_pipe_path)) None

Hide Details

# Delete the temp directory. try: os.rmdir(temp_dir) except: print( "failed to delete temp dir: {}, directory contents: '{}'".format( temp_dir, os.listdir(temp_dir))) None

Hide Details

Hide Details

PASS: LLDB (/Users/buildslave/jenkins/workspace/lldb-cmake-matrix/lldb-build/bin/clang-x86_64) :: test_qThreadInfo_contains_thread_launch_debugserver (TestLldbGdbServer.LldbGdbServerTestCase) runCmd: settings clear -all output:

Hide Details

runCmd: settings set symbols.enable-external-lookup false output:

Hide Details

runCmd: settings set target.inherit-tcc true output:

Hide Details

runCmd: settings set target.auto-apply-fixits false output:

Hide Details

runCmd: settings set plugin.process.gdb-remote.packet-timeout 60 output:

Hide Details

runCmd: settings set symbols.clang-modules-cache-path "/Users/buildslave/jenkins/workspace/lldb-cmake-matrix/lldb-build/lldb-test-build.noindex/module-cache-lldb/lldb-api" output:

Hide Details

runCmd: settings set use-color false output:

Hide Details

runCmd: setting set target.prefer-dynamic-value no-dynamic-values output:

Hide Details

UNSUPPORTED: LLDB (/Users/buildslave/jenkins/workspace/lldb-cmake-matrix/lldb-build/bin/clang-x86_64) :: test_qThreadInfo_contains_thread_launch_llgs (TestLldbGdbServer.LldbGdbServerTestCase) (llgs tests) runCmd: settings clear -all output:

Hide Details

runCmd: settings set symbols.enable-external-lookup false output:

Hide Details

runCmd: settings set target.inherit-tcc true output:

Hide Details

runCmd: settings set target.auto-apply-fixits false output:

Hide Details

runCmd: settings set plugin.process.gdb-remote.packet-timeout 60 output:

Hide Details

runCmd: settings set symbols.clang-modules-cache-path "/Users/buildslave/jenkins/workspace/lldb-cmake-matrix/lldb-build/lldb-test-build.noindex/module-cache-lldb/lldb-api" output:

Hide Details

runCmd: settings set use-color false output:

Hide Details

runCmd: setting set target.prefer-dynamic-value no-dynamic-values output:

Hide Details

Adding tearDown hook: def shutdown_named_pipe(): # Close the pipe. try: named_pipe.close() except: print("failed to close named pipe") None

Hide Details

# Delete the pipe. try: os.remove(named_pipe_path) except: print("failed to delete named pipe: {}".format(named_pipe_path)) None

Hide Details

# Delete the temp directory. try: os.rmdir(temp_dir) except: print( "failed to delete temp dir: {}, directory contents: '{}'".format( temp_dir, os.listdir(temp_dir))) None

Hide Details

Hide Details

Adding tearDown hook: def shutdown_socket(): if sock: try: # send the kill packet so lldb-server shuts down gracefully sock.sendall(GdbRemoteTestCaseBase._GDBREMOTE_KILL_PACKET) except: logger.warning( "failed to send kill packet to debug monitor: {}; ignoring".format( sys.exc_info()[0]))

Hide Details

try: sock.close() except: logger.warning( "failed to close socket to debug monitor: {}; ignoring".format( sys.exc_info()[0]))

Hide Details

Hide Details

Executing tearDown hook: def shutdown_socket(): if sock: try: # send the kill packet so lldb-server shuts down gracefully sock.sendall(GdbRemoteTestCaseBase._GDBREMOTE_KILL_PACKET) except: logger.warning( "failed to send kill packet to debug monitor: {}; ignoring".format( sys.exc_info()[0]))

Hide Details

try: sock.close() except: logger.warning( "failed to close socket to debug monitor: {}; ignoring".format( sys.exc_info()[0]))

Hide Details

Hide Details

Executing tearDown hook: def shutdown_named_pipe(): # Close the pipe. try: named_pipe.close() except: print("failed to close named pipe") None

Hide Details

# Delete the pipe. try: os.remove(named_pipe_path) except: print("failed to delete named pipe: {}".format(named_pipe_path)) None

Hide Details

# Delete the temp directory. try: os.rmdir(temp_dir) except: print( "failed to delete temp dir: {}, directory contents: '{}'".format( temp_dir, os.listdir(temp_dir))) None

Hide Details

Hide Details

PASS: LLDB (/Users/buildslave/jenkins/workspace/lldb-cmake-matrix/lldb-build/bin/clang-x86_64) :: test_qThreadInfo_matches_qC_attach_debugserver (TestLldbGdbServer.LldbGdbServerTestCase) runCmd: settings clear -all output:

Hide Details

runCmd: settings set symbols.enable-external-lookup false output:

Hide Details

runCmd: settings set target.inherit-tcc true output:

Hide Details

runCmd: settings set target.auto-apply-fixits false output:

Hide Details

runCmd: settings set plugin.process.gdb-remote.packet-timeout 60 output:

Hide Details

runCmd: settings set symbols.clang-modules-cache-path "/Users/buildslave/jenkins/workspace/lldb-cmake-matrix/lldb-build/lldb-test-build.noindex/module-cache-lldb/lldb-api" output:

Hide Details

runCmd: settings set use-color false output:

Hide Details

runCmd: setting set target.prefer-dynamic-value no-dynamic-values output:

Hide Details

UNSUPPORTED: LLDB (/Users/buildslave/jenkins/workspace/lldb-cmake-matrix/lldb-build/bin/clang-x86_64) :: test_qThreadInfo_matches_qC_attach_llgs (TestLldbGdbServer.LldbGdbServerTestCase) (llgs tests) runCmd: settings clear -all output:

Hide Details

runCmd: settings set symbols.enable-external-lookup false output:

Hide Details

runCmd: settings set target.inherit-tcc true output:

Hide Details

runCmd: settings set target.auto-apply-fixits false output:

Hide Details

runCmd: settings set plugin.process.gdb-remote.packet-timeout 60 output:

Hide Details

runCmd: settings set symbols.clang-modules-cache-path "/Users/buildslave/jenkins/workspace/lldb-cmake-matrix/lldb-build/lldb-test-build.noindex/module-cache-lldb/lldb-api" output:

Hide Details

runCmd: settings set use-color false output:

Hide Details

runCmd: setting set target.prefer-dynamic-value no-dynamic-values output:

Hide Details

Adding tearDown hook: def shutdown_named_pipe(): # Close the pipe. try: named_pipe.close() except: print("failed to close named pipe") None

Hide Details

# Delete the pipe. try: os.remove(named_pipe_path) except: print("failed to delete named pipe: {}".format(named_pipe_path)) None

Hide Details

# Delete the temp directory. try: os.rmdir(temp_dir) except: print( "failed to delete temp dir: {}, directory contents: '{}'".format( temp_dir, os.listdir(temp_dir))) None

Hide Details

Hide Details

Adding tearDown hook: def shutdown_socket(): if sock: try: # send the kill packet so lldb-server shuts down gracefully sock.sendall(GdbRemoteTestCaseBase._GDBREMOTE_KILL_PACKET) except: logger.warning( "failed to send kill packet to debug monitor: {}; ignoring".format( sys.exc_info()[0]))

Hide Details

try: sock.close() except: logger.warning( "failed to close socket to debug monitor: {}; ignoring".format( sys.exc_info()[0]))

Hide Details

Hide Details

Executing tearDown hook: def shutdown_socket(): if sock: try: # send the kill packet so lldb-server shuts down gracefully sock.sendall(GdbRemoteTestCaseBase._GDBREMOTE_KILL_PACKET) except: logger.warning( "failed to send kill packet to debug monitor: {}; ignoring".format( sys.exc_info()[0]))

Hide Details

try: sock.close() except: logger.warning( "failed to close socket to debug monitor: {}; ignoring".format( sys.exc_info()[0]))

Hide Details

Hide Details

Executing tearDown hook: def shutdown_named_pipe(): # Close the pipe. try: named_pipe.close() except: print("failed to close named pipe") None

Hide Details

# Delete the pipe. try: os.remove(named_pipe_path) except: print("failed to delete named pipe: {}".format(named_pipe_path)) None

Hide Details

# Delete the temp directory. try: os.rmdir(temp_dir) except: print( "failed to delete temp dir: {}, directory contents: '{}'".format( temp_dir, os.listdir(temp_dir))) None

Hide Details

Hide Details

PASS: LLDB (/Users/buildslave/jenkins/workspace/lldb-cmake-matrix/lldb-build/bin/clang-x86_64) :: test_qThreadInfo_matches_qC_launch_debugserver (TestLldbGdbServer.LldbGdbServerTestCase) runCmd: settings clear -all output:

Hide Details

runCmd: settings set symbols.enable-external-lookup false output:

Hide Details

runCmd: settings set target.inherit-tcc true output:

Hide Details

runCmd: settings set target.auto-apply-fixits false output:

Hide Details

runCmd: settings set plugin.process.gdb-remote.packet-timeout 60 output:

Hide Details

runCmd: settings set symbols.clang-modules-cache-path "/Users/buildslave/jenkins/workspace/lldb-cmake-matrix/lldb-build/lldb-test-build.noindex/module-cache-lldb/lldb-api" output:

Hide Details

runCmd: settings set use-color false output:

Hide Details

runCmd: setting set target.prefer-dynamic-value no-dynamic-values output:

Hide Details

UNSUPPORTED: LLDB (/Users/buildslave/jenkins/workspace/lldb-cmake-matrix/lldb-build/bin/clang-x86_64) :: test_qThreadInfo_matches_qC_launch_llgs (TestLldbGdbServer.LldbGdbServerTestCase) (llgs tests) runCmd: settings clear -all output:

Hide Details

runCmd: settings set symbols.enable-external-lookup false output:

Hide Details

runCmd: settings set target.inherit-tcc true output:

Hide Details

runCmd: settings set target.auto-apply-fixits false output:

Hide Details

runCmd: settings set plugin.process.gdb-remote.packet-timeout 60 output:

Hide Details

runCmd: settings set symbols.clang-modules-cache-path "/Users/buildslave/jenkins/workspace/lldb-cmake-matrix/lldb-build/lldb-test-build.noindex/module-cache-lldb/lldb-api" output:

Hide Details

runCmd: settings set use-color false output:

Hide Details

runCmd: setting set target.prefer-dynamic-value no-dynamic-values output:

Hide Details

Adding tearDown hook: def shutdown_named_pipe(): # Close the pipe. try: named_pipe.close() except: print("failed to close named pipe") None

Hide Details

# Delete the pipe. try: os.remove(named_pipe_path) except: print("failed to delete named pipe: {}".format(named_pipe_path)) None

Hide Details

# Delete the temp directory. try: os.rmdir(temp_dir) except: print( "failed to delete temp dir: {}, directory contents: '{}'".format( temp_dir, os.listdir(temp_dir))) None

Hide Details

Hide Details

Adding tearDown hook: def shutdown_socket(): if sock: try: # send the kill packet so lldb-server shuts down gracefully sock.sendall(GdbRemoteTestCaseBase._GDBREMOTE_KILL_PACKET) except: logger.warning( "failed to send kill packet to debug monitor: {}; ignoring".format( sys.exc_info()[0]))

Hide Details

try: sock.close() except: logger.warning( "failed to close socket to debug monitor: {}; ignoring".format( sys.exc_info()[0]))

Hide Details

Hide Details

Executing tearDown hook: def shutdown_socket(): if sock: try: # send the kill packet so lldb-server shuts down gracefully sock.sendall(GdbRemoteTestCaseBase._GDBREMOTE_KILL_PACKET) except: logger.warning( "failed to send kill packet to debug monitor: {}; ignoring".format( sys.exc_info()[0]))

Hide Details

try: sock.close() except: logger.warning( "failed to close socket to debug monitor: {}; ignoring".format( sys.exc_info()[0]))

Hide Details

Hide Details

Executing tearDown hook: def shutdown_named_pipe(): # Close the pipe. try: named_pipe.close() except: print("failed to close named pipe") None

Hide Details

# Delete the pipe. try: os.remove(named_pipe_path) except: print("failed to delete named pipe: {}".format(named_pipe_path)) None

Hide Details

# Delete the temp directory. try: os.rmdir(temp_dir) except: print( "failed to delete temp dir: {}, directory contents: '{}'".format( temp_dir, os.listdir(temp_dir))) None

Hide Details

Hide Details

PASS: LLDB (/Users/buildslave/jenkins/workspace/lldb-cmake-matrix/lldb-build/bin/clang-x86_64) :: test_software_breakpoint_set_and_remove_work_debugserver (TestLldbGdbServer.LldbGdbServerTestCase) runCmd: settings clear -all output:

Hide Details

runCmd: settings set symbols.enable-external-lookup false output:

Hide Details

runCmd: settings set target.inherit-tcc true output:

Hide Details

runCmd: settings set target.auto-apply-fixits false output:

Hide Details

runCmd: settings set plugin.process.gdb-remote.packet-timeout 60 output:

Hide Details

runCmd: settings set symbols.clang-modules-cache-path "/Users/buildslave/jenkins/workspace/lldb-cmake-matrix/lldb-build/lldb-test-build.noindex/module-cache-lldb/lldb-api" output:

Hide Details

runCmd: settings set use-color false output:

Hide Details

runCmd: setting set target.prefer-dynamic-value no-dynamic-values output:

Hide Details

UNSUPPORTED: LLDB (/Users/buildslave/jenkins/workspace/lldb-cmake-matrix/lldb-build/bin/clang-x86_64) :: test_software_breakpoint_set_and_remove_work_llgs (TestLldbGdbServer.LldbGdbServerTestCase) (llgs tests) runCmd: settings clear -all output:

Hide Details

runCmd: settings set symbols.enable-external-lookup false output:

Hide Details

runCmd: settings set target.inherit-tcc true output:

Hide Details

runCmd: settings set target.auto-apply-fixits false output:

Hide Details

runCmd: settings set plugin.process.gdb-remote.packet-timeout 60 output:

Hide Details

runCmd: settings set symbols.clang-modules-cache-path "/Users/buildslave/jenkins/workspace/lldb-cmake-matrix/lldb-build/lldb-test-build.noindex/module-cache-lldb/lldb-api" output:

Hide Details

runCmd: settings set use-color false output:

Hide Details

runCmd: setting set target.prefer-dynamic-value no-dynamic-values output:

Hide Details

Adding tearDown hook: def shutdown_named_pipe(): # Close the pipe. try: named_pipe.close() except: print("failed to close named pipe") None

Hide Details

# Delete the pipe. try: os.remove(named_pipe_path) except: print("failed to delete named pipe: {}".format(named_pipe_path)) None

Hide Details

# Delete the temp directory. try: os.rmdir(temp_dir) except: print( "failed to delete temp dir: {}, directory contents: '{}'".format( temp_dir, os.listdir(temp_dir))) None

Hide Details

Hide Details

Adding tearDown hook: def shutdown_socket(): if sock: try: # send the kill packet so lldb-server shuts down gracefully sock.sendall(GdbRemoteTestCaseBase._GDBREMOTE_KILL_PACKET) except: logger.warning( "failed to send kill packet to debug monitor: {}; ignoring".format( sys.exc_info()[0]))

Hide Details

try: sock.close() except: logger.warning( "failed to close socket to debug monitor: {}; ignoring".format( sys.exc_info()[0]))

Hide Details

Hide Details

Executing tearDown hook: def shutdown_socket(): if sock: try: # send the kill packet so lldb-server shuts down gracefully sock.sendall(GdbRemoteTestCaseBase._GDBREMOTE_KILL_PACKET) except: logger.warning( "failed to send kill packet to debug monitor: {}; ignoring".format( sys.exc_info()[0]))

Hide Details

try: sock.close() except: logger.warning( "failed to close socket to debug monitor: {}; ignoring".format( sys.exc_info()[0]))

Hide Details

Hide Details

Executing tearDown hook: def shutdown_named_pipe(): # Close the pipe. try: named_pipe.close() except: print("failed to close named pipe") None

Hide Details

# Delete the pipe. try: os.remove(named_pipe_path) except: print("failed to delete named pipe: {}".format(named_pipe_path)) None

Hide Details

# Delete the temp directory. try: os.rmdir(temp_dir) except: print( "failed to delete temp dir: {}, directory contents: '{}'".format( temp_dir, os.listdir(temp_dir))) None

Hide Details

Hide Details

PASS: LLDB (/Users/buildslave/jenkins/workspace/lldb-cmake-matrix/lldb-build/bin/clang-x86_64) :: test_start_no_ack_mode_debugserver (TestLldbGdbServer.LldbGdbServerTestCase) runCmd: settings clear -all output:

Hide Details

runCmd: settings set symbols.enable-external-lookup false output:

Hide Details

runCmd: settings set target.inherit-tcc true output:

Hide Details

runCmd: settings set target.auto-apply-fixits false output:

Hide Details

runCmd: settings set plugin.process.gdb-remote.packet-timeout 60 output:

Hide Details

runCmd: settings set symbols.clang-modules-cache-path "/Users/buildslave/jenkins/workspace/lldb-cmake-matrix/lldb-build/lldb-test-build.noindex/module-cache-lldb/lldb-api" output:

Hide Details

runCmd: settings set use-color false output:

Hide Details

runCmd: setting set target.prefer-dynamic-value no-dynamic-values output:

Hide Details

UNSUPPORTED: LLDB (/Users/buildslave/jenkins/workspace/lldb-cmake-matrix/lldb-build/bin/clang-x86_64) :: test_start_no_ack_mode_llgs (TestLldbGdbServer.LldbGdbServerTestCase) (llgs tests) runCmd: settings clear -all output:

Hide Details

runCmd: settings set symbols.enable-external-lookup false output:

Hide Details

runCmd: settings set target.inherit-tcc true output:

Hide Details

runCmd: settings set target.auto-apply-fixits false output:

Hide Details

runCmd: settings set plugin.process.gdb-remote.packet-timeout 60 output:

Hide Details

runCmd: settings set symbols.clang-modules-cache-path "/Users/buildslave/jenkins/workspace/lldb-cmake-matrix/lldb-build/lldb-test-build.noindex/module-cache-lldb/lldb-api" output:

Hide Details

runCmd: settings set use-color false output:

Hide Details

runCmd: setting set target.prefer-dynamic-value no-dynamic-values output:

Hide Details

Adding tearDown hook: def shutdown_named_pipe(): # Close the pipe. try: named_pipe.close() except: print("failed to close named pipe") None

Hide Details

# Delete the pipe. try: os.remove(named_pipe_path) except: print("failed to delete named pipe: {}".format(named_pipe_path)) None

Hide Details

# Delete the temp directory. try: os.rmdir(temp_dir) except: print( "failed to delete temp dir: {}, directory contents: '{}'".format( temp_dir, os.listdir(temp_dir))) None

Hide Details

Hide Details

Adding tearDown hook: def shutdown_socket(): if sock: try: # send the kill packet so lldb-server shuts down gracefully sock.sendall(GdbRemoteTestCaseBase._GDBREMOTE_KILL_PACKET) except: logger.warning( "failed to send kill packet to debug monitor: {}; ignoring".format( sys.exc_info()[0]))

Hide Details

try: sock.close() except: logger.warning( "failed to close socket to debug monitor: {}; ignoring".format( sys.exc_info()[0]))

Hide Details

Hide Details

Executing tearDown hook: def shutdown_socket(): if sock: try: # send the kill packet so lldb-server shuts down gracefully sock.sendall(GdbRemoteTestCaseBase._GDBREMOTE_KILL_PACKET) except: logger.warning( "failed to send kill packet to debug monitor: {}; ignoring".format( sys.exc_info()[0]))

Hide Details

try: sock.close() except: logger.warning( "failed to close socket to debug monitor: {}; ignoring".format( sys.exc_info()[0]))

Hide Details

Hide Details

Executing tearDown hook: def shutdown_named_pipe(): # Close the pipe. try: named_pipe.close() except: print("failed to close named pipe") None

Hide Details

# Delete the pipe. try: os.remove(named_pipe_path) except: print("failed to delete named pipe: {}".format(named_pipe_path)) None

Hide Details

# Delete the temp directory. try: os.rmdir(temp_dir) except: print( "failed to delete temp dir: {}, directory contents: '{}'".format( temp_dir, os.listdir(temp_dir))) None

Hide Details

Hide Details

PASS: LLDB (/Users/buildslave/jenkins/workspace/lldb-cmake-matrix/lldb-build/bin/clang-x86_64) :: test_thread_suffix_supported_debugserver (TestLldbGdbServer.LldbGdbServerTestCase) runCmd: settings clear -all output:

Hide Details

runCmd: settings set symbols.enable-external-lookup false output:

Hide Details

runCmd: settings set target.inherit-tcc true output:

Hide Details

runCmd: settings set target.auto-apply-fixits false output:

Hide Details

runCmd: settings set plugin.process.gdb-remote.packet-timeout 60 output:

Hide Details

runCmd: settings set symbols.clang-modules-cache-path "/Users/buildslave/jenkins/workspace/lldb-cmake-matrix/lldb-build/lldb-test-build.noindex/module-cache-lldb/lldb-api" output:

Hide Details

runCmd: settings set use-color false output:

Hide Details

runCmd: setting set target.prefer-dynamic-value no-dynamic-values output:

Hide Details

UNSUPPORTED: LLDB (/Users/buildslave/jenkins/workspace/lldb-cmake-matrix/lldb-build/bin/clang-x86_64) :: test_thread_suffix_supported_llgs (TestLldbGdbServer.LldbGdbServerTestCase) (llgs tests) runCmd: settings clear -all output:

Hide Details

runCmd: settings set symbols.enable-external-lookup false output:

Hide Details

runCmd: settings set target.inherit-tcc true output:

Hide Details

runCmd: settings set target.auto-apply-fixits false output:

Hide Details

runCmd: settings set plugin.process.gdb-remote.packet-timeout 60 output:

Hide Details

runCmd: settings set symbols.clang-modules-cache-path "/Users/buildslave/jenkins/workspace/lldb-cmake-matrix/lldb-build/lldb-test-build.noindex/module-cache-lldb/lldb-api" output:

Hide Details

runCmd: settings set use-color false output:

Hide Details

runCmd: setting set target.prefer-dynamic-value no-dynamic-values output:

Hide Details

Adding tearDown hook: def shutdown_named_pipe(): # Close the pipe. try: named_pipe.close() except: print("failed to close named pipe") None

Hide Details

# Delete the pipe. try: os.remove(named_pipe_path) except: print("failed to delete named pipe: {}".format(named_pipe_path)) None

Hide Details

# Delete the temp directory. try: os.rmdir(temp_dir) except: print( "failed to delete temp dir: {}, directory contents: '{}'".format( temp_dir, os.listdir(temp_dir))) None

Hide Details

Hide Details

Adding tearDown hook: def shutdown_socket(): if sock: try: # send the kill packet so lldb-server shuts down gracefully sock.sendall(GdbRemoteTestCaseBase._GDBREMOTE_KILL_PACKET) except: logger.warning( "failed to send kill packet to debug monitor: {}; ignoring".format( sys.exc_info()[0]))

Hide Details

try: sock.close() except: logger.warning( "failed to close socket to debug monitor: {}; ignoring".format( sys.exc_info()[0]))

Hide Details

Hide Details

Executing tearDown hook: def shutdown_socket(): if sock: try: # send the kill packet so lldb-server shuts down gracefully sock.sendall(GdbRemoteTestCaseBase._GDBREMOTE_KILL_PACKET) except: logger.warning( "failed to send kill packet to debug monitor: {}; ignoring".format( sys.exc_info()[0]))

Hide Details

try: sock.close() except: logger.warning( "failed to close socket to debug monitor: {}; ignoring".format( sys.exc_info()[0]))

Hide Details

Hide Details

Executing tearDown hook: def shutdown_named_pipe(): # Close the pipe. try: named_pipe.close() except: print("failed to close named pipe") None

Hide Details

# Delete the pipe. try: os.remove(named_pipe_path) except: print("failed to delete named pipe: {}".format(named_pipe_path)) None

Hide Details

# Delete the temp directory. try: os.rmdir(temp_dir) except: print( "failed to delete temp dir: {}, directory contents: '{}'".format( temp_dir, os.listdir(temp_dir))) None

Hide Details

Hide Details

PASS: LLDB (/Users/buildslave/jenkins/workspace/lldb-cmake-matrix/lldb-build/bin/clang-x86_64) :: test_written_M_content_reads_back_correctly_debugserver (TestLldbGdbServer.LldbGdbServerTestCase) runCmd: settings clear -all output:

Hide Details

runCmd: settings set symbols.enable-external-lookup false output:

Hide Details

runCmd: settings set target.inherit-tcc true output:

Hide Details

runCmd: settings set target.auto-apply-fixits false output:

Hide Details

runCmd: settings set plugin.process.gdb-remote.packet-timeout 60 output:

Hide Details

runCmd: settings set symbols.clang-modules-cache-path "/Users/buildslave/jenkins/workspace/lldb-cmake-matrix/lldb-build/lldb-test-build.noindex/module-cache-lldb/lldb-api" output:

Hide Details

runCmd: settings set use-color false output:

Hide Details

runCmd: setting set target.prefer-dynamic-value no-dynamic-values output:

Hide Details

UNSUPPORTED: LLDB (/Users/buildslave/jenkins/workspace/lldb-cmake-matrix/lldb-build/bin/clang-x86_64) :: test_written_M_content_reads_back_correctly_llgs (TestLldbGdbServer.LldbGdbServerTestCase) (llgs tests) Restore dir to: /Users/buildslave/jenkins/workspace/lldb-cmake-matrix/lldb-build/tools/lldb/test ====================================================================== ERROR: test_Hg_switches_to_3_threads_launch_debugserver (TestLldbGdbServer.LldbGdbServerTestCase) ---------------------------------------------------------------------- Traceback (most recent call last): File "/Users/buildslave/jenkins/workspace/lldb-cmake-matrix/llvm-project/lldb/packages/Python/lldbsuite/test/decorators.py", line 136, in wrapper return func(*args, **kwargs) File "/Users/buildslave/jenkins/workspace/lldb-cmake-matrix/llvm-project/lldb/test/API/tools/lldb-server/TestLldbGdbServer.py", line 672, in test_Hg_switches_to_3_threads_launch_debugserver self.Hg_switches_to_3_threads() File "/Users/buildslave/jenkins/workspace/lldb-cmake-matrix/llvm-project/lldb/test/API/tools/lldb-server/TestLldbGdbServer.py", line 645, in Hg_switches_to_3_threads threads = self.wait_for_thread_count(3) File "/Users/buildslave/jenkins/workspace/lldb-cmake-matrix/llvm-project/lldb/packages/Python/lldbsuite/test/tools/lldb-server/gdbremote_testcase.py", line 880, in wait_for_thread_count self.DEFAULT_TIMEOUT, thread_count, actual_thread_count)) Exception: timed out after 10 seconds while waiting for theads: waiting for at least 3 threads, found 1 Config=x86_64-/Users/buildslave/jenkins/workspace/lldb-cmake-matrix/lldb-build/bin/clang ---------------------------------------------------------------------- Ran 65 tests in 127.066s

Hide Details

RESULT: FAILED (29 passes, 0 failures, 1 errors, 34 skipped, 1 expected failures, 0 unexpected successes)

Hide Details

--

Hide Details

******************** UNSUPPORTED: lldb-api :: benchmarks/expression/TestRepeatedExprs.py (1165 of 2171) PASS: lldb-unit :: Utility/./UtilityTests/SharedCluster.ClusterManager (1166 of 2171) PASS: lldb-api :: lang/objc/ptr_refs/TestPtrRefsObjC.py (1167 of 2171) PASS: lldb-api :: tools/lldb-server/TestGdbRemoteAttach.py (1168 of 2171) PASS: lldb-unit :: Expression/./ExpressionTests/CppModuleConfigurationTest.UnrelatedLibrary (1169 of 2171) PASS: lldb-api :: lang/cpp/alignas_base_class/TestAlignAsBaseClass.py (1170 of 2171) PASS: lldb-unit :: Utility/./UtilityTests/AnsiTerminal.Unknown (1171 of 2171) UNSUPPORTED: lldb-api :: functionalities/thread/concurrent_events/TestConcurrentSignalWatch.py (1172 of 2171) PASS: lldb-api :: functionalities/tail_call_frames/ambiguous_tail_call_seq1/TestAmbiguousTailCallSeq1.py (1173 of 2171) PASS: lldb-api :: functionalities/data-formatter/data-formatter-objc/TestDataFormatterObjCNSError.py (1174 of 2171) PASS: lldb-unit :: Host/./HostTests/SocketAddressTest.GetAddressInfo (1175 of 2171) UNSUPPORTED: lldb-shell :: SymbolFile/DWARF/dir-separator-no-comp-dir-relative-name.s (1176 of 2171) PASS: lldb-api :: functionalities/data-formatter/typedef_array/TestTypedefArray.py (1177 of 2171) PASS: lldb-unit :: Utility/./UtilityTests/StringExtractorTest.GetHexU8_Extra (1178 of 2171) PASS: lldb-unit :: Language/Highlighting/./HighlighterTests/HighlighterTest.DefaultHighlighterWithCursorOutOfBounds (1179 of 2171) UNSUPPORTED: lldb-api :: functionalities/tsan/thread_leak/TestTsanThreadLeak.py (1180 of 2171) XFAIL: lldb-shell :: Register/x86-mm-xmm-read.test (1181 of 2171) PASS: lldb-api :: functionalities/unwind/noreturn/TestNoreturnUnwind.py (1182 of 2171) PASS: lldb-api :: lang/cpp/function_refs/TestFunctionRefs.py (1183 of 2171) PASS: lldb-unit :: Utility/./UtilityTests/UriParserTest.BadPort (1184 of 2171) PASS: lldb-api :: commands/log/invalid-args/TestInvalidArgsLog.py (1185 of 2171) PASS: lldb-api :: lang/objc/orderedset/TestOrderedSet.py (1186 of 2171) PASS: lldb-api :: types/TestCharType.py (1187 of 2171) PASS: lldb-unit :: Process/minidump/./LLDBMinidumpTests/MinidumpParserTest.GetMiscInfoWindows (1188 of 2171) PASS: lldb-unit :: Utility/./UtilityTests/ArgsTest.GetQuotedCommandString (1189 of 2171) PASS: lldb-unit :: UnwindAssembly/x86/./UnwindAssemblyx86Tests/Testx86AssemblyInspectionEngine.TestSpArithx86_64Augmented (1190 of 2171) PASS: lldb-unit :: Utility/./UtilityTests/BinaryStreamTest.PutSLEB128OneByte (1191 of 2171) PASS: lldb-unit :: Utility/./UtilityTests/DataExtractorTest.GetBitfield (1192 of 2171) PASS: lldb-api :: functionalities/data-formatter/data-formatter-stl/libcxx/unordered/TestDataFormatterUnordered.py (1193 of 2171) PASS: lldb-api :: commands/platform/basic/TestPlatformCommand.py (1194 of 2171) UNSUPPORTED: lldb-shell :: SymbolFile/DWARF/debug-types-signature-loop.s (1195 of 2171) PASS: lldb-api :: functionalities/data-formatter/data-formatter-stl/libcxx/iterator/TestDataFormatterLibccIterator.py (1196 of 2171) PASS: lldb-unit :: Utility/./UtilityTests/SerializationRountripTest.SerializeDeserializeCStringNull (1197 of 2171) PASS: lldb-api :: lang/c/shared_lib_stripped_symbols/TestSharedLibStrippedSymbols.py (1198 of 2171) PASS: lldb-unit :: Expression/./ExpressionTests/DiagnosticManagerTest.GetStringPreserveOrder (1199 of 2171) PASS: lldb-shell :: ObjectFile/ELF/minidebuginfo-corrupt-xz.yaml (1200 of 2171) PASS: lldb-api :: lang/objc/objc-ivar-protocols/TestIvarProtocols.py (1201 of 2171) PASS: lldb-api :: functionalities/breakpoint/step_over_breakpoint/TestStepOverBreakpoint.py (1202 of 2171) PASS: lldb-unit :: Utility/./UtilityTests/StringExtractorTest.GetHexBytesAvail_FullString (1203 of 2171) PASS: lldb-shell :: SymbolFile/Breakpad/symtab.test (1204 of 2171) PASS: lldb-unit :: UnwindAssembly/x86/./UnwindAssemblyx86Tests/Testx86AssemblyInspectionEngine.TestSimplei386ugmented (1205 of 2171) UNSUPPORTED: lldb-api :: tools/lldb-server/TestGdbRemoteModuleInfo.py (1206 of 2171) UNSUPPORTED: lldb-api :: commands/watchpoints/multiple_threads/TestWatchpointMultipleThreads.py (1207 of 2171) UNSUPPORTED: lldb-api :: functionalities/gdb_remote_client/TestQemuAArch64TargetXml.py (1208 of 2171) PASS: lldb-api :: macosx/function-starts/TestFunctionStarts.py (1209 of 2171) PASS: lldb-api :: commands/expression/import-std-module/list-dbg-info-content/TestDbgInfoContentListFromStdModule.py (1210 of 2171) UNSUPPORTED: lldb-api :: commands/expression/macros/TestMacros.py (1211 of 2171) PASS: lldb-api :: functionalities/data-formatter/data-formatter-stl/libcxx/optional/TestDataFormatterLibcxxOptional.py (1212 of 2171) PASS: lldb-unit :: Utility/./UtilityTests/OptionsWithRawTest.EmptyInput (1213 of 2171) PASS: lldb-api :: commands/expression/codegen-crash-typedefdecl-not-in_declcontext/TestCodegenCrashTypedefDeclNotInDeclContext.py (1214 of 2171) PASS: lldb-api :: functionalities/data-formatter/data-formatter-stl/libcxx/function/TestLibCxxFunction.py (1215 of 2171) PASS: lldb-api :: lang/c/struct_types/TestStructTypes.py (1216 of 2171) PASS: lldb-unit :: Language/Highlighting/./HighlighterTests/HighlighterTest.ClangSquareBrackets (1217 of 2171) PASS: lldb-unit :: Host/./HostTests/NativeProcessProtocolTest.ReadMemoryWithoutTrap (1218 of 2171) PASS: lldb-api :: lang/cpp/std-function-step-into-callable/TestStdFunctionStepIntoCallable.py (1219 of 2171) PASS: lldb-unit :: Host/./HostTests/ConnectionFileDescriptorTest.TCPGetURIv4 (1220 of 2171) PASS: lldb-shell :: SymbolFile/DWARF/debug_loclists-dwo.s (1221 of 2171) PASS: lldb-unit :: Utility/./UtilityTests/XcodeSDKTest.ParseTest (1222 of 2171) PASS: lldb-api :: functionalities/thread/concurrent_events/TestConcurrentBreakpointOneDelayBreakpointThreads.py (1223 of 2171) PASS: lldb-api :: lang/objc/foundation/TestObjCMethodsString.py (1224 of 2171) PASS: lldb-unit :: UnwindAssembly/x86/./UnwindAssemblyx86Tests/Testx86AssemblyInspectionEngine.TestPushRBP (1225 of 2171) PASS: lldb-api :: commands/command/script/import/rdar-12586188/TestRdar12586188.py (1226 of 2171) PASS: lldb-unit :: Utility/./UtilityTests/RangeTest.ContainsRange (1227 of 2171) PASS: lldb-api :: commands/expression/import-std-module/unique_ptr/TestUniquePtrFromStdModule.py (1228 of 2171) PASS: lldb-api :: python_api/sbvalue_const_addrof/TestSBValueConstAddrOf.py (1229 of 2171) PASS: lldb-unit :: Utility/./UtilityTests/RangeDataVector.CustomSort (1230 of 2171) PASS: lldb-api :: macosx/find-dsym/bundle-with-dot-in-filename/TestBundleWithDotInFilename.py (1231 of 2171) PASS: lldb-shell :: Minidump/dump-all.test (1232 of 2171) PASS: lldb-api :: lang/cpp/symbols/TestSymbols.py (1233 of 2171) PASS: lldb-api :: commands/apropos/basic/TestApropos.py (1234 of 2171) PASS: lldb-unit :: UnwindAssembly/x86/./UnwindAssemblyx86Tests/Testx86AssemblyInspectionEngine.TestSpillRegToStackViaMOVi386 (1235 of 2171) PASS: lldb-api :: lang/c/function_types/TestFunctionTypes.py (1236 of 2171) PASS: lldb-shell :: Reproducer/TestWorkingDir.test (1237 of 2171) UNSUPPORTED: lldb-api :: functionalities/tsan/thread_numbers/TestTsanThreadNumbers.py (1238 of 2171) PASS: lldb-unit :: Utility/./UtilityTests/XcodeSDKTest.SDKSupportsSwift (1239 of 2171) UNSUPPORTED: lldb-api :: functionalities/darwin_log/filter/regex/activity/TestDarwinLogFilterRegexActivity.py (1240 of 2171) PASS: lldb-unit :: Utility/./UtilityTests/CompletionRequest.DuplicateFilteringWithComments (1241 of 2171) UNSUPPORTED: lldb-api :: functionalities/darwin_log/filter/regex/message/TestDarwinLogFilterRegexMessage.py (1242 of 2171) UNSUPPORTED: lldb-api :: functionalities/thread/concurrent_events/TestConcurrentWatchBreakDelay.py (1243 of 2171) PASS: lldb-api :: commands/target/select/TestTargetSelect.py (1244 of 2171) UNSUPPORTED: lldb-api :: benchmarks/stepping/TestSteppingSpeed.py (1245 of 2171) PASS: lldb-api :: lang/c/vla/TestVLA.py (1246 of 2171) PASS: lldb-api :: commands/frame/diagnose/dereference-function-return/TestDiagnoseDereferenceFunctionReturn.py (1247 of 2171) PASS: lldb-unit :: Utility/./UtilityTests/FileSpecTest.EqualDotsPosixRoot (1248 of 2171) PASS: lldb-shell :: Breakpoint/dummy-target.test (1249 of 2171) PASS: lldb-shell :: BuildScript/modes.test (1250 of 2171) UNSUPPORTED: lldb-api :: commands/watchpoints/hello_watchpoint/TestMyFirstWatchpoint.py (1251 of 2171) PASS: lldb-shell :: Minidump/disassemble-no-module.yaml (1252 of 2171) PASS: lldb-shell :: lldb-server/TestErrorMessages.test (1253 of 2171) PASS: lldb-shell :: Minidump/memory-region.yaml (1254 of 2171) PASS: lldb-unit :: Language/Highlighting/./HighlighterTests/HighlighterTest.Keywords (1255 of 2171) PASS: lldb-unit :: Utility/./UtilityTests/RangeTest.NotEqual (1256 of 2171) PASS: lldb-unit :: Utility/./UtilityTests/StreamTest.QuotedCString (1257 of 2171) PASS: lldb-unit :: Expression/./ExpressionTests/DiagnosticManagerTest.AppendMessageAttachToLastDiag (1258 of 2171) PASS: lldb-unit :: Language/Highlighting/./HighlighterTests/HighlighterTest.ClangBraces (1259 of 2171) PASS: lldb-shell :: Breakpoint/implicit_const_form_support.test (1260 of 2171) PASS: lldb-unit :: Utility/./UtilityTests/Predicate.WaitForValueEqualTo (1261 of 2171) PASS: lldb-unit :: Utility/./UtilityTests/StreamTest.PutRawBytesToBigEndian (1262 of 2171) PASS: lldb-unit :: Utility/./UtilityTests/VMRange.IsValid (1263 of 2171) UNSUPPORTED: lldb-shell :: SymbolFile/DWARF/find-function-regex.cpp (1264 of 2171) PASS: lldb-api :: functionalities/memory/find/TestMemoryFind.py (1265 of 2171) PASS: lldb-shell :: Settings/TestSettingsSet.test (1266 of 2171) PASS: lldb-unit :: UnwindAssembly/x86/./UnwindAssemblyx86Tests/Testx86AssemblyInspectionEngine.TestPushEBP (1267 of 2171) PASS: lldb-unit :: Platform/./LLDBPlatformTests/PlatformDarwinTest.FindComponentInPath (1268 of 2171) PASS: lldb-api :: functionalities/breakpoint/breakpoint_locations/TestBreakpointLocations.py (1269 of 2171) PASS: lldb-unit :: Symbol/./SymbolTests/TestTypeSystemClang.TestOwningModule (1270 of 2171) PASS: lldb-unit :: Process/minidump/./LLDBMinidumpTests/MinidumpParserTest.GetThreadContext_x86_64 (1271 of 2171) PASS: lldb-unit :: Utility/./UtilityTests/UUIDTest.StringConverion (1272 of 2171) UNSUPPORTED: lldb-api :: commands/expression/completion-crash-invalid-iterator/TestInvalidIteratorCompletionCrash.py (1273 of 2171) PASS: lldb-unit :: ScriptInterpreter/Python/./ScriptInterpreterPythonTests/PythonDataObjectsTest.TestPythonStringToStructuredString (1274 of 2171) PASS: lldb-unit :: Utility/./UtilityTests/DataExtractorTest.GetMaxU64 (1275 of 2171) PASS: lldb-unit :: Utility/./UtilityTests/FileSpecTest.EqualSeparator (1276 of 2171) PASS: lldb-api :: functionalities/thread/concurrent_events/TestConcurrentCrashWithSignal.py (1277 of 2171) PASS: lldb-api :: types/TestDoubleTypes.py (1278 of 2171) PASS: lldb-unit :: Utility/./UtilityTests/StringExtractorTest.GetU64LittleEndian (1279 of 2171) PASS: lldb-api :: python_api/sbenvironment/TestSBEnvironment.py (1280 of 2171) PASS: lldb-api :: macosx/lc-note/kern-ver-str/TestKernVerStrLCNOTE.py (1281 of 2171) PASS: lldb-unit :: Utility/./UtilityTests/NameMatchesTest.Ignore (1282 of 2171) PASS: lldb-api :: commands/expression/import-std-module/forward_decl_from_module/TestForwardDeclFromStdModule.py (1283 of 2171) PASS: lldb-unit :: Utility/./UtilityTests/ConstStringTest.NullAndEmptyStates (1284 of 2171) PASS: lldb-unit :: Utility/./UtilityTests/EnvironmentTest.EnvpConstruction (1285 of 2171) PASS: lldb-shell :: Register/x86-64-ymm-read.test (1286 of 2171) PASS: lldb-unit :: Symbol/./SymbolTests/TestTypeSystemClang.TemplateArguments (1287 of 2171) PASS: lldb-unit :: Utility/./UtilityTests/RecordReplayTest.InstrumentedFoo (1288 of 2171) PASS: lldb-unit :: Utility/./UtilityTests/CompletionRequest.TryCompleteCurrentArgMode (1289 of 2171) XFAIL: lldb-shell :: Unwind/prefer-debug-over-eh-frame.test (1290 of 2171) UNSUPPORTED: lldb-shell :: SymbolFile/DWARF/inline-function-address.ll (1291 of 2171) PASS: lldb-unit :: Symbol/./SymbolTests/TestClangASTImporter.CopyDeclTagDecl (1292 of 2171) PASS: lldb-api :: commands/expression/top-level/TestTopLevelExprs.py (1293 of 2171) PASS: lldb-shell :: Process/Optimization.test (1294 of 2171) UNSUPPORTED: lldb-api :: tools/lldb-server/TestGdbRemoteAuxvSupport.py (1295 of 2171) PASS: lldb-api :: commands/expression/options/TestExprOptions.py (1296 of 2171) PASS: lldb-shell :: Driver/TestError.test (1297 of 2171) UNSUPPORTED: lldb-shell :: SymbolFile/PDB/pointers.test (1298 of 2171) PASS: lldb-shell :: Settings/TestDisassemblyFormat.test (1299 of 2171) PASS: lldb-api :: lang/cpp/class_types/TestClassTypes.py (1300 of 2171) PASS: lldb-api :: macosx/macCatalyst/TestMacCatalyst.py (1301 of 2171) PASS: lldb-shell :: Settings/TestModuleCacheSanity.test (1302 of 2171) PASS: lldb-api :: functionalities/history/TestHistoryRecall.py (1303 of 2171) UNSUPPORTED: lldb-api :: tools/lldb-server/TestGdbRemote_vContThreads.py (1304 of 2171) PASS: lldb-unit :: DataFormatter/./LLDBFormatterTests/TypeMatcherTests.RegexName (1305 of 2171) PASS: lldb-unit :: Expression/./ExpressionTests/DiagnosticManagerTest.PutString (1306 of 2171) PASS: lldb-api :: lang/c/complex/TestComplexC99.py (1307 of 2171) PASS: lldb-unit :: Utility/./UtilityTests/RecordReplayTest.InstrumentedBarRef (1308 of 2171) UNSUPPORTED: lldb-api :: benchmarks/libcxxmap/TestBenchmarkLibcxxMap.py (1309 of 2171) PASS: lldb-unit :: Process/gdb-remote/./ProcessGdbRemoteTests/GDBRemoteClientBaseTest.SendContinueAndAsyncSignal (1310 of 2171) PASS: lldb-api :: functionalities/plugins/python_os_plugin/stepping_plugin_threads/TestOSPluginStepping.py (1311 of 2171) PASS: lldb-shell :: SymbolFile/DWARF/dwp-debug-types.s (1312 of 2171) PASS: lldb-unit :: Symbol/./SymbolTests/TestClangASTImporter.RecordLayout (1313 of 2171) PASS: lldb-unit :: UnwindAssembly/x86/./UnwindAssemblyx86Tests/Testx86AssemblyInspectionEngine.TestPopR13 (1314 of 2171) PASS: lldb-api :: lang/objc/modules-compile-error/TestModulesCompileError.py (1315 of 2171) PASS: lldb-unit :: Process/gdb-remote/./ProcessGdbRemoteTests/GDBRemoteCommunicationClientTest.WriteRegister (1316 of 2171) PASS: lldb-unit :: Signals/./SignalsTests/UnixSignalsTest.Iteration (1317 of 2171) PASS: lldb-unit :: Language/Highlighting/./HighlighterTests/HighlighterTest.ClangCursorPosInOtherToken (1318 of 2171) UNSUPPORTED: lldb-api :: functionalities/unwind/ehframe/TestEhFrameUnwind.py (1319 of 2171) PASS: lldb-api :: functionalities/breakpoint/dummy_target_breakpoints/TestBreakpointsWithNoTargets.py (1320 of 2171) PASS: lldb-api :: lang/c/global_variables/TestGlobalVariables.py (1321 of 2171) PASS: lldb-unit :: Utility/./UtilityTests/StringListTest.LongestCommonPrefixSingleElement (1322 of 2171) PASS: lldb-unit :: Utility/./UtilityTests/TimerTest.CategoryTimesStats (1323 of 2171) PASS: lldb-api :: api/listeners/TestListener.py (1324 of 2171) PASS: lldb-api :: commands/expression/po_verbosity/TestPoVerbosity.py (1325 of 2171) PASS: lldb-api :: commands/expression/ignore-artificial-constructors/TestIgnoreArtificialConstructors.py (1326 of 2171) PASS: lldb-unit :: DataFormatter/./LLDBFormatterTests/StringPrinterTests.CxxASCII (1327 of 2171) PASS: lldb-unit :: ObjectFile/Breakpad/./ObjectFileBreakpadTests/PublicRecord.parse (1328 of 2171) UNSUPPORTED: lldb-shell :: SymbolFile/DWARF/find-variable-file.cpp (1329 of 2171) PASS: lldb-api :: commands/expression/import-std-module/unique_ptr-dbg-info-content/TestUniquePtrDbgInfoContent.py (1330 of 2171) PASS: lldb-api :: tools/lldb-vscode/launch/TestVSCode_launch.py (1331 of 2171) PASS: lldb-api :: functionalities/postmortem/elf-core/thread_crash/TestLinuxCoreThreads.py (1332 of 2171) PASS: lldb-api :: functionalities/thread/create_after_attach/TestCreateAfterAttach.py (1333 of 2171) PASS: lldb-unit :: Utility/./UtilityTests/RegularExpression.Invalid (1334 of 2171) PASS: lldb-api :: functionalities/gdb_remote_client/TestPlatformClient.py (1335 of 2171) PASS: lldb-unit :: Signals/./SignalsTests/UnixSignalsTest.GetInfo (1336 of 2171) PASS: lldb-api :: lang/cpp/constructors/TestCppConstructors.py (1337 of 2171) PASS: lldb-unit :: Expression/./ExpressionTests/CppModuleConfigurationTest.AmbiguousCLib (1338 of 2171) PASS: lldb-api :: functionalities/tail_call_frames/cross_dso/TestCrossDSOTailCalls.py (1339 of 2171) PASS: lldb-unit :: Utility/./UtilityTests/VASprintfTest.EncodingError (1340 of 2171) PASS: lldb-shell :: SymbolFile/DWARF/apple-index-is-used.cpp (1341 of 2171) PASS: lldb-unit :: ObjectFile/PECOFF/./ObjectFilePECOFFTests/PECallFrameInfoTest.Frame_reg_eh (1342 of 2171) PASS: lldb-api :: lang/cpp/modules-import/TestCXXModulesImport.py (1343 of 2171) PASS: lldb-api :: commands/command/source/TestCommandSource.py (1344 of 2171) PASS: lldb-api :: commands/expression/radar_9673664/TestExprHelpExamples.py (1345 of 2171) PASS: lldb-api :: python_api/section/TestSectionAPI.py (1346 of 2171) PASS: lldb-shell :: ObjectFile/ELF/PT_LOAD-overlap.yaml (1347 of 2171) PASS: lldb-api :: functionalities/thread/concurrent_events/TestConcurrentBreakpointDelayBreakpointOneSignal.py (1348 of 2171) UNSUPPORTED: lldb-shell :: Register/x86-ymm-read.test (1349 of 2171) PASS: lldb-api :: commands/expression/result_numbering/TestResultNumbering.py (1350 of 2171) PASS: lldb-unit :: Utility/./UtilityTests/UriParserTest.LongPath (1351 of 2171) PASS: lldb-api :: functionalities/data-formatter/ptr_ref_typedef/TestPtrRef2Typedef.py (1352 of 2171) PASS: lldb-unit :: Utility/./UtilityTests/BinaryStreamTest.PutULEB128SevenBytes (1353 of 2171) PASS: lldb-api :: lang/objc/global_ptrs/TestGlobalObjects.py (1354 of 2171) PASS: lldb-api :: functionalities/data-formatter/data-formatter-objc/nsindexpath/TestDataFormatterNSIndexPath.py (1355 of 2171) PASS: lldb-unit :: SymbolFile/NativePDB/./SymbolFileNativePDBTests/PDBFPOProgramToDWARFExpressionTests.InvalidOpUnary (1356 of 2171) PASS: lldb-shell :: ObjectFile/ELF/PT_LOAD-empty.yaml (1357 of 2171) PASS: lldb-unit :: Target/./TargetTests/RemoteAwarePlatformTest.TestResolveExecutabelOnClientByPlatform (1358 of 2171) PASS: lldb-unit :: Expression/./ExpressionTests/CppModuleConfigurationTest.UnknownLibCppFile (1359 of 2171) PASS: lldb-unit :: Utility/./UtilityTests/RangeTest.Copy (1360 of 2171) PASS: lldb-api :: functionalities/dynamic_value_child_count/TestDynamicValueChildCount.py (1361 of 2171) PASS: lldb-api :: lang/cpp/frame-var-anon-unions/TestFrameVariableAnonymousUnions.py (1362 of 2171) PASS: lldb-api :: commands/platform/file/read/TestPlatformFileRead.py (1363 of 2171) PASS: lldb-unit :: Utility/./UtilityTests/ScalarTest.APIntConstructor (1364 of 2171) PASS: lldb-api :: python_api/interpreter/TestRunCommandInterpreterAPI.py (1365 of 2171) PASS: lldb-shell :: SymbolFile/DWARF/DW_TAG_variable-DW_AT_const_value.s (1366 of 2171) PASS: lldb-api :: commands/expression/import-std-module/deque-basic/TestDequeFromStdModule.py (1367 of 2171) PASS: lldb-api :: functionalities/postmortem/elf-core/TestLinuxCore.py (1368 of 2171) PASS: lldb-api :: functionalities/data-formatter/data-formatter-python-synth/TestDataFormatterPythonSynth.py (1369 of 2171) UNSUPPORTED: lldb-api :: commands/watchpoints/watchpoint_count/TestWatchpointCount.py (1370 of 2171) PASS: lldb-unit :: Utility/./UtilityTests/SerializationRountripTest.SerializeDeserializePodReferences (1371 of 2171) PASS: lldb-api :: lang/cpp/elaborated-types/TestElaboratedTypes.py (1372 of 2171) PASS: lldb-unit :: Utility/./UtilityTests/StringListTest.LongestCommonPrefixEmpty (1373 of 2171) PASS: lldb-unit :: Utility/./UtilityTests/ScalarTest.TruncOrExtendTo (1374 of 2171) PASS: lldb-unit :: Expression/./ExpressionTests/DiagnosticManagerTest.AppendMessageSubsequentDiags (1375 of 2171) PASS: lldb-shell :: SymbolFile/Breakpad/unwind-via-stack-win-no-memory-info.yaml (1376 of 2171) PASS: lldb-api :: lang/cpp/char8_t/TestCxxChar8_t.py (1377 of 2171) PASS: lldb-api :: functionalities/exec/TestExec.py (1378 of 2171) PASS: lldb-unit :: SymbolFile/NativePDB/./SymbolFileNativePDBTests/PDBFPOProgramToDWARFExpressionTests.InvalidAssignmentMultiple (1379 of 2171) PASS: lldb-shell :: SymbolFile/DWARF/anon_class_w_and_wo_export_symbols.ll (1380 of 2171) PASS: lldb-api :: commands/thread/select/TestThreadSelect.py (1381 of 2171) UNSUPPORTED: lldb-api :: functionalities/thread/create_during_step/TestCreateDuringStep.py (1382 of 2171) PASS: lldb-api :: functionalities/data-formatter/data-formatter-disabling/TestDataFormatterDisabling.py (1383 of 2171) PASS: lldb-unit :: Utility/./UtilityTests/StreamTest.AddressSuffix (1384 of 2171) UNSUPPORTED: lldb-api :: linux/thread/create_during_instruction_step/TestCreateDuringInstructionStep.py (1385 of 2171) PASS: lldb-api :: functionalities/inferior-crashing/TestInferiorCrashing.py (1386 of 2171) PASS: lldb-unit :: Utility/./UtilityTests/UriParserTest.BracketedHostnameWithPortIPv6 (1387 of 2171) UNSUPPORTED: lldb-shell :: SymbolFile/DWARF/find-basic-namespace.cpp (1388 of 2171) PASS: lldb-unit :: UnwindAssembly/x86/./UnwindAssemblyx86Tests/Testx86AssemblyInspectionEngine.TestSubRSP (1389 of 2171) PASS: lldb-api :: functionalities/gdb_remote_client/TestRegDefinitionInParts.py (1390 of 2171) PASS: lldb-api :: macosx/order/TestOrderFile.py (1391 of 2171) PASS: lldb-unit :: Utility/./UtilityTests/TimerTest.CategoryTimes2 (1392 of 2171) PASS: lldb-shell :: SymbolFile/DWARF/debug_ranges-missing-section.s (1393 of 2171) PASS: lldb-api :: tools/lldb-server/TestGdbRemoteSingleStep.py (1394 of 2171) UNSUPPORTED: lldb-shell :: Register/x86-zmm-write.test (1395 of 2171) PASS: lldb-unit :: UnwindAssembly/x86/./UnwindAssemblyx86Tests/Testx86AssemblyInspectionEngine.TestPopEBX (1396 of 2171) PASS: lldb-api :: commands/expression/call-function/TestCallStopAndContinue.py (1397 of 2171) PASS: lldb-api :: functionalities/data-formatter/type_summary_list_script/TestTypeSummaryListScript.py (1398 of 2171) PASS: lldb-api :: lang/cpp/nested-class-other-compilation-unit/TestNestedClassWithParentInAnotherCU.py (1399 of 2171) PASS: lldb-api :: functionalities/pointer_num_children/TestPointerNumChildren.py (1400 of 2171) PASS: lldb-unit :: UnwindAssembly/x86/./UnwindAssemblyx86Tests/Testx86AssemblyInspectionEngine.TestSimple64bitFrameFunction (1401 of 2171) PASS: lldb-unit :: Utility/./UtilityTests/StringListTest.GetMaxStringLengthMixed (1402 of 2171) PASS: lldb-shell :: Process/UnsupportedLanguage.test (1403 of 2171) PASS: lldb-unit :: Language/Highlighting/./HighlighterTests/HighlighterTest.Colons (1404 of 2171) PASS: lldb-api :: commands/expression/entry-bp/TestExprEntryBP.py (1405 of 2171) PASS: lldb-api :: macosx/load-kext/TestLoadKext.py (1406 of 2171) PASS: lldb-api :: lang/cpp/bool/TestCPPBool.py (1407 of 2171) PASS: lldb-unit :: Target/./TargetTests/ExecutionContextTest.GetByteOrderProcess (1408 of 2171) UNSUPPORTED: lldb-api :: commands/expression/call-restarts/TestCallThatRestarts.py (1409 of 2171) PASS: lldb-unit :: Utility/./UtilityTests/StringExtractorTest.GetHexBytes (1410 of 2171) PASS: lldb-unit :: Utility/./UtilityTests/UUIDTest.RelationalOperators (1411 of 2171) PASS: lldb-unit :: Utility/./UtilityTests/Flags.AllSet (1412 of 2171) PASS: lldb-shell :: ScriptInterpreter/None/none.test (1413 of 2171) PASS: lldb-unit :: Utility/./UtilityTests/StreamTest.PutBytesAsRawHex8ToMixedEndian (1414 of 2171) PASS: lldb-unit :: Utility/./UtilityTests/XcodeSDKTest.SDKSupportsModules (1415 of 2171) PASS: lldb-unit :: Interpreter/./InterpreterTests/CompletionTest.FileCompletionAbsolute (1416 of 2171) PASS: lldb-unit :: Language/CPlusPlus/./LanguageCPlusPlusTests/CPlusPlusLanguage.CPlusPlusNameParser (1417 of 2171) PASS: lldb-shell :: SymbolFile/DWARF/dwp.s (1418 of 2171) UNSUPPORTED: lldb-api :: python_api/event/TestEvents.py (1419 of 2171) PASS: lldb-unit :: Utility/./UtilityTests/ArgsTest.TestSingleArg (1420 of 2171) PASS: lldb-unit :: Utility/./UtilityTests/CompletionRequest.DuplicateFiltering (1421 of 2171) PASS: lldb-api :: functionalities/set-data/TestSetData.py (1422 of 2171) UNSUPPORTED: lldb-api :: functionalities/thread/concurrent_events/TestConcurrentDelaySignalWatch.py (1423 of 2171) PASS: lldb-api :: functionalities/breakpoint/breakpoint_by_line_and_column/TestBreakpointByLineAndColumn.py (1424 of 2171) PASS: lldb-unit :: Expression/./ExpressionTests/CppModuleConfigurationTest.LinuxLocalLibCpp (1425 of 2171) PASS: lldb-unit :: Utility/./UtilityTests/BinaryStreamTest.PutSLEB128MaxValue (1426 of 2171) PASS: lldb-unit :: Host/./HostTests/FileActionTest.Open (1427 of 2171) PASS: lldb-shell :: Reproducer/TestDebugSymbols.test (1428 of 2171) PASS: lldb-shell :: Reproducer/TestFinalize.test (1429 of 2171) PASS: lldb-unit :: Core/./LLDBCoreTests/ModuleSpecTest.InvalidInMemoryBufferValidFile (1430 of 2171) PASS: lldb-api :: functionalities/thread/ignore_suspended/TestIgnoreSuspendedThread.py (1431 of 2171) PASS: lldb-shell :: SymbolFile/DWARF/DW_TAG_basic_type_DW_ATE_UTF_nonC.ll (1432 of 2171) PASS: lldb-api :: functionalities/deleted-executable/TestDeletedExecutable.py (1433 of 2171) UNSUPPORTED: lldb-shell :: SymbolFile/DWARF/find-basic-variable.cpp (1434 of 2171) UNSUPPORTED: lldb-shell :: SymbolFile/DWARF/split-dwarf-expression-eval-bug.cpp (1435 of 2171) PASS: lldb-unit :: Utility/./UtilityTests/StructuredDataTest.ParseJSONFromFile (1436 of 2171) PASS: lldb-shell :: Breakpoint/debug_rnglist_basic.test (1437 of 2171) UNSUPPORTED: lldb-shell :: ObjectFile/PECOFF/dep-modules.yaml (1438 of 2171) PASS: lldb-unit :: Utility/./UtilityTests/RangeDataVector.FindEntryIndexesThatContain_Overlap (1439 of 2171) PASS: lldb-unit :: Utility/./UtilityTests/ArgsTest.TestUnknownEscape (1440 of 2171) PASS: lldb-unit :: Utility/./UtilityTests/AnsiTerminal.Basic (1441 of 2171) PASS: lldb-api :: python_api/sbtype_typeclass/TestSBTypeTypeClass.py (1442 of 2171) PASS: lldb-api :: python_api/lldbutil/TestSwigVersion.py (1443 of 2171) PASS: lldb-api :: api/multiple-targets/TestMultipleTargets.py (1444 of 2171) PASS: lldb-unit :: Utility/./UtilityTests/StringListTest.GetMaxStringLengthEqualSize (1445 of 2171) PASS: lldb-unit :: Symbol/./SymbolTests/TestTypeSystemClang.TestNotDeletingUserCopyCstrDueToMoveCStr (1446 of 2171) UNSUPPORTED: lldb-shell :: Breakpoint/case-insensitive.test (1447 of 2171) PASS: lldb-unit :: Core/./LLDBCoreTests/ModuleSpecTest.TestELFFile (1448 of 2171) PASS: lldb-unit :: Symbol/./SymbolTests/TestTypeSystemClang.TestDeletingImplicitCopyCstrDueToMoveCStr (1449 of 2171) PASS: lldb-shell :: Breakpoint/case-sensitive.test (1450 of 2171) PASS: lldb-unit :: Host/./HostTests/NativeProcessProtocolTest.SetBreakpointFailRead (1451 of 2171) PASS: lldb-api :: lang/c/step-target/TestStepTarget.py (1452 of 2171) PASS: lldb-unit :: Utility/./UtilityTests/StringListTest.InsertStringAtIndexMove (1453 of 2171) PASS: lldb-api :: iohandler/resize/TestIOHandlerResize.py (1454 of 2171) PASS: lldb-unit :: Expression/./ExpressionTests/DiagnosticManagerTest.GetStringBasic (1455 of 2171) PASS: lldb-api :: functionalities/tail_call_frames/disambiguate_paths_to_common_sink/TestDisambiguatePathsToCommonSink.py (1456 of 2171) PASS: lldb-unit :: Utility/./UtilityTests/VMRange.Comparison (1457 of 2171) PASS: lldb-unit :: UnwindAssembly/x86/./UnwindAssemblyx86Tests/Testx86AssemblyInspectionEngine.TestSubESP (1458 of 2171) PASS: lldb-unit :: ScriptInterpreter/Python/./ScriptInterpreterPythonTests/PythonDataObjectsTest.TestPythonIntegerToStructuredInteger (1459 of 2171) PASS: lldb-unit :: Utility/./UtilityTests/StreamTeeTest.CopyConstructor (1460 of 2171) PASS: lldb-shell :: Process/TestAbortExitCode.test (1461 of 2171) PASS: lldb-api :: functionalities/thread/concurrent_events/TestConcurrentSignalBreak.py (1462 of 2171) PASS: lldb-unit :: Utility/./UtilityTests/BinaryStreamTest.PutULEB128NineBytes (1463 of 2171) PASS: lldb-unit :: Language/CPlusPlus/./LanguageCPlusPlusTests/CPlusPlusLanguage.MethodNameParsing (1464 of 2171) PASS: lldb-api :: lang/c/complex_int/TestComplexInt.py (1465 of 2171) PASS: lldb-api :: lang/c/conflicting-symbol/TestConflictingSymbol.py (1466 of 2171) PASS: lldb-shell :: Reproducer/Functionalities/TestImageList.test (1467 of 2171) PASS: lldb-unit :: Language/Highlighting/./HighlighterTests/HighlighterTest.ClangPPDirectives (1468 of 2171) UNSUPPORTED: lldb-api :: functionalities/data-formatter/data-formatter-stl/libstdcpp/map/TestDataFormatterStdMap.py (1469 of 2171) PASS: lldb-api :: assert_messages_test/TestAssertMessages.py (1470 of 2171) PASS: lldb-unit :: Utility/./UtilityTests/StreamTest.PutBytesAsRawHex8ToBigEndian (1471 of 2171) PASS: lldb-unit :: Utility/./UtilityTests/UriParserTest.SchemeHostSeparator (1472 of 2171) UNSUPPORTED: lldb-shell :: SymbolFile/PDB/typedefs.test (1473 of 2171) PASS: lldb-api :: functionalities/ptr_refs/TestPtrRefs.py (1474 of 2171) PASS: lldb-unit :: Utility/./UtilityTests/ArchSpecTest.YAML (1475 of 2171) PASS: lldb-api :: commands/frame/diagnose/virtual-method-call/TestDiagnoseDereferenceVirtualMethodCall.py (1476 of 2171) PASS: lldb-api :: python_api/lldbutil/process/TestPrintStackTraces.py (1477 of 2171) PASS: lldb-unit :: Host/./HostTests/NativeProcessProtocolTest.SetBreakpointFailWrite (1478 of 2171) PASS: lldb-unit :: Utility/./UtilityTests/AnsiTerminal.WhiteSpace (1479 of 2171) PASS: lldb-unit :: Expression/./ExpressionTests/ClangExpressionDeclMapTest.TestUnknownIdentifierLookup (1480 of 2171) PASS: lldb-unit :: Utility/./UtilityTests/StringExtractorTest.GetHexU8_Underflow2_NoEof (1481 of 2171) PASS: lldb-api :: python_api/value/linked_list/TestValueAPILinkedList.py (1482 of 2171) PASS: lldb-api :: functionalities/breakpoint/serialize/TestBreakpointSerialization.py (1483 of 2171) PASS: lldb-api :: iohandler/completion/TestIOHandlerCompletion.py (1484 of 2171) PASS: lldb-unit :: UnwindAssembly/x86/./UnwindAssemblyx86Tests/Testx86AssemblyInspectionEngine.TestPushImm (1485 of 2171) PASS: lldb-unit :: ScriptInterpreter/Python/./ScriptInterpreterPythonTests/PythonDataObjectsTest.TestModuleNameResolutionNoDot (1486 of 2171) UNSUPPORTED: lldb-api :: functionalities/thread/concurrent_events/TestConcurrentTwoWatchpointsOneSignal.py (1487 of 2171) UNSUPPORTED: lldb-api :: functionalities/darwin_log/filter/exact_match/activity/TestDarwinLogFilterMatchActivity.py (1488 of 2171) PASS: lldb-unit :: ScriptInterpreter/Python/./ScriptInterpreterPythonTests/PythonDataObjectsTest.TestPythonString (1489 of 2171) PASS: lldb-unit :: Utility/./UtilityTests/UriParserTest.BracketedHostname (1490 of 2171) PASS: lldb-unit :: Utility/./UtilityTests/ArgsTest.TestInsertArg (1491 of 2171) PASS: lldb-api :: lang/c/shared_lib/TestSharedLib.py (1492 of 2171) PASS: lldb-api :: commands/command/script/import/TestImport.py (1493 of 2171) PASS: lldb-unit :: Host/./HostTests/File.GetStreamFromDescriptor (1494 of 2171) PASS: lldb-shell :: SymbolFile/DWARF/debug-types-dwarf5.s (1495 of 2171) PASS: lldb-api :: commands/frame/select/TestFrameSelect.py (1496 of 2171) PASS: lldb-api :: commands/expression/import-std-module/vector-of-vectors/TestVectorOfVectorsFromStdModule.py (1497 of 2171) PASS: lldb-api :: lang/cpp/overloaded-functions/TestOverloadedFunctions.py (1498 of 2171) PASS: lldb-api :: commands/quit/TestQuit.py (1499 of 2171) PASS: lldb-unit :: Utility/./UtilityTests/FileSpecTest.Yaml (1500 of 2171) PASS: lldb-unit :: Symbol/./SymbolTests/TestTypeSystemClang.TestConvertAccessTypeToAccessSpecifier (1501 of 2171) PASS: lldb-shell :: SymbolFile/DWARF/DW_AT_loclists_base.s (1502 of 2171) PASS: lldb-api :: lang/objc/modules/TestObjCModules.py (1503 of 2171) PASS: lldb-unit :: SymbolFile/DWARF/./SymbolFileDWARFTests/SymbolFileDWARFTests.TestAbbrevOrder1Start5 (1504 of 2171) PASS: lldb-unit :: Utility/./UtilityTests/BinaryStreamTest.PutULEB128Zero (1505 of 2171) PASS: lldb-api :: lang/cpp/operators/TestCppOperators.py (1506 of 2171) PASS: lldb-unit :: Symbol/./SymbolTests/TestTypeSystemClang.TestGetEnumIntegerTypeInvalid (1507 of 2171) PASS: lldb-api :: lang/c/strings/TestCStrings.py (1508 of 2171) PASS: lldb-api :: lang/cpp/const_this/TestConstThis.py (1509 of 2171) PASS: lldb-api :: python_api/sbstructureddata/TestStructuredDataAPI.py (1510 of 2171) PASS: lldb-unit :: Host/./HostTests/MainLoopTest.DetectsEOF (1511 of 2171) PASS: lldb-api :: lang/c/stepping/TestStepAndBreakpoints.py (1512 of 2171) PASS: lldb-api :: functionalities/data-formatter/data-formatter-objc/TestDataFormatterObjCNSDate.py (1513 of 2171) PASS: lldb-unit :: Utility/./UtilityTests/DataExtractorTest.GetCStrAtEnd (1514 of 2171) PASS: lldb-api :: macosx/version_zero/TestGetVersionZeroVersion.py (1515 of 2171) PASS: lldb-api :: functionalities/data-formatter/nsarraysynth/TestNSArraySynthetic.py (1516 of 2171) PASS: lldb-unit :: Utility/./UtilityTests/StringExtractorTest.DecodeHexU8_InvalidHex (1517 of 2171) PASS: lldb-unit :: Utility/./UtilityTests/StringExtractorTest.GetNameColonValueNoColon (1518 of 2171) PASS: lldb-unit :: UnwindAssembly/x86/./UnwindAssemblyx86Tests/Testx86AssemblyInspectionEngine.TestPushR15 (1519 of 2171) PASS: lldb-api :: types/TestRecursiveTypes.py (1520 of 2171) PASS: lldb-unit :: Utility/./UtilityTests/ScalarTest.Getters (1521 of 2171) PASS: lldb-api :: functionalities/object-file/TestImageListMultiArchitecture.py (1522 of 2171) PASS: lldb-shell :: ObjectFile/ELF/PT_TLS-overlap-PT_LOAD.yaml (1523 of 2171) PASS: lldb-api :: lang/cpp/dynamic-value-same-basename/TestDynamicValueSameBase.py (1524 of 2171) PASS: lldb-api :: types/TestShortTypeExpr.py (1525 of 2171) PASS: lldb-unit :: Utility/./UtilityTests/ReproducerTest.SetCapture (1526 of 2171) PASS: lldb-unit :: Utility/./UtilityTests/StringExtractorTest.GetNameColonValueNoSemicolon (1527 of 2171) PASS: lldb-shell :: SymbolFile/symbol-binding.test (1528 of 2171) PASS: lldb-unit :: Utility/./UtilityTests/StringListTest.LongestCommonPrefixDuplicateElement (1529 of 2171) PASS: lldb-api :: commands/frame/diagnose/local-variable/TestLocalVariable.py (1530 of 2171) PASS: lldb-unit :: Utility/./UtilityTests/RangeTest.DefaultConstructor (1531 of 2171) PASS: lldb-api :: functionalities/load_using_paths/TestLoadUsingPaths.py (1532 of 2171) PASS: lldb-unit :: Process/./ProcessEventDataTests/ProcessEventDataTest.DoOnRemoval (1533 of 2171) PASS: lldb-unit :: Platform/./LLDBPlatformTests/PlatformAppleSimulatorTest.TestHostPlatformToSim (1534 of 2171) PASS: lldb-api :: lang/objc/modules-auto-import/TestModulesAutoImport.py (1535 of 2171) PASS: lldb-unit :: Host/./HostTests/MainLoopTest.UnmonitoredSignal (1536 of 2171) PASS: lldb-unit :: Utility/./UtilityTests/BinaryStreamTest.PutSLEB128ThreeBytes (1537 of 2171) PASS: lldb-unit :: Process/gdb-remote/./ProcessGdbRemoteTests/GDBRemoteCommunicationClientTest.ReadRegister (1538 of 2171) PASS: lldb-api :: types/TestIntegerType.py (1539 of 2171) PASS: lldb-api :: commands/expression/test/TestExprs.py (1540 of 2171) PASS: lldb-unit :: Utility/./UtilityTests/StringListTest.SplitIntoLinesEmpty (1541 of 2171) UNSUPPORTED: lldb-api :: commands/watchpoints/watchpoint_disable/TestWatchpointDisable.py (1542 of 2171) PASS: lldb-unit :: UnwindAssembly/x86/./UnwindAssemblyx86Tests/Testx86AssemblyInspectionEngine.TestPushR13 (1543 of 2171) PASS: lldb-api :: functionalities/thread/backtrace_limit/TestBacktraceLimit.py (1544 of 2171) PASS: lldb-unit :: ScriptInterpreter/Python/./ScriptInterpreterPythonTests/PythonDataObjectsTest.TestPythonListManipulation (1545 of 2171) PASS: lldb-unit :: Utility/./UtilityTests/StringExtractorTest.GetHexBytesAvail (1546 of 2171) PASS: lldb-unit :: Utility/./UtilityTests/ArchSpecTest.TestParseMachCPUDashSubtypeTripleExtra (1547 of 2171) PASS: lldb-api :: lang/cpp/breakpoint-commands/TestCPPBreakpointCommands.py (1548 of 2171) PASS: lldb-unit :: tools/lldb-server/tests/./LLDBServerTests/TestBase.LaunchModePreservesEnvironment (1549 of 2171) PASS: lldb-unit :: Utility/./UtilityTests/AnsiTerminal.Empty (1550 of 2171) PASS: lldb-api :: python_api/lldbutil/iter/TestRegistersIterator.py (1551 of 2171) UNSUPPORTED: lldb-shell :: ObjectFile/PECOFF/disassemble-thumb.yaml (1552 of 2171) PASS: lldb-api :: functionalities/breakpoint/debugbreak/TestDebugBreak.py (1553 of 2171) PASS: lldb-api :: tools/lldb-vscode/breakpoint/TestVSCode_setBreakpoints.py (1554 of 2171) PASS: lldb-api :: tools/lldb-server/TestGdbRemoteExpeditedRegisters.py (1555 of 2171) PASS: lldb-unit :: Utility/./UtilityTests/StreamTeeTest.AppendStream (1556 of 2171) PASS: lldb-api :: lang/cpp/dynamic-value/TestCppValueCast.py (1557 of 2171) PASS: lldb-unit :: ScriptInterpreter/Python/./ScriptInterpreterPythonTests/PythonDataObjectsTest.TestExtractingUInt64ThroughStructuredData (1558 of 2171) PASS: lldb-api :: lang/cpp/namespace/TestNamespaceLookup.py (1559 of 2171) PASS: lldb-shell :: SymbolFile/DWARF/clang-ast-from-dwarf-unamed-and-anon-structs.cpp (1560 of 2171) PASS: lldb-api :: functionalities/data-formatter/dump_dynamic/TestDumpDynamic.py (1561 of 2171) PASS: lldb-unit :: Utility/./UtilityTests/StreamTeeTest.GetStreamAtIndexOutOfBounds (1562 of 2171) PASS: lldb-unit :: Language/Highlighting/./HighlighterTests/HighlighterTest.ClangCursorPos (1563 of 2171) PASS: lldb-unit :: Utility/./UtilityTests/RegularExpression.Valid (1564 of 2171) PASS: lldb-unit :: Utility/./UtilityTests/StringListTest.InsertStringAtIndexOutOfBounds (1565 of 2171) PASS: lldb-api :: functionalities/gdb_remote_client/TestWriteMemory.py (1566 of 2171) PASS: lldb-unit :: Language/Highlighting/./HighlighterTests/HighlighterTest.ClangTrailingBackslashMissingNewLine (1567 of 2171) UNSUPPORTED: lldb-api :: functionalities/tty/TestTerminal.py (1568 of 2171) PASS: lldb-api :: lang/objc/rdar-10967107/TestRdar10967107.py (1569 of 2171) PASS: lldb-unit :: Utility/./UtilityTests/StreamTeeTest.Constructor1Stream (1570 of 2171) UNSUPPORTED: lldb-api :: functionalities/asan/TestReportData.py (1571 of 2171) PASS: lldb-unit :: Expression/./ExpressionTests/DiagnosticManagerTest.GetStringMultiline (1572 of 2171) PASS: lldb-shell :: ObjectFile/MachO/symtab.yaml (1573 of 2171) PASS: lldb-unit :: Utility/./UtilityTests/ScalarTest.LongLongAssigmentOperator (1574 of 2171) PASS: lldb-api :: lang/cpp/class-template-parameter-pack/TestClassTemplateParameterPack.py (1575 of 2171) UNSUPPORTED: lldb-api :: functionalities/thread/concurrent_events/TestConcurrentSignalWatchBreak.py (1576 of 2171) PASS: lldb-unit :: Language/Highlighting/./HighlighterTests/HighlighterTest.ClangCursorPosEndOfLine (1577 of 2171) PASS: lldb-api :: functionalities/gdb_remote_client/TestNoGPacketSupported.py (1578 of 2171) PASS: lldb-api :: python_api/interpreter/TestCommandInterpreterAPI.py (1579 of 2171) PASS: lldb-api :: functionalities/tail_call_frames/disambiguate_tail_call_seq/TestDisambiguateTailCallSeq.py (1580 of 2171) PASS: lldb-shell :: ObjectFile/PDB/object.test (1581 of 2171) PASS: lldb-api :: macosx/duplicate-archive-members/TestDuplicateMembers.py (1582 of 2171) PASS: lldb-shell :: SymbolFile/DWARF/module-ownership.mm (1583 of 2171) UNSUPPORTED: lldb-api :: linux/sepdebugsymlink/TestTargetSymbolsSepDebugSymlink.py (1584 of 2171) PASS: lldb-shell :: SymbolFile/DWARF/debug_aranges-empty-section.s (1585 of 2171) PASS: lldb-unit :: Process/minidump/./LLDBMinidumpTests/MinidumpParserTest.GetThreadContext_x86_32 (1586 of 2171) PASS: lldb-shell :: ObjectFile/ELF/PT_LOAD-overlap-section.yaml (1587 of 2171) PASS: lldb-api :: lang/cpp/this_class_type_mixing/TestThisClassTypeMixing.py (1588 of 2171) PASS: lldb-shell :: Reproducer/TestVerify.test (1589 of 2171) PASS: lldb-unit :: debugserver/./debugserverTests/RNBSocket.LoopBackListenIPv6 (1590 of 2171) PASS: lldb-unit :: Core/./LLDBCoreTests/ModuleSpecTest.InvalidInMemoryBuffer (1591 of 2171) PASS: lldb-api :: functionalities/data-formatter/format-propagation/TestFormatPropagation.py (1592 of 2171) PASS: lldb-unit :: UnwindAssembly/x86/./UnwindAssemblyx86Tests/Testx86AssemblyInspectionEngine.Testi386IgnoredRegisters (1593 of 2171) PASS: lldb-unit :: Utility/./UtilityTests/SubsystemRAIITest.SubsystemWithErrorSuccess (1594 of 2171) PASS: lldb-api :: functionalities/thread/step_until/TestStepUntil.py (1595 of 2171) UNSUPPORTED: lldb-api :: commands/watchpoints/watchpoint_events/TestWatchpointEvents.py (1596 of 2171) PASS: lldb-api :: lang/cpp/stl/TestStdCXXDisassembly.py (1597 of 2171) PASS: lldb-api :: python_api/sbdata/TestSBData.py (1598 of 2171) UNSUPPORTED: lldb-shell :: SymbolFile/DWARF/DW_TAG_GNU_call_site-DW_AT_low_pc.s (1599 of 2171) PASS: lldb-shell :: Breakpoint/split-dwarf-5-addrbase.test (1600 of 2171) PASS: lldb-unit :: Utility/./UtilityTests/ProcessInfoTest.Constructor (1601 of 2171) PASS: lldb-api :: terminal/TestSTTYBeforeAndAfter.py (1602 of 2171) PASS: lldb-api :: lang/objc/foundation/TestObjCMethodsNSError.py (1603 of 2171) UNSUPPORTED: lldb-api :: functionalities/data-formatter/data-formatter-stl/libstdcpp/vector/TestDataFormatterStdVector.py (1604 of 2171) PASS: lldb-api :: lang/cpp/auto/TestCPPAuto.py (1605 of 2171) PASS: lldb-unit :: Utility/./UtilityTests/RangeTest.Equal (1606 of 2171) PASS: lldb-shell :: Reproducer/TestReuseDirectory.test (1607 of 2171) PASS: lldb-unit :: Symbol/./SymbolTests/TestTypeSystemClang.TestFunctionTemplateConstruction (1608 of 2171) PASS: lldb-api :: functionalities/postmortem/mach-core/TestMachCore.py (1609 of 2171) UNSUPPORTED: lldb-shell :: SymbolFile/DWARF/debug_ranges_and_rnglists.test (1610 of 2171) PASS: lldb-unit :: Utility/./UtilityTests/UriParserTest.PortOverflow (1611 of 2171) PASS: lldb-api :: functionalities/plugins/python_os_plugin/TestPythonOSPlugin.py (1612 of 2171) PASS: lldb-api :: commands/target/stop-hook/disable/TestTargetStopHookDisable.py (1613 of 2171) PASS: lldb-unit :: Utility/./UtilityTests/DataExtractorTest.GetCStrUnterminated (1614 of 2171) PASS: lldb-unit :: Utility/./UtilityTests/StringListTest.Assignment (1615 of 2171) PASS: lldb-unit :: Utility/./UtilityTests/StringListTest.AppendStringMove (1616 of 2171) PASS: lldb-unit :: API/./APITests/SBCommandInterpreterTest.MultiWordCommand (1617 of 2171) PASS: lldb-unit :: Host/./HostTests/SocketTests/SocketTest.UDPConnect/ipv4 (1618 of 2171) PASS: lldb-api :: functionalities/breakpoint/cpp/TestCPPBreakpointLocations.py (1619 of 2171) PASS: lldb-api :: functionalities/gdb_remote_client/TestWasm.py (1620 of 2171) PASS: lldb-api :: lang/cpp/stl/TestSTL.py (1621 of 2171) PASS: lldb-api :: functionalities/tail_call_frames/ambiguous_tail_call_seq2/TestAmbiguousTailCallSeq2.py (1622 of 2171) PASS: lldb-unit :: Utility/./UtilityTests/ScalarTest.ComparisonFloat (1623 of 2171) PASS: lldb-unit :: DataFormatter/./LLDBFormatterTests/TypeMatcherTests.GetMatchStringExactName (1624 of 2171) PASS: lldb-shell :: SymbolFile/DWARF/dwarf5-debug_line.s (1625 of 2171) PASS: lldb-shell :: ObjectFile/Breakpad/sections-trailing-func.test (1626 of 2171) PASS: lldb-api :: lang/cpp/unique-types/TestUniqueTypes.py (1627 of 2171) PASS: lldb-api :: commands/expression/issue_11588/Test11588.py (1628 of 2171) PASS: lldb-api :: commands/expression/unwind_expression/TestUnwindExpression.py (1629 of 2171) UNSUPPORTED: lldb-shell :: ScriptInterpreter/Lua/lua-python.test (1630 of 2171) PASS: lldb-unit :: Utility/./UtilityTests/StringLexerTest.AdvanceIf (1631 of 2171) PASS: lldb-unit :: Utility/./UtilityTests/StreamTest.AddressRangeInvalidRange (1632 of 2171) PASS: lldb-unit :: Process/./ProcessEventDataTests/ProcessEventDataTest.ShouldStop (1633 of 2171) PASS: lldb-api :: functionalities/gdb_remote_client/TestGDBRemoteDiskFileCompletion.py (1634 of 2171) PASS: lldb-unit :: Utility/./UtilityTests/StreamTeeTest.SetStreamAtIndexOverwrite (1635 of 2171) UNSUPPORTED: lldb-shell :: SymbolFile/DWARF/limit-debug-info.s (1636 of 2171) PASS: lldb-api :: functionalities/data-formatter/var-in-aggregate-misuse/TestVarInAggregateMisuse.py (1637 of 2171) PASS: lldb-unit :: Process/minidump/./LLDBMinidumpTests/RegisterContextMinidump.CheckRegisterContextMinidump_ARM (1638 of 2171) PASS: lldb-api :: functionalities/data-formatter/data-formatter-stl/libcxx/queue/TestDataFormatterLibcxxQueue.py (1639 of 2171) UNSUPPORTED: lldb-api :: commands/watchpoints/variable_out_of_scope/TestWatchedVarHitWhenInScope.py (1640 of 2171) PASS: lldb-api :: commands/expression/persistent_types/TestNestedPersistentTypes.py (1641 of 2171) PASS: lldb-shell :: Quit/TestQuitExitCodeTooManyArgs.test (1642 of 2171) PASS: lldb-api :: tools/lldb-vscode/attach/TestVSCode_attach.py (1643 of 2171) PASS: lldb-unit :: SymbolFile/DWARF/./SymbolFileDWARFTests/SymbolFileDWARFTests.ParseArangesNonzeroSegmentSize (1644 of 2171) PASS: lldb-unit :: DataFormatter/./LLDBFormatterTests/StringPrinterTests.CxxUTF8 (1645 of 2171) PASS: lldb-shell :: SymbolFile/DWARF/static_scope.s (1646 of 2171) PASS: lldb-api :: python_api/exprpath_synthetic/TestExprPathSynthetic.py (1647 of 2171) PASS: lldb-shell :: Commands/command-script-import.test (1648 of 2171) PASS: lldb-shell :: ObjectFile/Breakpad/sections.test (1649 of 2171) PASS: lldb-shell :: Reproducer/Functionalities/TestDataFormatter.test (1650 of 2171) PASS: lldb-api :: lang/objcxx/hide-runtime-values/TestObjCXXHideRuntimeValues.py (1651 of 2171) PASS: lldb-shell :: SymbolFile/DWARF/find-qualified-variable.cpp (1652 of 2171) PASS: lldb-unit :: Core/./LLDBCoreTests/UniqueCStringMap.NoDefaultConstructor (1653 of 2171) PASS: lldb-api :: lang/cpp/static_methods/TestCPPStaticMethods.py (1654 of 2171) PASS: lldb-api :: commands/expression/class_template_specialization_empty_pack/TestClassTemplateSpecializationParametersHandling.py (1655 of 2171) PASS: lldb-unit :: Process/gdb-remote/./ProcessGdbRemoteTests/GDBRemoteCommunicationServerTest.SendErrorResponse_ErrorList (1656 of 2171) PASS: lldb-api :: functionalities/stats_api/TestStatisticsAPI.py (1657 of 2171) UNSUPPORTED: lldb-shell :: Register/arm-fp-read.test (1658 of 2171) PASS: lldb-unit :: UnwindAssembly/x86/./UnwindAssemblyx86Tests/Testx86AssemblyInspectionEngine.TestPushEDX (1659 of 2171) PASS: lldb-api :: functionalities/postmortem/elf-core/gcore/TestGCore.py (1660 of 2171) PASS: lldb-unit :: UnwindAssembly/x86/./UnwindAssemblyx86Tests/Testx86AssemblyInspectionEngine.TestPushRBPWithREX (1661 of 2171) PASS: lldb-api :: commands/target/create-no-such-arch/TestNoSuchArch.py (1662 of 2171) PASS: lldb-unit :: Host/./HostTests/SocketTests/SocketTest.DomainListenConnectAccept/ipv4 (1663 of 2171) UNSUPPORTED: lldb-api :: functionalities/thread/concurrent_events/TestConcurrentCrashWithWatchpointBreakpointSignal.py (1664 of 2171) PASS: lldb-unit :: Host/./HostTests/Host.WaitStatusFormat (1665 of 2171) UNSUPPORTED: lldb-api :: functionalities/thread/multi_break/TestMultipleBreakpoints.py (1666 of 2171) PASS: lldb-unit :: Utility/./UtilityTests/DataExtractorTest.GetMaxU64_unchecked (1667 of 2171) PASS: lldb-api :: commands/log/basic/TestLogging.py (1668 of 2171) PASS: lldb-unit :: Symbol/./SymbolTests/TestClangASTImporter.ImportInvalidType (1669 of 2171) PASS: lldb-api :: lang/cpp/function-qualifiers/TestCppFunctionQualifiers.py (1670 of 2171) PASS: lldb-unit :: Utility/./UtilityTests/StringExtractorTest.GetHexU8_Extra_NoEof (1671 of 2171) PASS: lldb-unit :: Process/minidump/./LLDBMinidumpTests/MinidumpParserTest.GetMemoryRegionInfoLinuxMaps (1672 of 2171) PASS: lldb-api :: commands/platform/process/list/TestProcessList.py (1673 of 2171) PASS: lldb-api :: functionalities/breakpoint/breakpoint_set_restart/TestBreakpointSetRestart.py (1674 of 2171) PASS: lldb-api :: lang/objc/foundation/TestObjCMethods.py (1675 of 2171) PASS: lldb-api :: functionalities/data-formatter/boolreference/TestFormattersBoolRefPtr.py (1676 of 2171) UNSUPPORTED: lldb-api :: functionalities/thread/concurrent_events/TestConcurrentDelayedCrashWithBreakpointWatchpoint.py (1677 of 2171) PASS: lldb-shell :: Driver/TestCore.test (1678 of 2171) PASS: lldb-api :: functionalities/abbreviation/TestAbbreviations.py (1679 of 2171) PASS: lldb-api :: functionalities/backticks/TestBackticksWithoutATarget.py (1680 of 2171) PASS: lldb-api :: lang/c/array_types/TestArrayTypes.py (1681 of 2171) PASS: lldb-api :: tools/lldb-server/TestGdbRemoteThreadsInStopReply.py (1682 of 2171) PASS: lldb-unit :: Utility/./UtilityTests/TildeExpressionResolver.ResolveFullPath (1683 of 2171) PASS: lldb-unit :: Utility/./UtilityTests/StreamTest.PutCharWhitespace (1684 of 2171) PASS: lldb-unit :: UnwindAssembly/x86/./UnwindAssemblyx86Tests/Testx86AssemblyInspectionEngine.TestStackRealign32BitDisp_x86_64 (1685 of 2171) PASS: lldb-api :: commands/process/attach/attach_denied/TestAttachDenied.py (1686 of 2171) PASS: lldb-unit :: Utility/./UtilityTests/XcodeSDKTest.FindXcodeContentsDirectoryInPath (1687 of 2171) PASS: lldb-api :: commands/expression/multiline-navigation/TestMultilineNavigation.py (1688 of 2171) PASS: lldb-unit :: Utility/./UtilityTests/RangeDataVector.FindEntryIndexesThatContain (1689 of 2171) PASS: lldb-shell :: ObjectFile/wasm/unified-debug-sections.yaml (1690 of 2171) PASS: lldb-unit :: Utility/./UtilityTests/DeserializerTest.HasData (1691 of 2171) PASS: lldb-unit :: Utility/./UtilityTests/BinaryStreamTest.PutULEB128FiveBytes (1692 of 2171) PASS: lldb-unit :: Language/Highlighting/./HighlighterTests/HighlighterTest.DefaultHighlighterWithCursor (1693 of 2171) PASS: lldb-unit :: Utility/./UtilityTests/StreamTest.AddressRangeSize (1694 of 2171) PASS: lldb-unit :: Utility/./UtilityTests/StringListTest.DefaultConstructor (1695 of 2171) PASS: lldb-unit :: ScriptInterpreter/Python/./ScriptInterpreterPythonTests/PythonDataObjectsTest.TestPythonCallableInvoke (1696 of 2171) PASS: lldb-api :: lang/cpp/char1632_t/TestChar1632T.py (1697 of 2171) PASS: lldb-api :: lang/cpp/type_lookup/TestCppTypeLookup.py (1698 of 2171) PASS: lldb-api :: python_api/breakpoint/TestBreakpointAPI.py (1699 of 2171) PASS: lldb-api :: functionalities/target-new-solib-notifications/TestModuleLoadedNotifys.py (1700 of 2171) PASS: lldb-unit :: Utility/./UtilityTests/FileSpecTest.EqualDotsWindows (1701 of 2171) PASS: lldb-api :: macosx/thread-names/TestInterruptThreadNames.py (1702 of 2171) PASS: lldb-shell :: Driver/TestPositionalArgs.test (1703 of 2171) PASS: lldb-unit :: ScriptInterpreter/Python/./ScriptInterpreterPythonTests/PythonDataObjectsTest.TestGlobalNameResolutionNoDot (1704 of 2171) PASS: lldb-unit :: Process/gdb-remote/./ProcessGdbRemoteTests/GDBRemoteCommunicationClientTest.SendSignalsToIgnore (1705 of 2171) UNSUPPORTED: lldb-shell :: Expr/TestIRMemoryMapWindows.test (1706 of 2171) PASS: lldb-api :: functionalities/breakpoint/breakpoint_conditions/TestBreakpointConditions.py (1707 of 2171) PASS: lldb-unit :: Symbol/./SymbolTests/PostfixExpression.ToDWARF (1708 of 2171) PASS: lldb-shell :: ObjectFile/ELF/duplicate-section.yaml (1709 of 2171) PASS: lldb-unit :: Host/./HostTests/FileSystemTest.OpenErrno (1710 of 2171) PASS: lldb-api :: lang/cpp/thread_local/TestThreadLocal.py (1711 of 2171) PASS: lldb-api :: functionalities/thread_plan/TestThreadPlanCommands.py (1712 of 2171) PASS: lldb-shell :: Reproducer/TestHomeDir.test (1713 of 2171) PASS: lldb-unit :: ScriptInterpreter/Python/./ScriptInterpreterPythonTests/PythonDataObjectsTest.TestResetting (1714 of 2171) PASS: lldb-api :: lang/objc/forward-decl/TestForwardDecl.py (1715 of 2171) PASS: lldb-shell :: SymbolFile/Breakpad/symtab-macho.test (1716 of 2171) PASS: lldb-unit :: Utility/./UtilityTests/XcodeSDKTest.GetCanonicalNameAndConstruct (1717 of 2171) PASS: lldb-api :: python_api/target/TestTargetAPI.py (1718 of 2171) UNSUPPORTED: lldb-api :: lang/cpp/static_members/TestCPPStaticMembers.py (1719 of 2171) PASS: lldb-unit :: Utility/./UtilityTests/StreamTest.AddressPrefix (1720 of 2171) PASS: lldb-unit :: UnwindAssembly/x86/./UnwindAssemblyx86Tests/Testx86AssemblyInspectionEngine.TestDisassemblyJunkBytes (1721 of 2171) PASS: lldb-unit :: Utility/./UtilityTests/StringExtractorTest.DecodeHexU8_Underflow2 (1722 of 2171) PASS: lldb-api :: functionalities/breakpoint/hardware_breakpoints/require_hw_breakpoints/TestRequireHWBreakpoints.py (1723 of 2171) PASS: lldb-api :: lang/cpp/scope/TestCppScope.py (1724 of 2171) UNSUPPORTED: lldb-api :: commands/register/register/intel_xtended_registers/mpx_offset_intersection/TestMPXOffsetIntersection.py (1725 of 2171) PASS: lldb-unit :: Utility/./UtilityTests/ArgsTest.ReplaceArgumentAtIndexEqual (1726 of 2171) PASS: lldb-api :: lang/objc/foundation/TestSymbolTable.py (1727 of 2171) UNSUPPORTED: lldb-api :: lang/objc/modules-app-update/TestClangModulesAppUpdate.py (1728 of 2171) UNSUPPORTED: lldb-api :: functionalities/unwind/standard/TestStandardUnwind.py (1729 of 2171) PASS: lldb-api :: commands/session/history/TestSessionHistory.py (1730 of 2171) PASS: lldb-unit :: SymbolFile/NativePDB/./SymbolFileNativePDBTests/PDBFPOProgramToDWARFExpressionTests.MultipleIndependentAssignments (1731 of 2171) PASS: lldb-shell :: ScriptInterpreter/None/import_module.test (1732 of 2171) UNSUPPORTED: lldb-api :: functionalities/thread/concurrent_events/TestConcurrentCrashWithWatchpoint.py (1733 of 2171) PASS: lldb-unit :: Utility/./UtilityTests/StreamTest.ChangingByteOrder (1734 of 2171) UNSUPPORTED: lldb-shell :: SymbolFile/DWARF/dir-separator-windows.s (1735 of 2171) PASS: lldb-shell :: Commands/command-disassemble-process.yaml (1736 of 2171) PASS: lldb-unit :: DataFormatter/./LLDBFormatterTests/StringPrinterTests.SwiftUTF8 (1737 of 2171) PASS: lldb-unit :: Symbol/./SymbolTests/TestTypeSystemClang.TestGetEnumIntegerTypeUnexpectedType (1738 of 2171) UNSUPPORTED: lldb-api :: functionalities/ubsan/user-expression/TestUbsanUserExpression.py (1739 of 2171) PASS: lldb-api :: functionalities/gdb_remote_client/TestProcessConnect.py (1740 of 2171) PASS: lldb-unit :: Utility/./UtilityTests/StreamTest.AddressRange (1741 of 2171) PASS: lldb-shell :: Reproducer/TestDSYM.test (1742 of 2171) PASS: lldb-api :: functionalities/breakpoint/breakpoint_ids/TestBreakpointIDs.py (1743 of 2171) PASS: lldb-unit :: Utility/./UtilityTests/Flags.AnySet (1744 of 2171) PASS: lldb-unit :: ObjectFile/ELF/./ObjectFileELFTests/ObjectFileELFTest.GetModuleSpecifications_EarlySectionHeaders (1745 of 2171) PASS: lldb-unit :: Process/minidump/./LLDBMinidumpTests/MinidumpParserTest.MinidumpDuplicateModuleMappedFirst (1746 of 2171) PASS: lldb-api :: functionalities/breakpoint/breakpoint_command/TestBreakpointCommand.py (1747 of 2171) PASS: lldb-unit :: Process/gdb-remote/./ProcessGdbRemoteTests/GDBRemoteCommunicationClientTest.WriteRegisterNoSuffix (1748 of 2171) PASS: lldb-shell :: Commands/command-thread-select.test (1749 of 2171) PASS: lldb-unit :: Editline/./EditlineTests/EditlineTestFixture.EditlineReceivesMultiLineText (1750 of 2171) PASS: lldb-api :: lang/cpp/unicode-literals/TestUnicodeLiterals.py (1751 of 2171) PASS: lldb-unit :: Utility/./UtilityTests/UriParserTest.MinimalPortPath (1752 of 2171) PASS: lldb-unit :: API/./APITests/SBCommandInterpreterTest.SingleWordCommand (1753 of 2171) PASS: lldb-unit :: Utility/./UtilityTests/StringListTest.InsertStringAtIndexStart (1754 of 2171) PASS: lldb-unit :: Utility/./UtilityTests/ArchSpecTest.TestParseMachCPUDashSubtypeTripleSimple (1755 of 2171) UNSUPPORTED: lldb-api :: android/platform/TestDefaultCacheLineSize.py (1756 of 2171) PASS: lldb-shell :: SymbolFile/DWARF/DW_AT_low_pc-addrx.s (1757 of 2171) PASS: lldb-unit :: Utility/./UtilityTests/ArgsTest.Yaml (1758 of 2171) UNSUPPORTED: lldb-api :: functionalities/breakpoint/hardware_breakpoints/write_memory_with_hw_breakpoint/TestWriteMemoryWithHWBreakpoint.py (1759 of 2171) PASS: lldb-unit :: ScriptInterpreter/Python/./ScriptInterpreterPythonTests/PythonDataObjectsTest.TestPythonDictionaryValueEquality (1760 of 2171) UNSUPPORTED: lldb-shell :: SymbolFile/NativePDB/ast-types.cpp (1761 of 2171) PASS: lldb-api :: commands/expression/context-object/TestContextObject.py (1762 of 2171) PASS: lldb-api :: commands/expression/import-std-module/vector/TestVectorFromStdModule.py (1763 of 2171) PASS: lldb-unit :: Utility/./UtilityTests/XcodeSDKTest.MergeTest (1764 of 2171) UNSUPPORTED: lldb-shell :: ObjectFile/PECOFF/export-dllfunc.yaml (1765 of 2171) UNSUPPORTED: lldb-api :: lang/objc/rdar-12408181/TestRdar12408181.py (1766 of 2171) UNSUPPORTED: lldb-api :: functionalities/darwin_log/source/info/TestDarwinLogSourceInfo.py (1767 of 2171) PASS: lldb-shell :: ObjectFile/ELF/section-addresses.yaml (1768 of 2171) PASS: lldb-shell :: Settings/TestLineMarkerColor.test (1769 of 2171) PASS: lldb-unit :: Process/gdb-remote/./ProcessGdbRemoteTests/GDBRemoteClientBaseTest.InterruptNoResponse (1770 of 2171) PASS: lldb-unit :: Utility/./UtilityTests/ArgsTest.ReplaceArgumentAtIndexShort (1771 of 2171) PASS: lldb-api :: linux/builtin_trap/TestBuiltinTrap.py (1772 of 2171) PASS: lldb-unit :: Utility/./UtilityTests/DataExtractorTest.GetDoubleUnaligned (1773 of 2171) UNSUPPORTED: lldb-shell :: Register/x86-64-xmm16-write.test (1774 of 2171) PASS: lldb-unit :: Utility/./UtilityTests/StreamTest.ShiftOperatorStrings (1775 of 2171) PASS: lldb-unit :: ScriptInterpreter/Python/./ScriptInterpreterPythonTests/PythonDataObjectsTest.TestPythonInteger (1776 of 2171) PASS: lldb-unit :: Process/minidump/./LLDBMinidumpTests/MinidumpParserTest.InvalidMinidump (1777 of 2171) PASS: lldb-api :: lang/cpp/enum_types/TestCPP11EnumTypes.py (1778 of 2171) PASS: lldb-api :: commands/expression/radar_9531204/TestPrintfAfterUp.py (1779 of 2171) PASS: lldb-shell :: Breakpoint/debug_rnglist_rlestartend.test (1780 of 2171) PASS: lldb-unit :: Expression/./ExpressionTests/CppModuleConfigurationTest.IgnoreLibStdCpp (1781 of 2171) UNSUPPORTED: lldb-shell :: Register/x86-ymm-write.test (1782 of 2171) PASS: lldb-unit :: Utility/./UtilityTests/RangeTest.NotEqualInvalid (1783 of 2171) UNSUPPORTED: lldb-api :: arm/breakpoint-it/TestBreakpointIt.py (1784 of 2171) PASS: lldb-shell :: Driver/TestTarget.test (1785 of 2171) UNSUPPORTED: lldb-api :: python_api/watchpoint/TestWatchpointIgnoreCount.py (1786 of 2171) PASS: lldb-unit :: Utility/./UtilityTests/Flags.AllClear (1787 of 2171) PASS: lldb-unit :: Process/gdb-remote/./ProcessGdbRemoteTests/GDBRemoteCommunicationServerTest.SendErrorResponse_ErrorNumber (1788 of 2171) PASS: lldb-shell :: ObjectFile/ELF/PT_LOAD-overlap-PT_INTERP.yaml (1789 of 2171) PASS: lldb-unit :: UnwindAssembly/x86/./UnwindAssemblyx86Tests/Testx86AssemblyInspectionEngine.TestPopR14 (1790 of 2171) PASS: lldb-api :: lang/objc/foundation/TestRuntimeTypes.py (1791 of 2171) PASS: lldb-api :: commands/expression/dont_allow_jit/TestAllowJIT.py (1792 of 2171) PASS: lldb-unit :: Utility/./UtilityTests/ArchSpecTest.OperatorBool (1793 of 2171) UNSUPPORTED: lldb-shell :: SymbolFile/PDB/ast-restore.test (1794 of 2171) PASS: lldb-unit :: Symbol/./SymbolTests/TestClangASTImporter.DeportTypeTagDecl (1795 of 2171) PASS: lldb-unit :: Utility/./UtilityTests/ScalarTest.SetValueFromData (1796 of 2171) PASS: lldb-api :: types/TestIntegerTypeExpr.py (1797 of 2171) PASS: lldb-api :: commands/command/invalid-args/TestInvalidArgsCommand.py (1798 of 2171) PASS: lldb-api :: python_api/formatters/TestFormattersSBAPI.py (1799 of 2171) UNSUPPORTED: lldb-shell :: SymbolFile/DWARF/find-method.cpp (1800 of 2171) UNSUPPORTED: lldb-shell :: SymbolFile/PDB/function-nested-block.test (1801 of 2171) PASS: lldb-api :: functionalities/data-formatter/data-formatter-stl/libcxx/map/TestDataFormatterLibccMap.py (1802 of 2171) PASS: lldb-unit :: Utility/./UtilityTests/StringExtractorTest.GetHexBytes_Underflow (1803 of 2171) PASS: lldb-unit :: Utility/./UtilityTests/BinaryStreamTest.PutULEB128MaxValue (1804 of 2171) PASS: lldb-api :: functionalities/gdb_remote_client/TestNestedRegDefinitions.py (1805 of 2171) PASS: lldb-unit :: Utility/./UtilityTests/StreamTeeTest.SetStreamAtIndexOutOfBounds (1806 of 2171) PASS: lldb-unit :: Utility/./UtilityTests/StreamTest.PutHex32ByteOrderLittle (1807 of 2171) PASS: lldb-unit :: Utility/./UtilityTests/SerializationRountripTest.SerializeDeserializeCStringArrayNullptr (1808 of 2171) PASS: lldb-api :: commands/frame/language/TestGuessLanguage.py (1809 of 2171) PASS: lldb-shell :: Driver/TestFile.test (1810 of 2171) PASS: lldb-shell :: ObjectFile/MachO/lc_build_version_notools.yaml (1811 of 2171) PASS: lldb-unit :: Utility/./UtilityTests/SubsystemRAIITest.SubsystemWithErrorFailure (1812 of 2171) PASS: lldb-api :: functionalities/data-formatter/data-formatter-stl/libcxx/multimap/TestDataFormatterLibccMultiMap.py (1813 of 2171) UNSUPPORTED: lldb-api :: commands/watchpoints/watchpoint_size/TestWatchpointSizes.py (1814 of 2171) PASS: lldb-unit :: Utility/./UtilityTests/Predicate.WaitForValueNotEqualTo (1815 of 2171) PASS: lldb-unit :: Utility/./UtilityTests/StreamTest.PutHex64ByteOrderLittle (1816 of 2171) PASS: lldb-unit :: Utility/./UtilityTests/FileSpecTest.OperatorBool (1817 of 2171) PASS: lldb-api :: lang/objc/hidden-ivars/TestHiddenIvars.py (1818 of 2171) PASS: lldb-unit :: Expression/./ExpressionTests/CppModuleConfigurationTest.Xcode (1819 of 2171) PASS: lldb-unit :: Utility/./UtilityTests/BroadcasterTest.BroadcastEvent (1820 of 2171) UNSUPPORTED: lldb-shell :: SymbolFile/NativePDB/ast-methods.cpp (1821 of 2171) UNSUPPORTED: lldb-api :: functionalities/darwin_log/filter/regex/subsystem/TestDarwinLogFilterRegexSubsystem.py (1822 of 2171) PASS: lldb-api :: lang/objcxx/cxx-bridged-po/TestObjCXXBridgedPO.py (1823 of 2171) PASS: lldb-unit :: Language/Highlighting/./HighlighterTests/HighlighterTest.DefaultHighlighter (1824 of 2171) PASS: lldb-api :: commands/expression/call-function/TestCallBuiltinFunction.py (1825 of 2171) PASS: lldb-api :: commands/expression/pr35310/TestExprsBug35310.py (1826 of 2171) PASS: lldb-unit :: SymbolFile/DWARF/./SymbolFileDWARFTests/SymbolFileDWARFTests.TestAbilitiesForDWARF (1827 of 2171) PASS: lldb-unit :: Process/gdb-remote/./ProcessGdbRemoteTests/GDBRemoteClientBaseTest.SendPacketAndReceiveResponseWithOutputSupport (1828 of 2171) PASS: lldb-api :: commands/expression/argument_passing_restrictions/TestArgumentPassingRestrictions.py (1829 of 2171) PASS: lldb-unit :: Platform/Android/./AdbClientTests/AdbClientTest.CreateByDeviceId (1830 of 2171) PASS: lldb-api :: python_api/sberror/TestSBError.py (1831 of 2171) PASS: lldb-unit :: Language/Highlighting/./HighlighterTests/HighlighterTest.ClangScalarLiterals (1832 of 2171) PASS: lldb-api :: functionalities/dlopen_other_executable/TestDlopenOtherExecutable.py (1833 of 2171) PASS: lldb-api :: lang/cpp/bitfields/TestCppBitfields.py (1834 of 2171) PASS: lldb-unit :: Utility/./UtilityTests/RegularExpression.Match (1835 of 2171) UNSUPPORTED: lldb-shell :: SymbolFile/NativePDB/source-list.cpp (1836 of 2171) PASS: lldb-unit :: Host/./HostTests/HostInfoTest.GetAugmentedArchSpec (1837 of 2171) PASS: lldb-unit :: ScriptInterpreter/Python/./ScriptInterpreterPythonTests/PythonDataObjectsTest.TestPythonIntegerToStr (1838 of 2171) PASS: lldb-unit :: Utility/./UtilityTests/StringLexerTest.GetUnlexed (1839 of 2171) UNSUPPORTED: lldb-shell :: BuildScript/toolchain-clang-cl.test (1840 of 2171) PASS: lldb-unit :: SymbolFile/DWARF/./SymbolFileDWARFTests/SymbolFileDWARFTests.TestAbbrevInvalidNULLTag (1841 of 2171) UNSUPPORTED: lldb-shell :: Process/Windows/exception_access_violation.cpp (1842 of 2171) UNSUPPORTED: lldb-api :: functionalities/darwin_log/filter/regex/activity-chain/TestDarwinLogFilterRegexActivityChain.py (1843 of 2171) PASS: lldb-api :: functionalities/data-formatter/data-formatter-stl/libcxx/vbool/TestDataFormatterLibcxxVBool.py (1844 of 2171) PASS: lldb-unit :: UnwindAssembly/x86/./UnwindAssemblyx86Tests/Testx86AssemblyInspectionEngine.Test64bitFramelessBigStackFrame (1845 of 2171) PASS: lldb-api :: lang/cpp/namespace_definitions/TestNamespaceDefinitions.py (1846 of 2171) PASS: lldb-api :: functionalities/data-formatter/data-formatter-objc/TestDataFormatterObjNSException.py (1847 of 2171) PASS: lldb-unit :: Utility/./UtilityTests/ConstStringTest.FromMidOfBufferStringRef (1848 of 2171) PASS: lldb-unit :: Utility/./UtilityTests/StringListTest.JoinSingle (1849 of 2171) PASS: lldb-api :: lang/cpp/virtual-functions/TestCppVirtualFunctions.py (1850 of 2171) PASS: lldb-api :: iohandler/unicode/TestUnicode.py (1851 of 2171) PASS: lldb-unit :: debugserver/./debugserverTests/RNBSocket.AnyListen (1852 of 2171) PASS: lldb-api :: commands/expression/no-deadlock/TestExprDoesntBlock.py (1853 of 2171) PASS: lldb-api :: lang/objc/ivar-IMP/TestObjCiVarIMP.py (1854 of 2171) PASS: lldb-api :: macosx/add-dsym/TestAddDsymMidExecutionCommand.py (1855 of 2171) PASS: lldb-unit :: Utility/./UtilityTests/ArgsTest.TestSingleQuotedArgWithSpace (1856 of 2171) PASS: lldb-shell :: SymbolFile/DWARF/debug-types-line-tables.s (1857 of 2171) PASS: lldb-unit :: Thread/./ThreadTests/ThreadTest.SetStopInfo (1858 of 2171) PASS: lldb-api :: commands/help/TestHelp.py (1859 of 2171) PASS: lldb-shell :: Reproducer/TestSynchronous.test (1860 of 2171) PASS: lldb-api :: functionalities/data-formatter/data-formatter-enum-format/TestDataFormatterEnumFormat.py (1861 of 2171) PASS: lldb-unit :: Utility/./UtilityTests/StreamTest.PutCStringWithStringRef (1862 of 2171) PASS: lldb-api :: lang/objc/objc-stepping/TestObjCStepping.py (1863 of 2171) PASS: lldb-api :: functionalities/wrong_commands/TestWrongCommands.py (1864 of 2171) PASS: lldb-unit :: Symbol/./SymbolTests/TestClangASTImporter.MetadataPropagationIndirectImport (1865 of 2171) PASS: lldb-api :: lang/objc/bitfield_ivars/TestBitfieldIvars.py (1866 of 2171) PASS: lldb-shell :: Breakpoint/split-dwarf5-debug-stroffsets.test (1867 of 2171) PASS: lldb-unit :: Utility/./UtilityTests/StringExtractorTest.DecodeHexU8_InvalidHex2 (1868 of 2171) PASS: lldb-api :: functionalities/avoids-fd-leak/TestFdLeak.py (1869 of 2171) PASS: lldb-api :: commands/session/save/TestSessionSave.py (1870 of 2171) PASS: lldb-unit :: Process/minidump/./LLDBMinidumpTests/MinidumpParserTest.GetPid (1871 of 2171) PASS: lldb-shell :: ObjectFile/ELF/section-types.yaml (1872 of 2171) PASS: lldb-unit :: Utility/./UtilityTests/ScalarTest.RightShiftOperator (1873 of 2171) UNSUPPORTED: lldb-shell :: Register/x86-64-gp-write.test (1874 of 2171) PASS: lldb-api :: functionalities/breakpoint/breakpoint_language/TestBreakpointLanguage.py (1875 of 2171) PASS: lldb-unit :: Expression/./ExpressionTests/DWARFExpression.DW_OP_unknown (1876 of 2171) PASS: lldb-api :: functionalities/thread/exit_during_step/TestExitDuringStep.py (1877 of 2171) PASS: lldb-unit :: SymbolFile/DWARF/./SymbolFileDWARFTests/SymbolFileDWARFTests.TestAbbrevOutOfOrder (1878 of 2171) PASS: lldb-api :: functionalities/data-formatter/setvaluefromcstring/TestSetValueFromCString.py (1879 of 2171) UNSUPPORTED: lldb-shell :: Register/x86-64-ymm16-write.test (1880 of 2171) PASS: lldb-unit :: Process/minidump/./LLDBMinidumpTests/MinidumpParserTest.GetMemoryRegionInfo (1881 of 2171) PASS: lldb-api :: lang/objc/self/TestObjCSelf.py (1882 of 2171) PASS: lldb-api :: lang/objc/single-entry-dictionary/TestObjCSingleEntryDictionary.py (1883 of 2171) PASS: lldb-unit :: Utility/./UtilityTests/StringLexerTest.PutBack (1884 of 2171) UNSUPPORTED: lldb-shell :: ScriptInterpreter/Lua/quit.test (1885 of 2171) PASS: lldb-shell :: Reproducer/TestDiscard.test (1886 of 2171) PASS: lldb-api :: python_api/frame/inlines/TestInlinedFrame.py (1887 of 2171) PASS: lldb-unit :: Utility/./UtilityTests/StreamTest.ShiftOperatorChars (1888 of 2171) PASS: lldb-unit :: Utility/./UtilityTests/PassiveReplayTest.InstrumentedBarPtr (1889 of 2171) PASS: lldb-api :: functionalities/signal/handle-abrt/TestHandleAbort.py (1890 of 2171) PASS: lldb-api :: functionalities/rerun/TestRerun.py (1891 of 2171) PASS: lldb-unit :: Symbol/./SymbolTests/LineEntryTest.GetSameLineContiguousAddressRangeNoInlines (1892 of 2171) PASS: lldb-unit :: UnwindAssembly/x86/./UnwindAssemblyx86Tests/Testx86AssemblyInspectionEngine.TestPushEBX (1893 of 2171) UNSUPPORTED: lldb-shell :: SymbolFile/NativePDB/function-types-calling-conv.cpp (1894 of 2171) PASS: lldb-unit :: Utility/./UtilityTests/PassiveReplayTest.InstrumentedBar (1895 of 2171) PASS: lldb-unit :: Utility/./UtilityTests/StringListTest.ShiftMove (1896 of 2171) PASS: lldb-api :: macosx/thread_suspend/TestInternalThreadSuspension.py (1897 of 2171) PASS: lldb-shell :: Driver/TestHelp.test (1898 of 2171) PASS: lldb-api :: lang/cpp/template/TestTemplateArgs.py (1899 of 2171) PASS: lldb-unit :: Utility/./UtilityTests/ProcessInstanceInfo.Yaml (1900 of 2171) PASS: lldb-api :: macosx/find-app-in-bundle/TestFindAppInBundle.py (1901 of 2171) PASS: lldb-unit :: ObjectFile/Breakpad/./ObjectFileBreakpadTests/Record.classify (1902 of 2171) PASS: lldb-api :: commands/expression/import-std-module/conflicts/TestStdModuleWithConflicts.py (1903 of 2171) PASS: lldb-api :: commands/expression/import-std-module/stack/TestStackFromStdModule.py (1904 of 2171) PASS: lldb-unit :: Process/gdb-remote/./ProcessGdbRemoteTests/GDBRemoteCommunicationClientTest.SendGetTraceConfigPacket (1905 of 2171) UNSUPPORTED: lldb-api :: functionalities/thread/state/TestThreadStates.py (1906 of 2171) PASS: lldb-api :: commands/process/launch-with-shellexpand/TestLaunchWithShellExpand.py (1907 of 2171) PASS: lldb-api :: commands/expression/two-files/TestObjCTypeQueryFromOtherCompileUnit.py (1908 of 2171) PASS: lldb-api :: lang/objc/print-obj/TestPrintObj.py (1909 of 2171) PASS: lldb-unit :: Utility/./UtilityTests/ArgsTest.ReplaceArgumentAtIndexFarOutOfRange (1910 of 2171) PASS: lldb-api :: lang/c/offsetof/TestOffsetof.py (1911 of 2171) PASS: lldb-api :: commands/expression/radar_8638051/Test8638051.py (1912 of 2171) PASS: lldb-unit :: Utility/./UtilityTests/NameMatchesTest.StartsWith (1913 of 2171) PASS: lldb-shell :: SymbolFile/DWARF/debug_line-tombstone.s (1914 of 2171) PASS: lldb-unit :: UnwindAssembly/x86/./UnwindAssemblyx86Tests/Testx86AssemblyInspectionEngine.Test32BitOnlyInstruction (1915 of 2171) PASS: lldb-unit :: Utility/./UtilityTests/DataExtractorTest.GetCStr (1916 of 2171) PASS: lldb-api :: functionalities/fat_archives/TestFatArchives.py (1917 of 2171) UNSUPPORTED: lldb-api :: functionalities/thread/break_after_join/TestBreakAfterJoin.py (1918 of 2171) UNSUPPORTED: lldb-shell :: SymbolFile/NativePDB/local-variables.cpp (1919 of 2171) PASS: lldb-api :: functionalities/data-formatter/data-formatter-objc/cmtime/TestDataFormatterCMTime.py (1920 of 2171) PASS: lldb-shell :: SymbolFile/DWARF/find-method-local-struct.cpp (1921 of 2171) PASS: lldb-shell :: ObjectFile/ELF/many-sections.s (1922 of 2171) PASS: lldb-unit :: Utility/./UtilityTests/ArgsTest.ReplaceArgumentAtIndexLonger (1923 of 2171) PASS: lldb-unit :: DataFormatter/./LLDBFormatterTests/FormatManagerTests.CompatibleLangs (1924 of 2171) PASS: lldb-unit :: Host/./HostTests/SocketTests/SocketTest.TCPGetAddress/ipv6 (1925 of 2171) PASS: lldb-unit :: Utility/./UtilityTests/RangeTest.Slide (1926 of 2171) PASS: lldb-unit :: ScriptInterpreter/Python/./ScriptInterpreterPythonTests/PythonDataObjectsTest.TestRun (1927 of 2171) PASS: lldb-api :: functionalities/breakpoint/breakpoint_ignore_count/TestBreakpointIgnoreCount.py (1928 of 2171) UNSUPPORTED: lldb-api :: tools/lldb-server/TestGdbRemoteCompletion.py (1929 of 2171) PASS: lldb-api :: lang/cpp/limit-debug-info/TestWithLimitDebugInfo.py (1930 of 2171) PASS: lldb-unit :: Symbol/./SymbolTests/TestClangASTImporter.MetadataPropagation (1931 of 2171) UNSUPPORTED: lldb-api :: functionalities/thread/concurrent_events/TestConcurrentSignalNWatchNBreak.py (1932 of 2171) PASS: lldb-api :: functionalities/thread/concurrent_events/TestConcurrentDelaySignalBreak.py (1933 of 2171) PASS: lldb-shell :: Unwind/eh-frame-dwarf-unwind.test (1934 of 2171) PASS: lldb-unit :: Utility/./UtilityTests/BinaryStreamTest.PutULEB128TwoBytes (1935 of 2171) PASS: lldb-shell :: Recognizer/assert.test (1936 of 2171) PASS: lldb-unit :: Expression/./ExpressionTests/DWARFExpression.DW_OP_pick (1937 of 2171) PASS: lldb-api :: commands/frame/diagnose/inheritance/TestDiagnoseInheritance.py (1938 of 2171) PASS: lldb-api :: tools/lldb-server/TestGdbRemote_qThreadStopInfo.py (1939 of 2171) PASS: lldb-unit :: Utility/./UtilityTests/ScalarTest.SetValueFromCString (1940 of 2171) PASS: lldb-api :: commands/command/script_alias/TestCommandScriptAlias.py (1941 of 2171) PASS: lldb-unit :: ObjectFile/ELF/./ObjectFileELFTests/ObjectFileELFTest.GetSymtab_NoSymEntryPointArmThumbAddressClass (1942 of 2171) PASS: lldb-unit :: Expression/./ExpressionTests/DiagnosticManagerTest.GetStringSeverityLabels (1943 of 2171) PASS: lldb-shell :: SymbolFile/Breakpad/line-table-missing-file.test (1944 of 2171) PASS: lldb-unit :: Utility/./UtilityTests/SerializationRountripTest.SerializeDeserializePod (1945 of 2171) PASS: lldb-api :: lang/cpp/rvalue-references/TestRvalueReferences.py (1946 of 2171) PASS: lldb-api :: functionalities/breakpoint/global_constructor/TestBreakpointInGlobalConstructor.py (1947 of 2171) PASS: lldb-unit :: Utility/./UtilityTests/Flags.Clear (1948 of 2171) PASS: lldb-api :: commands/expression/completion-crash-incomplete-record/TestCompletionCrashIncompleteRecord.py (1949 of 2171) UNSUPPORTED: lldb-shell :: Watchpoint/netbsd-nouserdbregs.test (1950 of 2171) PASS: lldb-api :: functionalities/postmortem/minidump-new/TestMiniDumpUUID.py (1951 of 2171) PASS: lldb-api :: functionalities/data-formatter/pyobjsynthprovider/TestPyObjSynthProvider.py (1952 of 2171) PASS: lldb-shell :: SymbolFile/DWARF/gnu-style-compression.cpp (1953 of 2171) PASS: lldb-shell :: SymbolFile/DWARF/DW_AT_const_value.s (1954 of 2171) PASS: lldb-api :: tools/lldb-server/TestGdbRemoteRegisterState.py (1955 of 2171) PASS: lldb-unit :: Utility/./UtilityTests/UriParserTest.Empty (1956 of 2171) PASS: lldb-shell :: Register/x86-fp-read.test (1957 of 2171) PASS: lldb-api :: api/command-return-object/TestSBCommandReturnObject.py (1958 of 2171) PASS: lldb-api :: functionalities/inline-stepping/TestInlineStepping.py (1959 of 2171) PASS: lldb-api :: lang/objc/modules-non-objc-target/TestObjCModulesNonObjCTarget.py (1960 of 2171) PASS: lldb-unit :: Utility/./UtilityTests/Flags.GetBitSize (1961 of 2171) PASS: lldb-api :: tools/lldb-server/TestGdbRemote_vCont.py (1962 of 2171) PASS: lldb-shell :: Unwind/trap_frame_sym_ctx.test (1963 of 2171) XFAIL: lldb-shell :: Register/x86-64-fp-write.test (1964 of 2171) PASS: lldb-unit :: Utility/./UtilityTests/SerializationRountripTest.SerializeDeserializeObjectReference (1965 of 2171) PASS: lldb-shell :: ObjectFile/MachO/lc_build_version.yaml (1966 of 2171) PASS: lldb-unit :: Utility/./UtilityTests/ScalarTest.CastOperations (1967 of 2171) PASS: lldb-unit :: Process/gdb-remote/./ProcessGdbRemoteTests/GDBRemoteCommunicationServerTest.SendErrorResponse_StringError (1968 of 2171) PASS: lldb-unit :: Utility/./UtilityTests/StringExtractorTest.InitMisc (1969 of 2171) PASS: lldb-api :: functionalities/gdb_remote_client/TestArmRegisterDefinition.py (1970 of 2171) PASS: lldb-api :: functionalities/breakpoint/consecutive_breakpoints/TestConsecutiveBreakpoints.py (1971 of 2171) PASS: lldb-api :: functionalities/data-formatter/cstring-utf8-summary/TestCstringUnicode.py (1972 of 2171) PASS: lldb-shell :: ObjectFile/ELF/PT_LOAD.yaml (1973 of 2171) PASS: lldb-api :: lang/cpp/lambdas/TestLambdas.py (1974 of 2171) PASS: lldb-unit :: Utility/./UtilityTests/OptionsWithRawTest.WhitespaceSuffix (1975 of 2171) PASS: lldb-api :: lang/c/unions/TestUnionMembers.py (1976 of 2171) UNSUPPORTED: lldb-shell :: Register/aarch64-fp-read.test (1977 of 2171) PASS: lldb-unit :: Utility/./UtilityTests/UriParserTest.BracketedHostnameWithColon (1978 of 2171) PASS: lldb-shell :: Minidump/Windows/Sigsegv/sigsegv.test (1979 of 2171) PASS: lldb-api :: functionalities/thread/concurrent_events/TestConcurrentTwoBreakpointsOneSignal.py (1980 of 2171) PASS: lldb-unit :: Utility/./UtilityTests/NameMatchesTest.EndsWith (1981 of 2171) PASS: lldb-api :: functionalities/data-formatter/data-formatter-objc/TestDataFormatterObjCCF.py (1982 of 2171) UNSUPPORTED: lldb-shell :: SymbolFile/Breakpad/stack-cfi-arm.yaml (1983 of 2171) PASS: lldb-unit :: Expression/./ExpressionTests/ClangHostTest.MacOSX (1984 of 2171) PASS: lldb-api :: functionalities/breakpoint/breakpoint_names/TestBreakpointNames.py (1985 of 2171) PASS: lldb-unit :: Host/./HostTests/SocketTests/SocketTest.UDPGetConnectURI/ipv6 (1986 of 2171) PASS: lldb-shell :: Reproducer/TestMultipleTargets.test (1987 of 2171) PASS: lldb-unit :: Utility/./UtilityTests/StreamTest.AddressSize (1988 of 2171) PASS: lldb-api :: commands/expression/inline-namespace/TestInlineNamespace.py (1989 of 2171) PASS: lldb-unit :: Core/./LLDBCoreTests/RichManglingContextTest.Basic (1990 of 2171) PASS: lldb-unit :: Process/gdb-remote/./ProcessGdbRemoteTests/GDBRemoteCommunicationClientTest.GetModulesInfo_UUID20 (1991 of 2171) UNSUPPORTED: lldb-api :: functionalities/breakpoint/hardware_breakpoints/hardware_breakpoint_on_multiple_threads/TestHWBreakMultiThread.py (1992 of 2171) PASS: lldb-unit :: Target/./TargetTests/MCBasedABI.MapRegisterName (1993 of 2171) PASS: lldb-api :: lang/c/tls_globals/TestTlsGlobals.py (1994 of 2171) PASS: lldb-api :: python_api/process/read-mem-cstring/TestReadMemCString.py (1995 of 2171) PASS: lldb-api :: commands/expression/multiline-completion/TestMultilineCompletion.py (1996 of 2171) PASS: lldb-api :: lang/objc/rdar-11355592/TestRdar11355592.py (1997 of 2171) PASS: lldb-api :: lang/objc/foundation/TestObjCMethods2.py (1998 of 2171) PASS: lldb-api :: lang/c/record_decl_in_expr/TestRecordDeclInExpr.py (1999 of 2171) PASS: lldb-unit :: Utility/./UtilityTests/ArchSpecTest.MergeFrom (2000 of 2171) PASS: lldb-unit :: Process/gdb-remote/./ProcessGdbRemoteTests/GDBRemoteCommunicationServerTest.SendErrorResponse_UnimplementedError (2001 of 2171) PASS: lldb-unit :: Utility/./UtilityTests/StreamTest.AddressEmptyPrefix (2002 of 2171) PASS: lldb-unit :: Utility/./UtilityTests/FileSpecTest.EqualDotsPosix (2003 of 2171) PASS: lldb-unit :: Symbol/./SymbolTests/TestTypeSystemClang.TestUnifyAccessSpecifiers (2004 of 2171) UNSUPPORTED: lldb-shell :: SymbolFile/NativePDB/function-types-classes.cpp (2005 of 2171) PASS: lldb-shell :: SymbolFile/DWARF/debug_line-relative_path.s (2006 of 2171) PASS: lldb-unit :: Process/gdb-remote/./ProcessGdbRemoteTests/GDBRemoteClientBaseTest.SendContinueDelegateInterface (2007 of 2171) UNSUPPORTED: lldb-api :: functionalities/thread/thread_specific_break_plus_condition/TestThreadSpecificBpPlusCondition.py (2008 of 2171) PASS: lldb-unit :: Utility/./UtilityTests/StringListTest.Join (2009 of 2171) UNSUPPORTED: lldb-api :: arm/breakpoint-thumb-codesection/TestBreakpointThumbCodesection.py (2010 of 2171) PASS: lldb-unit :: DataFormatter/./LLDBFormatterTests/TypeMatcherTests.CreatedBySameMatchStringExactNamePrefixes (2011 of 2171) PASS: lldb-api :: commands/add-dsym/uuid/TestAddDsymCommand.py (2012 of 2171) PASS: lldb-unit :: SymbolFile/DWARF/./SymbolFileDWARFTests/SymbolFileDWARFTests.TestAbbrevValidAttrNullForm (2013 of 2171) PASS: lldb-unit :: Process/minidump/./LLDBMinidumpTests/MinidumpParserTest.MinidumpDuplicateModuleSeparateCode (2014 of 2171) PASS: lldb-unit :: Utility/./UtilityTests/StringExtractorTest.GetHexU8_Underflow (2015 of 2171) PASS: lldb-shell :: Minidump/fb-dump.test (2016 of 2171) PASS: lldb-shell :: ObjectFile/ELF/base-address.yaml (2017 of 2171) PASS: lldb-unit :: Language/Highlighting/./HighlighterTests/HighlighterTest.ClangIdentifiers (2018 of 2171) PASS: lldb-api :: lang/objc/objc-optimized/TestObjcOptimized.py (2019 of 2171) PASS: lldb-unit :: Utility/./UtilityTests/BinaryStreamTest.PutULEB128ThreeBytes (2020 of 2171) PASS: lldb-unit :: Expression/./ExpressionTests/CppModuleConfigurationTest.MissingLibCpp (2021 of 2171) PASS: lldb-api :: functionalities/data-formatter/nsdictionarysynth/TestNSDictionarySynthetic.py (2022 of 2171) PASS: lldb-unit :: Process/gdb-remote/./ProcessGdbRemoteTests/GDBRemoteCommunicationTest.ReadPacket_checksum (2023 of 2171) UNSUPPORTED: lldb-shell :: SymbolFile/target-symbols-add-unwind.test (2024 of 2171) PASS: lldb-shell :: ObjectFile/Breakpad/discontiguous-sections.test (2025 of 2171) PASS: lldb-api :: commands/expression/import-std-module/sysroot/TestStdModuleSysroot.py (2026 of 2171) PASS: lldb-shell :: ObjectFile/ELF/section-overlap.yaml (2027 of 2171) PASS: lldb-unit :: Expression/./ExpressionTests/DWARFExpression.DW_OP_implicit_value (2028 of 2171) PASS: lldb-unit :: Utility/./UtilityTests/StringExtractorTest.GetHexU8_InvalidHex_NoEof (2029 of 2171) PASS: lldb-api :: macosx/safe-to-func-call/TestSafeFuncCalls.py (2030 of 2171) PASS: lldb-unit :: Target/./TargetTests/PathMappingListTest.RemapRoot (2031 of 2171) UNSUPPORTED: lldb-api :: commands/register/register/intel_xtended_registers/mpx_bound_violation/TestBoundViolation.py (2032 of 2171) PASS: lldb-api :: functionalities/gdb_remote_client/TestGDBRemoteClient.py (2033 of 2171) PASS: lldb-api :: commands/expression/rdar44436068/Test128BitsInteger.py (2034 of 2171) PASS: lldb-api :: types/TestCharTypeExpr.py (2035 of 2171) UNSUPPORTED: lldb-api :: tools/lldb-server/libraries-svr4/TestGdbRemoteLibrariesSvr4Support.py (2036 of 2171) PASS: lldb-unit :: Symbol/./SymbolTests/TestTypeSystemClang.TestGetTypeClassDeclType (2037 of 2171) PASS: lldb-unit :: UnwindAssembly/x86/./UnwindAssemblyx86Tests/Testx86AssemblyInspectionEngine.TestAddRSP (2038 of 2171) PASS: lldb-unit :: Utility/./UtilityTests/StreamTest.AddressPrefixAndSuffix (2039 of 2171) PASS: lldb-unit :: SymbolFile/NativePDB/./SymbolFileNativePDBTests/PDBFPOProgramToDWARFExpressionTests.UnresolvedCyclicRegisterAssignmentReference (2040 of 2171) PASS: lldb-unit :: ScriptInterpreter/Python/./ScriptInterpreterPythonTests/PythonDataObjectsTest.TestTypeNameResolutionNoDot (2041 of 2171) PASS: lldb-unit :: Utility/./UtilityTests/RangeTest.ContainsAddrInvalid (2042 of 2171) PASS: lldb-unit :: Language/Highlighting/./HighlighterTests/HighlighterTest.ClangTrailingBackslashBeforeNewline (2043 of 2171) PASS: lldb-api :: lang/objc/objc-dyn-sbtype/TestObjCDynamicSBType.py (2044 of 2171) PASS: lldb-unit :: Utility/./UtilityTests/SerializationRountripTest.SerializeDeserializeObjectPointer (2045 of 2171) PASS: lldb-api :: functionalities/data-formatter/synthupdate/TestSyntheticFilterRecompute.py (2046 of 2171) XFAIL: lldb-shell :: Register/x86-64-ymm-write.test (2047 of 2171) UNSUPPORTED: lldb-api :: functionalities/data-formatter/data-formatter-stl/libstdcpp/tuple/TestDataFormatterStdTuple.py (2048 of 2171) PASS: lldb-unit :: Utility/./UtilityTests/ListenerTest.GetEventWait (2049 of 2171) PASS: lldb-api :: lang/objc/direct-dispatch-step/TestObjCDirectDispatchStepping.py (2050 of 2171) PASS: lldb-api :: commands/expression/dollar-in-variable/TestDollarInVariable.py (2051 of 2171) PASS: lldb-unit :: SymbolFile/DWARF/./SymbolFileDWARFTests/DWARFASTParserClangTests.EnsureAllDIEsInDeclContextHaveBeenParsedParsesOnlyMatchingEntries (2052 of 2171) UNSUPPORTED: lldb-api :: tools/lldb-server/signal-filtering/TestGdbRemote_QPassSignals.py (2053 of 2171) PASS: lldb-api :: functionalities/data-formatter/data-formatter-objc/TestDataFormatterObjCNSBundle.py (2054 of 2171) PASS: lldb-unit :: Utility/./UtilityTests/OptionsWithRawTest.EmptyArgsOnlySuffix (2055 of 2171) UNSUPPORTED: lldb-api :: python_api/watchpoint/TestWatchpointIter.py (2056 of 2171) PASS: lldb-api :: commands/expression/calculator_mode/TestCalculatorMode.py (2057 of 2171) PASS: lldb-unit :: Host/./HostTests/SocketTests/SocketTest.TCPListen0GetPort/ipv6 (2058 of 2171) PASS: lldb-unit :: Language/Highlighting/./HighlighterTests/HighlighterTest.ClangTrailingBackslashWithWhitespace (2059 of 2171) PASS: lldb-api :: lang/objcxx/class-name-clash/TestNameClash.py (2060 of 2171) PASS: lldb-api :: functionalities/signal/TestSendSignal.py (2061 of 2171) PASS: lldb-api :: tools/lldb-vscode/step/TestVSCode_step.py (2062 of 2171) PASS: lldb-api :: commands/expression/import-std-module/weak_ptr/TestWeakPtrFromStdModule.py (2063 of 2171) PASS: lldb-api :: functionalities/gdb_remote_client/TestStopPCs.py (2064 of 2171) PASS: lldb-unit :: Utility/./UtilityTests/StreamTest.AddressRangeEmptyRange (2065 of 2171) PASS: lldb-unit :: Host/./HostTests/ProcessLaunchInfoTest.Constructor (2066 of 2171) PASS: lldb-unit :: Utility/./UtilityTests/IndexToObjectTest.ObjectForIndex (2067 of 2171) PASS: lldb-unit :: Utility/./UtilityTests/ArgsTest.TestSingleArgWithQuotedSpace (2068 of 2171) PASS: lldb-api :: lang/objc/objc-new-syntax/TestObjCNewSyntaxDictionary.py (2069 of 2171) PASS: lldb-unit :: Host/./HostTests/FileSystemTest.Exists (2070 of 2171) PASS: lldb-unit :: Process/gdb-remote/./ProcessGdbRemoteTests/GDBRemoteCommunicationClientTest.SendStartTracePacket (2071 of 2171) PASS: lldb-unit :: Symbol/./SymbolTests/PostfixExpression.ParseOneExpression (2072 of 2171) PASS: lldb-api :: functionalities/non-overlapping-index-variable-i/TestIndexVariable.py (2073 of 2171) PASS: lldb-api :: lang/c/stepping/TestThreadStepping.py (2074 of 2171) PASS: lldb-api :: commands/expression/completion/TestExprCompletion.py (2075 of 2171) PASS: lldb-shell :: SymbolFile/DWARF/debug_loc-aslr.s (2076 of 2171) PASS: lldb-api :: macosx/save_crashlog/TestSaveCrashlog.py (2077 of 2171) UNSUPPORTED: lldb-shell :: ScriptInterpreter/Lua/independent_state.test (2078 of 2171) PASS: lldb-unit :: Symbol/./SymbolTests/TestClangASTImporter.CompleteFwdDeclWithOtherOrigin (2079 of 2171) PASS: lldb-unit :: Utility/./UtilityTests/ProcessInstanceInfo.Dump (2080 of 2171) PASS: lldb-unit :: Process/minidump/./LLDBMinidumpTests/RegisterContextMinidump.ConvertMinidumpContext_x86_32 (2081 of 2171) PASS: lldb-api :: commands/target/stop-hooks/TestStopHookScripted.py (2082 of 2171) PASS: lldb-unit :: Utility/./UtilityTests/StreamTeeTest.DefaultConstructor (2083 of 2171) UNSUPPORTED: lldb-api :: commands/trace/TestTraceSchema.py (2084 of 2171) PASS: lldb-unit :: Host/./HostTests/SocketTests/SocketTest.UDPConnect/ipv6 (2085 of 2171) PASS: lldb-api :: lang/cpp/global_variables/TestCPPGlobalVariables.py (2086 of 2171) PASS: lldb-shell :: SymbolFile/DWARF/DW_AT_data_bit_offset-DW_OP_stack_value.s (2087 of 2171) PASS: lldb-shell :: SymbolFile/Breakpad/line-table-mixed-path-styles.test (2088 of 2171) UNSUPPORTED: lldb-shell :: SymbolFile/NativePDB/locate-pdb.cpp (2089 of 2171) UNSUPPORTED: lldb-api :: benchmarks/continue/TestBenchmarkContinue.py (2090 of 2171) PASS: lldb-unit :: Utility/./UtilityTests/UserIDResolver.GetUserName (2091 of 2171) PASS: lldb-unit :: UnwindAssembly/x86/./UnwindAssemblyx86Tests/Testx86AssemblyInspectionEngine.TestPushESI (2092 of 2171) PASS: lldb-shell :: Reproducer/TestDriverOptions.test (2093 of 2171) PASS: lldb-api :: commands/expression/invalid-args/TestInvalidArgsExpression.py (2094 of 2171) PASS: lldb-api :: lang/cpp/offsetof/TestOffsetofCpp.py (2095 of 2171) PASS: lldb-unit :: Utility/./UtilityTests/StringListTest.JoinNonSpace (2096 of 2171) PASS: lldb-api :: functionalities/data-formatter/data-formatter-stl/libcxx/unique_ptr/TestDataFormatterLibcxxUniquePtr.py (2097 of 2171) PASS: lldb-unit :: ObjectFile/Breakpad/./ObjectFileBreakpadTests/FileRecord.parse (2098 of 2171) PASS: lldb-api :: functionalities/data-formatter/data-formatter-ptr-to-array/TestPtrToArrayFormatting.py (2099 of 2171) PASS: lldb-api :: lang/objc/modules-cache/TestClangModulesCache.py (2100 of 2171) PASS: lldb-api :: functionalities/memory/read/TestMemoryRead.py (2101 of 2171) PASS: lldb-unit :: Utility/./UtilityTests/StringListTest.JoinMultiCharSeparator (2102 of 2171) PASS: lldb-api :: commands/settings/use_source_cache/TestUseSourceCache.py (2103 of 2171) PASS: lldb-unit :: Utility/./UtilityTests/StringExtractorTest.GetHexBytesAvail_OddPair (2104 of 2171) PASS: lldb-api :: functionalities/breakpoint/breakpoint_by_file_colon_line/TestBreakpointByFileColonLine.py (2105 of 2171) PASS: lldb-unit :: Utility/./UtilityTests/StringExtractorTest.GetHexU8_Exact_NoEof (2106 of 2171) PASS: lldb-api :: lang/c/register_variables/TestRegisterVariables.py (2107 of 2171) PASS: lldb-unit :: Utility/./UtilityTests/CompletionRequest.TryCompleteCurrentArgBad (2108 of 2171) PASS: lldb-api :: lang/objc/variadic_methods/TestVariadicMethods.py (2109 of 2171) PASS: lldb-unit :: Symbol/./SymbolTests/TestTypeSystemClang.TestIsClangType (2110 of 2171) PASS: lldb-unit :: Utility/./UtilityTests/StreamTest.PutRawBytesToLittleEndian (2111 of 2171) PASS: lldb-api :: functionalities/thread/concurrent_events/TestConcurrentTwoBreakpointsOneDelaySignal.py (2112 of 2171) PASS: lldb-api :: commands/command/nested_alias/TestNestedAlias.py (2113 of 2171) PASS: lldb-shell :: Breakpoint/single-file-split-dwarf.test (2114 of 2171) UNSUPPORTED: lldb-api :: functionalities/darwin_log/format/TestDarwinLogMessageFormat.py (2115 of 2171) UNSUPPORTED: lldb-shell :: ScriptInterpreter/Lua/lua.test (2116 of 2171) PASS: lldb-shell :: ObjectFile/Breakpad/breakpad-identification.test (2117 of 2171) PASS: lldb-shell :: ObjectFile/ELF/short-build-id.yaml (2118 of 2171) PASS: lldb-api :: python_api/frame/TestFrames.py (2119 of 2171) PASS: lldb-unit :: Symbol/./SymbolTests/TestTypeSystemClang.AddMethodToObjCObjectType (2120 of 2171) UNSUPPORTED: lldb-api :: functionalities/thread/concurrent_events/TestConcurrentTwoWatchpointsOneDelayBreakpoint.py (2121 of 2171) PASS: lldb-unit :: SymbolFile/NativePDB/./SymbolFileNativePDBTests/PDBFPOProgramToDWARFExpressionTests.InvalidOpBinary (2122 of 2171) PASS: lldb-unit :: Utility/./UtilityTests/UriParserTest.MinimalPath (2123 of 2171) PASS: lldb-shell :: SymbolFile/DWARF/debug_rnglists.s (2124 of 2171) PASS: lldb-api :: lang/objc/objc-new-syntax/TestObjCNewSyntaxArray.py (2125 of 2171) PASS: lldb-api :: lang/cpp/covariant-return-types/TestCovariantReturnTypes.py (2126 of 2171) UNSUPPORTED: lldb-shell :: ObjectFile/ELF/minidebuginfo-set-and-hit-breakpoint.test (2127 of 2171) UNSUPPORTED: lldb-api :: functionalities/thread/concurrent_events/TestConcurrentBreakpointsDelayedBreakpointOneWatchpoint.py (2128 of 2171) UNSUPPORTED: lldb-shell :: SymbolFile/NativePDB/s_constant.cpp (2129 of 2171) PASS: lldb-shell :: SymbolFile/Breakpad/unwind-via-stack-cfi.test (2130 of 2171) PASS: lldb-unit :: Utility/./UtilityTests/ScalarTest.Division (2131 of 2171) PASS: lldb-unit :: Utility/./UtilityTests/OptionsWithRawTest.UnterminatedQuote (2132 of 2171) PASS: lldb-api :: macosx/queues/TestQueues.py (2133 of 2171) UNSUPPORTED: lldb-api :: tools/lldb-server/memory-allocation/TestGdbRemoteMemoryAllocation.py (2134 of 2171) PASS: lldb-unit :: Language/Highlighting/./HighlighterTests/HighlighterTest.ClangOperators (2135 of 2171) PASS: lldb-api :: functionalities/unwind/sigtramp/TestSigtrampUnwind.py (2136 of 2171) PASS: lldb-api :: functionalities/breakpoint/comp_dir_symlink/TestCompDirSymLink.py (2137 of 2171) PASS: lldb-api :: commands/expression/call-function/TestCallUserDefinedFunction.py (2138 of 2171) PASS: lldb-api :: functionalities/thread/concurrent_events/TestConcurrentManyCrash.py (2139 of 2171) PASS: lldb-api :: commands/target/create-deps/TestTargetCreateDeps.py (2140 of 2171) PASS: lldb-unit :: Utility/./UtilityTests/ProcessInstanceInfoList.Yaml (2141 of 2171) PASS: lldb-unit :: Host/./HostTests/FileSystemTest.GetPermissions (2142 of 2171) PASS: lldb-unit :: SymbolFile/NativePDB/./SymbolFileNativePDBTests/PDBFPOProgramToDWARFExpressionTests.MissingTargetRegister (2143 of 2171) PASS: lldb-unit :: Process/minidump/./LLDBMinidumpTests/MinidumpParserTest.GetExceptionStream (2144 of 2171) PASS: lldb-unit :: Utility/./UtilityTests/DataExtractorTest.PeekData (2145 of 2171) PASS: lldb-shell :: Quit/TestQuitExitCode-30.test (2146 of 2171) PASS: lldb-api :: commands/expression/anonymous-struct/TestCallUserAnonTypedef.py (2147 of 2171) UNSUPPORTED: lldb-shell :: SymbolFile/PDB/variables.test (2148 of 2171) PASS: lldb-api :: functionalities/data-formatter/poarray/TestPrintObjectArray.py (2149 of 2171) PASS: lldb-unit :: Utility/./UtilityTests/RangeTest.Constructor (2150 of 2171) PASS: lldb-api :: lang/cpp/virtual-overload/TestVirtualOverload.py (2151 of 2171) PASS: lldb-unit :: Utility/./UtilityTests/PassiveReplayTest.InstrumentedFooInvalid (2152 of 2171) PASS: lldb-unit :: Utility/./UtilityTests/DataExtractorTest.GetMaxS64 (2153 of 2171) PASS: lldb-shell :: Driver/TestUseColor.test (2154 of 2171) UNSUPPORTED: lldb-shell :: SymbolFile/DWARF/find-basic-function.cpp (2155 of 2171) PASS: lldb-api :: commands/gui/viewlarge/TestGuiViewLarge.py (2156 of 2171) PASS: lldb-shell :: Reproducer/TestVersionCheck.test (2157 of 2171) PASS: lldb-api :: lang/c/forward/TestForwardDeclaration.py (2158 of 2171) PASS: lldb-api :: commands/expression/persist_objc_pointeetype/TestPersistObjCPointeeType.py (2159 of 2171) PASS: lldb-api :: lang/cpp/multiple-inheritance/TestCppMultipleInheritance.py (2160 of 2171) PASS: lldb-shell :: SymbolFile/Breakpad/unwind-via-stack-win.test (2161 of 2171) PASS: lldb-api :: commands/expression/import-std-module/shared_ptr/TestSharedPtrFromStdModule.py (2162 of 2171) PASS: lldb-api :: lang/c/blocks/TestBlocks.py (2163 of 2171) PASS: lldb-api :: lang/c/anonymous/TestAnonymous.py (2164 of 2171) PASS: lldb-api :: macosx/simulator/TestSimulatorPlatform.py (2165 of 2171) PASS: lldb-api :: commands/expression/expr-in-syscall/TestExpressionInSyscall.py (2166 of 2171) PASS: lldb-api :: lang/objc/objc-new-syntax/TestObjCNewSyntaxLiteral.py (2167 of 2171) PASS: lldb-api :: commands/target/basic/TestTargetCommand.py (2168 of 2171) PASS: lldb-api :: lang/objc/exceptions/TestObjCExceptions.py (2169 of 2171) PASS: lldb-api :: functionalities/completion/TestCompletion.py (2170 of 2171) PASS: lldb-api :: lang/objc/foundation/TestFoundationDisassembly.py (2171 of 2171) Slowest Tests: -------------------------------------------------------------------------- 127.55s: lldb-api :: tools/lldb-server/TestLldbGdbServer.py 60.38s: lldb-api :: api/multithreaded/TestMultithreaded.py 55.03s: lldb-api :: lang/objc/hidden-ivars/TestHiddenIvars.py 51.91s: lldb-api :: lang/objc/exceptions/TestObjCExceptions.py 50.42s: lldb-api :: lang/objc/foundation/TestFoundationDisassembly.py 49.04s: lldb-api :: lang/objc/foundation/TestObjCMethods.py 46.84s: lldb-api :: functionalities/completion/TestCompletion.py 46.78s: lldb-api :: macosx/simulator/TestSimulatorPlatform.py 36.75s: lldb-api :: lang/objc/real-definition/TestRealDefinition.py 33.27s: lldb-api :: types/TestLongTypesExpr.py 33.21s: lldb-api :: lang/objc/objc-new-syntax/TestObjCNewSyntaxLiteral.py 32.75s: lldb-api :: tools/lldb-server/TestGdbRemoteThreadsInStopReply.py 31.98s: lldb-api :: lang/objc/objc-new-syntax/TestObjCNewSyntaxArray.py 31.28s: lldb-api :: lang/objc/objc-new-syntax/TestObjCNewSyntaxDictionary.py 29.73s: lldb-api :: python_api/target/TestTargetAPI.py 29.62s: lldb-api :: lang/cpp/namespace/TestNamespaceLookup.py 27.61s: lldb-api :: functionalities/load_unload/TestLoadUnload.py 26.63s: lldb-api :: lang/objc/foundation/TestObjCMethodsString.py 25.62s: lldb-api :: lang/objc/foundation/TestObjCMethodsNSError.py 24.96s: lldb-api :: commands/settings/TestSettings.py

Hide Details

Tests Times: -------------------------------------------------------------------------- [ Range ] :: [ Percentage ] :: [ Count ] -------------------------------------------------------------------------- [120s,130s) :: [ ] :: [ 1/2171] [110s,120s) :: [ ] :: [ 0/2171] [100s,110s) :: [ ] :: [ 0/2171] [ 90s,100s) :: [ ] :: [ 0/2171] [ 80s, 90s) :: [ ] :: [ 0/2171] [ 70s, 80s) :: [ ] :: [ 0/2171] [ 60s, 70s) :: [ ] :: [ 1/2171] [ 50s, 60s) :: [ ] :: [ 3/2171] [ 40s, 50s) :: [ ] :: [ 3/2171] [ 30s, 40s) :: [ ] :: [ 8/2171] [ 20s, 30s) :: [ ] :: [ 8/2171] [ 10s, 20s) :: [* ] :: [ 103/2171] [ 0s, 10s) :: [************************************* ] :: [2044/2171] -------------------------------------------------------------------------- ******************** Failed Tests (1): lldb-api :: tools/lldb-server/TestLldbGdbServer.py

Hide Details

Hide Details

Testing Time: 333.52s Unsupported : 278 Passed : 1884 Expectedly Failed: 8 Failed : 1 FAILED: tools/lldb/test/CMakeFiles/check-lldb-lit cd /Users/buildslave/jenkins/workspace/lldb-cmake-matrix/lldb-build/tools/lldb/test && /usr/local/Frameworks/Python.framework/Versions/3.7/bin/python3.7 /Users/buildslave/jenkins/workspace/lldb-cmake-matrix/lldb-build/./bin/llvm-lit -v --time-tests --shuffle --xunit-xml-output=/Users/buildslave/jenkins/workspace/lldb-cmake-matrix/test/results.xml -v /Users/buildslave/jenkins/workspace/lldb-cmake-matrix/lldb-build/tools/lldb/test ninja: build stopped: subcommand failed. Command failed: Command '['/usr/bin/env', 'TERM=vt100', '/usr/local/bin/ninja', '-v', 'check-lldb']' returned non-zero exit status 1. Command: ['/usr/bin/env', 'TERM=vt100', '/usr/local/bin/ninja', '-v', 'check-lldb'] + set -e [Pipeline] } [Pipeline] // timeout [Pipeline] junit Recording test results [Pipeline] } [Pipeline] // stage [Pipeline] } [Pipeline] // withEnv [Pipeline] } [Pipeline] // node [Pipeline] End of Pipeline [Checks API] No suitable checks publisher found. Finished: UNSTABLE