AbortedConsole Output

Skipping 6,838 KB.. Full Log
ctions/TestOverloadedFunctions.py (755 of 2172)
PASS: lldb-api :: functionalities/thread/exit_during_break/TestExitDuringBreak.py (756 of 2172)
PASS: lldb-shell :: Register/x86-multithread-read.test (757 of 2172)
PASS: lldb-shell :: Quit/TestQuitExitCode-30.test (758 of 2172)
PASS: lldb-shell :: SymbolFile/DWARF/debug_loc-aslr.s (759 of 2172)
PASS: lldb-unit :: Expression/./ExpressionTests/CppModuleConfigurationTest.Xcode (760 of 2172)
PASS: lldb-unit :: Symbol/./SymbolTests/TestClangASTImporter.DeportTypeTagDecl (761 of 2172)
PASS: lldb-unit :: Utility/./UtilityTests/BinaryStreamTest.PutULEB128ThreeBytes (762 of 2172)
PASS: lldb-unit :: Utility/./UtilityTests/ArchSpecTest.TripleComponentsWereSpecified (763 of 2172)
PASS: lldb-api :: lang/objc/objc_direct-methods/TestObjCDirectMethods.py (764 of 2172)
PASS: lldb-unit :: Utility/./UtilityTests/LogChannelTest.EnableOptions (765 of 2172)
PASS: lldb-unit :: Utility/./UtilityTests/NameMatchesTest.StartsWith (766 of 2172)
PASS: lldb-api :: commands/expression/import-std-module/stack/TestStackFromStdModule.py (767 of 2172)
PASS: lldb-api :: python_api/sbtype_typeclass/TestSBTypeTypeClass.py (768 of 2172)
PASS: lldb-unit :: Utility/./UtilityTests/UUIDTest.Validity (769 of 2172)
UNSUPPORTED: lldb-shell :: SymbolFile/NativePDB/ast-functions-msvc.cpp (770 of 2172)
PASS: lldb-shell :: ObjectFile/Breakpad/sections-trailing-func.test (771 of 2172)
PASS: lldb-unit :: Utility/./UtilityTests/RangeTest.EqualInvalid (772 of 2172)
PASS: lldb-unit :: Utility/./UtilityTests/GeneratorTest.GetOrCreate (773 of 2172)
PASS: lldb-unit :: Utility/./UtilityTests/StructuredDataTest.ParseJSONFromFile (774 of 2172)
PASS: lldb-unit :: Utility/./UtilityTests/Flags.GetBitSize (775 of 2172)
PASS: lldb-api :: lang/objc/objc-struct-return/TestObjCStructReturn.py (776 of 2172)
XFAIL: lldb-shell :: Register/x86-mm-xmm-write.test (777 of 2172)
PASS: lldb-shell :: Settings/TestModuleCacheSanity.test (778 of 2172)
PASS: lldb-unit :: Host/./HostTests/MainLoopTest.UnmonitoredSignal (779 of 2172)
PASS: lldb-api :: lang/c/forward/TestForwardDeclaration.py (780 of 2172)
PASS: lldb-unit :: Utility/./UtilityTests/StringExtractorTest.GetHexBytes_FullString (781 of 2172)
PASS: lldb-api :: functionalities/tail_call_frames/thread_step_out_or_return/TestSteppingOutWithArtificialFrames.py (782 of 2172)
PASS: lldb-api :: lang/objc/modules-inline-functions/TestModulesInlineFunctions.py (783 of 2172)
PASS: lldb-api :: functionalities/data-formatter/synthcapping/TestSyntheticCapping.py (784 of 2172)
PASS: lldb-api :: lang/cpp/class-template-parameter-pack/TestClassTemplateParameterPack.py (785 of 2172)
PASS: lldb-unit :: Process/gdb-remote/./ProcessGdbRemoteTests/GDBRemoteCommunicationClientTest.WriteRegister (786 of 2172)
PASS: lldb-unit :: Utility/./UtilityTests/ConstStringTest.CompareStringRef (787 of 2172)
PASS: lldb-unit :: Utility/./UtilityTests/StringExtractorTest.GetNameColonValueContainsColon (788 of 2172)
PASS: lldb-shell :: Reproducer/TestPythonImport.test (789 of 2172)
PASS: lldb-unit :: Process/minidump/./LLDBMinidumpTests/MinidumpParserTest.GetThreadsAndGetThreadContext (790 of 2172)
PASS: lldb-unit :: Expression/./ExpressionTests/DiagnosticManagerTest.HasFixits (791 of 2172)
PASS: lldb-unit :: Utility/./UtilityTests/ArgsTest.GetArgumentArrayRef (792 of 2172)
PASS: lldb-unit :: Utility/./UtilityTests/SerializationRountripTest.SerializeDeserializeCStringNull (793 of 2172)
PASS: lldb-unit :: Utility/./UtilityTests/RangeTest.Constructor (794 of 2172)
PASS: lldb-unit :: Signals/./SignalsTests/UnixSignalsTest.VersionChange (795 of 2172)
PASS: lldb-shell :: Commands/command-disassemble-process.yaml (796 of 2172)
PASS: lldb-unit :: Symbol/./SymbolTests/DWARFCallFrameInfoTest.Basic_dwarf4 (797 of 2172)
PASS: lldb-api :: python_api/process/TestProcessAPI.py (798 of 2172)
PASS: lldb-unit :: Utility/./UtilityTests/BinaryStreamTest.PutSLEB128ThreeBytes (799 of 2172)
PASS: lldb-api :: commands/expression/call-function/TestCallStdStringFunction.py (800 of 2172)
PASS: lldb-shell :: Driver/TestRepl.test (801 of 2172)
PASS: lldb-unit :: Language/Highlighting/./HighlighterTests/HighlighterTest.HighlighterSelectionPath (802 of 2172)
PASS: lldb-api :: functionalities/thread/concurrent_events/TestConcurrentSignalBreak.py (803 of 2172)
PASS: lldb-unit :: Process/minidump/./LLDBMinidumpTests/MinidumpParserTest.MinidumpDuplicateModuleMinAddress (804 of 2172)
PASS: lldb-unit :: Utility/./UtilityTests/SerializationRountripTest.SerializeDeserializeCString (805 of 2172)
PASS: lldb-shell :: Minidump/memory-region-from-module.yaml (806 of 2172)
PASS: lldb-api :: functionalities/thread/concurrent_events/TestConcurrentCrashWithSignal.py (807 of 2172)
PASS: lldb-unit :: Host/./HostTests/File.GetStreamFromDescriptor (808 of 2172)
PASS: lldb-unit :: Process/minidump/./LLDBMinidumpTests/MinidumpParserTest.FindMemoryRangeWithFullMemoryMinidump (809 of 2172)
PASS: lldb-unit :: Utility/./UtilityTests/BinaryStreamTest.PutULEB128SevenBytes (810 of 2172)
UNSUPPORTED: lldb-shell :: SymbolFile/NativePDB/break-by-function.cpp (811 of 2172)
PASS: lldb-api :: lang/cpp/nested-class-other-compilation-unit/TestNestedClassWithParentInAnotherCU.py (812 of 2172)
PASS: lldb-shell :: ObjectFile/ELF/PT_LOAD-overlap.yaml (813 of 2172)
PASS: lldb-unit :: Host/./HostTests/FileSystemTest.MakeAbsolute (814 of 2172)
PASS: lldb-unit :: Utility/./UtilityTests/LogChannelEnabledTest.LogThread (815 of 2172)
PASS: lldb-unit :: Utility/./UtilityTests/StringListTest.Assignment (816 of 2172)
PASS: lldb-api :: lang/cpp/limit-debug-info/TestWithLimitDebugInfo.py (817 of 2172)
UNSUPPORTED: lldb-api :: lang/objc/modules-update/TestClangModulesUpdate.py (818 of 2172)
PASS: lldb-api :: commands/disassemble/basic/TestFrameDisassemble.py (819 of 2172)
PASS: lldb-api :: commands/expression/import_base_class_when_class_has_derived_member/TestImportBaseClassWhenClassHasDerivedMember.py (820 of 2172)
PASS: lldb-api :: commands/expression/completion/TestExprCompletion.py (821 of 2172)
PASS: lldb-unit :: ObjectFile/PECOFF/./ObjectFilePECOFFTests/PECallFrameInfoTest.Chained_eh (822 of 2172)
PASS: lldb-api :: functionalities/optimized_code/TestNoASanExceptionAfterEvalOP_piece.py (823 of 2172)
PASS: lldb-api :: functionalities/var_path/TestVarPath.py (824 of 2172)
PASS: lldb-shell :: ObjectFile/ELF/section-permissions.yaml (825 of 2172)
PASS: lldb-unit :: Utility/./UtilityTests/ScalarTest.TruncOrExtendTo (826 of 2172)
UNSUPPORTED: lldb-shell :: SymbolFile/PDB/variables-locations.test (827 of 2172)
PASS: lldb-unit :: Utility/./UtilityTests/StreamTest.AddressRange (828 of 2172)
PASS: lldb-api :: lang/cpp/class_types/TestClassTypes.py (829 of 2172)
PASS: lldb-shell :: ObjectFile/wasm/unified-debug-sections.yaml (830 of 2172)
UNSUPPORTED: lldb-api :: functionalities/process_save_core/TestProcessSaveCore.py (831 of 2172)
PASS: lldb-unit :: ObjectFile/Breakpad/./ObjectFileBreakpadTests/StackWinRecord.parse (832 of 2172)
PASS: lldb-api :: lang/cpp/accelerator-table/TestCPPAccelerator.py (833 of 2172)
XFAIL: lldb-shell :: Register/x86-64-write.test (834 of 2172)
PASS: lldb-unit :: Expression/./ExpressionTests/ClangHostTest.MacOSX (835 of 2172)
PASS: lldb-api :: lang/cpp/class_static/TestStaticVariables.py (836 of 2172)
PASS: lldb-api :: commands/expression/pr35310/TestExprsBug35310.py (837 of 2172)
PASS: lldb-unit :: ScriptInterpreter/Python/./ScriptInterpreterPythonTests/PythonDataObjectsTest.TestPythonTupleInitializerList2 (838 of 2172)
PASS: lldb-unit :: UnwindAssembly/x86/./UnwindAssemblyx86Tests/Testx86AssemblyInspectionEngine.TestStackRealignMSVC_i386 (839 of 2172)
PASS: lldb-api :: lang/objc/foundation/TestObjCMethods2.py (840 of 2172)
PASS: lldb-unit :: Language/Highlighting/./HighlighterTests/HighlighterTest.ClangCursorPosEndOfLine (841 of 2172)
PASS: lldb-api :: functionalities/step_scripted/TestStepScripted.py (842 of 2172)
PASS: lldb-shell :: Unwind/eh-frame-dwarf-unwind.test (843 of 2172)
PASS: lldb-unit :: UnwindAssembly/x86/./UnwindAssemblyx86Tests/Testx86AssemblyInspectionEngine.TestLEAVE (844 of 2172)
PASS: lldb-shell :: ScriptInterpreter/Python/eof.test (845 of 2172)
UNSUPPORTED: lldb-api :: functionalities/data-formatter/data-formatter-stl/libstdcpp/unique_ptr/TestDataFormatterStdUniquePtr.py (846 of 2172)
PASS: lldb-api :: lang/cpp/member-and-local-vars-with-same-name/TestMembersAndLocalsWithSameName.py (847 of 2172)
PASS: lldb-api :: functionalities/data-formatter/data-formatter-advanced/TestDataFormatterAdv.py (848 of 2172)
PASS: lldb-unit :: Utility/./UtilityTests/FileSpecTest.EqualDotsWindows (849 of 2172)
PASS: lldb-shell :: SymbolFile/Breakpad/unwind-via-stack-win.test (850 of 2172)
PASS: lldb-shell :: ObjectFile/ELF/gnu-debuglink.yaml (851 of 2172)
PASS: lldb-unit :: Utility/./UtilityTests/StringExtractorTest.GetHexBytesAvail_Underflow (852 of 2172)
PASS: lldb-unit :: Process/gdb-remote/./ProcessGdbRemoteTests/GDBRemoteCommunicationClientTest.SendGetMetaDataPacket (853 of 2172)
PASS: lldb-unit :: Utility/./UtilityTests/StreamTest.AddressRangeEmptyRange (854 of 2172)
PASS: lldb-shell :: SymbolFile/DWARF/dwo-type-in-main-file.s (855 of 2172)
PASS: lldb-unit :: Language/Highlighting/./HighlighterTests/HighlighterTest.FallbackHighlighter (856 of 2172)
PASS: lldb-api :: functionalities/thread/crash_during_step/TestCrashDuringStep.py (857 of 2172)
UNSUPPORTED: lldb-api :: tools/lldb-server/TestGdbRemoteAuxvSupport.py (858 of 2172)
UNSUPPORTED: lldb-api :: functionalities/thread/concurrent_events/TestConcurrentManyWatchpoints.py (859 of 2172)
PASS: lldb-api :: commands/expression/import-std-module/list-dbg-info-content/TestDbgInfoContentListFromStdModule.py (860 of 2172)
PASS: lldb-unit :: UnwindAssembly/x86/./UnwindAssemblyx86Tests/Testx86AssemblyInspectionEngine.TestReturnDetect (861 of 2172)
PASS: lldb-unit :: Utility/./UtilityTests/StreamTest.PutHex64ByteOrderLittle (862 of 2172)
PASS: lldb-unit :: Utility/./UtilityTests/StringListTest.GetMaxStringLengthDecreasingSize (863 of 2172)
PASS: lldb-api :: macosx/DBGSourcePathRemapping/TestDSYMSourcePathRemapping.py (864 of 2172)
PASS: lldb-unit :: Utility/./UtilityTests/ProcessInstanceInfoMatch.Name (865 of 2172)
PASS: lldb-unit :: Utility/./UtilityTests/StringExtractorTest.GetHexU8_Underflow_NoEof (866 of 2172)
PASS: lldb-unit :: Utility/./UtilityTests/SerializationRountripTest.SerializeDeserializeCStringArray (867 of 2172)
PASS: lldb-api :: functionalities/multidebugger_commands/TestMultipleDebuggersCommands.py (868 of 2172)
UNSUPPORTED: lldb-api :: benchmarks/continue/TestBenchmarkContinue.py (869 of 2172)
PASS: lldb-unit :: Utility/./UtilityTests/RangeVector.CombineConsecutiveRanges (870 of 2172)
PASS: lldb-unit :: ObjectFile/ELF/./ObjectFileELFTests/ObjectFileELFTest.GetModuleSpecifications_EarlySectionHeaders (871 of 2172)
PASS: lldb-shell :: Minidump/disassemble-no-module.yaml (872 of 2172)
PASS: lldb-api :: functionalities/memory/find/TestMemoryFind.py (873 of 2172)
PASS: lldb-api :: lang/cpp/rvalue-references/TestRvalueReferences.py (874 of 2172)
PASS: lldb-unit :: Core/./LLDBCoreTests/RichManglingContextTest.SwitchProvider (875 of 2172)
UNSUPPORTED: lldb-api :: functionalities/darwin_log/filter/regex/activity/TestDarwinLogFilterRegexActivity.py (876 of 2172)
PASS: lldb-api :: functionalities/breakpoint/auto_continue/TestBreakpointAutoContinue.py (877 of 2172)
PASS: lldb-unit :: Utility/./UtilityTests/CompletionRequest.DuplicateFiltering (878 of 2172)
PASS: lldb-unit :: Utility/./UtilityTests/StreamTest.PutHex16ByteOrderBig (879 of 2172)
PASS: lldb-shell :: Breakpoint/case-sensitive.test (880 of 2172)
PASS: lldb-api :: commands/expression/weak_symbols/TestWeakSymbols.py (881 of 2172)
PASS: lldb-api :: functionalities/exec/TestExec.py (882 of 2172)
PASS: lldb-unit :: Utility/./UtilityTests/RangeTest.ContainsRange (883 of 2172)
PASS: lldb-unit :: Language/Highlighting/./HighlighterTests/HighlighterTest.ClangScalarLiterals (884 of 2172)
PASS: lldb-shell :: ObjectFile/ELF/avr-basic-info.yaml (885 of 2172)
UNSUPPORTED: lldb-api :: commands/watchpoints/multiple_threads/TestWatchpointMultipleThreads.py (886 of 2172)
UNSUPPORTED: lldb-shell :: SymbolFile/DWARF/find-variable-dwo.cpp (887 of 2172)
PASS: lldb-api :: commands/gui/basic/TestGuiBasic.py (888 of 2172)
PASS: lldb-api :: lang/cpp/bool/TestCPPBool.py (889 of 2172)
UNSUPPORTED: lldb-shell :: SymbolFile/DWARF/debug-types-address-ranges.s (890 of 2172)
PASS: lldb-unit :: Language/Highlighting/./HighlighterTests/HighlighterTest.ClangEmptyInput (891 of 2172)
PASS: lldb-api :: commands/apropos/with-process/TestAproposWithProcess.py (892 of 2172)
PASS: lldb-api :: python_api/interpreter/TestRunCommandInterpreterAPI.py (893 of 2172)
PASS: lldb-unit :: Language/CPlusPlus/./LanguageCPlusPlusTests/CPlusPlusLanguage.CPlusPlusNameParser (894 of 2172)
PASS: lldb-unit :: Utility/./UtilityTests/EnvironmentTest.EnvpConstruction (895 of 2172)
PASS: lldb-api :: functionalities/plugins/command_plugin/TestPluginCommands.py (896 of 2172)
PASS: lldb-unit :: Utility/./UtilityTests/AnsiTerminal.KnownPrefix (897 of 2172)
UNSUPPORTED: lldb-api :: functionalities/data-formatter/data-formatter-stl/libstdcpp/tuple/TestDataFormatterStdTuple.py (898 of 2172)
PASS: lldb-api :: commands/expression/error-limit/TestExprErrorLimit.py (899 of 2172)
UNSUPPORTED: lldb-shell :: ObjectFile/PECOFF/uuid.yaml (900 of 2172)
PASS: lldb-api :: functionalities/breakpoint/breakpoint_options/TestBreakpointOptions.py (901 of 2172)
PASS: lldb-unit :: Utility/./UtilityTests/StreamTest.AddressSuffix (902 of 2172)
PASS: lldb-unit :: Expression/./ExpressionTests/DiagnosticManagerTest.GetStringNoDiags (903 of 2172)
PASS: lldb-unit :: ScriptInterpreter/Python/./ScriptInterpreterPythonTests/PythonDataObjectsTest.TestPythonTupleInitializerList (904 of 2172)
PASS: lldb-unit :: Core/./LLDBCoreTests/CommunicationTest.SynchronizeWhileClosing (905 of 2172)
PASS: lldb-api :: api/multiple-targets/TestMultipleTargets.py (906 of 2172)
PASS: lldb-api :: commands/target/select/TestTargetSelect.py (907 of 2172)
PASS: lldb-api :: commands/thread/select/TestThreadSelect.py (908 of 2172)
PASS: lldb-unit :: Symbol/./SymbolTests/TestTypeSystemClang.TestRemoveFastQualifiers (909 of 2172)
PASS: lldb-api :: functionalities/unwind/zeroth_frame/TestZerothFrame.py (910 of 2172)
UNSUPPORTED: lldb-shell :: SymbolFile/DWARF/find-basic-namespace.cpp (911 of 2172)
PASS: lldb-unit :: Utility/./UtilityTests/FileSpecTest.FormatFileSpec (912 of 2172)
PASS: lldb-unit :: Utility/./UtilityTests/SerializationRountripTest.SerializeDeserializeCStringArrayNullptr (913 of 2172)
PASS: lldb-api :: tools/lldb-server/TestLldbGdbServer.py (914 of 2172)
PASS: lldb-api :: tools/lldb-vscode/stackTrace/TestVSCode_stackTrace.py (915 of 2172)
PASS: lldb-api :: functionalities/thread/concurrent_events/TestConcurrentTwoBreakpointsOneDelaySignal.py (916 of 2172)
PASS: lldb-shell :: ObjectFile/ELF/aarch64-relocations.yaml (917 of 2172)
PASS: lldb-unit :: Language/Highlighting/./HighlighterTests/HighlighterTest.ClangOperators (918 of 2172)
PASS: lldb-api :: tools/lldb-server/inferior-crash/TestGdbRemoteAbort.py (919 of 2172)
PASS: lldb-api :: python_api/formatters/TestFormattersSBAPI.py (920 of 2172)
UNSUPPORTED: lldb-shell :: ScriptInterpreter/Lua/bindings.test (921 of 2172)
PASS: lldb-shell :: ObjectFile/MachO/lc_version_min.yaml (922 of 2172)
PASS: lldb-api :: commands/target/create-no-such-arch/TestNoSuchArch.py (923 of 2172)
PASS: lldb-shell :: ObjectFile/ELF/netbsd-core-amd64.test (924 of 2172)
PASS: lldb-api :: commands/process/attach-resume/TestAttachResume.py (925 of 2172)
PASS: lldb-api :: functionalities/data-formatter/parray/TestPrintArray.py (926 of 2172)
PASS: lldb-api :: lang/c/function_types/TestFunctionTypes.py (927 of 2172)
PASS: lldb-unit :: Utility/./UtilityTests/GeneratorTest.Get (928 of 2172)
PASS: lldb-api :: functionalities/inline-stepping/TestInlineStepping.py (929 of 2172)
PASS: lldb-api :: lang/c/enum_types/TestEnumTypes.py (930 of 2172)
PASS: lldb-api :: arm/emulation/TestEmulations.py (931 of 2172)
PASS: lldb-unit :: ScriptInterpreter/Python/./ScriptInterpreterPythonTests/PythonDataObjectsTest.TestPythonBytes (932 of 2172)
PASS: lldb-unit :: Utility/./UtilityTests/RecordReplayTest.InstrumentedBarPtr (933 of 2172)
PASS: lldb-api :: functionalities/data-formatter/hexcaps/TestDataFormatterHexCaps.py (934 of 2172)
PASS: lldb-api :: functionalities/data-formatter/data-formatter-stl/libcxx/set/TestDataFormatterLibcxxSet.py (935 of 2172)
PASS: lldb-unit :: Symbol/./SymbolTests/TestTypeSystemClang.TestFunctionTemplateInRecordConstruction (936 of 2172)
PASS: lldb-unit :: Process/minidump/./LLDBMinidumpTests/MinidumpParserTest.GetThreadContext_x86_32_wow64 (937 of 2172)
PASS: lldb-api :: functionalities/data-formatter/data-formatter-stl/libcxx/function/TestLibCxxFunction.py (938 of 2172)
UNSUPPORTED: lldb-shell :: SymbolFile/target-symbols-add-unwind.test (939 of 2172)
PASS: lldb-unit :: Host/./HostTests/FileSystemTest.FileAndDirectoryComponents (940 of 2172)
PASS: lldb-api :: lang/c/struct_types/TestStructTypes.py (941 of 2172)
PASS: lldb-unit :: UnwindAssembly/x86/./UnwindAssemblyx86Tests/Testx86AssemblyInspectionEngine.Test64bitFramelessBigStackFrame (942 of 2172)
PASS: lldb-unit :: Language/Highlighting/./HighlighterTests/HighlighterTest.DefaultHighlighter (943 of 2172)
PASS: lldb-unit :: Utility/./UtilityTests/CompletionRequest.ShiftArguments (944 of 2172)
PASS: lldb-unit :: ScriptInterpreter/Python/./ScriptInterpreterPythonTests/PythonDataObjectsTest.TestModuleNameResolutionNoDot (945 of 2172)
PASS: lldb-unit :: Utility/./UtilityTests/StringListTest.Join (946 of 2172)
PASS: lldb-shell :: Breakpoint/dummy-target.test (947 of 2172)
PASS: lldb-unit :: Utility/./UtilityTests/ArgsTest.ReplaceArgumentAtIndexOutOfRange (948 of 2172)
PASS: lldb-api :: functionalities/inferior-crashing/TestInferiorCrashing.py (949 of 2172)
PASS: lldb-unit :: Utility/./UtilityTests/ArgsTest.TestSingleQuotedArgWithSpace (950 of 2172)
PASS: lldb-api :: functionalities/gdb_remote_client/TestProcessConnect.py (951 of 2172)
PASS: lldb-unit :: Host/./HostTests/HostInfoTest.GetXcodeSDK (952 of 2172)
PASS: lldb-unit :: Symbol/./SymbolTests/TestTypeSystemClang.TestGetEnumIntegerTypeInvalid (953 of 2172)
PASS: lldb-api :: lang/c/blocks/TestBlocks.py (954 of 2172)
PASS: lldb-api :: commands/frame/diagnose/dereference-this/TestDiagnoseDereferenceThis.py (955 of 2172)
PASS: lldb-unit :: Utility/./UtilityTests/StringLexerTest.GetUnlexed (956 of 2172)
PASS: lldb-unit :: Utility/./UtilityTests/ScalarTest.GetValue (957 of 2172)
PASS: lldb-shell :: SymbolFile/DWARF/clang-ast-from-dwarf-unamed-and-anon-structs.cpp (958 of 2172)
PASS: lldb-unit :: Utility/./UtilityTests/RecordReplayTest.InstrumentedFoo (959 of 2172)
PASS: lldb-unit :: Host/./HostTests/SocketTests/SocketTest.TCPListen0GetPort/ipv6 (960 of 2172)
PASS: lldb-api :: functionalities/breakpoint/scripted_bkpt/TestScriptedResolver.py (961 of 2172)
UNSUPPORTED: lldb-shell :: SymbolFile/DWARF/find-function-regex.cpp (962 of 2172)
PASS: lldb-api :: functionalities/data-formatter/data-formatter-stl/libcxx/list/TestDataFormatterLibcxxList.py (963 of 2172)
PASS: lldb-unit :: Utility/./UtilityTests/StringListTest.InsertStringAtIndexEnd (964 of 2172)
PASS: lldb-api :: python_api/sberror/TestSBError.py (965 of 2172)
UNSUPPORTED: lldb-api :: functionalities/tail_call_frames/unambiguous_sequence/TestUnambiguousTailCalls.py (966 of 2172)
PASS: lldb-api :: functionalities/data-formatter/data-formatter-stl/libcxx/vbool/TestDataFormatterLibcxxVBool.py (967 of 2172)
PASS: lldb-api :: functionalities/data-formatter/synthupdate/TestSyntheticFilterRecompute.py (968 of 2172)
PASS: lldb-unit :: API/./APITests/SBCommandInterpreterTest.SingleWordCommand (969 of 2172)
PASS: lldb-unit :: Symbol/./SymbolTests/TestTypeSystemClang.TestFunctionTemplateConstruction (970 of 2172)
UNSUPPORTED: lldb-shell :: Register/x86-ymm-write.test (971 of 2172)
UNSUPPORTED: lldb-shell :: ScriptInterpreter/Lua/nested_sessions.test (972 of 2172)
UNSUPPORTED: lldb-api :: functionalities/unwind/standard/TestStandardUnwind.py (973 of 2172)
PASS: lldb-shell :: Process/Optimization.test (974 of 2172)
PASS: lldb-unit :: ObjectFile/PECOFF/./ObjectFilePECOFFTests/PECallFrameInfoTest.Basic_eh (975 of 2172)
PASS: lldb-shell :: BuildScript/toolchain-clang.test (976 of 2172)
PASS: lldb-shell :: SymbolFile/DWARF/DW_AT_declaration-with-children.s (977 of 2172)
PASS: lldb-api :: functionalities/breakpoint/hardware_breakpoints/require_hw_breakpoints/TestRequireHWBreakpoints.py (978 of 2172)
PASS: lldb-api :: commands/expression/issue_11588/Test11588.py (979 of 2172)
PASS: lldb-api :: python_api/objc_type/TestObjCType.py (980 of 2172)
PASS: lldb-unit :: Utility/./UtilityTests/RegularExpression.Match (981 of 2172)
PASS: lldb-unit :: Host/./HostTests/FileSystemTest.GetByteSize (982 of 2172)
PASS: lldb-api :: lang/cpp/template-specialization-type/TestTemplateSpecializationType.py (983 of 2172)
PASS: lldb-unit :: Utility/./UtilityTests/ListenerTest.GetEventWait (984 of 2172)
PASS: lldb-unit :: Host/./HostTests/ConnectionFileDescriptorTest.TCPGetURIv4 (985 of 2172)
PASS: lldb-api :: functionalities/show_location/TestShowLocationDwarf5.py (986 of 2172)
PASS: lldb-unit :: UnwindAssembly/x86/./UnwindAssemblyx86Tests/Testx86AssemblyInspectionEngine.Test32BitOnlyInstruction (987 of 2172)
PASS: lldb-unit :: Utility/./UtilityTests/UriParserTest.BadPort2 (988 of 2172)
UNSUPPORTED: lldb-api :: functionalities/darwin_log/format/TestDarwinLogMessageFormat.py (989 of 2172)
PASS: lldb-api :: lang/objc/objc-new-syntax/TestObjCNewSyntaxArray.py (990 of 2172)
PASS: lldb-unit :: Process/gdb-remote/./ProcessGdbRemoteTests/GDBRemoteCommunicationClientTest.SendGetDataPacket (991 of 2172)
PASS: lldb-api :: functionalities/limit-debug-info/TestLimitDebugInfo.py (992 of 2172)
PASS: lldb-unit :: Utility/./UtilityTests/VASprintfTest.NoBufferResize (993 of 2172)
PASS: lldb-unit :: Language/Highlighting/./HighlighterTests/HighlighterTest.ClangComments (994 of 2172)
PASS: lldb-unit :: Core/./LLDBCoreTests/RichManglingContextTest.Basic (995 of 2172)
PASS: lldb-api :: commands/process/signal/TestProcessSignal.py (996 of 2172)
PASS: lldb-unit :: ScriptInterpreter/Python/./ScriptInterpreterPythonTests/PythonDataObjectsTest.TestOwnedReferences (997 of 2172)
PASS: lldb-unit :: Symbol/./SymbolTests/TestTypeSystemClang.TestOwningModule (998 of 2172)
PASS: lldb-unit :: Language/Highlighting/./HighlighterTests/HighlighterTest.ClangPreserveNewLine (999 of 2172)
PASS: lldb-api :: functionalities/target-new-solib-notifications/TestModuleLoadedNotifys.py (1000 of 2172)
PASS: lldb-api :: tools/lldb-vscode/console/TestVSCode_console.py (1001 of 2172)
PASS: lldb-shell :: SymbolFile/Breakpad/stack-cfi-parsing.test (1002 of 2172)
PASS: lldb-api :: lang/c/complex_int/TestComplexInt.py (1003 of 2172)
PASS: lldb-api :: python_api/lldbutil/TestSwigVersion.py (1004 of 2172)
PASS: lldb-shell :: Driver/TestSingleQuote.test (1005 of 2172)
UNSUPPORTED: lldb-api :: functionalities/signal/handle-segv/TestHandleSegv.py (1006 of 2172)
UNSUPPORTED: lldb-api :: functionalities/darwin_log/filter/regex/category/TestDarwinLogFilterRegexCategory.py (1007 of 2172)
PASS: lldb-unit :: Utility/./UtilityTests/RegularExpression.Invalid (1008 of 2172)
PASS: lldb-unit :: Utility/./UtilityTests/ReproducerTest.SetReplay (1009 of 2172)
PASS: lldb-unit :: SymbolFile/DWARF/./SymbolFileDWARFTests/XcodeSDKModuleTests.TestModuleGetXcodeSDK (1010 of 2172)
PASS: lldb-unit :: Utility/./UtilityTests/UUIDTest.StringConverion (1011 of 2172)
PASS: lldb-api :: lang/cpp/template-arguments/TestCppTemplateArguments.py (1012 of 2172)
PASS: lldb-unit :: Utility/./UtilityTests/TimerTest.CategoryTimesStats (1013 of 2172)
PASS: lldb-unit :: Utility/./UtilityTests/ScalarTest.ComparisonFloat (1014 of 2172)
PASS: lldb-api :: functionalities/target_var/no_vars/TestTargetVarNoVars.py (1015 of 2172)
PASS: lldb-unit :: Utility/./UtilityTests/ArgsTest.TestAppendArg (1016 of 2172)
PASS: lldb-unit :: Symbol/./SymbolTests/TestClangASTImporter.MetadataPropagationAfterCopying (1017 of 2172)
PASS: lldb-unit :: Utility/./UtilityTests/StreamTest.PutHex16ByteOrderLittle (1018 of 2172)
PASS: lldb-api :: lang/cpp/signed_types/TestSignedTypes.py (1019 of 2172)
PASS: lldb-api :: python_api/lldbutil/iter/TestRegistersIterator.py (1020 of 2172)
UNSUPPORTED: lldb-api :: commands/watchpoints/variable_out_of_scope/TestWatchedVarHitWhenInScope.py (1021 of 2172)
UNSUPPORTED: lldb-api :: python_api/watchpoint/TestWatchpointIgnoreCount.py (1022 of 2172)
PASS: lldb-api :: functionalities/gdb_remote_client/TestJLink6Armv7RegisterDefinition.py (1023 of 2172)
PASS: lldb-unit :: Utility/./UtilityTests/ArgsTest.GetShellSafeArgument (1024 of 2172)
PASS: lldb-api :: functionalities/postmortem/minidump-new/TestMiniDumpUUID.py (1025 of 2172)
UNSUPPORTED: lldb-shell :: SymbolFile/NativePDB/globals-fundamental.cpp (1026 of 2172)
PASS: lldb-unit :: Utility/./UtilityTests/DataExtractorTest.PeekData (1027 of 2172)
PASS: lldb-unit :: Utility/./UtilityTests/UriParserTest.BracketedHostnamePort (1028 of 2172)
PASS: lldb-api :: commands/expression/dont_allow_jit/TestAllowJIT.py (1029 of 2172)
PASS: lldb-unit :: Interpreter/./InterpreterTests/CompletionTest.DirCompletionUsername (1030 of 2172)
UNSUPPORTED: lldb-shell :: Minidump/Windows/arm-fp-unwind.test (1031 of 2172)
UNSUPPORTED: lldb-api :: commands/watchpoints/hello_watchlocation/TestWatchLocation.py (1032 of 2172)
PASS: lldb-shell :: Breakpoint/debug_rnglist_basic.test (1033 of 2172)
PASS: lldb-unit :: ScriptInterpreter/Python/./ScriptInterpreterPythonTests/PythonDataObjectsTest.TestCallable (1034 of 2172)
PASS: lldb-shell :: Reproducer/TestVerify.test (1035 of 2172)
PASS: lldb-unit :: SymbolFile/DWARF/./SymbolFileDWARFTests/SymbolFileDWARFTests.TestAbbrevValidAttrNullForm (1036 of 2172)
PASS: lldb-unit :: Utility/./UtilityTests/AnsiTerminal.Basic (1037 of 2172)
PASS: lldb-unit :: Process/minidump/./LLDBMinidumpTests/MinidumpParserTest.FindMemoryRange (1038 of 2172)
PASS: lldb-api :: lang/objc/foundation/TestFoundationDisassembly.py (1039 of 2172)
PASS: lldb-shell :: Expr/TestIRMemoryMap.test (1040 of 2172)
PASS: lldb-api :: lang/cpp/char1632_t/TestChar1632T.py (1041 of 2172)
PASS: lldb-shell :: Commands/command-source.test (1042 of 2172)
PASS: lldb-unit :: Utility/./UtilityTests/StringListTest.CopyListSingle (1043 of 2172)
PASS: lldb-unit :: UnwindAssembly/x86/./UnwindAssemblyx86Tests/Testx86AssemblyInspectionEngine.TestPushEBP (1044 of 2172)
PASS: lldb-api :: functionalities/data-formatter/varscript_formatting/TestDataFormatterVarScriptFormatting.py (1045 of 2172)
PASS: lldb-api :: lang/cpp/typeof/TestTypeOfDeclTypeExpr.py (1046 of 2172)
PASS: lldb-shell :: Settings/TestEchoCommands.test (1047 of 2172)
PASS: lldb-api :: functionalities/breakpoint/debugbreak/TestDebugBreak.py (1048 of 2172)
PASS: lldb-api :: lang/c/find_struct_type/TestFindStructTypes.py (1049 of 2172)
PASS: lldb-unit :: UnwindAssembly/x86/./UnwindAssemblyx86Tests/Testx86AssemblyInspectionEngine.TestPushEBX (1050 of 2172)
PASS: lldb-api :: commands/expression/import-std-module/shared_ptr/TestSharedPtrFromStdModule.py (1051 of 2172)
UNSUPPORTED: lldb-api :: lang/cpp/function-template-parameter-pack/TestFunctionTemplateParameterPack.py (1052 of 2172)
PASS: lldb-api :: functionalities/pre_run_dylibs/TestPreRunDylibs.py (1053 of 2172)
UNSUPPORTED: lldb-shell :: SymbolFile/NativePDB/break-by-line.cpp (1054 of 2172)
PASS: lldb-api :: commands/frame/diagnose/local-variable/TestLocalVariable.py (1055 of 2172)
PASS: lldb-unit :: UnwindAssembly/x86/./UnwindAssemblyx86Tests/Testx86AssemblyInspectionEngine.TestPushEDX (1056 of 2172)
PASS: lldb-api :: functionalities/target_var/TestTargetVar.py (1057 of 2172)
PASS: lldb-unit :: Symbol/./SymbolTests/TestTypeSystemClang.TestGetEnumIntegerTypeBasicTypes (1058 of 2172)
PASS: lldb-unit :: UnwindAssembly/x86/./UnwindAssemblyx86Tests/Testx86AssemblyInspectionEngine.TestStackRealign32BitDisp_x86_64 (1059 of 2172)
PASS: lldb-unit :: Utility/./UtilityTests/ArchSpecTest.TestParseMachCPUDashSubtypeTripleSimple (1060 of 2172)
PASS: lldb-api :: commands/frame/select/TestFrameSelect.py (1061 of 2172)
PASS: lldb-shell :: Minidump/dump-all.test (1062 of 2172)
UNSUPPORTED: lldb-shell :: ObjectFile/PECOFF/dep-modules.yaml (1063 of 2172)
PASS: lldb-shell :: ObjectFile/PECOFF/basic-info-arm64.yaml (1064 of 2172)
PASS: lldb-unit :: Process/minidump/./LLDBMinidumpTests/MinidumpParserTest.GetMemoryRegionInfo (1065 of 2172)
PASS: lldb-unit :: Utility/./UtilityTests/ScalarTest.SetValueFromData (1066 of 2172)
PASS: lldb-unit :: Utility/./UtilityTests/BinaryStreamTest.PutSLEB128OneByte (1067 of 2172)
PASS: lldb-api :: commands/process/attach/attach_denied/TestAttachDenied.py (1068 of 2172)
PASS: lldb-api :: types/TestShortType.py (1069 of 2172)
UNSUPPORTED: lldb-api :: commands/watchpoints/watchpoint_size/TestWatchpointSizes.py (1070 of 2172)
PASS: lldb-api :: functionalities/breakpoint/serialize/TestBreakpointSerialization.py (1071 of 2172)
PASS: lldb-unit :: Utility/./UtilityTests/LogTest.Unregister (1072 of 2172)
PASS: lldb-api :: lang/cpp/thread_local/TestThreadLocal.py (1073 of 2172)
PASS: lldb-unit :: Utility/./UtilityTests/UriParserTest.SchemeHostSeparator3 (1074 of 2172)
UNSUPPORTED: lldb-shell :: SymbolFile/PDB/ast-restore.test (1075 of 2172)
UNSUPPORTED: lldb-shell :: SymbolFile/Breakpad/stack-cfi-arm.yaml (1076 of 2172)
UNSUPPORTED: lldb-api :: functionalities/thread/concurrent_events/TestConcurrentWatchBreakDelay.py (1077 of 2172)
PASS: lldb-api :: functionalities/postmortem/netbsd-core/TestNetBSDCore.py (1078 of 2172)
UNSUPPORTED: lldb-api :: functionalities/darwin_log/filter/exact_match/activity/TestDarwinLogFilterMatchActivity.py (1079 of 2172)
XFAIL: lldb-shell :: Expr/nodefaultlib.cpp (1080 of 2172)
UNSUPPORTED: lldb-shell :: SymbolFile/PDB/typedefs.test (1081 of 2172)
PASS: lldb-api :: functionalities/breakpoint/move_nearest/TestMoveNearest.py (1082 of 2172)
PASS: lldb-api :: commands/command/delete/TestCommandDelete.py (1083 of 2172)
PASS: lldb-unit :: Utility/./UtilityTests/ArgsTest.ReplaceArgumentAtIndexShort (1084 of 2172)
PASS: lldb-unit :: SymbolFile/NativePDB/./SymbolFileNativePDBTests/PDBFPOProgramToDWARFExpressionTests.UnsupportedRASearch (1085 of 2172)
PASS: lldb-shell :: ObjectFile/ELF/section-overlap.yaml (1086 of 2172)
PASS: lldb-api :: functionalities/gdb_remote_client/TestIOSSimulator.py (1087 of 2172)
PASS: lldb-api :: macosx/profile_vrs_detach/TestDetachVrsProfile.py (1088 of 2172)
PASS: lldb-api :: functionalities/breakpoint/objc/TestObjCBreakpoints.py (1089 of 2172)
PASS: lldb-api :: lang/c/local_types/TestUseClosestType.py (1090 of 2172)
UNSUPPORTED: lldb-api :: functionalities/thread/state/TestThreadStates.py (1091 of 2172)
PASS: lldb-unit :: Utility/./UtilityTests/ProcessInfoTest.Constructor (1092 of 2172)
PASS: lldb-unit :: Core/./LLDBCoreTests/RichManglingContextTest.IPDRealloc (1093 of 2172)
PASS: lldb-unit :: Utility/./UtilityTests/NameMatchesTest.RegularExpression (1094 of 2172)
PASS: lldb-unit :: Utility/./UtilityTests/ReproducerTest.SetCapture (1095 of 2172)
PASS: lldb-shell :: Recognizer/assert.test (1096 of 2172)
PASS: lldb-api :: commands/expression/import-std-module/basic/TestImportStdModule.py (1097 of 2172)
PASS: lldb-api :: lang/cpp/virtual-functions/TestCppVirtualFunctions.py (1098 of 2172)
PASS: lldb-api :: functionalities/load_using_paths/TestLoadUsingPaths.py (1099 of 2172)
UNSUPPORTED: lldb-api :: lang/objc/modules-incomplete/TestIncompleteModules.py (1100 of 2172)
UNSUPPORTED: lldb-shell :: Breakpoint/case-insensitive.test (1101 of 2172)
PASS: lldb-api :: lang/cpp/stl/TestStdCXXDisassembly.py (1102 of 2172)
PASS: lldb-api :: functionalities/data-formatter/frameformat_smallstruct/TestFrameFormatSmallStruct.py (1103 of 2172)
PASS: lldb-unit :: Target/./TargetTests/ModuleCacheTest.GetAndPutUuidExists (1104 of 2172)
PASS: lldb-unit :: Process/minidump/./LLDBMinidumpTests/MinidumpParserTest.GetPid (1105 of 2172)
PASS: lldb-unit :: Utility/./UtilityTests/OptionsWithRawTest.LeadingSpaceArgs (1106 of 2172)
PASS: lldb-unit :: Utility/./UtilityTests/StringExtractorTest.GetNameColonValueNoSemicolon (1107 of 2172)
PASS: lldb-api :: types/TestIntegerType.py (1108 of 2172)
PASS: lldb-unit :: Utility/./UtilityTests/StreamTest.PutHex64ByteOrderBig (1109 of 2172)
PASS: lldb-unit :: ScriptInterpreter/Python/./ScriptInterpreterPythonTests/PythonDataObjectsTest.TestResetting (1110 of 2172)
PASS: lldb-unit :: Utility/./UtilityTests/UriParserTest.MinimalPort (1111 of 2172)
PASS: lldb-unit :: Utility/./UtilityTests/StringExtractorTest.GetHexBytesAvail_Partial (1112 of 2172)
PASS: lldb-api :: commands/expression/codegen-crash-typedefdecl-not-in_declcontext/TestCodegenCrashTypedefDeclNotInDeclContext.py (1113 of 2172)
PASS: lldb-api :: functionalities/postmortem/minidump-new/TestMiniDumpNew.py (1114 of 2172)
PASS: lldb-api :: commands/expression/import-std-module/no-std-module/TestMissingStdModule.py (1115 of 2172)
PASS: lldb-api :: tools/lldb-server/TestGdbRemoteAttach.py (1116 of 2172)
PASS: lldb-shell :: SymbolFile/DWARF/debug_line-tombstone.s (1117 of 2172)
PASS: lldb-api :: functionalities/memory/read/TestMemoryRead.py (1118 of 2172)
UNSUPPORTED: lldb-api :: lang/objc/rdar-12408181/TestRdar12408181.py (1119 of 2172)
PASS: lldb-unit :: Breakpoint/./LLDBBreakpointTests/BreakpointIDTest.StringIsBreakpointName (1120 of 2172)
PASS: lldb-unit :: Utility/./UtilityTests/ArchSpecTest.Compatibility (1121 of 2172)
PASS: lldb-api :: commands/expression/call-throws/TestCallThatThrows.py (1122 of 2172)
PASS: lldb-unit :: Utility/./UtilityTests/Predicate.WaitForValueEqualTo (1123 of 2172)
PASS: lldb-unit :: Utility/./UtilityTests/StatusTest.ErrorConversion (1124 of 2172)
PASS: lldb-unit :: Utility/./UtilityTests/StreamTest.PutRawBytesToLittleEndian (1125 of 2172)
PASS: lldb-unit :: ObjectFile/Breakpad/./ObjectFileBreakpadTests/PublicRecord.parse (1126 of 2172)
PASS: lldb-unit :: ObjectFile/Breakpad/./ObjectFileBreakpadTests/FileRecord.parse (1127 of 2172)
UNSUPPORTED: lldb-api :: functionalities/data-formatter/data-formatter-stl/libstdcpp/smart_ptr/TestDataFormatterStdSmartPtr.py (1128 of 2172)
PASS: lldb-api :: lang/objc/objc-runtime-ivars/TestRuntimeIvars.py (1129 of 2172)
PASS: lldb-unit :: Utility/./UtilityTests/ConstStringTest.NullAndEmptyStates (1130 of 2172)
PASS: lldb-unit :: Language/Highlighting/./HighlighterTests/HighlighterTest.Keywords (1131 of 2172)
PASS: lldb-unit :: UnwindAssembly/x86/./UnwindAssemblyx86Tests/Testx86AssemblyInspectionEngine.TestSimple64bitFrameFunction (1132 of 2172)
PASS: lldb-api :: functionalities/process_crash_info/TestProcessCrashInfo.py (1133 of 2172)
PASS: lldb-api :: lang/objc/foundation/TestObjCMethodsNSArray.py (1134 of 2172)
PASS: lldb-api :: python_api/value/change_values/TestChangeValueAPI.py (1135 of 2172)
PASS: lldb-shell :: BuildScript/script-args.test (1136 of 2172)
PASS: lldb-api :: lang/c/offsetof/TestOffsetof.py (1137 of 2172)
PASS: lldb-api :: functionalities/memory/cache/TestMemoryCache.py (1138 of 2172)
PASS: lldb-unit :: Utility/./UtilityTests/CompletionRequest.TryCompleteCurrentArgMode (1139 of 2172)
PASS: lldb-unit :: Expression/./ExpressionTests/CppModuleConfigurationTest.MissingUsrInclude (1140 of 2172)
PASS: lldb-unit :: Utility/./UtilityTests/RecordReplayTest.InstrumentedBarRef (1141 of 2172)
PASS: lldb-api :: commands/process/launch-with-shellexpand/TestLaunchWithShellExpand.py (1142 of 2172)
UNSUPPORTED: lldb-api :: functionalities/tsan/multiple/TestTsanMultiple.py (1143 of 2172)
PASS: lldb-api :: commands/platform/file/close/TestPlatformFileClose.py (1144 of 2172)
PASS: lldb-unit :: Utility/./UtilityTests/XcodeSDKTest.MergeTest (1145 of 2172)
PASS: lldb-api :: lang/cpp/llvm-style/TestLLVMStyle.py (1146 of 2172)
PASS: lldb-unit :: Utility/./UtilityTests/StreamTest.ShiftOperatorStrings (1147 of 2172)
PASS: lldb-unit :: ScriptInterpreter/Python/./ScriptInterpreterPythonTests/PythonDataObjectsTest.TestPythonListManipulation (1148 of 2172)
UNSUPPORTED: lldb-api :: functionalities/darwin_log/filter/exact_match/activity-chain/TestDarwinLogFilterMatchActivityChain.py (1149 of 2172)
PASS: lldb-unit :: Utility/./UtilityTests/DataExtractorTest.GetFloat (1150 of 2172)
PASS: lldb-unit :: Utility/./UtilityTests/FileSpecTest.GetPath (1151 of 2172)
PASS: lldb-unit :: Utility/./UtilityTests/LogTest.Register (1152 of 2172)
FAIL: lldb-api :: functionalities/thread/concurrent_events/TestConcurrentBreakpointOneDelayBreakpointThreads.py (1153 of 2172)
******************** TEST 'lldb-api :: functionalities/thread/concurrent_events/TestConcurrentBreakpointOneDelayBreakpointThreads.py' FAILED ********************
Script:
--
/usr/local/Frameworks/Python.framework/Versions/3.7/bin/python3.7 /Users/buildslave/jenkins/workspace/lldb-cmake-matrix/llvm-project/lldb/test/API/dotest.py -S nm -u CXXFLAGS -u CFLAGS --codesign-identity lldb_codesign --arch x86_64 --build-dir /Users/buildslave/jenkins/workspace/lldb-cmake-matrix/lldb-build/lldb-test-build.noindex -s=/Users/buildslave/jenkins/workspace/lldb-cmake-matrix/test/logs -t --env TERM=vt100 --skip-category gmodules --skip-category watchpoint --arch=x86_64 --dwarf-version=2 --env LLVM_LIBS_DIR=/Users/buildslave/jenkins/workspace/lldb-cmake-matrix/lldb-build/./lib --arch x86_64 --build-dir /Users/buildslave/jenkins/workspace/lldb-cmake-matrix/lldb-build/lldb-test-build.noindex -s /Users/buildslave/jenkins/workspace/lldb-cmake-matrix/lldb-build/lldb-test-traces --lldb-module-cache-dir /Users/buildslave/jenkins/workspace/lldb-cmake-matrix/lldb-build/lldb-test-build.noindex/module-cache-lldb/lldb-api --clang-module-cache-dir /Users/buildslave/jenkins/workspace/lldb-cmake-matrix/lldb-build/lldb-test-build.noindex/module-cache-clang/lldb-api --executable /Users/buildslave/jenkins/workspace/lldb-cmake-matrix/lldb-build/./bin/lldb --compiler /Users/buildslave/jenkins/workspace/lldb-cmake-matrix/lldb-build/./bin/clang --dsymutil /Users/buildslave/jenkins/workspace/lldb-cmake-matrix/lldb-build/./bin/dsymutil --filecheck /Users/buildslave/jenkins/workspace/lldb-cmake-matrix/lldb-build/./bin/FileCheck --yaml2obj /Users/buildslave/jenkins/workspace/lldb-cmake-matrix/lldb-build/./bin/yaml2obj --server /Users/buildslave/jenkins/workspace/lldb-cmake-matrix/lldb-build/./bin/debugserver --lldb-libs-dir /Users/buildslave/jenkins/workspace/lldb-cmake-matrix/lldb-build/./lib /Users/buildslave/jenkins/workspace/lldb-cmake-matrix/llvm-project/lldb/test/API/functionalities/thread/concurrent_events -p TestConcurrentBreakpointOneDelayBreakpointThreads.py
--
Exit Code: 1

Hide Details

Command Output (stdout): -- lldb version 12.0.99 (http://labmaster3.local/git/llvm-project.git revision b2f05fae80b0c1a307a9e257157a0d70e6623eb8) clang revision b2f05fae80b0c1a307a9e257157a0d70e6623eb8 llvm revision b2f05fae80b0c1a307a9e257157a0d70e6623eb8 libstdcxx tests will not be run because: Don't know how to build with libstdcxx on macosx Skipping following debug info categories: ['dwo']

Hide Details

-- Command Output (stderr): --

Hide Details

Session logs for test failures/errors/unexpected successes will go into directory '/Users/buildslave/jenkins/workspace/lldb-cmake-matrix/lldb-build/lldb-test-traces' Change dir to: /Users/buildslave/jenkins/workspace/lldb-cmake-matrix/llvm-project/lldb/test/API/functionalities/thread/concurrent_events runCmd: settings clear -all output:

Hide Details

runCmd: settings set symbols.enable-external-lookup false output:

Hide Details

runCmd: settings set target.inherit-tcc true output:

Hide Details

runCmd: settings set target.auto-apply-fixits false output:

Hide Details

runCmd: settings set plugin.process.gdb-remote.packet-timeout 60 output:

Hide Details

runCmd: settings set symbols.clang-modules-cache-path "/Users/buildslave/jenkins/workspace/lldb-cmake-matrix/lldb-build/lldb-test-build.noindex/module-cache-lldb/lldb-api" output:

Hide Details

runCmd: settings set use-color false output:

Hide Details

runCmd: setting set target.prefer-dynamic-value no-dynamic-values output:

Hide Details

runCmd: file /Users/buildslave/jenkins/workspace/lldb-cmake-matrix/lldb-build/lldb-test-build.noindex/functionalities/thread/concurrent_events/TestConcurrentBreakpointOneDelayBreakpointThreads.test/a.out output: Current executable set to '/Users/buildslave/jenkins/workspace/lldb-cmake-matrix/lldb-build/lldb-test-build.noindex/functionalities/thread/concurrent_events/TestConcurrentBreakpointOneDelayBreakpointThreads.test/a.out' (x86_64).

Hide Details

Hide Details

runCmd: breakpoint set -f "main.cpp" -l 130 output: Breakpoint 1: where = a.out`dotest() + 77 at main.cpp:130:5, address = 0x00000001000019ad

Hide Details

Hide Details

Expecting pattern: ^Breakpoint (?P<bpno>[0-9]+): (?P<num_locations>[0-9]+) locations\.$ Not matched

Hide Details

Expecting pattern: ^Breakpoint (?P<bpno>[0-9]+): (?P<num_locations>no) locations \(pending\)\. Not matched

Hide Details

Expecting pattern: ^Breakpoint (?P<bpno>[0-9]+): where = (?P<module>.*)`(?P<symbol>[+\-]{0,1}[^+]+)( \+ (?P<offset>[0-9]+)){0,1}( \[inlined\] (?P<inline_symbol>.*)){0,1} at (?P<file>[^:]+):(?P<line_no>[0-9]+)(?P<column>(:[0-9]+)?), address = (?P<address>0x[0-9a-fA-F]+)$ Matched

Hide Details

runCmd: breakpoint set -f "main.cpp" -l 176 output: Breakpoint 2: where = a.out`main + 22 at main.cpp:176:5, address = 0x0000000100002056

Hide Details

Hide Details

Expecting pattern: ^Breakpoint (?P<bpno>[0-9]+): (?P<num_locations>[0-9]+) locations\.$ Not matched

Hide Details

Expecting pattern: ^Breakpoint (?P<bpno>[0-9]+): (?P<num_locations>no) locations \(pending\)\. Not matched

Hide Details

Expecting pattern: ^Breakpoint (?P<bpno>[0-9]+): where = (?P<module>.*)`(?P<symbol>[+\-]{0,1}[^+]+)( \+ (?P<offset>[0-9]+)){0,1}( \[inlined\] (?P<inline_symbol>.*)){0,1} at (?P<file>[^:]+):(?P<line_no>[0-9]+)(?P<column>(:[0-9]+)?), address = (?P<address>0x[0-9a-fA-F]+)$ Matched

Hide Details

runCmd: breakpoint set -f "main.cpp" -l 45 output: Breakpoint 3: where = a.out`breakpoint_func(void*) + 71 at main.cpp:45:17, address = 0x0000000100001547

Hide Details

Hide Details

Expecting pattern: ^Breakpoint (?P<bpno>[0-9]+): (?P<num_locations>[0-9]+) locations\.$ Not matched

Hide Details

Expecting pattern: ^Breakpoint (?P<bpno>[0-9]+): (?P<num_locations>no) locations \(pending\)\. Not matched

Hide Details

Expecting pattern: ^Breakpoint (?P<bpno>[0-9]+): where = (?P<module>.*)`(?P<symbol>[+\-]{0,1}[^+]+)( \+ (?P<offset>[0-9]+)){0,1}( \[inlined\] (?P<inline_symbol>.*)){0,1} at (?P<file>[^:]+):(?P<line_no>[0-9]+)(?P<column>(:[0-9]+)?), address = (?P<address>0x[0-9a-fA-F]+)$ Matched

Hide Details

runCmd: breakpoint list -f output: Current breakpoints: 1: file = 'main.cpp', line = 130, exact_match = 0, locations = 1 1.1: where = a.out`dotest() + 77 at main.cpp:130:5, address = a.out[0x00000001000019ad], unresolved, hit count = 0

Hide Details

2: file = 'main.cpp', line = 176, exact_match = 0, locations = 1 2.1: where = a.out`main + 22 at main.cpp:176:5, address = a.out[0x0000000100002056], unresolved, hit count = 0

Hide Details

3: file = 'main.cpp', line = 45, exact_match = 0, locations = 1 3.1: where = a.out`breakpoint_func(void*) + 71 at main.cpp:45:17, address = a.out[0x0000000100001547], unresolved, hit count = 0

Hide Details

Hide Details

Hide Details

Ran command: "breakpoint list -f"

Hide Details

Got output: Current breakpoints: 1: file = 'main.cpp', line = 130, exact_match = 0, locations = 1 1.1: where = a.out`dotest() + 77 at main.cpp:130:5, address = a.out[0x00000001000019ad], unresolved, hit count = 0

Hide Details

2: file = 'main.cpp', line = 176, exact_match = 0, locations = 1 2.1: where = a.out`main + 22 at main.cpp:176:5, address = a.out[0x0000000100002056], unresolved, hit count = 0

Hide Details

3: file = 'main.cpp', line = 45, exact_match = 0, locations = 1 3.1: where = a.out`breakpoint_func(void*) + 71 at main.cpp:45:17, address = a.out[0x0000000100001547], unresolved, hit count = 0

Hide Details

Hide Details

Expecting sub string: ": file = 'main.cpp', line = 176" (was found) Expecting sub string: ": file = 'main.cpp', line = 176" (was found) Expecting sub string: ": file = 'main.cpp', line = 176" (was found)

Hide Details

runCmd: run runCmd failed! error: process exited with status -1 (tried to attach to process already being debugged)

Hide Details

Hide Details

Command 'run' failed!

Hide Details

FAIL: LLDB (/Users/buildslave/jenkins/workspace/lldb-cmake-matrix/lldb-build/bin/clang-x86_64) :: test (TestConcurrentBreakpointOneDelayBreakpointThreads.ConcurrentBreakpointOneDelayBreakpointThreads) <bound method SBProcess.Kill of <lldb.SBProcess; proxy of <Swig Object of type 'lldb::SBProcess *' at 0x1062acbd0> >>: success

Hide Details

Restore dir to: /Users/buildslave/jenkins/workspace/lldb-cmake-matrix/lldb-build/tools/lldb/test ====================================================================== FAIL: test (TestConcurrentBreakpointOneDelayBreakpointThreads.ConcurrentBreakpointOneDelayBreakpointThreads) Test threads that trigger a breakpoint where one thread has a 1 second delay. ---------------------------------------------------------------------- Traceback (most recent call last): File "/Users/buildslave/jenkins/workspace/lldb-cmake-matrix/llvm-project/lldb/packages/Python/lldbsuite/test/decorators.py", line 136, in wrapper return func(*args, **kwargs) File "/Users/buildslave/jenkins/workspace/lldb-cmake-matrix/llvm-project/lldb/test/API/functionalities/thread/concurrent_events/TestConcurrentBreakpointOneDelayBreakpointThreads.py", line 20, in test num_delay_breakpoint_threads=1) File "/Users/buildslave/jenkins/workspace/lldb-cmake-matrix/llvm-project/lldb/packages/Python/lldbsuite/test/concurrent_base.py", line 139, in do_thread_actions self.runCmd("run", RUN_SUCCEEDED) File "/Users/buildslave/jenkins/workspace/lldb-cmake-matrix/llvm-project/lldb/packages/Python/lldbsuite/test/lldbtest.py", line 2153, in runCmd msg if (msg) else CMD_MSG(cmd)) AssertionError: False is not True : Process is launched successfully Error output: error: process exited with status -1 (tried to attach to process already being debugged)

Hide Details

Config=x86_64-/Users/buildslave/jenkins/workspace/lldb-cmake-matrix/lldb-build/bin/clang ---------------------------------------------------------------------- Ran 1 test in 3.152s

Hide Details

RESULT: FAILED (0 passes, 1 failures, 0 errors, 0 skipped, 0 expected failures, 0 unexpected successes)

Hide Details

--

Hide Details

******************** UNSUPPORTED: lldb-shell :: SymbolFile/NativePDB/function-types-classes.cpp (1154 of 2172) PASS: lldb-api :: functionalities/breakpoint/breakpoint_callback_command_source/TestBreakpointCallbackCommandSource.py (1155 of 2172) PASS: lldb-shell :: SymbolFile/DWARF/debug_loclists-dwo.s (1156 of 2172) UNSUPPORTED: lldb-api :: linux/sepdebugsymlink/TestTargetSymbolsSepDebugSymlink.py (1157 of 2172) PASS: lldb-shell :: ObjectFile/PECOFF/invalid-export-table.yaml (1158 of 2172) PASS: lldb-unit :: Utility/./UtilityTests/RangeTest.ContainsAddrInvalid (1159 of 2172) UNSUPPORTED: lldb-shell :: Register/x86-fp-write.test (1160 of 2172) PASS: lldb-unit :: Utility/./UtilityTests/StringListTest.AppendStringStdString (1161 of 2172) PASS: lldb-api :: python_api/sbplatform/TestSBPlatform.py (1162 of 2172) PASS: lldb-unit :: Process/./ProcessEventDataTests/ProcessEventDataTest.DoOnRemoval (1163 of 2172) PASS: lldb-unit :: Utility/./UtilityTests/BinaryStreamTest.PutSLEB128TwoBytes (1164 of 2172) PASS: lldb-shell :: ObjectFile/ELF/PT_LOAD-overlap-section.yaml (1165 of 2172) PASS: lldb-unit :: Process/minidump/./LLDBMinidumpTests/MinidumpParserTest.GetPidWindows (1166 of 2172) PASS: lldb-shell :: Minidump/memory-region.yaml (1167 of 2172) PASS: lldb-unit :: Utility/./UtilityTests/ProcessInstanceInfo.Yaml (1168 of 2172) PASS: lldb-api :: python_api/lldbutil/frame/TestFrameUtils.py (1169 of 2172) PASS: lldb-unit :: Utility/./UtilityTests/BinaryStreamTest.PutSLEB128NineBytes (1170 of 2172) PASS: lldb-api :: python_api/disassemble-raw-data/TestDisassembleRawData.py (1171 of 2172) PASS: lldb-unit :: Process/gdb-remote/./ProcessGdbRemoteTests/GDBRemoteCommunicationClientTest.GetMemoryRegionInfo (1172 of 2172) PASS: lldb-api :: commands/expression/completion-crash-incomplete-record/TestCompletionCrashIncompleteRecord.py (1173 of 2172) UNSUPPORTED: lldb-api :: functionalities/data-formatter/data-formatter-stl/libstdcpp/map/TestDataFormatterStdMap.py (1174 of 2172) PASS: lldb-unit :: Host/./HostTests/SocketTests/SocketTest.DomainGetConnectURI/ipv6 (1175 of 2172) PASS: lldb-api :: functionalities/gdb_remote_client/TestArmRegisterDefinition.py (1176 of 2172) PASS: lldb-unit :: Symbol/./SymbolTests/TestTypeSystemClang.TestGetTypeClassDeclType (1177 of 2172) PASS: lldb-unit :: Utility/./UtilityTests/StringExtractorTest.GetU32BigEndian (1178 of 2172) PASS: lldb-api :: functionalities/breakpoint/cpp/TestCPPBreakpointLocations.py (1179 of 2172) PASS: lldb-api :: terminal/TestEditline.py (1180 of 2172) UNSUPPORTED: lldb-shell :: SymbolFile/DWARF/win-i386-line-table.s (1181 of 2172) PASS: lldb-api :: functionalities/breakpoint/source_regexp/TestSourceRegexBreakpoints.py (1182 of 2172) PASS: lldb-unit :: Symbol/./SymbolTests/PostfixExpression.ToDWARF (1183 of 2172) PASS: lldb-api :: tools/lldb-vscode/step/TestVSCode_step.py (1184 of 2172) PASS: lldb-api :: python_api/signals/TestSignalsAPI.py (1185 of 2172) UNSUPPORTED: lldb-api :: commands/expression/namespace_local_var_same_name_obj_c/TestNamespaceLocalVarSameNameObjC.py (1186 of 2172) PASS: lldb-unit :: Utility/./UtilityTests/NameMatchesTest.Contains (1187 of 2172) PASS: lldb-api :: python_api/sbenvironment/TestSBEnvironment.py (1188 of 2172) PASS: lldb-unit :: ScriptInterpreter/Python/./ScriptInterpreterPythonTests/PythonDataObjectsTest.TestBorrowedReferences (1189 of 2172) PASS: lldb-api :: commands/expression/timeout/TestCallWithTimeout.py (1190 of 2172) PASS: lldb-api :: lang/objc/exceptions/TestObjCExceptions.py (1191 of 2172) UNSUPPORTED: lldb-api :: commands/watchpoints/multi_watchpoint_slots/TestWatchpointMultipleSlots.py (1192 of 2172) PASS: lldb-unit :: Utility/./UtilityTests/DataExtractorTest.GetMaxS64 (1193 of 2172) PASS: lldb-api :: commands/expression/import-std-module/list/TestListFromStdModule.py (1194 of 2172) PASS: lldb-shell :: SymbolFile/DWARF/static_scope.s (1195 of 2172) UNSUPPORTED: lldb-shell :: SymbolFile/DWARF/split-dwarf-expression-eval-bug.cpp (1196 of 2172) PASS: lldb-unit :: Symbol/./SymbolTests/LineEntryTest.GetSameLineContiguousAddressRangeNestedInline (1197 of 2172) PASS: lldb-api :: python_api/value/empty_class/TestValueAPIEmptyClass.py (1198 of 2172) PASS: lldb-unit :: SymbolFile/NativePDB/./SymbolFileNativePDBTests/PDBFPOProgramToDWARFExpressionTests.InvalidOpUnary (1199 of 2172) UNSUPPORTED: lldb-shell :: SymbolFile/DWARF/debug_ranges_and_rnglists.test (1200 of 2172) PASS: lldb-unit :: Process/gdb-remote/./ProcessGdbRemoteTests/GDBRemoteCommunicationClientTest.SendStopTracePacket (1201 of 2172) UNSUPPORTED: lldb-api :: commands/trace/TestTraceSchema.py (1202 of 2172) PASS: lldb-api :: lang/objc/objc-baseclass-sbtype/TestObjCBaseClassSBType.py (1203 of 2172) PASS: lldb-unit :: Utility/./UtilityTests/RangeTest.ContainsEndInclusiveInvalid (1204 of 2172) PASS: lldb-api :: python_api/default-constructor/TestDefaultConstructorForAPIObjects.py (1205 of 2172) PASS: lldb-api :: lang/mixed/TestMixedLanguages.py (1206 of 2172) PASS: lldb-api :: sanity/TestSettingSkipping.py (1207 of 2172) PASS: lldb-unit :: Utility/./UtilityTests/BinaryStreamTest.PutSLEB128One (1208 of 2172) PASS: lldb-unit :: Host/./HostTests/SocketTests/SocketTest.UDPGetConnectURI/ipv6 (1209 of 2172) PASS: lldb-api :: lang/cpp/unique-types/TestUniqueTypes.py (1210 of 2172) UNSUPPORTED: lldb-shell :: ScriptInterpreter/Lua/lua-python.test (1211 of 2172) PASS: lldb-unit :: Utility/./UtilityTests/StreamTest.AddressPrefixAndSuffix (1212 of 2172) PASS: lldb-api :: lang/c/bitfields/TestBitfields.py (1213 of 2172) UNSUPPORTED: lldb-shell :: SymbolFile/NativePDB/load-pdb.cpp (1214 of 2172) PASS: lldb-api :: lang/cpp/namespace/TestNamespace.py (1215 of 2172) PASS: lldb-unit :: Symbol/./SymbolTests/TestTypeSystemClang.TestGetTypeClassTypeOfExpr (1216 of 2172) PASS: lldb-unit :: Utility/./UtilityTests/ArgsTest.TestArgv (1217 of 2172) PASS: lldb-unit :: Symbol/./SymbolTests/TestClangASTImporter.RecordLayout (1218 of 2172) PASS: lldb-unit :: Utility/./UtilityTests/LogTest.LLDB_LOG_nullptr (1219 of 2172) PASS: lldb-shell :: SymbolFile/DWARF/DW_OP_piece-smaller-than-struct.s (1220 of 2172) PASS: lldb-unit :: Expression/./ExpressionTests/DiagnosticManagerTest.FixedExpression (1221 of 2172) UNSUPPORTED: lldb-shell :: SymbolFile/PDB/vbases.test (1222 of 2172) UNSUPPORTED: lldb-api :: functionalities/data-formatter/data-formatter-stl/libstdcpp/vbool/TestDataFormatterStdVBool.py (1223 of 2172) PASS: lldb-unit :: Utility/./UtilityTests/StringLexerTest.AdvanceIf (1224 of 2172) UNSUPPORTED: lldb-api :: commands/watchpoints/hello_watchpoint/TestMyFirstWatchpoint.py (1225 of 2172) PASS: lldb-api :: functionalities/object-file/TestImageListMultiArchitecture.py (1226 of 2172) PASS: lldb-api :: lang/cpp/operator-overload/TestOperatorOverload.py (1227 of 2172) PASS: lldb-shell :: Reproducer/TestDSYM.test (1228 of 2172) PASS: lldb-unit :: Symbol/./SymbolTests/TestClangASTImporter.CompleteFwdDeclWithOtherOrigin (1229 of 2172) PASS: lldb-unit :: ScriptInterpreter/Python/./ScriptInterpreterPythonTests/PythonDataObjectsTest.TestExceptions (1230 of 2172) PASS: lldb-unit :: Utility/./UtilityTests/StringListTest.PopBack (1231 of 2172) PASS: lldb-api :: commands/expression/completion-in-lambda-and-unnamed-class/TestCompletionInLambdaAndUnnamedClass.py (1232 of 2172) PASS: lldb-unit :: Utility/./UtilityTests/StringLexerTest.NextIf (1233 of 2172) PASS: lldb-api :: commands/expression/import-std-module/pair/TestPairFromStdModule.py (1234 of 2172) PASS: lldb-unit :: Utility/./UtilityTests/ArgsTest.StringListConstructor (1235 of 2172) PASS: lldb-shell :: SymbolFile/DWARF/debug_rnglists.s (1236 of 2172) PASS: lldb-unit :: Utility/./UtilityTests/StringExtractorTest.GetNameColonValueNoColon (1237 of 2172) PASS: lldb-api :: functionalities/breakpoint/inlined_breakpoints/TestInlinedBreakpoints.py (1238 of 2172) UNSUPPORTED: lldb-shell :: Register/x86-64-xmm16-write.test (1239 of 2172) PASS: lldb-unit :: UnwindAssembly/x86/./UnwindAssemblyx86Tests/Testx86AssemblyInspectionEngine.TestMovRSPtoRBP (1240 of 2172) PASS: lldb-api :: commands/expression/calculator_mode/TestCalculatorMode.py (1241 of 2172) PASS: lldb-api :: commands/frame/diagnose/bad-reference/TestBadReference.py (1242 of 2172) PASS: lldb-api :: lang/objc/ivar-IMP/TestObjCiVarIMP.py (1243 of 2172) PASS: lldb-api :: functionalities/data-formatter/vector-types/TestVectorTypesFormatting.py (1244 of 2172) PASS: lldb-unit :: Language/Highlighting/./HighlighterTests/HighlighterTest.Colons (1245 of 2172) PASS: lldb-unit :: Utility/./UtilityTests/SerializationRountripTest.SerializeDeserializeObjectPointer (1246 of 2172) UNSUPPORTED: lldb-shell :: Breakpoint/ppc64-localentry.test (1247 of 2172) PASS: lldb-unit :: UnwindAssembly/x86/./UnwindAssemblyx86Tests/Testx86AssemblyInspectionEngine.TestCALLNextInsn (1248 of 2172) PASS: lldb-unit :: Utility/./UtilityTests/StringExtractorTest.DecodeHexU8_Underflow (1249 of 2172) PASS: lldb-unit :: Language/CPlusPlus/./LanguageCPlusPlusTests/CPlusPlusLanguage.ExtractContextAndIdentifier (1250 of 2172) UNSUPPORTED: lldb-api :: commands/register/register/intel_xtended_registers/mpx_bound_violation/TestBoundViolation.py (1251 of 2172) PASS: lldb-api :: functionalities/breakpoint/comp_dir_symlink/TestCompDirSymLink.py (1252 of 2172) PASS: lldb-api :: commands/expression/call-function/TestCallStopAndContinue.py (1253 of 2172) PASS: lldb-api :: macosx/safe-to-func-call/TestSafeFuncCalls.py (1254 of 2172) PASS: lldb-api :: linux/builtin_trap/TestBuiltinTrap.py (1255 of 2172) PASS: lldb-unit :: Utility/./UtilityTests/StringExtractorTest.GetHexBytes (1256 of 2172) PASS: lldb-unit :: Utility/./UtilityTests/TimerTest.CategoryTimesNested (1257 of 2172) PASS: lldb-api :: commands/command/source/TestCommandSource.py (1258 of 2172) PASS: lldb-api :: commands/expression/xvalue/TestXValuePrinting.py (1259 of 2172) PASS: lldb-shell :: ObjectFile/ELF/PT_LOAD-overlap-PT_TLS.yaml (1260 of 2172) PASS: lldb-unit :: Interpreter/./InterpreterTests/CompletionTest.DirCompletionAbsolute (1261 of 2172) PASS: lldb-shell :: SymbolFile/DWARF/debug_loc.s (1262 of 2172) PASS: lldb-api :: functionalities/lazy-loading/TestLazyLoading.py (1263 of 2172) PASS: lldb-unit :: SymbolFile/DWARF/./SymbolFileDWARFTests/DWARFASTParserClangTests.EnsureAllDIEsInDeclContextHaveBeenParsedParsesOnlyMatchingEntries (1264 of 2172) UNSUPPORTED: lldb-shell :: SymbolFile/DWARF/dir-separator-no-comp-dir.s (1265 of 2172) PASS: lldb-unit :: Utility/./UtilityTests/FileSpecTest.CopyByAppendingPathComponent (1266 of 2172) PASS: lldb-api :: functionalities/thread/step_until/TestStepUntil.py (1267 of 2172) PASS: lldb-unit :: SymbolFile/NativePDB/./SymbolFileNativePDBTests/PDBFPOProgramToDWARFExpressionTests.UnresolvedRegisterAssignmentReference (1268 of 2172) PASS: lldb-api :: python_api/hello_world/TestHelloWorld.py (1269 of 2172) PASS: lldb-api :: api/log/TestAPILog.py (1270 of 2172) PASS: lldb-shell :: ScriptInterpreter/Python/command_relative_import.test (1271 of 2172) PASS: lldb-unit :: Utility/./UtilityTests/BinaryStreamTest.PutULEB128NineBytes (1272 of 2172) PASS: lldb-unit :: Process/gdb-remote/./ProcessGdbRemoteTests/GDBRemoteClientBaseTest.SendContinueAndInterrupt2PacketBug (1273 of 2172) PASS: lldb-unit :: Utility/./UtilityTests/BinaryStreamTest.PutSLEB128MaxValue (1274 of 2172) PASS: lldb-api :: python_api/sbstructureddata/TestStructuredDataAPI.py (1275 of 2172) UNSUPPORTED: lldb-shell :: SymbolFile/NativePDB/source-list.cpp (1276 of 2172) PASS: lldb-api :: commands/expression/import-std-module/forward_list/TestForwardListFromStdModule.py (1277 of 2172) PASS: lldb-unit :: Utility/./UtilityTests/OptionsWithRawTest.SingleWhitespaceInput (1278 of 2172) PASS: lldb-shell :: Reproducer/TestVersionCheck.test (1279 of 2172) PASS: lldb-api :: lang/objc/modules-compile-error/TestModulesCompileError.py (1280 of 2172) PASS: lldb-unit :: Utility/./UtilityTests/StringExtractorTest.DecodeHexU8_InvalidHex (1281 of 2172) PASS: lldb-api :: lang/cpp/subst_template_type_param/TestSubstTemplateTypeParam.py (1282 of 2172) PASS: lldb-api :: functionalities/abbreviation/TestCommonShortSpellings.py (1283 of 2172) PASS: lldb-api :: macosx/add-dsym/TestAddDsymMidExecutionCommand.py (1284 of 2172) UNSUPPORTED: lldb-api :: functionalities/tsan/thread_leak/TestTsanThreadLeak.py (1285 of 2172) PASS: lldb-unit :: Utility/./UtilityTests/FileSpecTest.GuessPathStyle (1286 of 2172) PASS: lldb-unit :: Symbol/./SymbolTests/DWARFCallFrameInfoTest.Basic_eh (1287 of 2172) PASS: lldb-unit :: UnwindAssembly/x86/./UnwindAssemblyx86Tests/Testx86AssemblyInspectionEngine.TestSpArithx86_64Augmented (1288 of 2172) PASS: lldb-api :: functionalities/data-formatter/data-formatter-objc/TestDataFormatterObjCExpr.py (1289 of 2172) PASS: lldb-shell :: Driver/TestProcessAttach.test (1290 of 2172) PASS: lldb-unit :: Utility/./UtilityTests/FileSpecTest.EqualSeparator (1291 of 2172) PASS: lldb-unit :: Utility/./UtilityTests/StringListTest.InsertStringAtIndexOutOfBounds (1292 of 2172) PASS: lldb-unit :: Utility/./UtilityTests/StringListTest.Clear (1293 of 2172) PASS: lldb-unit :: ScriptInterpreter/Python/./ScriptInterpreterPythonTests/PythonDataObjectsTest.TestPythonTupleValues (1294 of 2172) PASS: lldb-api :: python_api/module_section/TestModuleAndSection.py (1295 of 2172) UNSUPPORTED: lldb-api :: tools/lldb-server/TestGdbRemoteCompletion.py (1296 of 2172) PASS: lldb-unit :: Platform/./LLDBPlatformTests/PlatformDarwinTest.TestParseVersionBuildDir (1297 of 2172) PASS: lldb-api :: lang/cpp/template/TestTemplateArgs.py (1298 of 2172) PASS: lldb-api :: functionalities/gdb_remote_client/TestRestartBug.py (1299 of 2172) PASS: lldb-unit :: Expression/./ExpressionTests/CppModuleConfigurationTest.MissingLibCpp (1300 of 2172) PASS: lldb-api :: functionalities/testid/TestTestId.py (1301 of 2172) PASS: lldb-unit :: UnwindAssembly/x86/./UnwindAssemblyx86Tests/Testx86AssemblyInspectionEngine.TestPopRBPWithREX (1302 of 2172) PASS: lldb-api :: lang/c/step_over_no_deadlock/TestStepOverDoesntBlock.py (1303 of 2172) PASS: lldb-unit :: Utility/./UtilityTests/StringListTest.LongestCommonPrefixEmpty (1304 of 2172) PASS: lldb-unit :: Utility/./UtilityTests/LogChannelTest.List (1305 of 2172) PASS: lldb-unit :: Expression/./ExpressionTests/DiagnosticManagerTest.GetStringPreserveOrder (1306 of 2172) UNSUPPORTED: lldb-api :: functionalities/asan/TestMemoryHistory.py (1307 of 2172) PASS: lldb-unit :: Utility/./UtilityTests/RangeTest.LessThan (1308 of 2172) PASS: lldb-api :: commands/target/stop-hook/delete/TestTargetStopHookDelete.py (1309 of 2172) PASS: lldb-shell :: Driver/LocalLLDBInit.test (1310 of 2172) UNSUPPORTED: lldb-shell :: ScriptInterpreter/Lua/convenience_variables.test (1311 of 2172) PASS: lldb-unit :: Utility/./UtilityTests/StreamTeeTest.SetStreamAtIndexOutOfBounds (1312 of 2172) PASS: lldb-unit :: debugserver/./debugserverTests/JSON.Parse (1313 of 2172) UNSUPPORTED: lldb-api :: commands/watchpoints/watchpoint_commands/command/TestWatchpointCommandPython.py (1314 of 2172) UNSUPPORTED: lldb-api :: functionalities/thread/create_during_step/TestCreateDuringStep.py (1315 of 2172) UNSUPPORTED: lldb-shell :: Process/Windows/exception_access_violation.cpp (1316 of 2172) PASS: lldb-shell :: VSCode/TestOptions.test (1317 of 2172) PASS: lldb-unit :: Utility/./UtilityTests/ArchSpecTest.TestSetTriple (1318 of 2172) PASS: lldb-unit :: Utility/./UtilityTests/DataExtractorTest.GetFloatUnaligned (1319 of 2172) PASS: lldb-unit :: Utility/./UtilityTests/TimeoutTest.Format (1320 of 2172) PASS: lldb-unit :: Utility/./UtilityTests/StringExtractorTest.GetHexU8_Underflow2_NoEof (1321 of 2172) PASS: lldb-api :: functionalities/data-formatter/data-formatter-categories/TestDataFormatterCategories.py (1322 of 2172) PASS: lldb-api :: lang/objc/self/TestObjCSelf.py (1323 of 2172) PASS: lldb-unit :: Utility/./UtilityTests/StreamTest.PutCString (1324 of 2172) PASS: lldb-api :: commands/process/attach/TestProcessAttach.py (1325 of 2172) PASS: lldb-api :: lang/c/inlines/TestRedefinitionsInInlines.py (1326 of 2172) PASS: lldb-api :: commands/frame/diagnose/inheritance/TestDiagnoseInheritance.py (1327 of 2172) PASS: lldb-api :: lang/cpp/const_this/TestConstThis.py (1328 of 2172) PASS: lldb-api :: lang/cpp/exceptions/TestCPPExceptionBreakpoints.py (1329 of 2172) PASS: lldb-api :: lang/cpp/this_class_type_mixing/TestThisClassTypeMixing.py (1330 of 2172) PASS: lldb-unit :: Host/./HostTests/SocketTests/SocketTest.UDPConnect/ipv6 (1331 of 2172) PASS: lldb-api :: functionalities/thread_plan/TestThreadPlanCommands.py (1332 of 2172) UNSUPPORTED: lldb-api :: arm/breakpoint-thumb-codesection/TestBreakpointThumbCodesection.py (1333 of 2172) PASS: lldb-unit :: Thread/./ThreadTests/ThreadTest.SetStopInfo (1334 of 2172) PASS: lldb-shell :: ObjectFile/ELF/duplicate-section.yaml (1335 of 2172) PASS: lldb-unit :: Symbol/./SymbolTests/TestClangASTImporter.CopyDeclTagDecl (1336 of 2172) PASS: lldb-unit :: Target/./TargetTests/MemoryRegionInfoTest.Formatv (1337 of 2172) PASS: lldb-shell :: Driver/TestPositionalArgs.test (1338 of 2172) PASS: lldb-shell :: Settings/TestFrameFormatColor.test (1339 of 2172) PASS: lldb-unit :: Utility/./UtilityTests/UriParserTest.SchemeHostSeparator (1340 of 2172) PASS: lldb-api :: commands/expression/import-std-module/vector-of-vectors/TestVectorOfVectorsFromStdModule.py (1341 of 2172) PASS: lldb-unit :: UnwindAssembly/x86/./UnwindAssemblyx86Tests/Testx86AssemblyInspectionEngine.TestPopR15 (1342 of 2172) PASS: lldb-api :: commands/target/stop-hook/disable/TestTargetStopHookDisable.py (1343 of 2172) UNSUPPORTED: lldb-api :: python_api/watchpoint/watchlocation/TestSetWatchlocation.py (1344 of 2172) PASS: lldb-unit :: ObjectFile/Breakpad/./ObjectFileBreakpadTests/InfoRecord.parse (1345 of 2172) PASS: lldb-api :: lang/objc/objc-foundation-dictionary-empty/TestNSDictionary0.py (1346 of 2172) PASS: lldb-unit :: Utility/./UtilityTests/VMRange.Reset (1347 of 2172) PASS: lldb-api :: lang/cpp/std-function-step-into-callable/TestStdFunctionStepIntoCallable.py (1348 of 2172) PASS: lldb-shell :: SymbolFile/DWARF/split-dwarf-multiple-cu.ll (1349 of 2172) PASS: lldb-shell :: ExecControl/StopHook/stop-hook.test (1350 of 2172) PASS: lldb-api :: lang/cpp/elaborated-types/TestElaboratedTypes.py (1351 of 2172) UNSUPPORTED: lldb-shell :: ExecControl/StopHook/stop-hook-threads.test (1352 of 2172) PASS: lldb-unit :: Utility/./UtilityTests/StringListTest.GetMaxStringLengthMixed (1353 of 2172) PASS: lldb-shell :: Breakpoint/debug_addrx.test (1354 of 2172) PASS: lldb-unit :: ScriptInterpreter/Python/./ScriptInterpreterPythonTests/PythonDataObjectsTest.TestPythonTupleToStructuredList (1355 of 2172) PASS: lldb-unit :: UnwindAssembly/x86/./UnwindAssemblyx86Tests/Testx86AssemblyInspectionEngine.TestSpillRegToStackViaMOVx86_64 (1356 of 2172) PASS: lldb-unit :: UnwindAssembly/x86/./UnwindAssemblyx86Tests/Testx86AssemblyInspectionEngine.TestPopEBP (1357 of 2172) PASS: lldb-unit :: Utility/./UtilityTests/UriParserTest.TypicalPortPathIPv6 (1358 of 2172) PASS: lldb-unit :: UnwindAssembly/x86/./UnwindAssemblyx86Tests/Testx86AssemblyInspectionEngine.TestPushRBP (1359 of 2172) PASS: lldb-api :: commands/target/stop-hook/enable/TestTargetStopHookEnable.py (1360 of 2172) PASS: lldb-unit :: ScriptInterpreter/Python/./ScriptInterpreterPythonTests/PythonDataObjectsTest.TestTypeNameResolutionNoDot (1361 of 2172) PASS: lldb-shell :: Minidump/fb-dump.test (1362 of 2172) PASS: lldb-api :: macosx/universal/TestUniversal.py (1363 of 2172) PASS: lldb-unit :: Platform/./LLDBPlatformTests/PlatformDarwinTest.FindComponentInPath (1364 of 2172) PASS: lldb-api :: commands/expression/dollar-in-variable/TestDollarInVariable.py (1365 of 2172) PASS: lldb-api :: functionalities/data-formatter/data-formatter-smart-array/TestDataFormatterSmartArray.py (1366 of 2172) UNSUPPORTED: lldb-api :: benchmarks/stepping/TestSteppingSpeed.py (1367 of 2172) PASS: lldb-shell :: ObjectFile/wasm/basic.yaml (1368 of 2172) PASS: lldb-shell :: Process/TestAbortExitCode.test (1369 of 2172) UNSUPPORTED: lldb-shell :: SymbolFile/NativePDB/nested-types.cpp (1370 of 2172) UNSUPPORTED: lldb-shell :: Unwind/basic-block-sections.test (1371 of 2172) PASS: lldb-api :: lang/objc/foundation/TestObjCMethods.py (1372 of 2172) PASS: lldb-api :: lang/objc/objc-ivar-stripped/TestObjCIvarStripped.py (1373 of 2172) UNSUPPORTED: lldb-shell :: Unwind/eh-frame-augment-noop.test (1374 of 2172) PASS: lldb-unit :: Host/./HostTests/FileSystemTest.Resolve (1375 of 2172) PASS: lldb-api :: lang/cpp/this/TestCPPThis.py (1376 of 2172) PASS: lldb-api :: functionalities/data-formatter/data-formatter-script/TestDataFormatterScript.py (1377 of 2172) PASS: lldb-shell :: Driver/TestTarget.test (1378 of 2172) PASS: lldb-api :: lang/objc/modules-cache/TestClangModulesCache.py (1379 of 2172) PASS: lldb-unit :: Language/Highlighting/./HighlighterTests/HighlighterTest.ClangStringLiterals (1380 of 2172) PASS: lldb-api :: python_api/debugger/TestDebuggerAPI.py (1381 of 2172) PASS: lldb-unit :: Interpreter/./InterpreterTests/OptionArgParserTest.toBoolean (1382 of 2172) PASS: lldb-unit :: Process/minidump/./LLDBMinidumpTests/MinidumpParserTest.GetFilteredModuleList (1383 of 2172) PASS: lldb-unit :: UnwindAssembly/x86/./UnwindAssemblyx86Tests/Testx86AssemblyInspectionEngine.TestSubESP (1384 of 2172) PASS: lldb-api :: tools/lldb-vscode/attach/TestVSCode_attach.py (1385 of 2172) PASS: lldb-unit :: Platform/./LLDBPlatformTests/PlatformAppleSimulatorTest.TestSimHasSimEnvionament (1386 of 2172) PASS: lldb-unit :: UnwindAssembly/x86/./UnwindAssemblyx86Tests/Testx86AssemblyInspectionEngine.TestPopEBX (1387 of 2172) PASS: lldb-api :: api/multithreaded/TestMultithreaded.py (1388 of 2172) UNSUPPORTED: lldb-shell :: ObjectFile/PECOFF/export-dllfunc.yaml (1389 of 2172) UNSUPPORTED: lldb-shell :: SymbolFile/DWARF/find-method.cpp (1390 of 2172) PASS: lldb-shell :: SymbolFile/Breakpad/symtab.test (1391 of 2172) UNSUPPORTED: lldb-shell :: SymbolFile/dissassemble-entry-point.s (1392 of 2172) PASS: lldb-unit :: Utility/./UtilityTests/XcodeSDKTest.GetSDKTypeForTriple (1393 of 2172) PASS: lldb-unit :: Utility/./UtilityTests/RangeDataVector.CustomSort (1394 of 2172) PASS: lldb-unit :: Symbol/./SymbolTests/PostfixExpression.ParseOneExpression (1395 of 2172) PASS: lldb-unit :: Utility/./UtilityTests/AnsiTerminal.Incomplete (1396 of 2172) PASS: lldb-api :: lang/cpp/bitfields/TestCppBitfields.py (1397 of 2172) PASS: lldb-unit :: Host/./HostTests/SocketAddressTest.GetAddressInfo (1398 of 2172) PASS: lldb-unit :: Utility/./UtilityTests/FileSpecTest.Yaml (1399 of 2172) PASS: lldb-api :: lang/cpp/incomplete-types/TestCppIncompleteTypes.py (1400 of 2172) PASS: lldb-api :: python_api/sbdata/TestSBData.py (1401 of 2172) PASS: lldb-unit :: UnwindAssembly/x86/./UnwindAssemblyx86Tests/Testx86AssemblyInspectionEngine.TestPopR13 (1402 of 2172) PASS: lldb-api :: python_api/sbvalue_const_addrof/TestSBValueConstAddrOf.py (1403 of 2172) PASS: lldb-unit :: Utility/./UtilityTests/StringListTest.CopyList (1404 of 2172) PASS: lldb-api :: lang/cpp/wchar_t/TestCxxWCharT.py (1405 of 2172) PASS: lldb-shell :: Breakpoint/single-file-split-dwarf.test (1406 of 2172) PASS: lldb-unit :: Utility/./UtilityTests/Flags.Reset (1407 of 2172) PASS: lldb-unit :: Utility/./UtilityTests/AnsiTerminal.Unknown (1408 of 2172) PASS: lldb-shell :: Driver/TestFile.test (1409 of 2172) PASS: lldb-api :: tools/lldb-server/TestAppleSimulatorOSType.py (1410 of 2172) PASS: lldb-unit :: Language/Highlighting/./HighlighterTests/HighlighterTest.ClangCursorPosBeforeOtherToken (1411 of 2172) PASS: lldb-api :: commands/breakpoint/set/func-regex/TestBreakpointRegexError.py (1412 of 2172) PASS: lldb-api :: tools/lldb-server/TestGdbRemoteSingleStep.py (1413 of 2172) PASS: lldb-api :: functionalities/data-formatter/data-formatter-objc/TestDataFormatterObjCNSURL.py (1414 of 2172) PASS: lldb-unit :: Process/gdb-remote/./ProcessGdbRemoteTests/GDBRemoteCommunicationServerTest.SendErrorResponse_ErrorNumber (1415 of 2172) PASS: lldb-api :: lang/objc/modules-non-objc-target/TestObjCModulesNonObjCTarget.py (1416 of 2172) PASS: lldb-api :: commands/expression/import-std-module/unique_ptr-dbg-info-content/TestUniquePtrDbgInfoContent.py (1417 of 2172) PASS: lldb-api :: commands/expression/top-level/TestTopLevelExprs.py (1418 of 2172) PASS: lldb-unit :: Host/./HostTests/NativeProcessProtocolTest.SetBreakpointFailRead (1419 of 2172) PASS: lldb-api :: types/TestRecursiveTypes.py (1420 of 2172) PASS: lldb-api :: lang/objc/orderedset/TestOrderedSet.py (1421 of 2172) PASS: lldb-api :: functionalities/data-formatter/var-in-aggregate-misuse/TestVarInAggregateMisuse.py (1422 of 2172) PASS: lldb-unit :: Utility/./UtilityTests/UserIDResolver.GetGroupName (1423 of 2172) UNSUPPORTED: lldb-api :: commands/watchpoints/watchpoint_events/TestWatchpointEvents.py (1424 of 2172) PASS: lldb-shell :: SymbolFile/DWARF/module-ownership.mm (1425 of 2172) UNSUPPORTED: lldb-api :: tools/lldb-server/TestGdbRemoteModuleInfo.py (1426 of 2172) PASS: lldb-unit :: SymbolFile/DWARF/./SymbolFileDWARFTests/SymbolFileDWARFTests.TestAbilitiesForDWARF (1427 of 2172) PASS: lldb-unit :: Utility/./UtilityTests/StreamTest.PutCharNull (1428 of 2172) UNSUPPORTED: lldb-shell :: SymbolFile/PDB/calling-conventions.test (1429 of 2172) PASS: lldb-api :: functionalities/data-formatter/nsdictionarysynth/TestNSDictionarySynthetic.py (1430 of 2172) PASS: lldb-shell :: ObjectFile/Breakpad/discontiguous-sections.test (1431 of 2172) PASS: lldb-api :: lang/c/step-target/TestStepTarget.py (1432 of 2172) PASS: lldb-api :: tools/lldb-server/TestGdbRemoteRegisterState.py (1433 of 2172) PASS: lldb-api :: functionalities/breakpoint/breakpoint_by_line_and_column/TestBreakpointByLineAndColumn.py (1434 of 2172) PASS: lldb-api :: commands/expression/invalid-args/TestInvalidArgsExpression.py (1435 of 2172) UNSUPPORTED: lldb-api :: lang/cpp/breakpoint_in_member_func_w_non_primitive_params/TestBreakpointInMemberFuncWNonPrimitiveParams.py (1436 of 2172) PASS: lldb-shell :: ObjectFile/ELF/netbsd-exec-8.99.30-amd64.yaml (1437 of 2172) PASS: lldb-unit :: Utility/./UtilityTests/ScalarTest.SetValueFromCString (1438 of 2172) UNSUPPORTED: lldb-shell :: Register/x86-gp-read.test (1439 of 2172) UNSUPPORTED: lldb-shell :: Unwind/eh-frame-small-fde.test (1440 of 2172) PASS: lldb-unit :: Utility/./UtilityTests/ScalarTest.GetBytes (1441 of 2172) UNSUPPORTED: lldb-api :: commands/expression/import_builtin_fileid/TestImportBuiltinFileID.py (1442 of 2172) PASS: lldb-api :: functionalities/data-formatter/stringprinter/TestStringPrinter.py (1443 of 2172) PASS: lldb-shell :: Register/x86-64-ymm-read.test (1444 of 2172) PASS: lldb-api :: functionalities/data-formatter/type_summary_list_arg/TestTypeSummaryListArg.py (1445 of 2172) PASS: lldb-api :: commands/platform/process/list/TestProcessList.py (1446 of 2172) PASS: lldb-unit :: Utility/./UtilityTests/CompletionRequest.DuplicateFilteringWithComments (1447 of 2172) PASS: lldb-unit :: Utility/./UtilityTests/StringExtractorTest.GetHexBytesAvail_FullString (1448 of 2172) PASS: lldb-api :: functionalities/breakpoint/breakpoint_command/TestBreakpointCommandsFromPython.py (1449 of 2172) PASS: lldb-api :: tools/lldb-server/inferior-crash/TestGdbRemoteSegFault.py (1450 of 2172) UNSUPPORTED: lldb-api :: benchmarks/libcxxmap/TestBenchmarkLibcxxMap.py (1451 of 2172) PASS: lldb-shell :: SymbolFile/DWARF/gnu-style-compression.cpp (1452 of 2172) PASS: lldb-api :: functionalities/data-formatter/ostypeformatting/TestFormattersOsType.py (1453 of 2172) UNSUPPORTED: lldb-api :: python_api/watchpoint/TestSetWatchpoint.py (1454 of 2172) PASS: lldb-api :: lang/objc/objc++/TestObjCXX.py (1455 of 2172) PASS: lldb-unit :: Language/CPlusPlus/./LanguageCPlusPlusTests/CPlusPlusLanguage.MethodNameParsing (1456 of 2172) UNSUPPORTED: lldb-api :: functionalities/thread/multi_break/TestMultipleBreakpoints.py (1457 of 2172) PASS: lldb-api :: functionalities/data-formatter/data-formatter-stl/libcxx/multimap/TestDataFormatterLibccMultiMap.py (1458 of 2172) PASS: lldb-api :: commands/gui/breakpoints/TestGuiBreakpoints.py (1459 of 2172) PASS: lldb-api :: functionalities/gdb_remote_client/TestGDBRemoteLoad.py (1460 of 2172) PASS: lldb-unit :: Host/./HostTests/SocketTests/SocketTest.DecodeHostAndPort/ipv4 (1461 of 2172) UNSUPPORTED: lldb-api :: tools/lldb-vscode/disconnect/TestVSCode_disconnect.py (1462 of 2172) UNSUPPORTED: lldb-api :: commands/expression/macros/TestMacros.py (1463 of 2172) PASS: lldb-api :: lang/cpp/typedef/TestCppTypedef.py (1464 of 2172) UNSUPPORTED: lldb-api :: lang/cpp/printf/TestPrintf.py (1465 of 2172) PASS: lldb-shell :: Breakpoint/implicit_const_form_support.test (1466 of 2172) PASS: lldb-api :: lang/cpp/namespace/TestNamespaceLookup.py (1467 of 2172) PASS: lldb-api :: functionalities/thread/ignore_suspended/TestIgnoreSuspendedThread.py (1468 of 2172) PASS: lldb-unit :: Utility/./UtilityTests/StructuredDataTest.StringDump (1469 of 2172) PASS: lldb-api :: functionalities/load_unload/TestLoadUnload.py (1470 of 2172) PASS: lldb-api :: lang/objc/radar-9691614/TestObjCMethodReturningBOOL.py (1471 of 2172) PASS: lldb-shell :: Reproducer/TestMultipleTargets.test (1472 of 2172) UNSUPPORTED: lldb-api :: benchmarks/expression/TestRepeatedExprs.py (1473 of 2172) PASS: lldb-api :: commands/expression/context-object/TestContextObject.py (1474 of 2172) PASS: lldb-api :: commands/frame/diagnose/dereference-function-return/TestDiagnoseDereferenceFunctionReturn.py (1475 of 2172) PASS: lldb-shell :: SymbolFile/DWARF/dwarf5-debug_line.s (1476 of 2172) PASS: lldb-api :: functionalities/return-value/TestReturnValue.py (1477 of 2172) PASS: lldb-shell :: Reproducer/Functionalities/TestImageList.test (1478 of 2172) PASS: lldb-api :: commands/register/register/register_command/TestRegisters.py (1479 of 2172) PASS: lldb-shell :: Process/TestEnvironment.test (1480 of 2172) PASS: lldb-api :: functionalities/non-overlapping-index-variable-i/TestIndexVariable.py (1481 of 2172) UNSUPPORTED: lldb-api :: functionalities/darwin_log/filter/exact_match/category/TestDarwinLogFilterMatchCategory.py (1482 of 2172) PASS: lldb-shell :: ObjectFile/Breakpad/sections.test (1483 of 2172) PASS: lldb-api :: macosx/dyld-trie-symbols/TestDyldTrieSymbols.py (1484 of 2172) PASS: lldb-shell :: ObjectFile/MachO/lc_build_version_notools.yaml (1485 of 2172) PASS: lldb-unit :: ObjectFile/ELF/./ObjectFileELFTests/ObjectFileELFTest.GetSymtab_NoSymEntryPointArmAddressClass (1486 of 2172) PASS: lldb-api :: lang/cpp/global_variables/TestCPPGlobalVariables.py (1487 of 2172) PASS: lldb-shell :: Driver/TestError.test (1488 of 2172) PASS: lldb-unit :: Host/./HostTests/SocketTests/SocketTest.TCPGetConnectURI/ipv4 (1489 of 2172) PASS: lldb-api :: commands/quit/TestQuit.py (1490 of 2172) PASS: lldb-unit :: Target/./TargetTests/PathMappingListTest.AbsoluteTests (1491 of 2172) PASS: lldb-shell :: Quit/TestQuitExitCodeImplicit0.test (1492 of 2172) PASS: lldb-shell :: ObjectFile/Breakpad/uuid-matching-mac.test (1493 of 2172) PASS: lldb-unit :: SymbolFile/DWARF/./SymbolFileDWARFTests/SymbolFileDWARFTests.TestAbbrevInvalidNULLTag (1494 of 2172) PASS: lldb-shell :: Reproducer/TestRelativePath.test (1495 of 2172) PASS: lldb-api :: commands/gui/invalid-args/TestInvalidArgsGui.py (1496 of 2172) PASS: lldb-shell :: Reproducer/TestFinalize.test (1497 of 2172) UNSUPPORTED: lldb-api :: functionalities/thread/concurrent_events/TestConcurrentSignalWatchBreak.py (1498 of 2172) PASS: lldb-shell :: Breakpoint/jitbp_elf.test (1499 of 2172) PASS: lldb-api :: macosx/macCatalyst/TestMacCatalyst.py (1500 of 2172) PASS: lldb-unit :: Expression/./ExpressionTests/CppModuleConfigurationTest.UnknownLibCppFile (1501 of 2172) PASS: lldb-unit :: Utility/./UtilityTests/Flags.IsClear (1502 of 2172) PASS: lldb-unit :: SymbolFile/NativePDB/./SymbolFileNativePDBTests/PDBFPOProgramToDWARFExpressionTests.UnresolvedDependentCyclicRegisterAssignmentReference (1503 of 2172) PASS: lldb-api :: sample_test/TestSampleTest.py (1504 of 2172) UNSUPPORTED: lldb-api :: functionalities/ubsan/basic/TestUbsanBasic.py (1505 of 2172) PASS: lldb-api :: lang/objc/forward-decl/TestForwardDecl.py (1506 of 2172) UNSUPPORTED: lldb-shell :: SymbolFile/NativePDB/locate-pdb.cpp (1507 of 2172) PASS: lldb-api :: lang/c/unicode/TestUnicodeSymbols.py (1508 of 2172) PASS: lldb-unit :: Host/./HostTests/FileActionTest.Open (1509 of 2172) PASS: lldb-shell :: Reproducer/TestReuseDirectory.test (1510 of 2172) UNSUPPORTED: lldb-shell :: SymbolFile/NativePDB/local-variables.cpp (1511 of 2172) PASS: lldb-unit :: Utility/./UtilityTests/DataExtractorTest.GetBitfield (1512 of 2172) PASS: lldb-api :: functionalities/unwind/noreturn/TestNoreturnUnwind.py (1513 of 2172) PASS: lldb-api :: lang/cpp/namespace_definitions/TestNamespaceDefinitions.py (1514 of 2172) PASS: lldb-api :: macosx/lc-note/firmware-corefile/TestFirmwareCorefiles.py (1515 of 2172) PASS: lldb-api :: python_api/section/TestSectionAPI.py (1516 of 2172) PASS: lldb-unit :: Utility/./UtilityTests/FileSpecTest.PrependPathComponent (1517 of 2172) PASS: lldb-api :: terminal/TestSTTYBeforeAndAfter.py (1518 of 2172) PASS: lldb-unit :: Utility/./UtilityTests/RangeTest.NotEqual (1519 of 2172) UNSUPPORTED: lldb-api :: commands/watchpoints/watchpoint_commands/condition/TestWatchpointConditionCmd.py (1520 of 2172) PASS: lldb-shell :: ObjectFile/ELF/section-addresses.yaml (1521 of 2172) PASS: lldb-api :: lang/c/const_variables/TestConstVariables.py (1522 of 2172) PASS: lldb-shell :: SymbolFile/Breakpad/line-table-edgecases.test (1523 of 2172) UNSUPPORTED: lldb-shell :: SymbolFile/PDB/compilands.test (1524 of 2172) PASS: lldb-api :: lang/cpp/static_methods/TestCPPStaticMethods.py (1525 of 2172) PASS: lldb-api :: macosx/function-starts/TestFunctionStarts.py (1526 of 2172) PASS: lldb-api :: commands/help/TestHelp.py (1527 of 2172) PASS: lldb-api :: functionalities/thread/concurrent_events/TestConcurrentDelayedCrashWithBreakpointSignal.py (1528 of 2172) PASS: lldb-api :: functionalities/data-formatter/data-formatter-objc/TestDataFormatterObjCNSDate.py (1529 of 2172) PASS: lldb-shell :: Breakpoint/split-dwarf5-debug-stroffsets.test (1530 of 2172) PASS: lldb-unit :: Expression/./ExpressionTests/DiagnosticManagerTest.AddDiagnostic (1531 of 2172) PASS: lldb-api :: functionalities/thread/create_after_attach/TestCreateAfterAttach.py (1532 of 2172) PASS: lldb-unit :: Utility/./UtilityTests/RangeTest.DoesIntersect (1533 of 2172) PASS: lldb-unit :: ScriptInterpreter/Python/./ScriptInterpreterPythonTests/PythonDataObjectsTest.TestRun (1534 of 2172) UNSUPPORTED: lldb-api :: functionalities/thread/concurrent_events/TestConcurrentSignalNWatchNBreak.py (1535 of 2172) PASS: lldb-shell :: Settings/TestDisableColor.test (1536 of 2172) UNSUPPORTED: lldb-shell :: SymbolFile/DWARF/dwp-separate-debug-file.cpp (1537 of 2172) PASS: lldb-api :: functionalities/thread/concurrent_events/TestConcurrentDelaySignalBreak.py (1538 of 2172) PASS: lldb-api :: lang/objc/rdar-10967107/TestRdar10967107.py (1539 of 2172) PASS: lldb-unit :: Utility/./UtilityTests/StringListTest.SplitIntoLinesEmpty (1540 of 2172) PASS: lldb-api :: macosx/thread-names/TestInterruptThreadNames.py (1541 of 2172) PASS: lldb-unit :: Expression/./ExpressionTests/CppModuleConfigurationTest.AmbiguousCLib (1542 of 2172) PASS: lldb-api :: functionalities/data-formatter/data-formatter-proper-plurals/TestFormattersOneIsSingular.py (1543 of 2172) PASS: lldb-unit :: Utility/./UtilityTests/OptionsWithRawTest.WhitespaceInput (1544 of 2172) PASS: lldb-api :: lang/cpp/alignas_base_class/TestAlignAsBaseClass.py (1545 of 2172) PASS: lldb-api :: commands/expression/save_jit_objects/TestSaveJITObjects.py (1546 of 2172) UNSUPPORTED: lldb-api :: functionalities/darwin_log/source/debug/TestDarwinLogSourceDebug.py (1547 of 2172) PASS: lldb-api :: lang/objc/direct-dispatch-step/TestObjCDirectDispatchStepping.py (1548 of 2172) PASS: lldb-unit :: Host/./HostTests/SocketTests/SocketTest.TCPGetConnectURI/ipv6 (1549 of 2172) PASS: lldb-unit :: tools/lldb-server/tests/./LLDBServerTests/TestBase.LaunchModePreservesEnvironment (1550 of 2172) PASS: lldb-api :: macosx/load-kext/TestLoadKext.py (1551 of 2172) PASS: lldb-unit :: Utility/./UtilityTests/StreamTeeTest.SetStreamAtIndexOverwrite (1552 of 2172) UNSUPPORTED: lldb-shell :: Register/x86-ymm-read.test (1553 of 2172) PASS: lldb-unit :: Utility/./UtilityTests/StringLexerTest.HasAtLeast (1554 of 2172) PASS: lldb-unit :: Utility/./UtilityTests/TildeExpressionResolver.ResolveFullPath (1555 of 2172) UNSUPPORTED: lldb-api :: functionalities/tail_call_frames/inlining_and_tail_calls/TestInliningAndTailCalls.py (1556 of 2172) PASS: lldb-unit :: Host/./HostTests/SocketTests/SocketTest.TCPListen0ConnectAccept/ipv4 (1557 of 2172) PASS: lldb-unit :: Process/minidump/./LLDBMinidumpTests/MinidumpParserTest.GetExceptionStream (1558 of 2172) PASS: lldb-unit :: UnwindAssembly/x86/./UnwindAssemblyx86Tests/Testx86AssemblyInspectionEngine.TestPushRBX (1559 of 2172) PASS: lldb-api :: commands/expression/inline-namespace/TestInlineNamespace.py (1560 of 2172) PASS: lldb-api :: functionalities/stats_api/TestStatisticsAPI.py (1561 of 2172) PASS: lldb-unit :: Utility/./UtilityTests/ArgsTest.ReplaceArgumentAtIndexEqual (1562 of 2172) PASS: lldb-api :: functionalities/plugins/python_os_plugin/stepping_plugin_threads/TestOSPluginStepping.py (1563 of 2172) PASS: lldb-api :: functionalities/breakpoint/global_constructor/TestBreakpointInGlobalConstructor.py (1564 of 2172) UNSUPPORTED: lldb-api :: benchmarks/frame_variable/TestFrameVariableResponse.py (1565 of 2172) PASS: lldb-unit :: Utility/./UtilityTests/Flags.AllSet (1566 of 2172) PASS: lldb-unit :: Process/gdb-remote/./ProcessGdbRemoteTests/GDBRemoteCommunicationServerTest.SendErrorResponse_StringError (1567 of 2172) PASS: lldb-api :: macosx/version_zero/TestGetVersionZeroVersion.py (1568 of 2172) PASS: lldb-unit :: ScriptInterpreter/Python/./ScriptInterpreterPythonTests/PythonDataObjectsTest.TestPythonBoolean (1569 of 2172) PASS: lldb-unit :: ScriptInterpreter/Python/./ScriptInterpreterPythonTests/PythonDataObjectsTest.TestPythonFile (1570 of 2172) PASS: lldb-shell :: Settings/TestStopCommandSourceOnError.test (1571 of 2172) PASS: lldb-shell :: Reproducer/Functionalities/TestExpressionEvaluation.test (1572 of 2172) PASS: lldb-unit :: Utility/./UtilityTests/BinaryStreamTest.PutSLEB128SixBytes (1573 of 2172) PASS: lldb-api :: commands/frame/recognizer/TestFrameRecognizer.py (1574 of 2172) UNSUPPORTED: lldb-api :: functionalities/thread/concurrent_events/TestConcurrentTwoBreakpointsOneWatchpoint.py (1575 of 2172) PASS: lldb-unit :: Utility/./UtilityTests/UriParserTest.BracketedHostnameWithColon (1576 of 2172) PASS: lldb-unit :: Utility/./UtilityTests/StringListTest.AppendListCStringArrayEmpty (1577 of 2172) PASS: lldb-unit :: Utility/./UtilityTests/ConstStringTest.format_provider (1578 of 2172) PASS: lldb-api :: tools/lldb-server/TestGdbRemote_vCont.py (1579 of 2172) PASS: lldb-unit :: ScriptInterpreter/Python/./ScriptInterpreterPythonTests/PythonDataObjectsTest.TestDictionaryResolutionWithDot (1580 of 2172) PASS: lldb-unit :: Utility/./UtilityTests/ArgsTest.AppendArguments (1581 of 2172) PASS: lldb-unit :: Utility/./UtilityTests/StringExtractorTest.DecodeHexU8_Extra (1582 of 2172) PASS: lldb-api :: lang/objc/foundation/TestRuntimeTypes.py (1583 of 2172) UNSUPPORTED: lldb-shell :: Register/aarch64-gp-read.test (1584 of 2172) PASS: lldb-unit :: Platform/./LLDBPlatformTests/PlatformAppleSimulatorTest.TestHostPlatformToSim (1585 of 2172) PASS: lldb-unit :: Utility/./UtilityTests/BinaryStreamTest.PutULEB128FiveBytes (1586 of 2172) PASS: lldb-unit :: debugserver/./debugserverTests/RNBSocket.AnyListen (1587 of 2172) PASS: lldb-api :: commands/source/info/TestSourceInfo.py (1588 of 2172) PASS: lldb-unit :: Utility/./UtilityTests/LogChannelEnabledTest.LogVerboseThread (1589 of 2172) PASS: lldb-unit :: Expression/./ExpressionTests/CppModuleConfigurationTest.Linux (1590 of 2172) PASS: lldb-api :: lang/cpp/breakpoint-commands/TestCPPBreakpointCommands.py (1591 of 2172) PASS: lldb-api :: lang/objcxx/cxx-bridged-po/TestObjCXXBridgedPO.py (1592 of 2172) PASS: lldb-unit :: Utility/./UtilityTests/VMRange.Clear (1593 of 2172) PASS: lldb-unit :: Utility/./UtilityTests/StringListTest.ShiftCString (1594 of 2172) PASS: lldb-unit :: Utility/./UtilityTests/SharedCluster.ClusterManager (1595 of 2172) PASS: lldb-shell :: ScriptInterpreter/Python/python.test (1596 of 2172) PASS: lldb-api :: functionalities/data-formatter/builtin-formats/TestBuiltinFormats.py (1597 of 2172) PASS: lldb-unit :: Utility/./UtilityTests/ArgsTest.TestInsertArg (1598 of 2172) UNSUPPORTED: lldb-shell :: SymbolFile/PDB/class-layout.test (1599 of 2172) UNSUPPORTED: lldb-shell :: Register/x86-64-ymm16-read.test (1600 of 2172) PASS: lldb-unit :: Utility/./UtilityTests/StringExtractorTest.GetHexU8_InvalidHex_NoEof (1601 of 2172) PASS: lldb-unit :: ScriptInterpreter/Python/./ScriptInterpreterPythonTests/PythonDataObjectsTest.TestPythonStringToStr (1602 of 2172) PASS: lldb-api :: macosx/duplicate-archive-members/TestDuplicateMembers.py (1603 of 2172) UNSUPPORTED: lldb-shell :: SymbolFile/DWARF/debug-names-compressed.cpp (1604 of 2172) PASS: lldb-unit :: Process/minidump/./LLDBMinidumpTests/MinidumpParserTest.GetThreadContext_x86_32 (1605 of 2172) UNSUPPORTED: lldb-api :: commands/watchpoints/watchpoint_on_vectors/TestValueOfVectorVariable.py (1606 of 2172) PASS: lldb-api :: commands/expression/import-std-module/empty-module/TestEmptyStdModule.py (1607 of 2172) PASS: lldb-unit :: Utility/./UtilityTests/ScalarTest.Comparison (1608 of 2172) PASS: lldb-unit :: Host/./HostTests/NativeProcessProtocolTest.ReadMemoryWithoutTrap (1609 of 2172) PASS: lldb-unit :: SymbolFile/DWARF/./SymbolFileDWARFTests/SymbolFileDWARFTests.ParseArangesNonzeroSegmentSize (1610 of 2172) PASS: lldb-api :: commands/expression/import-std-module/deque-dbg-info-content/TestDbgInfoContentDequeFromStdModule.py (1611 of 2172) PASS: lldb-api :: lang/cpp/type_lookup/TestCppTypeLookup.py (1612 of 2172) PASS: lldb-unit :: ObjectFile/Breakpad/./ObjectFileBreakpadTests/StackCFIRecord.parse (1613 of 2172) PASS: lldb-unit :: Utility/./UtilityTests/VMRange.CollectionContains (1614 of 2172) PASS: lldb-api :: types/TestCharType.py (1615 of 2172) UNSUPPORTED: lldb-shell :: Register/x86-64-gp-write.test (1616 of 2172) PASS: lldb-api :: tools/lldb-server/register-reading/TestGdbRemoteGPacket.py (1617 of 2172) PASS: lldb-unit :: Process/minidump/./LLDBMinidumpTests/MinidumpParserTest.GetLinuxProcStatus (1618 of 2172) PASS: lldb-api :: driver/batch_mode/TestBatchMode.py (1619 of 2172) PASS: lldb-api :: commands/frame/diagnose/array/TestArray.py (1620 of 2172) PASS: lldb-api :: lang/objc/foundation/TestObjectDescriptionAPI.py (1621 of 2172) UNSUPPORTED: lldb-api :: functionalities/darwin_log/filter/exact_match/message/TestDarwinLogFilterMatchMessage.py (1622 of 2172) PASS: lldb-unit :: Process/gdb-remote/./ProcessGdbRemoteTests/GDBRemoteCommunicationTest.ReadPacket_checksum (1623 of 2172) PASS: lldb-unit :: Target/./TargetTests/MCBasedABI.MapRegisterName (1624 of 2172) UNSUPPORTED: lldb-api :: functionalities/tail_call_frames/thread_step_out_message/TestArtificialFrameStepOutMessage.py (1625 of 2172) PASS: lldb-unit :: Utility/./UtilityTests/VMRange.Ordering (1626 of 2172) PASS: lldb-unit :: Process/gdb-remote/./ProcessGdbRemoteTests/GDBRemoteCommunicationClientTest.GetQOffsets (1627 of 2172) PASS: lldb-api :: commands/expression/multiline-completion/TestMultilineCompletion.py (1628 of 2172) PASS: lldb-api :: functionalities/thread/concurrent_events/TestConcurrentBreakpointDelayBreakpointOneSignal.py (1629 of 2172) PASS: lldb-api :: types/TestShortTypeExpr.py (1630 of 2172) PASS: lldb-shell :: SymbolFile/DWARF/find-qualified-variable.cpp (1631 of 2172) PASS: lldb-unit :: ScriptInterpreter/Python/./ScriptInterpreterPythonTests/PythonDataObjectsTest.TestPythonDictionaryManipulation (1632 of 2172) PASS: lldb-shell :: Reproducer/TestDebugSymbols.test (1633 of 2172) UNSUPPORTED: lldb-api :: functionalities/asan/TestReportData.py (1634 of 2172) PASS: lldb-api :: commands/expression/import-std-module/vector/TestVectorFromStdModule.py (1635 of 2172) PASS: lldb-unit :: Symbol/./SymbolTests/TestTypeSystemClang.TestDeletingImplicitCopyCstrDueToMoveCStr (1636 of 2172) UNSUPPORTED: lldb-shell :: BuildScript/toolchain-clang-cl.test (1637 of 2172) UNSUPPORTED: lldb-api :: functionalities/thread/concurrent_events/TestConcurrentWatchpointDelayWatchpointOneBreakpoint.py (1638 of 2172) PASS: lldb-api :: commands/command/script/import/rdar-12586188/TestRdar12586188.py (1639 of 2172) PASS: lldb-api :: iohandler/autosuggestion/TestAutosuggestion.py (1640 of 2172) PASS: lldb-unit :: Utility/./UtilityTests/ConstStringTest.CompareConstString (1641 of 2172) UNSUPPORTED: lldb-shell :: SymbolFile/PDB/function-level-linking.test (1642 of 2172) PASS: lldb-unit :: Utility/./UtilityTests/RangeTest.Slide (1643 of 2172) PASS: lldb-unit :: DataFormatter/./LLDBFormatterTests/StringPrinterTests.SwiftUTF8 (1644 of 2172) PASS: lldb-shell :: Reproducer/TestFileRepro.test (1645 of 2172) UNSUPPORTED: lldb-api :: functionalities/tail_call_frames/ambiguous_tail_call_seq2/TestAmbiguousTailCallSeq2.py (1646 of 2172) PASS: lldb-unit :: Host/./HostTests/HostInfoTest.GetAugmentedArchSpec (1647 of 2172) PASS: lldb-api :: commands/session/save/TestSessionSave.py (1648 of 2172) PASS: lldb-shell :: SymbolFile/DWARF/DW_AT_location-DW_AT_const_value.s (1649 of 2172) PASS: lldb-api :: functionalities/type_lookup/TestTypeLookup.py (1650 of 2172) PASS: lldb-unit :: Host/./HostTests/FileSystemTest.Exists (1651 of 2172) PASS: lldb-unit :: Utility/./UtilityTests/StreamTeeTest.DefaultConstructor (1652 of 2172) PASS: lldb-api :: commands/expression/import-std-module/forward_list-dbg-info-content/TestDbgInfoContentForwardListFromStdModule.py (1653 of 2172) PASS: lldb-api :: tools/lldb-vscode/launch/TestVSCode_launch.py (1654 of 2172) PASS: lldb-unit :: Utility/./UtilityTests/StringListTest.AppendListCStringArray (1655 of 2172) PASS: lldb-unit :: Process/gdb-remote/./ProcessGdbRemoteTests/GDBRemoteClientBaseTest.SendContinueAndInterrupt (1656 of 2172) PASS: lldb-api :: lang/objc/modules/TestObjCModules.py (1657 of 2172) PASS: lldb-unit :: Utility/./UtilityTests/StreamTeeTest.GetStreamAtIndexOutOfBounds (1658 of 2172) PASS: lldb-shell :: SymbolFile/DWARF/debug_ranges-missing-section.s (1659 of 2172) PASS: lldb-api :: commands/expression/function_template_specialization_temp_args/TestFunctionTemplateSpecializationTempArgs.py (1660 of 2172) UNSUPPORTED: lldb-shell :: SymbolFile/NativePDB/stack_unwinding01.cpp (1661 of 2172) PASS: lldb-unit :: SymbolFile/NativePDB/./SymbolFileNativePDBTests/PDBFPOProgramToDWARFExpressionTests.MultipleIndependentAssignments (1662 of 2172) PASS: lldb-unit :: Utility/./UtilityTests/StreamTest.PutChar (1663 of 2172) PASS: lldb-api :: lang/cpp/frame-var-anon-unions/TestFrameVariableAnonymousUnions.py (1664 of 2172) PASS: lldb-api :: functionalities/plugins/python_os_plugin/TestPythonOSPlugin.py (1665 of 2172) PASS: lldb-unit :: Interpreter/./InterpreterTests/OptionValueFileColonLine.setFromString (1666 of 2172) PASS: lldb-api :: tools/lldb-server/TestGdbRemoteExpeditedRegisters.py (1667 of 2172) PASS: lldb-shell :: BuildScript/modes.test (1668 of 2172) PASS: lldb-shell :: Settings/TestSettingsWrite.test (1669 of 2172) PASS: lldb-unit :: Utility/./UtilityTests/ProcessInstanceInfoList.Yaml (1670 of 2172) PASS: lldb-unit :: Utility/./UtilityTests/StringListTest.ForRangeEmpty (1671 of 2172) PASS: lldb-unit :: Utility/./UtilityTests/UriParserTest.BracketedHostnameWithPortIPv6 (1672 of 2172) PASS: lldb-unit :: Utility/./UtilityTests/StreamTest.PutCStringWithStringRef (1673 of 2172) PASS: lldb-unit :: Utility/./UtilityTests/RangeTest.SetRangeBase (1674 of 2172) PASS: lldb-shell :: Minidump/breakpad-symbols.test (1675 of 2172) UNSUPPORTED: lldb-api :: functionalities/thread/concurrent_events/TestConcurrentTwoWatchpointThreads.py (1676 of 2172) PASS: lldb-shell :: SymbolFile/DWARF/debug_ranges.s (1677 of 2172) PASS: lldb-api :: lang/cpp/namespace_conflicts/TestNamespaceConflicts.py (1678 of 2172) PASS: lldb-shell :: Commands/CommandScriptImmediateOutput/CommandScriptImmediateOutputConsole.test (1679 of 2172) PASS: lldb-shell :: Quit/TestQuitExitCodeHexA.test (1680 of 2172) PASS: lldb-unit :: Utility/./UtilityTests/BinaryStreamTest.PutULEB128One (1681 of 2172) PASS: lldb-api :: commands/expression/diagnostics/TestExprDiagnostics.py (1682 of 2172) PASS: lldb-api :: functionalities/data-formatter/data-formatter-stl/libcxx/unordered/TestDataFormatterUnordered.py (1683 of 2172) PASS: lldb-api :: functionalities/data-formatter/data-formatter-stl/libcxx/list/loop/TestDataFormatterLibcxxListLoop.py (1684 of 2172) PASS: lldb-unit :: Utility/./UtilityTests/StringExtractorTest.GetNameColonValueSuccess (1685 of 2172) PASS: lldb-unit :: Utility/./UtilityTests/ScalarTest.CastOperations (1686 of 2172) PASS: lldb-api :: functionalities/multiword-commands/TestMultiWordCommands.py (1687 of 2172) PASS: lldb-api :: functionalities/data-formatter/data-formatter-stl/libcxx/vector/TestDataFormatterLibcxxVector.py (1688 of 2172) PASS: lldb-api :: functionalities/data-formatter/data-formatter-cpp/TestDataFormatterCpp.py (1689 of 2172) PASS: lldb-unit :: Utility/./UtilityTests/LogChannelEnabledTest.log_options (1690 of 2172) PASS: lldb-unit :: Host/./HostTests/NativeProcessProtocolTest.ReadCStringFromMemory_CrossPageBoundary (1691 of 2172) PASS: lldb-unit :: Utility/./UtilityTests/ScalarTest.Scalar_512 (1692 of 2172) PASS: lldb-api :: api/command-return-object/TestSBCommandReturnObject.py (1693 of 2172) PASS: lldb-unit :: ObjectFile/Breakpad/./ObjectFileBreakpadTests/ModuleRecord.parse (1694 of 2172) PASS: lldb-api :: functionalities/step-avoids-no-debug/TestStepNoDebug.py (1695 of 2172) PASS: lldb-unit :: Utility/./UtilityTests/StreamTeeTest.CopyConstructor (1696 of 2172) PASS: lldb-api :: lang/cpp/diamond/TestDiamond.py (1697 of 2172) PASS: lldb-unit :: Utility/./UtilityTests/ArgsTest.DoubleQuotedItem (1698 of 2172) UNSUPPORTED: lldb-shell :: ScriptInterpreter/Lua/breakpoint_callback.test (1699 of 2172) UNSUPPORTED: lldb-shell :: Watchpoint/netbsd-nouserdbregs.test (1700 of 2172) PASS: lldb-api :: functionalities/data-formatter/data-formatter-objc/TestDataFormatterObjCPlain.py (1701 of 2172) PASS: lldb-unit :: Utility/./UtilityTests/LogChannelEnabledTest.LLDB_LOG_ERROR (1702 of 2172) PASS: lldb-unit :: Utility/./UtilityTests/RegularExpression.CopyAssignment (1703 of 2172) UNSUPPORTED: lldb-shell :: SymbolFile/DWARF/inline-function-address-shared.test (1704 of 2172) PASS: lldb-api :: functionalities/data-formatter/data-formatter-objc/TestDataFormatterObjCNSData.py (1705 of 2172) PASS: lldb-unit :: Process/gdb-remote/./ProcessGdbRemoteTests/GDBRemoteCommunicationClientTest.GetMemoryRegionInfoInvalidResponse (1706 of 2172) PASS: lldb-unit :: Utility/./UtilityTests/StreamTeeTest.GetStreamAtIndexOutOfBoundsEmpty (1707 of 2172) UNSUPPORTED: lldb-shell :: Register/x86-zmm-read.test (1708 of 2172) PASS: lldb-api :: functionalities/inferior-crashing/recursive-inferior/TestRecursiveInferior.py (1709 of 2172) PASS: lldb-api :: python_api/exprpath_synthetic/TestExprPathSynthetic.py (1710 of 2172) UNSUPPORTED: lldb-shell :: SymbolFile/DWARF/find-inline-method.s (1711 of 2172) PASS: lldb-shell :: ObjectFile/ELF/short-build-id.yaml (1712 of 2172) PASS: lldb-api :: commands/expression/context-object-objc/TestContextObjectObjc.py (1713 of 2172) PASS: lldb-unit :: Symbol/./SymbolTests/DWARFCallFrameInfoTest.Basic_dwarf3 (1714 of 2172) PASS: lldb-api :: commands/frame/diagnose/virtual-method-call/TestDiagnoseDereferenceVirtualMethodCall.py (1715 of 2172) PASS: lldb-unit :: Signals/./SignalsTests/UnixSignalsTest.GetFilteredSignals (1716 of 2172) UNSUPPORTED: lldb-shell :: ObjectFile/ELF/minidebuginfo-set-and-hit-breakpoint.test (1717 of 2172) PASS: lldb-shell :: ObjectFile/wasm/embedded-debug-sections.yaml (1718 of 2172) PASS: lldb-unit :: Utility/./UtilityTests/RangeDataVector.FindEntryThatContains (1719 of 2172) PASS: lldb-unit :: Process/minidump/./LLDBMinidumpTests/MinidumpParserTest.GetMemoryRegionInfoFromMemory64List (1720 of 2172) PASS: lldb-shell :: SymbolFile/DWARF/debug-types-line-tables.s (1721 of 2172) PASS: lldb-unit :: Utility/./UtilityTests/BinaryStreamTest.PutULEB128FourBytes (1722 of 2172) PASS: lldb-unit :: Utility/./UtilityTests/StringExtractorTest.GetU32LittleEndian (1723 of 2172) PASS: lldb-api :: lang/cpp/char8_t/TestCxxChar8_t.py (1724 of 2172) PASS: lldb-shell :: Reproducer/TestDriverOptions.test (1725 of 2172) PASS: lldb-unit :: Process/minidump/./LLDBMinidumpTests/MinidumpParserTest.GetMiscInfo_no_stream (1726 of 2172) PASS: lldb-unit :: Utility/./UtilityTests/FileSpecTest.EqualDotsPosix (1727 of 2172) PASS: lldb-api :: functionalities/recursion/TestValueObjectRecursion.py (1728 of 2172) PASS: lldb-shell :: Unwind/thread-step-out-ret-addr-check.test (1729 of 2172) UNSUPPORTED: lldb-shell :: SymbolFile/DWARF/inline-function-address.ll (1730 of 2172) PASS: lldb-api :: python_api/target/TestTargetAPI.py (1731 of 2172) PASS: lldb-api :: commands/expression/po_verbosity/TestPoVerbosity.py (1732 of 2172) UNSUPPORTED: lldb-shell :: SymbolFile/DWARF/dir-separator-windows.s (1733 of 2172) PASS: lldb-shell :: ObjectFile/ELF/build-id-case.yaml (1734 of 2172) PASS: lldb-api :: commands/frame/var/TestFrameVar.py (1735 of 2172) PASS: lldb-unit :: UnwindAssembly/x86/./UnwindAssemblyx86Tests/Testx86AssemblyInspectionEngine.TestSpillRegToStackViaMOVi386 (1736 of 2172) PASS: lldb-unit :: Utility/./UtilityTests/VMRange.IsValid (1737 of 2172) PASS: lldb-unit :: Utility/./UtilityTests/StringExtractorTest.GetHexU8_Extra_NoEof (1738 of 2172) PASS: lldb-unit :: Utility/./UtilityTests/Flags.AnySet (1739 of 2172) PASS: lldb-unit :: Utility/./UtilityTests/Flags.AnyClear (1740 of 2172) PASS: lldb-unit :: Symbol/./SymbolTests/TestTypeSystemClang.TestIsClangType (1741 of 2172) PASS: lldb-shell :: ScriptInterpreter/Python/sb_address_exception.test (1742 of 2172) PASS: lldb-unit :: Symbol/./SymbolTests/Type.GetTypeScopeAndBasename (1743 of 2172) PASS: lldb-api :: python_api/frame/get-variables/TestGetVariables.py (1744 of 2172) PASS: lldb-unit :: Utility/./UtilityTests/TimerTest.CategoryTimes2 (1745 of 2172) PASS: lldb-api :: lang/cpp/symbols/TestSymbols.py (1746 of 2172) PASS: lldb-unit :: Symbol/./SymbolTests/TestTypeSystemClang.TemplateArguments (1747 of 2172) PASS: lldb-unit :: UnwindAssembly/x86/./UnwindAssemblyx86Tests/Testx86AssemblyInspectionEngine.TestPushImm (1748 of 2172) PASS: lldb-api :: lang/cpp/global_operators/TestCppGlobalOperators.py (1749 of 2172) PASS: lldb-shell :: ObjectFile/MachO/lc_build_version.yaml (1750 of 2172) PASS: lldb-unit :: Utility/./UtilityTests/StringExtractorTest.GetHexU8_Underflow (1751 of 2172) PASS: lldb-api :: functionalities/wrong_commands/TestWrongCommands.py (1752 of 2172) PASS: lldb-api :: functionalities/data-formatter/format-propagation/TestFormatPropagation.py (1753 of 2172) PASS: lldb-api :: commands/platform/basic/TestPlatformCommand.py (1754 of 2172) PASS: lldb-api :: python_api/value_var_update/TestValueVarUpdate.py (1755 of 2172) PASS: lldb-api :: functionalities/breakpoint/breakpoint_command/TestBreakpointCommand.py (1756 of 2172) PASS: lldb-api :: functionalities/thread/exit_during_step/TestExitDuringStep.py (1757 of 2172) PASS: lldb-shell :: Reproducer/TestGDBRemoteRepro.test (1758 of 2172) PASS: lldb-api :: lang/objc/modules-auto-import/TestModulesAutoImport.py (1759 of 2172) PASS: lldb-shell :: Driver/TestUseColor.test (1760 of 2172) PASS: lldb-unit :: Utility/./UtilityTests/StringListTest.InsertStringAtIndexMove (1761 of 2172) PASS: lldb-shell :: SymbolFile/DWARF/apple-index-is-used.cpp (1762 of 2172) PASS: lldb-api :: lang/c/set_values/TestSetValues.py (1763 of 2172) UNSUPPORTED: lldb-shell :: ScriptInterpreter/Lua/persistent_state.test (1764 of 2172) PASS: lldb-unit :: Utility/./UtilityTests/StreamTest.PutNHex8 (1765 of 2172) PASS: lldb-api :: functionalities/data-formatter/data-formatter-objc/TestDataFormatterObjCNSContainer.py (1766 of 2172) UNSUPPORTED: lldb-shell :: ScriptInterpreter/Lua/command_script_import.test (1767 of 2172) PASS: lldb-api :: lang/cpp/virtual-overload/TestVirtualOverload.py (1768 of 2172) PASS: lldb-unit :: Utility/./UtilityTests/OptionsWithRawTest.EmptySuffixSingleWhitespace (1769 of 2172) UNSUPPORTED: lldb-api :: functionalities/tail_call_frames/cross_dso/TestCrossDSOTailCalls.py (1770 of 2172) PASS: lldb-unit :: Expression/./ExpressionTests/CppModuleConfigurationTest.IgnoreLibStdCpp (1771 of 2172) UNSUPPORTED: lldb-api :: functionalities/darwin_log/filter/regex/activity-chain/TestDarwinLogFilterRegexActivityChain.py (1772 of 2172) PASS: lldb-api :: macosx/find-dsym/deep-bundle/TestDeepBundle.py (1773 of 2172) PASS: lldb-unit :: UnwindAssembly/x86/./UnwindAssemblyx86Tests/Testx86AssemblyInspectionEngine.TestAddESP (1774 of 2172) PASS: lldb-unit :: Utility/./UtilityTests/StreamTest.PutMaxHex64ByteOrderLittle (1775 of 2172) PASS: lldb-api :: python_api/thread/TestThreadAPI.py (1776 of 2172) PASS: lldb-unit :: DataFormatter/./LLDBFormatterTests/TypeMatcherTests.GetMatchStringExactName (1777 of 2172) UNSUPPORTED: lldb-shell :: SymbolFile/NativePDB/function-types-calling-conv.cpp (1778 of 2172) PASS: lldb-unit :: Utility/./UtilityTests/DataExtractorTest.GetULEB128_bit63 (1779 of 2172) PASS: lldb-unit :: Symbol/./SymbolTests/TestTypeSystemClang.TestUnifyAccessSpecifiers (1780 of 2172) PASS: lldb-api :: functionalities/gdb_remote_client/TestWriteMemory.py (1781 of 2172) PASS: lldb-api :: tools/lldb-server/TestGdbRemote_qThreadStopInfo.py (1782 of 2172) PASS: lldb-api :: functionalities/type_completion/TestTypeCompletion.py (1783 of 2172) PASS: lldb-unit :: Target/./TargetTests/ExecutionContextTest.GetByteOrderProcess (1784 of 2172) UNSUPPORTED: lldb-api :: lang/cpp/static_members/TestCPPStaticMembers.py (1785 of 2172) PASS: lldb-unit :: Process/minidump/./LLDBMinidumpTests/MinidumpParserTest.GetMemoryRegionInfoFromMemoryList (1786 of 2172) PASS: lldb-unit :: Utility/./UtilityTests/DataExtractorTest.UncommonAddressSize (1787 of 2172) PASS: lldb-unit :: Process/minidump/./LLDBMinidumpTests/MinidumpParserTest.MinidumpDuplicateModuleMappedSecond (1788 of 2172) PASS: lldb-api :: lang/objc/global_ptrs/TestGlobalObjects.py (1789 of 2172) UNSUPPORTED: lldb-shell :: SymbolFile/NativePDB/tag-types.cpp (1790 of 2172) UNSUPPORTED: lldb-api :: functionalities/tail_call_frames/disambiguate_tail_call_seq/TestDisambiguateTailCallSeq.py (1791 of 2172) PASS: lldb-unit :: Signals/./SignalsTests/UnixSignalsTest.GetInfo (1792 of 2172) PASS: lldb-api :: commands/expression/ir-interpreter-phi-nodes/TestIRInterpreterPHINodes.py (1793 of 2172) PASS: lldb-shell :: Settings/TestFrameFormatMangling.test (1794 of 2172) PASS: lldb-api :: functionalities/data-formatter/data-formatter-objc/TestDataFormatterObjCNSBundle.py (1795 of 2172) PASS: lldb-unit :: Expression/./ExpressionTests/DWARFExpression.DW_OP_implicit_value (1796 of 2172) PASS: lldb-api :: iohandler/resize/TestIOHandlerResize.py (1797 of 2172) PASS: lldb-unit :: Utility/./UtilityTests/OptionsWithRawTest.EmptyInput (1798 of 2172) PASS: lldb-unit :: Utility/./UtilityTests/BinaryStreamTest.PutSLEB128FiveBytes (1799 of 2172) PASS: lldb-api :: functionalities/gdb_remote_client/TestThreadSelectionBug.py (1800 of 2172) PASS: lldb-unit :: Utility/./UtilityTests/UriParserTest.MinimalPath (1801 of 2172) UNSUPPORTED: lldb-api :: functionalities/thread/concurrent_events/TestConcurrentSignalWatch.py (1802 of 2172) PASS: lldb-shell :: SymbolFile/DWARF/anon_class_w_and_wo_export_symbols.ll (1803 of 2172) PASS: lldb-api :: commands/expression/persist_objc_pointeetype/TestPersistObjCPointeeType.py (1804 of 2172) PASS: lldb-unit :: Utility/./UtilityTests/BinaryStreamTest.PutULEB128EightBytes (1805 of 2172) PASS: lldb-api :: commands/frame/diagnose/dereference-argument/TestDiagnoseDereferenceArgument.py (1806 of 2172) PASS: lldb-shell :: Register/x86-fp-read.test (1807 of 2172) PASS: lldb-api :: functionalities/data-formatter/data-formatter-ptr-to-array/TestPtrToArrayFormatting.py (1808 of 2172) PASS: lldb-api :: lang/objc/objc-optimized/TestObjcOptimized.py (1809 of 2172) PASS: lldb-unit :: SymbolFile/DWARF/./SymbolFileDWARFTests/SymbolFileDWARFTests.TestAbbrevOrder1Start1 (1810 of 2172) PASS: lldb-api :: commands/expression/cast_int_to_anonymous_enum/TestCastIntToAnonymousEnum.py (1811 of 2172) PASS: lldb-unit :: Host/./HostTests/MainLoopTest.TerminatesImmediately (1812 of 2172) PASS: lldb-api :: functionalities/gdb_remote_client/TestGDBRemoteDiskFileCompletion.py (1813 of 2172) PASS: lldb-unit :: Process/minidump/./LLDBMinidumpTests/RegisterContextMinidump.ConvertMinidumpContext_x86_32 (1814 of 2172) PASS: lldb-api :: commands/expression/import-std-module/weak_ptr-dbg-info-content/TestDbgInfoContentWeakPtrFromStdModule.py (1815 of 2172) PASS: lldb-unit :: Host/./HostTests/SocketTests/SocketTest.TCPListen0ConnectAccept/ipv6 (1816 of 2172) PASS: lldb-api :: lang/c/conflicting-symbol/TestConflictingSymbol.py (1817 of 2172) PASS: lldb-unit :: Host/./HostTests/MainLoopTest.DetectsEOF (1818 of 2172) PASS: lldb-unit :: Utility/./UtilityTests/CompletionRequest.TryCompleteCurrentArgGood (1819 of 2172) PASS: lldb-unit :: SymbolFile/NativePDB/./SymbolFileNativePDBTests/PDBFPOProgramToDWARFExpressionTests.DependencyChain (1820 of 2172) PASS: lldb-unit :: Utility/./UtilityTests/RangeTest.SlideZero (1821 of 2172) PASS: lldb-unit :: ScriptInterpreter/Python/./ScriptInterpreterPythonTests/PythonDataObjectsTest.TestPythonListToStructuredList (1822 of 2172) PASS: lldb-unit :: DataFormatter/./LLDBFormatterTests/FormatManagerTests.CompatibleLangs (1823 of 2172) UNSUPPORTED: lldb-api :: tools/intel-features/intel-pt/test/TestIntelPTSimpleBinary.py (1824 of 2172) PASS: lldb-api :: types/TestLongTypes.py (1825 of 2172) PASS: lldb-api :: python_api/breakpoint/TestBreakpointAPI.py (1826 of 2172) PASS: lldb-unit :: Utility/./UtilityTests/StringExtractorTest.GetHexBytes_OddPair2 (1827 of 2172) PASS: lldb-unit :: Expression/./ExpressionTests/DWARFExpression.DW_OP_convert (1828 of 2172) PASS: lldb-api :: functionalities/data-formatter/data-formatter-skip-summary/TestDataFormatterSkipSummary.py (1829 of 2172) UNSUPPORTED: lldb-shell :: SymbolFile/DWARF/find-basic-function.cpp (1830 of 2172) PASS: lldb-unit :: Utility/./UtilityTests/RegularExpression.Valid (1831 of 2172) PASS: lldb-unit :: Language/Highlighting/./HighlighterTests/HighlighterTest.ClangCursorPosInOtherToken (1832 of 2172) UNSUPPORTED: lldb-shell :: SymbolFile/PDB/enums-layout.test (1833 of 2172) UNSUPPORTED: lldb-shell :: SymbolFile/DWARF/find-type-in-function.cpp (1834 of 2172) UNSUPPORTED: lldb-api :: python_api/disassemble-raw-data/TestDisassemble_VST1_64.py (1835 of 2172) PASS: lldb-api :: lang/objc/print-obj/TestPrintObj.py (1836 of 2172) PASS: lldb-api :: functionalities/gdb_remote_client/TestRecognizeBreakpoint.py (1837 of 2172) UNSUPPORTED: lldb-shell :: SymbolFile/DWARF/find-variable-file.cpp (1838 of 2172) PASS: lldb-api :: iohandler/resize/TestIOHandlerResizeNoEditline.py (1839 of 2172) PASS: lldb-unit :: Utility/./UtilityTests/ListenerTest.GetEventImmediate (1840 of 2172) UNSUPPORTED: lldb-api :: functionalities/thread/concurrent_events/TestConcurrentBreakpointsDelayedBreakpointOneWatchpoint.py (1841 of 2172) PASS: lldb-unit :: Utility/./UtilityTests/Flags.Clear (1842 of 2172) PASS: lldb-api :: commands/expression/import-std-module/sysroot/TestStdModuleSysroot.py (1843 of 2172) PASS: lldb-api :: tools/lldb-server/TestGdbRemoteThreadsInStopReply.py (1844 of 2172) PASS: lldb-unit :: Utility/./UtilityTests/SubsystemRAIITest.SubsystemWithErrorSuccess (1845 of 2172) UNSUPPORTED: lldb-api :: functionalities/data-formatter/data-formatter-stl/libstdcpp/list/TestDataFormatterStdList.py (1846 of 2172) UNSUPPORTED: lldb-api :: functionalities/tail_call_frames/sbapi_support/TestTailCallFrameSBAPI.py (1847 of 2172) PASS: lldb-api :: commands/expression/rdar44436068/Test128BitsInteger.py (1848 of 2172) PASS: lldb-unit :: Host/./HostTests/SocketTests/SocketTest.UDPConnect/ipv4 (1849 of 2172) PASS: lldb-api :: functionalities/mtc/simple/TestMTCSimple.py (1850 of 2172) PASS: lldb-api :: tools/lldb-server/TestGdbRemoteExitCode.py (1851 of 2172) UNSUPPORTED: lldb-api :: commands/trace/TestTraceLoad.py (1852 of 2172) PASS: lldb-api :: functionalities/signal/handle-abrt/TestHandleAbort.py (1853 of 2172) PASS: lldb-unit :: Utility/./UtilityTests/StringListTest.CopyListEmpty (1854 of 2172) PASS: lldb-api :: lang/objc/foundation/TestObjCMethodsString.py (1855 of 2172) PASS: lldb-api :: commands/settings/TestSettings.py (1856 of 2172) PASS: lldb-unit :: SymbolFile/NativePDB/./SymbolFileNativePDBTests/PDBFPOProgramToDWARFExpressionTests.InvalidOpBinary (1857 of 2172) UNSUPPORTED: lldb-api :: functionalities/tail_call_frames/ambiguous_tail_call_seq1/TestAmbiguousTailCallSeq1.py (1858 of 2172) PASS: lldb-shell :: Driver/TestHelp.test (1859 of 2172) PASS: lldb-api :: functionalities/thread/state_after_expression/TestStateAfterExpression.py (1860 of 2172) PASS: lldb-api :: commands/expression/ignore-artificial-constructors/TestIgnoreArtificialConstructors.py (1861 of 2172) PASS: lldb-unit :: ScriptInterpreter/Python/./ScriptInterpreterPythonTests/PythonDataObjectsTest.TestPythonIntegerToStr (1862 of 2172) PASS: lldb-shell :: Process/UnsupportedLanguage.test (1863 of 2172) PASS: lldb-api :: lang/c/stepping/TestThreadStepping.py (1864 of 2172) PASS: lldb-api :: types/TestFloatTypes.py (1865 of 2172) PASS: lldb-unit :: Utility/./UtilityTests/RangeTest.NotEqualInvalid (1866 of 2172) PASS: lldb-unit :: Utility/./UtilityTests/RegularExpression.Empty (1867 of 2172) PASS: lldb-shell :: ObjectFile/ELF/minidebuginfo-find-symbols.yaml (1868 of 2172) UNSUPPORTED: lldb-api :: benchmarks/expression/TestExpressionCmd.py (1869 of 2172) PASS: lldb-unit :: Utility/./UtilityTests/StreamTest.ShiftOperatorPtr (1870 of 2172) PASS: lldb-unit :: Utility/./UtilityTests/StreamTest.ChangingByteOrder (1871 of 2172) PASS: lldb-unit :: Utility/./UtilityTests/SerializationRountripTest.SerializeDeserializeCStringArrayNullptrElem (1872 of 2172) UNSUPPORTED: lldb-api :: functionalities/breakpoint/hardware_breakpoints/hardware_breakpoint_on_multiple_threads/TestHWBreakMultiThread.py (1873 of 2172) PASS: lldb-api :: functionalities/data-formatter/data-formatter-objc/nsstring/TestDataFormatterNSString.py (1874 of 2172) PASS: lldb-api :: tools/lldb-server/commandline/TestStubReverseConnect.py (1875 of 2172) PASS: lldb-shell :: Commands/command-backtrace.test (1876 of 2172) PASS: lldb-shell :: Register/x86-64-read.test (1877 of 2172) PASS: lldb-shell :: SymbolFile/Breakpad/line-table.test (1878 of 2172) PASS: lldb-api :: functionalities/data-formatter/data-formatter-stl/libcxx/map/TestDataFormatterLibccMap.py (1879 of 2172) PASS: lldb-api :: python_api/function_symbol/TestDisasmAPI.py (1880 of 2172) PASS: lldb-unit :: Process/minidump/./LLDBMinidumpTests/MinidumpParserTest.InvalidMinidump (1881 of 2172) PASS: lldb-unit :: DataFormatter/./LLDBFormatterTests/TypeMatcherTests.GetMatchStringRegex (1882 of 2172) PASS: lldb-api :: functionalities/data-formatter/data-formatter-objc/nsindexpath/TestDataFormatterNSIndexPath.py (1883 of 2172) PASS: lldb-api :: commands/expression/static-initializers/TestStaticInitializers.py (1884 of 2172) PASS: lldb-unit :: UnwindAssembly/x86/./UnwindAssemblyx86Tests/Testx86AssemblyInspectionEngine.TestPush0 (1885 of 2172) PASS: lldb-api :: python_api/findvalue_duplist/TestSBFrameFindValue.py (1886 of 2172) PASS: lldb-api :: functionalities/postmortem/minidump/TestMiniDump.py (1887 of 2172) PASS: lldb-api :: functionalities/thread/concurrent_events/TestConcurrentManyBreakpoints.py (1888 of 2172) PASS: lldb-unit :: Utility/./UtilityTests/StreamTest.PutBytesAsRawHex8ToBigEndian (1889 of 2172) PASS: lldb-unit :: Language/Highlighting/./HighlighterTests/HighlighterTest.ClangSquareBrackets (1890 of 2172) PASS: lldb-unit :: Interpreter/./InterpreterTests/OptionArgParserTest.toChar (1891 of 2172) PASS: lldb-unit :: Host/./HostTests/ConnectionFileDescriptorTest.TCPGetURIv6 (1892 of 2172) PASS: lldb-api :: commands/expression/radar_9531204/TestPrintfAfterUp.py (1893 of 2172) PASS: lldb-unit :: Process/gdb-remote/./ProcessGdbRemoteTests/GDBRemoteClientBaseTest.SendContinueAndLateInterrupt (1894 of 2172) UNSUPPORTED: lldb-api :: functionalities/thread/concurrent_events/TestConcurrentDelayWatchBreak.py (1895 of 2172) PASS: lldb-unit :: Utility/./UtilityTests/VMRange.Comparison (1896 of 2172) UNSUPPORTED: lldb-api :: functionalities/breakpoint/hardware_breakpoints/write_memory_with_hw_breakpoint/TestWriteMemoryWithHWBreakpoint.py (1897 of 2172) PASS: lldb-api :: commands/expression/char/TestExprsChar.py (1898 of 2172) PASS: lldb-unit :: UnwindAssembly/x86/./UnwindAssemblyx86Tests/Testx86AssemblyInspectionEngine.TestDisassemblyJunkBytes (1899 of 2172) PASS: lldb-api :: functionalities/inferior-crashing/recursive-inferior/TestRecursiveInferiorStep.py (1900 of 2172) PASS: lldb-unit :: Language/Highlighting/./HighlighterTests/HighlighterTest.ClangCursorPosAfterOtherToken (1901 of 2172) PASS: lldb-api :: commands/settings/quoting/TestQuoting.py (1902 of 2172) UNSUPPORTED: lldb-api :: functionalities/thread/concurrent_events/TestConcurrentManySignals.py (1903 of 2172) PASS: lldb-unit :: Utility/./UtilityTests/ProcessInstanceInfo.Dump (1904 of 2172) PASS: lldb-shell :: SymbolFile/DWARF/dwarf5-atomic.s (1905 of 2172) PASS: lldb-api :: functionalities/data-formatter/data-formatter-objc/TestDataFormatterObjCKVO.py (1906 of 2172) PASS: lldb-shell :: SymbolFile/DWARF/DW_AT_const_value.s (1907 of 2172) PASS: lldb-api :: commands/target/stop-hooks/TestStopHooks.py (1908 of 2172) UNSUPPORTED: lldb-api :: lang/objc/objc-dynamic-value/TestObjCDynamicValue.py (1909 of 2172) PASS: lldb-unit :: Utility/./UtilityTests/StringListTest.GetMaxStringLengthEqualSize (1910 of 2172) PASS: lldb-api :: functionalities/breakpoint/breakpoint_ignore_count/TestBreakpointIgnoreCount.py (1911 of 2172) PASS: lldb-unit :: Utility/./UtilityTests/UriParserTest.Minimal (1912 of 2172) PASS: lldb-api :: lang/cpp/dynamic-value/TestDynamicValue.py (1913 of 2172) PASS: lldb-unit :: Utility/./UtilityTests/LogChannelTest.Disable (1914 of 2172) PASS: lldb-api :: functionalities/thread/num_threads/TestNumThreads.py (1915 of 2172) PASS: lldb-unit :: ScriptInterpreter/Python/./ScriptInterpreterPythonTests/PythonDataObjectsTest.TestPythonCallableCheck (1916 of 2172) PASS: lldb-unit :: Utility/./UtilityTests/StringListTest.JoinMultiCharSeparator (1917 of 2172) PASS: lldb-unit :: Utility/./UtilityTests/FileSpecTest.Match (1918 of 2172) UNSUPPORTED: lldb-shell :: SymbolFile/NativePDB/global-classes.cpp (1919 of 2172) PASS: lldb-unit :: Process/gdb-remote/./ProcessGdbRemoteTests/GDBRemoteClientBaseTest.InterruptNoResponse (1920 of 2172) PASS: lldb-api :: python_api/frame/inlines/TestInlinedFrame.py (1921 of 2172) PASS: lldb-api :: lang/objc/objc-struct-argument/TestObjCStructArgument.py (1922 of 2172) PASS: lldb-shell :: SymbolFile/DWARF/split-dwarf-inlining.cpp (1923 of 2172) PASS: lldb-api :: functionalities/thread/thread_exit/TestThreadExit.py (1924 of 2172) PASS: lldb-api :: functionalities/signal/raise/TestRaise.py (1925 of 2172) PASS: lldb-api :: functionalities/data-formatter/pyobjsynthprovider/TestPyObjSynthProvider.py (1926 of 2172) PASS: lldb-unit :: Utility/./UtilityTests/RangeTest.Copy (1927 of 2172) UNSUPPORTED: lldb-api :: functionalities/tsan/basic/TestTsanBasic.py (1928 of 2172) PASS: lldb-unit :: Utility/./UtilityTests/VMRange.ContainsAddr (1929 of 2172) PASS: lldb-unit :: Utility/./UtilityTests/SubsystemRAIITest.NormalSubsystem (1930 of 2172) PASS: lldb-unit :: Host/./HostTests/SocketTests/SocketTest.UDPGetConnectURI/ipv4 (1931 of 2172) PASS: lldb-api :: functionalities/breakpoint/address_breakpoints/TestAddressBreakpoints.py (1932 of 2172) PASS: lldb-api :: python_api/interpreter/TestCommandInterpreterAPI.py (1933 of 2172) PASS: lldb-unit :: Utility/./UtilityTests/StreamTest.PutULEB128 (1934 of 2172) PASS: lldb-unit :: Utility/./UtilityTests/StreamTest.ShiftOperatorChars (1935 of 2172) PASS: lldb-unit :: Utility/./UtilityTests/StringListTest.SplitIntoLines (1936 of 2172) PASS: lldb-api :: functionalities/gdb_remote_client/TestRegDefinitionInParts.py (1937 of 2172) UNSUPPORTED: lldb-api :: functionalities/tail_call_frames/cross_object/TestCrossObjectTailCalls.py (1938 of 2172) PASS: lldb-api :: functionalities/breakpoint/breakpoint_language/TestBreakpointLanguage.py (1939 of 2172) PASS: lldb-api :: lang/c/strings/TestCStrings.py (1940 of 2172) PASS: lldb-unit :: Utility/./UtilityTests/StringLexerTest.Next (1941 of 2172) PASS: lldb-api :: commands/expression/multiline-navigation/TestMultilineNavigation.py (1942 of 2172) PASS: lldb-unit :: Utility/./UtilityTests/UriParserTest.TypicalPortPathIPv4 (1943 of 2172) PASS: lldb-api :: functionalities/reproducers/attach/TestReproducerAttach.py (1944 of 2172) PASS: lldb-unit :: Expression/./ExpressionTests/DiagnosticManagerTest.GetStringBasic (1945 of 2172) PASS: lldb-unit :: Process/minidump/./LLDBMinidumpTests/MinidumpParserTest.GetArchitecture (1946 of 2172) PASS: lldb-api :: commands/target/create-deps/TestTargetCreateDeps.py (1947 of 2172) PASS: lldb-unit :: Utility/./UtilityTests/DataExtractorTest.GetCStrUnterminated (1948 of 2172) PASS: lldb-shell :: ObjectFile/ELF/PT_LOAD.yaml (1949 of 2172) PASS: lldb-unit :: debugserver/./debugserverTests/RNBSocket.LoopBackListenIPv6 (1950 of 2172) PASS: lldb-unit :: Utility/./UtilityTests/StreamTest.Indent (1951 of 2172) PASS: lldb-unit :: Utility/./UtilityTests/StringExtractorTest.GetHexU8_Exact_NoEof (1952 of 2172) PASS: lldb-unit :: tools/lldb-server/tests/./LLDBServerTests/TestBase.DebugserverEnv (1953 of 2172) PASS: lldb-api :: functionalities/data-formatter/refpointer-recursion/TestDataFormatterRefPtrRecursion.py (1954 of 2172) PASS: lldb-unit :: Expression/./ExpressionTests/CppModuleConfigurationTest.LibCppV2 (1955 of 2172) PASS: lldb-unit :: Utility/./UtilityTests/VMRange.SetEndAddress (1956 of 2172) PASS: lldb-api :: commands/apropos/basic/TestApropos.py (1957 of 2172) PASS: lldb-unit :: UnwindAssembly/x86/./UnwindAssemblyx86Tests/Testx86AssemblyInspectionEngine.TestPushEDI (1958 of 2172) UNSUPPORTED: lldb-api :: lang/objc/modules-hash-mismatch/TestClangModulesHashMismatch.py (1959 of 2172) PASS: lldb-api :: python_api/sbvalue_persist/TestSBValuePersist.py (1960 of 2172) PASS: lldb-unit :: Utility/./UtilityTests/UUIDTest.RelationalOperators (1961 of 2172) UNSUPPORTED: lldb-api :: functionalities/tty/TestTerminal.py (1962 of 2172) PASS: lldb-unit :: Utility/./UtilityTests/OptionsWithRawTest.ArgsButNoDelimiter (1963 of 2172) PASS: lldb-unit :: Symbol/./SymbolTests/TestTypeSystemClang.TestConvertAccessTypeToAccessSpecifier (1964 of 2172) PASS: lldb-unit :: Language/Highlighting/./HighlighterTests/HighlighterTest.DefaultHighlighterWithCursor (1965 of 2172) PASS: lldb-unit :: Host/./HostTests/SocketTests/SocketTest.DecodeHostAndPort/ipv6 (1966 of 2172) PASS: lldb-api :: macosx/thread_suspend/TestInternalThreadSuspension.py (1967 of 2172) PASS: lldb-unit :: UnwindAssembly/x86/./UnwindAssemblyx86Tests/Testx86AssemblyInspectionEngine.TestPushEAX (1968 of 2172) UNSUPPORTED: lldb-api :: commands/watchpoints/step_over_watchpoint/TestStepOverWatchpoint.py (1969 of 2172) PASS: lldb-unit :: Utility/./UtilityTests/StringListTest.AppendList (1970 of 2172) PASS: lldb-unit :: Utility/./UtilityTests/VASprintfTest.BufferResize (1971 of 2172) PASS: lldb-api :: tools/lldb-vscode/breakpoint-events/TestVSCode_breakpointEvents.py (1972 of 2172) PASS: lldb-api :: lang/cpp/dynamic-value/TestCppValueCast.py (1973 of 2172) UNSUPPORTED: lldb-api :: tools/lldb-server/platform-process-connect/TestPlatformProcessConnect.py (1974 of 2172) PASS: lldb-api :: lang/cpp/unicode-literals/TestUnicodeLiterals.py (1975 of 2172) PASS: lldb-api :: lang/c/shared_lib/TestSharedLib.py (1976 of 2172) PASS: lldb-api :: functionalities/conditional_break/TestConditionalBreak.py (1977 of 2172) PASS: lldb-shell :: Reproducer/TestProcessList.test (1978 of 2172) UNSUPPORTED: lldb-shell :: SymbolFile/DWARF/debug-line-basic.s (1979 of 2172) UNSUPPORTED: lldb-shell :: ObjectFile/ELF/basic-info.yaml (1980 of 2172) PASS: lldb-api :: python_api/symbol-context/TestSymbolContext.py (1981 of 2172) PASS: lldb-api :: types/TestFloatTypesExpr.py (1982 of 2172) PASS: lldb-unit :: Core/./LLDBCoreTests/ModuleSpecTest.InvalidInMemoryBufferValidFile (1983 of 2172) PASS: lldb-unit :: Process/gdb-remote/./ProcessGdbRemoteTests/GDBRemoteCommunicationClientTest.SendGetTraceConfigPacket (1984 of 2172) PASS: lldb-unit :: Utility/./UtilityTests/StringListTest.RemoveBlankLines (1985 of 2172) PASS: lldb-api :: commands/expression/deleting-implicit-copy-constructor/TestDeletingImplicitCopyConstructor.py (1986 of 2172) UNSUPPORTED: lldb-api :: lang/cpp/enum_types/TestCPP11EnumTypes.py (1987 of 2172) PASS: lldb-api :: commands/gui/viewlarge/TestGuiViewLarge.py (1988 of 2172) UNSUPPORTED: lldb-shell :: SymbolFile/NativePDB/typedefs.cpp (1989 of 2172) UNSUPPORTED: lldb-shell :: SymbolFile/NativePDB/disassembly.cpp (1990 of 2172) PASS: lldb-unit :: Host/./HostTests/FileSystemTest.Readable (1991 of 2172) UNSUPPORTED: lldb-shell :: Unwind/split-machine-functions.test (1992 of 2172) UNSUPPORTED: lldb-api :: functionalities/longjmp/TestLongjmp.py (1993 of 2172) PASS: lldb-unit :: Language/Highlighting/./HighlighterTests/HighlighterTest.ClangTrailingBackslashWithWhitespace (1994 of 2172) PASS: lldb-api :: commands/log/invalid-args/TestInvalidArgsLog.py (1995 of 2172) UNSUPPORTED: lldb-shell :: ObjectFile/ELF/minidebuginfo-no-lzma.yaml (1996 of 2172) PASS: lldb-unit :: Expression/./ExpressionTests/DiagnosticManagerTest.GetStringMultipleDiags (1997 of 2172) PASS: lldb-api :: commands/expression/result_numbering/TestResultNumbering.py (1998 of 2172) PASS: lldb-unit :: Core/./LLDBCoreTests/MangledTest.ResultForValidName (1999 of 2172) UNSUPPORTED: lldb-api :: arm/breakpoint-it/TestBreakpointIt.py (2000 of 2172) PASS: lldb-unit :: Utility/./UtilityTests/RangeTest.ClearWithStarAddress (2001 of 2172) PASS: lldb-api :: commands/expression/codegen-crash-import-def-arraytype-element/TestImportDefinitionArrayType.py (2002 of 2172) UNSUPPORTED: lldb-api :: functionalities/param_entry_vals/basic_entry_values/TestBasicEntryValues.py (2003 of 2172) PASS: lldb-api :: functionalities/process_group/TestChangeProcessGroup.py (2004 of 2172) UNSUPPORTED: lldb-api :: android/platform/TestDefaultCacheLineSize.py (2005 of 2172) PASS: lldb-unit :: Utility/./UtilityTests/OptionsWithRawTest.EmptySuffix (2006 of 2172) UNSUPPORTED: lldb-shell :: SymbolFile/PDB/type-quals.test (2007 of 2172) UNSUPPORTED: lldb-api :: functionalities/thread/break_after_join/TestBreakAfterJoin.py (2008 of 2172) PASS: lldb-unit :: Language/Highlighting/./HighlighterTests/HighlighterTest.ClangCursorOutOfBounds (2009 of 2172) PASS: lldb-shell :: ScriptInterpreter/Python/crashlog.test (2010 of 2172) PASS: lldb-unit :: Utility/./UtilityTests/NameMatchesTest.EndsWith (2011 of 2172) PASS: lldb-shell :: Commands/command-stop-hook-output.test (2012 of 2172) PASS: lldb-unit :: Host/./HostTests/SocketAddressTest.Set (2013 of 2172) PASS: lldb-api :: commands/command/script_alias/TestCommandScriptAlias.py (2014 of 2172) PASS: lldb-api :: lang/objcxx/class-name-clash/TestNameClash.py (2015 of 2172) UNSUPPORTED: lldb-shell :: Register/x86-64-zmm-read.test (2016 of 2172) PASS: lldb-unit :: Utility/./UtilityTests/GeneratorTest.Create (2017 of 2172) PASS: lldb-api :: commands/expression/entry-bp/TestExprEntryBP.py (2018 of 2172) PASS: lldb-unit :: Host/./HostTests/Host.GetEnvironment (2019 of 2172) PASS: lldb-unit :: DataFormatter/./LLDBFormatterTests/TypeMatcherTests.CreatedBySameMatchStringExactNamePrefixes (2020 of 2172) PASS: lldb-api :: functionalities/thread/backtrace_all/TestBacktraceAll.py (2021 of 2172) PASS: lldb-unit :: Core/./LLDBCoreTests/MangledTest.ResultForBlockInvocation (2022 of 2172) PASS: lldb-api :: commands/expression/rdar42038760/TestScalarURem.py (2023 of 2172) PASS: lldb-shell :: Unwind/trap_frame_sym_ctx.test (2024 of 2172) PASS: lldb-unit :: Language/Highlighting/./HighlighterTests/HighlighterTest.ClangCommas (2025 of 2172) PASS: lldb-unit :: Language/Highlighting/./HighlighterTests/HighlighterTest.ClangTrailingBackslashBeforeNewline (2026 of 2172) UNSUPPORTED: lldb-api :: benchmarks/startup/TestStartupDelays.py (2027 of 2172) PASS: lldb-unit :: Process/gdb-remote/./ProcessGdbRemoteTests/GDBRemoteCommunicationClientTest.SaveRestoreRegistersNoSuffix (2028 of 2172) PASS: lldb-api :: commands/expression/class_template_specialization_empty_pack/TestClassTemplateSpecializationParametersHandling.py (2029 of 2172) PASS: lldb-api :: commands/frame/var-scope/TestFrameVariableScope.py (2030 of 2172) PASS: lldb-api :: macosx/save_crashlog/TestSaveCrashlog.py (2031 of 2172) PASS: lldb-api :: lang/cpp/auto/TestCPPAuto.py (2032 of 2172) UNSUPPORTED: lldb-api :: functionalities/tail_call_frames/disambiguate_paths_to_common_sink/TestDisambiguatePathsToCommonSink.py (2033 of 2172) PASS: lldb-unit :: Host/./HostTests/HostInfoTest.GetHostname (2034 of 2172) PASS: lldb-unit :: UnwindAssembly/x86/./UnwindAssemblyx86Tests/Testx86AssemblyInspectionEngine.TestPopR12 (2035 of 2172) PASS: lldb-api :: commands/breakpoint/command/list/TestBreakpointCommandList.py (2036 of 2172) PASS: lldb-api :: lang/objc/objc-dyn-sbtype/TestObjCDynamicSBType.py (2037 of 2172) UNSUPPORTED: lldb-api :: functionalities/gdb_remote_client/TestQemuAArch64TargetXml.py (2038 of 2172) PASS: lldb-unit :: UnwindAssembly/x86/./UnwindAssemblyx86Tests/Testx86AssemblyInspectionEngine.TestPushR12 (2039 of 2172) PASS: lldb-api :: lang/objc/objc-static-method-stripped/TestObjCStaticMethodStripped.py (2040 of 2172) PASS: lldb-unit :: Utility/./UtilityTests/ArgsTest.TestQuotedUnknownEscape (2041 of 2172) PASS: lldb-api :: lang/objcxx/objcxx-ivar-vector/TestIvarVector.py (2042 of 2172) PASS: lldb-api :: commands/command/script/TestCommandScript.py (2043 of 2172) PASS: lldb-unit :: Utility/./UtilityTests/Flags.Test (2044 of 2172) PASS: lldb-unit :: Language/CPlusPlus/./LanguageCPlusPlusTests/CPlusPlusLanguage.FindAlternateFunctionManglings (2045 of 2172) PASS: lldb-unit :: Utility/./UtilityTests/XcodeSDKTest.ParseTest (2046 of 2172) PASS: lldb-unit :: Utility/./UtilityTests/DataExtractorTest.GetDoubleUnaligned (2047 of 2172) PASS: lldb-unit :: Expression/./ExpressionTests/CppModuleConfigurationTest.LinuxLocalLibCpp (2048 of 2172) PASS: lldb-unit :: Utility/./UtilityTests/CompletionRequest.TestCompletionOwnership (2049 of 2172) UNSUPPORTED: lldb-shell :: ObjectFile/PECOFF/disassemble-thumb.yaml (2050 of 2172) PASS: lldb-api :: functionalities/data-formatter/data-formatter-enum-format/TestDataFormatterEnumFormat.py (2051 of 2172) PASS: lldb-unit :: Symbol/./SymbolTests/TestTypeSystemClang.TestGetTypeClassTypeOf (2052 of 2172) PASS: lldb-api :: commands/expression/no-deadlock/TestExprDoesntBlock.py (2053 of 2172) PASS: lldb-unit :: Utility/./UtilityTests/RangeTest.LessThanInvalid (2054 of 2172) PASS: lldb-unit :: Host/./HostTests/SocketTests/SocketTest.DomainListenConnectAccept/ipv6 (2055 of 2172) PASS: lldb-unit :: Host/./HostTests/File.GetWaitableHandleFileno (2056 of 2172) UNSUPPORTED: lldb-shell :: Register/x86-gp-write.test (2057 of 2172) PASS: lldb-shell :: Heap/heap-cstr.test (2058 of 2172) PASS: lldb-unit :: Symbol/./SymbolTests/TestTypeSystemClang.TestGetBasicTypeFromName (2059 of 2172) PASS: lldb-api :: functionalities/breakpoint/breakpoint_names/TestBreakpointNames.py (2060 of 2172) PASS: lldb-api :: commands/command/invalid-args/TestInvalidArgsCommand.py (2061 of 2172) PASS: lldb-unit :: Language/CLanguages/./LanguageCLanguagesTests/CLanguages.LookupCLanguagesByLanguageType (2062 of 2172) PASS: lldb-unit :: ObjectFile/PECOFF/./ObjectFilePECOFFTests/PECallFrameInfoTest.Frame_reg_eh (2063 of 2172) PASS: lldb-unit :: Utility/./UtilityTests/StringExtractorTest.InitMisc (2064 of 2172) PASS: lldb-unit :: Utility/./UtilityTests/CompletionRequest.TryCompleteCurrentArgBad (2065 of 2172) PASS: lldb-unit :: Utility/./UtilityTests/ScalarTest.Promotion (2066 of 2172) PASS: lldb-api :: commands/expression/expr-in-syscall/TestExpressionInSyscall.py (2067 of 2172) PASS: lldb-api :: commands/expression/regression-access-function-template-in-record/TestRegressionAccessFunctionTemplateInRecord.py (2068 of 2172) UNSUPPORTED: lldb-shell :: SymbolFile/DWARF/dir-separator-no-comp-dir-relative-name.s (2069 of 2172) PASS: lldb-unit :: Utility/./UtilityTests/StreamTest.AddressNoSuffix (2070 of 2172) PASS: lldb-unit :: Symbol/./SymbolTests/TestTypeSystemClang.TestDisplayName (2071 of 2172) PASS: lldb-api :: functionalities/fat_archives/TestFatArchives.py (2072 of 2172) PASS: lldb-unit :: Utility/./UtilityTests/OptionsWithRawTest.ArgsButNoLeadingDash (2073 of 2172) PASS: lldb-shell :: ScriptInterpreter/None/import_module.test (2074 of 2172) PASS: lldb-api :: tools/lldb-vscode/breakpoint/TestVSCode_setExceptionBreakpoints.py (2075 of 2172) PASS: lldb-unit :: DataFormatter/./LLDBFormatterTests/TypeMatcherTests.CreatedBySameMatchString (2076 of 2172) PASS: lldb-unit :: Utility/./UtilityTests/AnsiTerminal.WhiteSpace (2077 of 2172) PASS: lldb-shell :: Quit/TestQuitExitCode0.test (2078 of 2172) PASS: lldb-api :: lang/cpp/constructors/TestCppConstructors.py (2079 of 2172) PASS: lldb-unit :: Utility/./UtilityTests/StreamTest.PutSLEB128 (2080 of 2172) PASS: lldb-unit :: Utility/./UtilityTests/Flags.AllClear (2081 of 2172) XFAIL: lldb-shell :: Register/x86-mm-xmm-read.test (2082 of 2172) PASS: lldb-unit :: Utility/./UtilityTests/StringExtractorTest.DecodeHexU8_Underflow2 (2083 of 2172) PASS: lldb-unit :: ScriptInterpreter/Python/./ScriptInterpreterPythonTests/PythonDataObjectsTest.TestPythonTupleSize (2084 of 2172) PASS: lldb-shell :: ObjectFile/PECOFF/sections-names.yaml (2085 of 2172) PASS: lldb-unit :: Utility/./UtilityTests/StreamTeeTest.Flush (2086 of 2172) PASS: lldb-unit :: Utility/./UtilityTests/UriParserTest.BadPort (2087 of 2172) PASS: lldb-unit :: Utility/./UtilityTests/ArgsTest.BareSingleQuote (2088 of 2172) PASS: lldb-shell :: Commands/command-script-import.test (2089 of 2172) PASS: lldb-api :: commands/expression/test/TestExprs2.py (2090 of 2172) PASS: lldb-api :: commands/frame/diagnose/complicated-expression/TestComplicatedExpression.py (2091 of 2172) PASS: lldb-api :: lang/objc/objc-ivar-protocols/TestIvarProtocols.py (2092 of 2172) PASS: lldb-unit :: Platform/Android/./AdbClientTests/AdbClientTest.CreateByDeviceId_ByEnvVar (2093 of 2172) PASS: lldb-unit :: tools/lldb-server/tests/./LLDBServerTests/StandardStartupTest.TestStopReplyContainsThreadPcs (2094 of 2172) UNSUPPORTED: lldb-shell :: SymbolFile/NativePDB/ast-types.cpp (2095 of 2172) PASS: lldb-unit :: Utility/./UtilityTests/ArchSpecTest.MergeFromMachOUnknown (2096 of 2172) PASS: lldb-unit :: Signals/./SignalsTests/UnixSignalsTest.Iteration (2097 of 2172) PASS: lldb-unit :: Utility/./UtilityTests/StringExtractorTest.GetU64BigEndian (2098 of 2172) PASS: lldb-shell :: ScriptInterpreter/Python/scripted_breakpoint.test (2099 of 2172) PASS: lldb-shell :: Settings/TestDisassemblyFormat.test (2100 of 2172) PASS: lldb-shell :: Commands/CommandScriptImmediateOutput/CommandScriptImmediateOutputFile.test (2101 of 2172) PASS: lldb-unit :: Utility/./UtilityTests/StringExtractorTest.GetHexBytes_Underflow (2102 of 2172) PASS: lldb-api :: commands/platform/basic/TestPlatformPython.py (2103 of 2172) PASS: lldb-api :: types/TestIntegerTypeExpr.py (2104 of 2172) PASS: lldb-api :: python_api/frame/TestFrames.py (2105 of 2172) PASS: lldb-unit :: SymbolFile/NativePDB/./SymbolFileNativePDBTests/PDBFPOProgramToDWARFExpressionTests.SingleAssignmentRegisterRef (2106 of 2172) PASS: lldb-unit :: Process/gdb-remote/./ProcessGdbRemoteTests/GDBRemoteCommunicationClientTest.GetModulesInfoInvalidResponse (2107 of 2172) PASS: lldb-api :: commands/expression/import-std-module/queue/TestQueueFromStdModule.py (2108 of 2172) PASS: lldb-unit :: Utility/./UtilityTests/NameMatchesTest.Ignore (2109 of 2172) PASS: lldb-api :: functionalities/thread/concurrent_events/TestConcurrentManyCrash.py (2110 of 2172) PASS: lldb-unit :: ScriptInterpreter/Python/./ScriptInterpreterPythonTests/PythonDataObjectsTest.TestPythonDictionaryToStructuredDictionary (2111 of 2172) PASS: lldb-api :: lang/c/record_decl_in_expr/TestRecordDeclInExpr.py (2112 of 2172) PASS: lldb-shell :: SymbolFile/DWARF/debug_loc_and_loclists.s (2113 of 2172) PASS: lldb-api :: functionalities/unwind/noreturn/module-end/TestNoReturnModuleEnd.py (2114 of 2172) PASS: lldb-unit :: Utility/./UtilityTests/BinaryStreamTest.PutSLEB128EightBytes (2115 of 2172) PASS: lldb-shell :: ObjectFile/ELF/PT_LOAD-empty.yaml (2116 of 2172) PASS: lldb-unit :: Utility/./UtilityTests/DataExtractorTest.GetDouble (2117 of 2172) PASS: lldb-shell :: Breakpoint/debug_rnglist_rlestartend.test (2118 of 2172) PASS: lldb-api :: functionalities/data-formatter/data-formatter-caching/TestDataFormatterCaching.py (2119 of 2172) PASS: lldb-unit :: Symbol/./SymbolTests/TestTypeSystemClang.AddMethodToObjCObjectType (2120 of 2172) PASS: lldb-api :: commands/command/script/import/TestImport.py (2121 of 2172) PASS: lldb-unit :: Symbol/./SymbolTests/TestTypeSystemClang.TestGetBasicTypeFromEnum (2122 of 2172) PASS: lldb-api :: api/multiple-debuggers/TestMultipleDebuggers.py (2123 of 2172) PASS: lldb-unit :: SymbolFile/NativePDB/./SymbolFileNativePDBTests/PDBFPOProgramToDWARFExpressionTests.InvalidAssignmentSingle (2124 of 2172) PASS: lldb-unit :: Utility/./UtilityTests/StringListTest.JoinSingle (2125 of 2172) PASS: lldb-api :: commands/add-dsym/uuid/TestAddDsymCommand.py (2126 of 2172) PASS: lldb-shell :: SymbolFile/DWARF/dwp-debug-types.s (2127 of 2172) PASS: lldb-unit :: Process/gdb-remote/./ProcessGdbRemoteTests/GDBRemoteClientBaseTest.SendContinueAndAsyncPacket (2128 of 2172) PASS: lldb-unit :: Symbol/./SymbolTests/LineEntryTest.GetSameLineContiguousAddressRangeNoInlines (2129 of 2172) PASS: lldb-unit :: UnwindAssembly/x86/./UnwindAssemblyx86Tests/Testx86AssemblyInspectionEngine.TestPushR13 (2130 of 2172) PASS: lldb-api :: functionalities/abbreviation/TestAbbreviations.py (2131 of 2172) PASS: lldb-unit :: Utility/./UtilityTests/BinaryStreamTest.PutSLEB128Zero (2132 of 2172) PASS: lldb-shell :: SymbolFile/DWARF/childless-compile-unit.s (2133 of 2172) PASS: lldb-api :: commands/process/launch/TestProcessLaunch.py (2134 of 2172) PASS: lldb-api :: commands/expression/test/TestExprs.py (2135 of 2172) PASS: lldb-api :: functionalities/breakpoint/breakpoint_by_file_colon_line/TestBreakpointByFileColonLine.py (2136 of 2172) PASS: lldb-unit :: DataFormatter/./LLDBFormatterTests/TypeMatcherTests.RegexName (2137 of 2172) PASS: lldb-api :: functionalities/data-formatter/summary-string-onfail/Test-rdar-9974002.py (2138 of 2172) PASS: lldb-unit :: Process/minidump/./LLDBMinidumpTests/MinidumpParserTest.GetMemory (2139 of 2172) PASS: lldb-shell :: Quit/TestQuitExitCodeHex0.test (2140 of 2172) PASS: lldb-api :: functionalities/data-formatter/data-formatter-stl/libcxx/unique_ptr/TestDataFormatterLibcxxUniquePtr.py (2141 of 2172) PASS: lldb-unit :: Target/./TargetTests/ExecutionContextTest.GetByteOrder (2142 of 2172) PASS: lldb-api :: lang/c/local_variables/TestLocalVariables.py (2143 of 2172) PASS: lldb-api :: functionalities/rerun/TestRerun.py (2144 of 2172) UNSUPPORTED: lldb-api :: functionalities/thread/concurrent_events/TestConcurrentTwoWatchpointsOneBreakpoint.py (2145 of 2172) PASS: lldb-unit :: Editline/./EditlineTests/EditlineTestFixture.EditlineReceivesMultiLineText (2146 of 2172) UNSUPPORTED: lldb-api :: commands/register/register/intel_xtended_registers/mpx_offset_intersection/TestMPXOffsetIntersection.py (2147 of 2172) PASS: lldb-unit :: Utility/./UtilityTests/ScalarTest.RightShiftOperator (2148 of 2172) PASS: lldb-api :: functionalities/data-formatter/data-formatter-objc/TestDataFormatterObjCNSError.py (2149 of 2172) PASS: lldb-unit :: Utility/./UtilityTests/BinaryStreamTest.PutULEB128SixBytes (2150 of 2172) PASS: lldb-unit :: Symbol/./SymbolTests/TestTypeSystemClang.TestRecordHasFields (2151 of 2172) PASS: lldb-api :: functionalities/thread/thread_specific_break/TestThreadSpecificBreakpoint.py (2152 of 2172) PASS: lldb-shell :: SymbolFile/DWARF/DW_TAG_variable-invalid_location.s (2153 of 2172) PASS: lldb-api :: functionalities/data-formatter/data-formatter-synth/TestDataFormatterSynth.py (2154 of 2172) PASS: lldb-unit :: Utility/./UtilityTests/UriParserTest.SchemeHostSeparator2 (2155 of 2172) PASS: lldb-unit :: Utility/./UtilityTests/AnsiTerminal.Empty (2156 of 2172) PASS: lldb-unit :: ScriptInterpreter/Python/./ScriptInterpreterPythonTests/PythonDataObjectsTest.TestScript (2157 of 2172) PASS: lldb-api :: commands/expression/vector_of_enums/TestVectorOfEnums.py (2158 of 2172) PASS: lldb-api :: functionalities/breakpoint/step_over_breakpoint/TestStepOverBreakpoint.py (2159 of 2172) PASS: lldb-api :: lang/objc/conflicting-definition/TestConflictingDefinition.py (2160 of 2172) PASS: lldb-api :: tools/lldb-server/TestGdbRemoteHostInfo.py (2161 of 2172) PASS: lldb-shell :: Reproducer/TestWorkingDir.test (2162 of 2172) PASS: lldb-api :: commands/expression/import-std-module/conflicts/TestStdModuleWithConflicts.py (2163 of 2172) PASS: lldb-api :: lang/objc/objc-property/TestObjCProperty.py (2164 of 2172) PASS: lldb-shell :: SymbolFile/Breakpad/unwind-via-stack-win-no-memory-info.yaml (2165 of 2172) PASS: lldb-api :: commands/expression/import-std-module/shared_ptr-dbg-info-content/TestSharedPtrDbgInfoContentFromStdModule.py (2166 of 2172) PASS: lldb-api :: tools/lldb-vscode/module/TestVSCode_module.py (2167 of 2172) PASS: lldb-api :: lang/objc/objc-new-syntax/TestObjCNewSyntaxDictionary.py (2168 of 2172) PASS: lldb-api :: types/TestCharTypeExpr.py (2169 of 2172) PASS: lldb-api :: lang/objc/hidden-ivars/TestHiddenIvars.py (2170 of 2172) PASS: lldb-api :: functionalities/completion/TestCompletion.py (2171 of 2172) Cancelling nested steps due to timeout Sending interrupt signal to process ninja: build stopped: interrupted by user. script returned exit code 143 [Pipeline] } [Pipeline] // timeout [Pipeline] } [Pipeline] // stage [Pipeline] stage [Pipeline] { (Test DWARF4) Stage "Test DWARF4" skipped due to earlier failure(s) [Pipeline] } [Pipeline] // stage [Pipeline] stage [Pipeline] { (Test DWARF5) Stage "Test DWARF5" skipped due to earlier failure(s) [Pipeline] } [Pipeline] // stage [Pipeline] stage [Pipeline] { (Build Clang 5.0.2) Stage "Build Clang 5.0.2" skipped due to earlier failure(s) [Pipeline] } [Pipeline] // stage [Pipeline] stage [Pipeline] { (Test Clang 5.0.2) Stage "Test Clang 5.0.2" skipped due to earlier failure(s) [Pipeline] } [Pipeline] // stage [Pipeline] stage [Pipeline] { (Build Clang 7.0.1) Stage "Build Clang 7.0.1" skipped due to earlier failure(s) [Pipeline] } [Pipeline] // stage [Pipeline] stage [Pipeline] { (Test Clang 7.0.1) Stage "Test Clang 7.0.1" skipped due to earlier failure(s) [Pipeline] } [Pipeline] // stage [Pipeline] stage [Pipeline] { (Build Clang 9.0.0) Stage "Build Clang 9.0.0" skipped due to earlier failure(s) [Pipeline] } [Pipeline] // stage [Pipeline] stage [Pipeline] { (Test Clang 9.0.0) Stage "Test Clang 9.0.0" skipped due to earlier failure(s) [Pipeline] } [Pipeline] // stage [Pipeline] } [Pipeline] // withEnv [Pipeline] } [Pipeline] // node [Pipeline] End of Pipeline [Checks API] No suitable checks publisher found. Timeout has been exceeded Finished: ABORTED