AbortedConsole Output

Skipping 8,177 KB.. Full Log
ests/OptionsWithRawTest.ArgsButNoDelimiter (643 of 2142)
UNSUPPORTED: lldb-api :: functionalities/asan/TestMemoryHistory.py (644 of 2142)
PASS: lldb-unit :: Symbol/./SymbolTests/TestTypeSystemClang.TestDisplayNameEmpty (645 of 2142)
PASS: lldb-api :: functionalities/breakpoint/consecutive_breakpoints/TestConsecutiveBreakpoints.py (646 of 2142)
UNSUPPORTED: lldb-shell :: Unwind/eh-frame-small-fde.test (647 of 2142)
PASS: lldb-unit :: Utility/./UtilityTests/RangeTest.ClearWithStarAddress (648 of 2142)
PASS: lldb-unit :: Host/./HostTests/FileSystemTest.EnumerateDirectory (649 of 2142)
PASS: lldb-unit :: SymbolFile/NativePDB/./SymbolFileNativePDBTests/PDBFPOProgramToDWARFExpressionTests.UnknownOp (650 of 2142)
PASS: lldb-api :: functionalities/data-formatter/ptr_ref_typedef/TestPtrRef2Typedef.py (651 of 2142)
PASS: lldb-api :: lang/cpp/member-and-local-vars-with-same-name/TestMembersAndLocalsWithSameName.py (652 of 2142)
PASS: lldb-unit :: Thread/./ThreadTests/ThreadTest.GetPrivateStopInfo (653 of 2142)
PASS: lldb-api :: lang/cpp/signed_types/TestSignedTypes.py (654 of 2142)
PASS: lldb-api :: functionalities/breakpoint/breakpoint_hit_count/TestBreakpointHitCount.py (655 of 2142)
PASS: lldb-api :: functionalities/gdb_remote_client/TestRegDefinitionInParts.py (656 of 2142)
PASS: lldb-unit :: ScriptInterpreter/Python/./ScriptInterpreterPythonTests/PythonDataObjectsTest.TestPythonDictionaryValueEquality (657 of 2142)
PASS: lldb-shell :: Driver/TestError.test (658 of 2142)
PASS: lldb-unit :: SymbolFile/NativePDB/./SymbolFileNativePDBTests/PDBFPOProgramToDWARFExpressionTests.UnresolvedDependentCyclicRegisterAssignmentReference (659 of 2142)
PASS: lldb-api :: functionalities/data-formatter/data-formatter-stl/libcxx/vector/TestDataFormatterLibcxxVector.py (660 of 2142)
PASS: lldb-api :: functionalities/data-formatter/data-formatter-objc/TestDataFormatterObjCNSDate.py (661 of 2142)
PASS: lldb-api :: lang/cpp/limit-debug-info/TestWithLimitDebugInfo.py (662 of 2142)
UNSUPPORTED: lldb-shell :: ScriptInterpreter/Lua/breakpoint_callback.test (663 of 2142)
PASS: lldb-unit :: DataFormatter/./LLDBFormatterTests/StringPrinterTests.CxxUTF8 (664 of 2142)
PASS: lldb-unit :: Utility/./UtilityTests/RangeTest.SlideZero (665 of 2142)
PASS: lldb-unit :: Utility/./UtilityTests/StringExtractorTest.DecodeHexU8_Underflow2 (666 of 2142)
PASS: lldb-unit :: ObjectFile/Breakpad/./ObjectFileBreakpadTests/LineRecord.parse (667 of 2142)
PASS: lldb-unit :: ObjectFile/Breakpad/./ObjectFileBreakpadTests/ModuleRecord.parse (668 of 2142)
PASS: lldb-unit :: Utility/./UtilityTests/ArgsTest.ReplaceArgumentAtIndexOutOfRange (669 of 2142)
PASS: lldb-api :: functionalities/type_completion/TestTypeCompletion.py (670 of 2142)
PASS: lldb-unit :: Utility/./UtilityTests/ArchSpecTest.TripleComponentsWereSpecified (671 of 2142)
PASS: lldb-unit :: Language/Highlighting/./HighlighterTests/HighlighterTest.ClangBraces (672 of 2142)
PASS: lldb-api :: commands/target/create-no-such-arch/TestNoSuchArch.py (673 of 2142)
PASS: lldb-unit :: Utility/./UtilityTests/StringExtractorTest.GetHexBytes_Partial (674 of 2142)
PASS: lldb-shell :: Driver/TestProcessAttach.test (675 of 2142)
UNSUPPORTED: lldb-api :: commands/register/register/intel_xtended_registers/mpx_offset_intersection/TestMPXOffsetIntersection.py (676 of 2142)
PASS: lldb-unit :: Process/./ProcessEventDataTests/ProcessEventDataTest.DoOnRemoval (677 of 2142)
PASS: lldb-api :: commands/frame/language/TestGuessLanguage.py (678 of 2142)
PASS: lldb-api :: functionalities/thread/concurrent_events/TestConcurrentSignalWatchBreak.py (679 of 2142)
PASS: lldb-api :: functionalities/breakpoint/breakpoint_names/TestBreakpointNames.py (680 of 2142)
PASS: lldb-unit :: UnwindAssembly/x86/./UnwindAssemblyx86Tests/Testx86AssemblyInspectionEngine.TestPushRBPWithREX (681 of 2142)
PASS: lldb-unit :: UnwindAssembly/x86/./UnwindAssemblyx86Tests/Testx86AssemblyInspectionEngine.TestPopEBX (682 of 2142)
PASS: lldb-api :: functionalities/inferior-crashing/TestInferiorCrashingStep.py (683 of 2142)
PASS: lldb-unit :: SymbolFile/DWARF/./SymbolFileDWARFTests/SymbolFileDWARFTests.TestAbbrevInvalidNULLTag (684 of 2142)
PASS: lldb-shell :: Settings/TestEchoCommands.test (685 of 2142)
PASS: lldb-api :: types/TestIntegerType.py (686 of 2142)
PASS: lldb-shell :: ObjectFile/ELF/build-id-case.yaml (687 of 2142)
PASS: lldb-unit :: Utility/./UtilityTests/StreamTest.PutPtr (688 of 2142)
PASS: lldb-api :: commands/expression/result_numbering/TestResultNumbering.py (689 of 2142)
UNSUPPORTED: lldb-shell :: SymbolFile/target-symbols-add-unwind.test (690 of 2142)
PASS: lldb-shell :: SymbolFile/NativePDB/globals-bss.cpp (691 of 2142)
PASS: lldb-api :: functionalities/data-formatter/nsdictionarysynth/TestNSDictionarySynthetic.py (692 of 2142)
PASS: lldb-unit :: debugserver/./debugserverTests/RNBSocket.AnyListen (693 of 2142)
PASS: lldb-api :: lang/objc/orderedset/TestOrderedSet.py (694 of 2142)
PASS: lldb-api :: lang/c/register_variables/TestRegisterVariables.py (695 of 2142)
PASS: lldb-unit :: Platform/./LLDBPlatformTests/PlatformAppleSimulatorTest.TestSimHasSimEnvionament (696 of 2142)
PASS: lldb-unit :: Host/./HostTests/FileSystemTest.EmptyTest (697 of 2142)
PASS: lldb-shell :: Minidump/dump-all.test (698 of 2142)
PASS: lldb-shell :: ObjectFile/PECOFF/symbol.yaml (699 of 2142)
PASS: lldb-api :: lang/cpp/covariant-return-types/TestCovariantReturnTypes.py (700 of 2142)
PASS: lldb-api :: commands/expression/expr-in-syscall/TestExpressionInSyscall.py (701 of 2142)
PASS: lldb-unit :: Utility/./UtilityTests/FileSpecTest.FileAndDirectoryComponents (702 of 2142)
UNSUPPORTED: lldb-api :: arm/breakpoint-thumb-codesection/TestBreakpointThumbCodesection.py (703 of 2142)
PASS: lldb-shell :: ObjectFile/PECOFF/section-types.yaml (704 of 2142)
PASS: lldb-unit :: Target/./TargetTests/ExecutionContextTest.GetByteOrder (705 of 2142)
PASS: lldb-unit :: Utility/./UtilityTests/RangeTest.LessThan (706 of 2142)
PASS: lldb-unit :: Utility/./UtilityTests/ArgsTest.EscapeLLDBCommandArgument (707 of 2142)
PASS: lldb-unit :: Utility/./UtilityTests/StringExtractorTest.DecodeHexU8_InvalidHex2 (708 of 2142)
PASS: lldb-unit :: Language/Highlighting/./HighlighterTests/HighlighterTest.HighlighterSelectionPath (709 of 2142)
PASS: lldb-api :: functionalities/backticks/TestBackticksWithoutATarget.py (710 of 2142)
PASS: lldb-unit :: Utility/./UtilityTests/StreamTest.PutHex32ByteOrderLittle (711 of 2142)
UNSUPPORTED: lldb-api :: tools/lldb-server/TestGdbRemote_vContThreads.py (712 of 2142)
PASS: lldb-api :: commands/process/signal/TestProcessSignal.py (713 of 2142)
UNSUPPORTED: lldb-api :: iohandler/unicode/TestUnicode.py (714 of 2142)
PASS: lldb-unit :: Core/./LLDBCoreTests/ModuleSpecTest.TestCOFFFile (715 of 2142)
PASS: lldb-unit :: Utility/./UtilityTests/StringListTest.ShiftCString (716 of 2142)
PASS: lldb-api :: functionalities/data-formatter/summary-string-onfail/Test-rdar-9974002.py (717 of 2142)
PASS: lldb-unit :: Utility/./UtilityTests/NameMatchesTest.RegularExpression (718 of 2142)
PASS: lldb-shell :: SymbolFile/DWARF/debug_ranges_and_rnglists.test (719 of 2142)
PASS: lldb-shell :: ObjectFile/ELF/section-types-edgecases.yaml (720 of 2142)
PASS: lldb-unit :: Process/gdb-remote/./ProcessGdbRemoteTests/GDBRemoteCommunicationClientTest.SaveRestoreRegistersNoSuffix (721 of 2142)
PASS: lldb-unit :: Utility/./UtilityTests/OptionsWithRawTest.EmptySuffix (722 of 2142)
PASS: lldb-unit :: Utility/./UtilityTests/SerializationRountripTest.SerializeDeserializePodPointers (723 of 2142)
PASS: lldb-shell :: ObjectFile/ELF/gnu-debuglink.yaml (724 of 2142)
PASS: lldb-api :: lang/c/shared_lib/TestSharedLib.py (725 of 2142)
PASS: lldb-api :: tools/lldb-vscode/attach/TestVSCode_attach.py (726 of 2142)
PASS: lldb-unit :: Utility/./UtilityTests/LogChannelTest.List (727 of 2142)
PASS: lldb-api :: commands/frame/diagnose/array/TestArray.py (728 of 2142)
PASS: lldb-unit :: ObjectFile/Breakpad/./ObjectFileBreakpadTests/StackCFIRecord.parse (729 of 2142)
PASS: lldb-unit :: Host/./HostTests/NativeProcessProtocolTest.SetBreakpoint (730 of 2142)
PASS: lldb-api :: functionalities/non-overlapping-index-variable-i/TestIndexVariable.py (731 of 2142)
PASS: lldb-unit :: SymbolFile/DWARF/./SymbolFileDWARFTests/SymbolFileDWARFTests.TestAbbrevOrder1Start5 (732 of 2142)
PASS: lldb-unit :: Utility/./UtilityTests/StreamTeeTest.CopyConstructor (733 of 2142)
PASS: lldb-unit :: Utility/./UtilityTests/StreamTest.PutBytesAsRawHex8ToBigEndian (734 of 2142)
PASS: lldb-api :: commands/command/source/TestCommandSource.py (735 of 2142)
PASS: lldb-api :: functionalities/data-formatter/data-formatter-stl/libcxx/multimap/TestDataFormatterLibccMultiMap.py (736 of 2142)
PASS: lldb-api :: commands/register/register/register_command/TestRegisters.py (737 of 2142)
PASS: lldb-api :: api/log/TestAPILog.py (738 of 2142)
PASS: lldb-unit :: Utility/./UtilityTests/RegularExpression.CopyAssignment (739 of 2142)
PASS: lldb-shell :: Minidump/fb-dump.test (740 of 2142)
PASS: lldb-api :: functionalities/breakpoint/move_nearest/TestMoveNearest.py (741 of 2142)
PASS: lldb-unit :: ScriptInterpreter/Python/./ScriptInterpreterPythonTests/PythonDataObjectsTest.TestPythonCallableInvoke (742 of 2142)
PASS: lldb-shell :: Commands/CommandScriptImmediateOutput/CommandScriptImmediateOutputFile.test (743 of 2142)
PASS: lldb-shell :: ObjectFile/ELF/PT_LOAD-overlap.yaml (744 of 2142)
PASS: lldb-shell :: Settings/TestFrameFormatColor.test (745 of 2142)
PASS: lldb-shell :: SymbolFile/DWARF/find-function-regex.cpp (746 of 2142)
PASS: lldb-api :: commands/expression/top-level/TestTopLevelExprs.py (747 of 2142)
PASS: lldb-api :: functionalities/recursion/TestValueObjectRecursion.py (748 of 2142)
UNSUPPORTED: lldb-shell :: Process/Windows/exception_access_violation.cpp (749 of 2142)
PASS: lldb-api :: python_api/sblaunchinfo/TestSBLaunchInfo.py (750 of 2142)
PASS: lldb-api :: functionalities/thread/num_threads/TestNumThreads.py (751 of 2142)
PASS: lldb-unit :: Utility/./UtilityTests/ScalarTest.TruncOrExtendTo (752 of 2142)
PASS: lldb-shell :: Reproducer/TestGDBRemoteRepro.test (753 of 2142)
PASS: lldb-unit :: ScriptInterpreter/Python/./ScriptInterpreterPythonTests/PythonDataObjectsTest.TestPythonIntegerToStr (754 of 2142)
PASS: lldb-api :: commands/frame/var-scope/TestFrameVariableScope.py (755 of 2142)
PASS: lldb-shell :: Reproducer/TestDSYM.test (756 of 2142)
PASS: lldb-unit :: Target/./TargetTests/RemoteAwarePlatformTest.TestResolveExecutabelOnClientByPlatform (757 of 2142)
UNSUPPORTED: lldb-shell :: ScriptInterpreter/Lua/quit.test (758 of 2142)
PASS: lldb-unit :: Utility/./UtilityTests/ListenerTest.GetEventImmediate (759 of 2142)
PASS: lldb-api :: commands/expression/codegen-crash-typedefdecl-not-in_declcontext/TestCodegenCrashTypedefDeclNotInDeclContext.py (760 of 2142)
PASS: lldb-shell :: SymbolFile/DWARF/childless-compile-unit.s (761 of 2142)
PASS: lldb-api :: commands/expression/cast_int_to_anonymous_enum/TestCastIntToAnonymousEnum.py (762 of 2142)
UNSUPPORTED: lldb-api :: lang/cpp/static_members/TestCPPStaticMembers.py (763 of 2142)
PASS: lldb-shell :: Quit/TestQuitExitCodeNonInt.test (764 of 2142)
PASS: lldb-api :: functionalities/unwind/noreturn/module-end/TestNoReturnModuleEnd.py (765 of 2142)
PASS: lldb-api :: commands/expression/test/TestExprs.py (766 of 2142)
UNSUPPORTED: lldb-api :: tools/lldb-vscode/completions/TestVSCode_completions.py (767 of 2142)
PASS: lldb-shell :: Process/TestEnvironment.test (768 of 2142)
PASS: lldb-unit :: Process/gdb-remote/./ProcessGdbRemoteTests/GDBRemoteCommunicationClientTest.SendStartTracePacket (769 of 2142)
PASS: lldb-unit :: Utility/./UtilityTests/DataExtractorTest.GetMaxU64 (770 of 2142)
PASS: lldb-api :: lang/c/step-target/TestStepTarget.py (771 of 2142)
PASS: lldb-api :: functionalities/data-formatter/data-formatter-stl/libcxx/iterator/TestDataFormatterLibccIterator.py (772 of 2142)
PASS: lldb-shell :: ObjectFile/wasm/unified-debug-sections.yaml (773 of 2142)
PASS: lldb-unit :: Utility/./UtilityTests/StreamTest.ShiftOperatorStrings (774 of 2142)
UNSUPPORTED: lldb-api :: commands/gui/basicdebug/TestGuiBasicDebug.py (775 of 2142)
PASS: lldb-api :: functionalities/memory/read/TestMemoryRead.py (776 of 2142)
PASS: lldb-api :: functionalities/data-formatter/array_typedef/TestArrayTypedef.py (777 of 2142)
PASS: lldb-api :: lang/objc/hidden-ivars/TestHiddenIvars.py (778 of 2142)
PASS: lldb-unit :: Symbol/./SymbolTests/TestTypeSystemClang.TestIsClangType (779 of 2142)
PASS: lldb-unit :: Symbol/./SymbolTests/DWARFCallFrameInfoTest.Basic_dwarf3 (780 of 2142)
PASS: lldb-unit :: Host/./HostTests/Host.GetEnvironment (781 of 2142)
PASS: lldb-api :: tools/lldb-vscode/variables/TestVSCode_variables.py (782 of 2142)
PASS: lldb-unit :: Utility/./UtilityTests/Flags.AllSet (783 of 2142)
UNSUPPORTED: lldb-shell :: SymbolFile/PDB/ast-restore.test (784 of 2142)
PASS: lldb-unit :: Language/Highlighting/./HighlighterTests/HighlighterTest.ClangStringLiterals (785 of 2142)
PASS: lldb-api :: commands/expression/completion/TestExprCompletion.py (786 of 2142)
PASS: lldb-api :: lang/c/stepping/TestStepAndBreakpoints.py (787 of 2142)
PASS: lldb-api :: functionalities/gdb_remote_client/TestGDBRemoteClient.py (788 of 2142)
PASS: lldb-api :: macosx/load-kext/TestLoadKext.py (789 of 2142)
PASS: lldb-api :: functionalities/breakpoint/address_breakpoints/TestBadAddressBreakpoints.py (790 of 2142)
PASS: lldb-unit :: Utility/./UtilityTests/StringLexerTest.Peek (791 of 2142)
PASS: lldb-api :: lang/cpp/diamond/TestDiamond.py (792 of 2142)
PASS: lldb-unit :: Utility/./UtilityTests/UriParserTest.Minimal (793 of 2142)
PASS: lldb-unit :: Utility/./UtilityTests/ArgsTest.GetArgumentArrayRef (794 of 2142)
PASS: lldb-unit :: Symbol/./SymbolTests/TestTypeSystemClang.TestConvertAccessTypeToAccessSpecifier (795 of 2142)
PASS: lldb-shell :: SymbolFile/DWARF/debug-types-missing-signature.test (796 of 2142)
PASS: lldb-unit :: Expression/./ExpressionTests/DWARFExpression.DW_OP_convert (797 of 2142)
PASS: lldb-unit :: Utility/./UtilityTests/DataExtractorTest.GetCStrAtEnd (798 of 2142)
PASS: lldb-unit :: ScriptInterpreter/Python/./ScriptInterpreterPythonTests/PythonDataObjectsTest.TestObjectAttributes (799 of 2142)
PASS: lldb-unit :: Host/./HostTests/File.GetWaitableHandleFileno (800 of 2142)
PASS: lldb-shell :: ObjectFile/ELF/minidebuginfo-find-symbols.yaml (801 of 2142)
PASS: lldb-api :: tools/lldb-server/commandline/TestStubReverseConnect.py (802 of 2142)
PASS: lldb-unit :: SymbolFile/DWARF/./SymbolFileDWARFTests/SymbolFileDWARFTests.TestAbbrevNullAttrValidForm (803 of 2142)
PASS: lldb-unit :: Utility/./UtilityTests/ArgsTest.AppendArguments (804 of 2142)
UNSUPPORTED: lldb-api :: functionalities/data-formatter/data-formatter-stl/libstdcpp/vector/TestDataFormatterStdVector.py (805 of 2142)
PASS: lldb-unit :: SymbolFile/DWARF/./SymbolFileDWARFTests/SymbolFileDWARFTests.TestAbbrevOutOfOrder (806 of 2142)
PASS: lldb-unit :: Utility/./UtilityTests/BinaryStreamTest.PutSLEB128EightBytes (807 of 2142)
PASS: lldb-unit :: Utility/./UtilityTests/ScalarTest.Scalar_512 (808 of 2142)
PASS: lldb-api :: python_api/findvalue_duplist/TestSBFrameFindValue.py (809 of 2142)
PASS: lldb-unit :: Utility/./UtilityTests/StringListTest.ForRange (810 of 2142)
PASS: lldb-unit :: Utility/./UtilityTests/UriParserTest.MinimalPortPath (811 of 2142)
PASS: lldb-unit :: Host/./HostTests/MainLoopTest.ReadObject (812 of 2142)
PASS: lldb-unit :: Utility/./UtilityTests/StatusTest.ErrorConversion (813 of 2142)
PASS: lldb-api :: python_api/disassemble-raw-data/TestDisassembleRawData.py (814 of 2142)
PASS: lldb-unit :: Core/./LLDBCoreTests/CommunicationTest.SynchronizeWhileClosing (815 of 2142)
PASS: lldb-unit :: Language/Highlighting/./HighlighterTests/HighlighterTest.ClangCursorPosEndOfLine (816 of 2142)
PASS: lldb-shell :: SymbolFile/DWARF/dwp-debug-types.s (817 of 2142)
PASS: lldb-unit :: Expression/./ExpressionTests/DWARFExpression.DW_OP_piece (818 of 2142)
UNSUPPORTED: lldb-api :: benchmarks/turnaround/TestCompileRunToBreakpointTurnaround.py (819 of 2142)
PASS: lldb-api :: macosx/nslog/TestDarwinNSLogOutput.py (820 of 2142)
PASS: lldb-api :: macosx/function-starts/TestFunctionStarts.py (821 of 2142)
PASS: lldb-api :: functionalities/tail_call_frames/ambiguous_tail_call_seq2/TestAmbiguousTailCallSeq2.py (822 of 2142)
PASS: lldb-unit :: Utility/./UtilityTests/StatusTest.ErrorConstructor (823 of 2142)
PASS: lldb-unit :: Core/./LLDBCoreTests/RichManglingContextTest.IPDRealloc (824 of 2142)
PASS: lldb-api :: functionalities/data-formatter/data-formatter-skip-summary/TestDataFormatterSkipSummary.py (825 of 2142)
PASS: lldb-unit :: Utility/./UtilityTests/ArchSpecTest.TestParseMachCPUDashSubtypeTripleExtra (826 of 2142)
PASS: lldb-api :: functionalities/breakpoint/debugbreak/TestDebugBreak.py (827 of 2142)
PASS: lldb-api :: functionalities/abbreviation/TestAbbreviations.py (828 of 2142)
PASS: lldb-shell :: Settings/TestSettingsWrite.test (829 of 2142)
PASS: lldb-unit :: Utility/./UtilityTests/StringExtractorTest.GetNameColonValueContainsColon (830 of 2142)
PASS: lldb-api :: functionalities/thread/concurrent_events/TestConcurrentSignalWatch.py (831 of 2142)
PASS: lldb-shell :: ObjectFile/ELF/many-sections.s (832 of 2142)
PASS: lldb-api :: tools/lldb-server/TestLldbGdbServer.py (833 of 2142)
PASS: lldb-api :: lang/objc/objc-static-method-stripped/TestObjCStaticMethodStripped.py (834 of 2142)
PASS: lldb-unit :: Process/minidump/./LLDBMinidumpTests/MinidumpParserTest.MinidumpDuplicateModuleMappedSecond (835 of 2142)
PASS: lldb-unit :: Utility/./UtilityTests/StringListTest.AppendListCStringArray (836 of 2142)
UNSUPPORTED: lldb-shell :: ScriptInterpreter/Lua/io.test (837 of 2142)
PASS: lldb-shell :: SymbolFile/DWARF/find-basic-variable.cpp (838 of 2142)
PASS: lldb-unit :: Utility/./UtilityTests/ArchSpecTest.TestSetTriple (839 of 2142)
PASS: lldb-shell :: SymbolFile/DWARF/debug-types-address-ranges.s (840 of 2142)
PASS: lldb-unit :: UnwindAssembly/x86/./UnwindAssemblyx86Tests/Testx86AssemblyInspectionEngine.TestSubESP (841 of 2142)
PASS: lldb-api :: python_api/sbvalue_const_addrof/TestSBValueConstAddrOf.py (842 of 2142)
PASS: lldb-shell :: ObjectFile/wasm/embedded-debug-sections.yaml (843 of 2142)
PASS: lldb-unit :: Utility/./UtilityTests/NameMatchesTest.Ignore (844 of 2142)
PASS: lldb-api :: functionalities/breakpoint/breakpoint_command/TestRegexpBreakCommand.py (845 of 2142)
PASS: lldb-unit :: Utility/./UtilityTests/StringListTest.JoinNonSpace (846 of 2142)
PASS: lldb-shell :: ObjectFile/ELF/base-address.yaml (847 of 2142)
PASS: lldb-api :: commands/expression/import-std-module/sysroot/TestStdModuleSysroot.py (848 of 2142)
PASS: lldb-shell :: SymbolFile/DWARF/DW_AT_declaration-with-children.s (849 of 2142)
PASS: lldb-unit :: Utility/./UtilityTests/StreamTest.AddressRangeSize (850 of 2142)
UNSUPPORTED: lldb-shell :: SymbolFile/PDB/func-symbols.test (851 of 2142)
PASS: lldb-api :: functionalities/optimized_code/TestNoASanExceptionAfterEvalOP_piece.py (852 of 2142)
PASS: lldb-api :: commands/expression/ir-interpreter/TestIRInterpreter.py (853 of 2142)
PASS: lldb-unit :: Language/Highlighting/./HighlighterTests/HighlighterTest.ClangUnterminatedString (854 of 2142)
PASS: lldb-unit :: Process/minidump/./LLDBMinidumpTests/MinidumpParserTest.GetMemoryRegionInfoFromMemoryList (855 of 2142)
PASS: lldb-unit :: Utility/./UtilityTests/StreamTest.AddressRange (856 of 2142)
PASS: lldb-unit :: Utility/./UtilityTests/ProcessInfoTest.Constructor (857 of 2142)
PASS: lldb-shell :: SymbolFile/symbol-binding.test (858 of 2142)
PASS: lldb-unit :: Utility/./UtilityTests/StringListTest.Clear (859 of 2142)
PASS: lldb-api :: commands/expression/ignore-artificial-constructors/TestIgnoreArtificialConstructors.py (860 of 2142)
UNSUPPORTED: lldb-shell :: ScriptInterpreter/Lua/bindings.test (861 of 2142)
UNSUPPORTED: lldb-shell :: SymbolFile/dissassemble-entry-point.s (862 of 2142)
PASS: lldb-unit :: Symbol/./SymbolTests/DWARFCallFrameInfoTest.Basic_eh (863 of 2142)
UNSUPPORTED: lldb-api :: lang/objc/foundation/TestFoundationDisassembly.py (864 of 2142)
PASS: lldb-unit :: Utility/./UtilityTests/FileSpecTest.EqualDotsPosix (865 of 2142)
PASS: lldb-shell :: Register/x86-64-ymm-read.test (866 of 2142)
PASS: lldb-api :: lang/cpp/char1632_t/TestChar1632T.py (867 of 2142)
PASS: lldb-unit :: UnwindAssembly/x86/./UnwindAssemblyx86Tests/Testx86AssemblyInspectionEngine.TestPopESI (868 of 2142)
PASS: lldb-api :: functionalities/thread/thread_specific_break/TestThreadSpecificBreakpoint.py (869 of 2142)
UNSUPPORTED: lldb-api :: functionalities/darwin_log/format/TestDarwinLogMessageFormat.py (870 of 2142)
PASS: lldb-unit :: Utility/./UtilityTests/AnsiTerminal.AtEnd (871 of 2142)
PASS: lldb-api :: lang/objc/blocks/TestObjCIvarsInBlocks.py (872 of 2142)
PASS: lldb-api :: functionalities/data-formatter/synthupdate/TestSyntheticFilterRecompute.py (873 of 2142)
PASS: lldb-unit :: Utility/./UtilityTests/FileSpecTest.FormatFileSpec (874 of 2142)
PASS: lldb-api :: lang/c/global_variables/TestGlobalVariables.py (875 of 2142)
PASS: lldb-unit :: Signals/./SignalsTests/UnixSignalsTest.VersionChange (876 of 2142)
PASS: lldb-shell :: SymbolFile/DWARF/DW_AT_data_bit_offset-DW_OP_stack_value.s (877 of 2142)
PASS: lldb-unit :: ObjectFile/ELF/./ObjectFileELFTests/ObjectFileELFTest.SectionsResolveConsistently (878 of 2142)
PASS: lldb-unit :: debugserver/./debugserverTests/RNBSocket.LoopBackListenIPv4 (879 of 2142)
PASS: lldb-api :: functionalities/thread/concurrent_events/TestConcurrentTwoBreakpointThreads.py (880 of 2142)
PASS: lldb-api :: commands/expression/xvalue/TestXValuePrinting.py (881 of 2142)
PASS: lldb-api :: lang/objc/objc++/TestObjCXX.py (882 of 2142)
PASS: lldb-unit :: Expression/./ExpressionTests/DiagnosticManagerTest.AppendMessageSubsequentDiags (883 of 2142)
PASS: lldb-api :: lang/cpp/global_variables/TestCPPGlobalVariables.py (884 of 2142)
UNSUPPORTED: lldb-shell :: Register/x86-zmm-read.test (885 of 2142)
PASS: lldb-unit :: Process/minidump/./LLDBMinidumpTests/RegisterContextMinidump.CheckRegisterContextMinidump_ARM (886 of 2142)
PASS: lldb-unit :: Language/CLanguages/./LanguageCLanguagesTests/CLanguages.LookupCLanguagesByLanguageType (887 of 2142)
PASS: lldb-unit :: Core/./LLDBCoreTests/ModuleSpecTest.InvalidInMemoryBuffer (888 of 2142)
PASS: lldb-api :: macosx/simulator/TestSimulatorPlatform.py (889 of 2142)
PASS: lldb-unit :: Utility/./UtilityTests/AnsiTerminal.Twice (890 of 2142)
PASS: lldb-unit :: Symbol/./SymbolTests/TestTypeSystemClang.TestRecordHasFields (891 of 2142)
PASS: lldb-api :: commands/thread/select/TestThreadSelect.py (892 of 2142)
PASS: lldb-api :: lang/cpp/gmodules/TestWithModuleDebugging.py (893 of 2142)
UNSUPPORTED: lldb-shell :: SymbolFile/NativePDB/stack_unwinding01.cpp (894 of 2142)
PASS: lldb-api :: functionalities/reproducers/attach/TestReproducerAttach.py (895 of 2142)
PASS: lldb-shell :: ObjectFile/PECOFF/export-dllfunc.yaml (896 of 2142)
PASS: lldb-unit :: Utility/./UtilityTests/ScalarTest.ExtractBitfield (897 of 2142)
PASS: lldb-api :: functionalities/tail_call_frames/disambiguate_paths_to_common_sink/TestDisambiguatePathsToCommonSink.py (898 of 2142)
PASS: lldb-unit :: Utility/./UtilityTests/StringExtractorTest.GetHexU8_Underflow (899 of 2142)
PASS: lldb-shell :: Reproducer/TestRelativePath.test (900 of 2142)
PASS: lldb-unit :: Utility/./UtilityTests/Flags.Test (901 of 2142)
PASS: lldb-unit :: UnwindAssembly/x86/./UnwindAssemblyx86Tests/Testx86AssemblyInspectionEngine.TestCALLNextInsn (902 of 2142)
UNSUPPORTED: lldb-api :: tools/lldb-vscode/disconnect/TestVSCode_disconnect.py (903 of 2142)
PASS: lldb-shell :: ScriptInterpreter/None/import_module.test (904 of 2142)
PASS: lldb-unit :: Utility/./UtilityTests/BroadcasterTest.BroadcastEvent (905 of 2142)
PASS: lldb-unit :: Utility/./UtilityTests/VMRange.Ordering (906 of 2142)
PASS: lldb-unit :: Symbol/./SymbolTests/TestTypeSystemClang.TestOwningModule (907 of 2142)
PASS: lldb-shell :: ObjectFile/ELF/basic-info.yaml (908 of 2142)
PASS: lldb-unit :: Utility/./UtilityTests/NameMatchesTest.EndsWith (909 of 2142)
PASS: lldb-api :: lang/c/shared_lib_stripped_symbols/TestSharedLibStrippedSymbols.py (910 of 2142)
PASS: lldb-unit :: Symbol/./SymbolTests/PostfixExpression.ToDWARF (911 of 2142)
PASS: lldb-shell :: SymbolFile/NativePDB/global-classes.cpp (912 of 2142)
PASS: lldb-api :: commands/expression/import-std-module/forward_list-dbg-info-content/TestDbgInfoContentForwardListFromStdModule.py (913 of 2142)
PASS: lldb-api :: lang/objc/objc-checker/TestObjCCheckers.py (914 of 2142)
UNSUPPORTED: lldb-api :: commands/gui/viewlarge/TestGuiViewLarge.py (915 of 2142)
PASS: lldb-api :: commands/expression/persistent_types/TestPersistentTypes.py (916 of 2142)
PASS: lldb-api :: iohandler/resize/TestIOHandlerResizeNoEditline.py (917 of 2142)
PASS: lldb-api :: functionalities/tail_call_frames/disambiguate_call_site/TestDisambiguateCallSite.py (918 of 2142)
UNSUPPORTED: lldb-shell :: ObjectFile/PECOFF/disassemble-thumb.yaml (919 of 2142)
PASS: lldb-unit :: ScriptInterpreter/Python/./ScriptInterpreterPythonTests/PythonDataObjectsTest.TestExceptions (920 of 2142)
PASS: lldb-unit :: UnwindAssembly/x86/./UnwindAssemblyx86Tests/Testx86AssemblyInspectionEngine.TestPopEDI (921 of 2142)
PASS: lldb-shell :: SymbolFile/DWARF/debug-types-line-tables.s (922 of 2142)
PASS: lldb-api :: lang/cpp/namespace_definitions/TestNamespaceDefinitions.py (923 of 2142)
PASS: lldb-api :: tools/lldb-server/TestGdbRemote_qThreadStopInfo.py (924 of 2142)
PASS: lldb-api :: functionalities/gdb_remote_client/TestGDBRemoteLoad.py (925 of 2142)
PASS: lldb-api :: commands/command/script/import/TestImport.py (926 of 2142)
PASS: lldb-shell :: ScriptInterpreter/Python/crashlog.test (927 of 2142)
PASS: lldb-unit :: Utility/./UtilityTests/Flags.Reset (928 of 2142)
PASS: lldb-unit :: Utility/./UtilityTests/FileSpecTest.Equal (929 of 2142)
PASS: lldb-api :: functionalities/signal/handle-abrt/TestHandleAbort.py (930 of 2142)
PASS: lldb-unit :: Utility/./UtilityTests/XcodeSDKTest.MergeTest (931 of 2142)
PASS: lldb-unit :: Utility/./UtilityTests/StreamTest.AddressPrefixAndSuffix (932 of 2142)
PASS: lldb-api :: functionalities/breakpoint/step_over_breakpoint/TestStepOverBreakpoint.py (933 of 2142)
PASS: lldb-unit :: Host/./HostTests/FileSystemTest.GetPermissions (934 of 2142)
PASS: lldb-unit :: Host/./HostTests/SocketTest.DomainListenConnectAccept (935 of 2142)
PASS: lldb-unit :: Expression/./ExpressionTests/CppModuleConfigurationTest.LibCppV2 (936 of 2142)
PASS: lldb-api :: functionalities/data-formatter/data-formatter-stl/libcxx/list/loop/TestDataFormatterLibcxxListLoop.py (937 of 2142)
PASS: lldb-api :: functionalities/thread/concurrent_events/TestConcurrentWatchpointWithDelayWatchpointThreads.py (938 of 2142)
PASS: lldb-api :: lang/objc/foundation/TestSymbolTable.py (939 of 2142)
PASS: lldb-api :: commands/expression/issue_11588/Test11588.py (940 of 2142)
PASS: lldb-unit :: Utility/./UtilityTests/EventTest.DumpEventDataBytes (941 of 2142)
PASS: lldb-shell :: Settings/TestDisassemblyFormat.test (942 of 2142)
PASS: lldb-unit :: Utility/./UtilityTests/RecordReplayTest.InstrumentedFooSameThis (943 of 2142)
PASS: lldb-unit :: UnwindAssembly/x86/./UnwindAssemblyx86Tests/Testx86AssemblyInspectionEngine.TestSimplei386ugmented (944 of 2142)
PASS: lldb-api :: functionalities/breakpoint/address_breakpoints/TestAddressBreakpoints.py (945 of 2142)
PASS: lldb-unit :: Utility/./UtilityTests/Flags.AllClear (946 of 2142)
UNSUPPORTED: lldb-shell :: Breakpoint/case-insensitive.test (947 of 2142)
PASS: lldb-api :: tools/lldb-server/TestGdbRemoteHostInfo.py (948 of 2142)
PASS: lldb-api :: functionalities/completion/TestCompletion.py (949 of 2142)
PASS: lldb-unit :: UnwindAssembly/x86/./UnwindAssemblyx86Tests/Testx86AssemblyInspectionEngine.TestPopRBX (950 of 2142)
PASS: lldb-shell :: Driver/TestConvenienceVariables.test (951 of 2142)
PASS: lldb-shell :: SymbolFile/DWARF/DW_AT_const_value-bitfields.s (952 of 2142)
PASS: lldb-unit :: ScriptInterpreter/Python/./ScriptInterpreterPythonTests/PythonDataObjectsTest.TestGlobalNameResolutionWithDot (953 of 2142)
PASS: lldb-api :: functionalities/gdb_remote_client/TestPlatformClient.py (954 of 2142)
PASS: lldb-unit :: Utility/./UtilityTests/LogChannelEnabledTest.log_options (955 of 2142)
PASS: lldb-unit :: Utility/./UtilityTests/GeneratorTest.YamlMultiProvider (956 of 2142)
PASS: lldb-api :: lang/cpp/extern_c/TestExternCSymbols.py (957 of 2142)
PASS: lldb-shell :: Commands/command-disassemble.s (958 of 2142)
PASS: lldb-unit :: Utility/./UtilityTests/Flags.IsClear (959 of 2142)
PASS: lldb-api :: commands/expression/import-std-module/list/TestListFromStdModule.py (960 of 2142)
PASS: lldb-api :: functionalities/thread/concurrent_events/TestConcurrentWatchBreakDelay.py (961 of 2142)
PASS: lldb-api :: lang/objc/modules-non-objc-target/TestObjCModulesNonObjCTarget.py (962 of 2142)
PASS: lldb-unit :: ScriptInterpreter/Python/./ScriptInterpreterPythonTests/PythonDataObjectsTest.TestModuleNameResolutionNoDot (963 of 2142)
PASS: lldb-unit :: Language/Highlighting/./HighlighterTests/HighlighterTest.ClangIdentifiers (964 of 2142)
PASS: lldb-api :: functionalities/plugins/command_plugin/TestPluginCommands.py (965 of 2142)
PASS: lldb-unit :: Utility/./UtilityTests/ArchSpecTest.YAML (966 of 2142)
PASS: lldb-unit :: Process/gdb-remote/./ProcessGdbRemoteTests/GDBRemoteCommunicationClientTest.GetMemoryRegionInfoInvalidResponse (967 of 2142)
PASS: lldb-unit :: Symbol/./SymbolTests/TestClangASTImporter.CopyDeclTagDecl (968 of 2142)
PASS: lldb-api :: functionalities/wrong_commands/TestWrongCommands.py (969 of 2142)
PASS: lldb-shell :: Driver/TestSingleQuote.test (970 of 2142)
PASS: lldb-unit :: Utility/./UtilityTests/StreamTeeTest.Constructor2Streams (971 of 2142)
PASS: lldb-unit :: Utility/./UtilityTests/BinaryStreamTest.PutSLEB128OneByte (972 of 2142)
PASS: lldb-api :: sanity/TestModuleCacheSanity.py (973 of 2142)
PASS: lldb-unit :: Symbol/./SymbolTests/DWARFCallFrameInfoTest.Basic_dwarf4 (974 of 2142)
PASS: lldb-unit :: Utility/./UtilityTests/StreamTest.QuotedCString (975 of 2142)
PASS: lldb-api :: lang/objc/objc-new-syntax/TestObjCNewSyntaxArray.py (976 of 2142)
PASS: lldb-unit :: Utility/./UtilityTests/DataExtractorTest.GetBitfield (977 of 2142)
PASS: lldb-api :: functionalities/postmortem/elf-core/thread_crash/TestLinuxCoreThreads.py (978 of 2142)
PASS: lldb-api :: commands/expression/import-std-module/unique_ptr/TestUniquePtrFromStdModule.py (979 of 2142)
PASS: lldb-unit :: Process/minidump/./LLDBMinidumpTests/MinidumpParserTest.GetMiscInfoWindows (980 of 2142)
PASS: lldb-unit :: Utility/./UtilityTests/FileSpecTest.RemoveLastPathComponent (981 of 2142)
PASS: lldb-unit :: Interpreter/./InterpreterTests/CompletionTest.DirCompletionAbsolute (982 of 2142)
PASS: lldb-unit :: Utility/./UtilityTests/RecordReplayTest.InstrumentedBarRef (983 of 2142)
PASS: lldb-unit :: Process/minidump/./LLDBMinidumpTests/MinidumpParserTest.GetThreadContext_x86_32 (984 of 2142)
PASS: lldb-unit :: Utility/./UtilityTests/StringExtractorTest.DecodeHexU8_Underflow (985 of 2142)
PASS: lldb-unit :: Utility/./UtilityTests/BinaryStreamTest.PutSLEB128NineBytes (986 of 2142)
PASS: lldb-unit :: Expression/./ExpressionTests/CppModuleConfigurationTest.Sysroot (987 of 2142)
UNSUPPORTED: lldb-api :: functionalities/tty/TestTerminal.py (988 of 2142)
UNSUPPORTED: lldb-shell :: SymbolFile/PDB/variables.test (989 of 2142)
PASS: lldb-shell :: SymbolFile/DWARF/debug_loc.s (990 of 2142)
PASS: lldb-api :: commands/expression/import-std-module/no-std-module/TestMissingStdModule.py (991 of 2142)
PASS: lldb-unit :: Utility/./UtilityTests/StreamTeeTest.SetStreamAtIndexOverwrite (992 of 2142)
PASS: lldb-api :: commands/watchpoints/step_over_watchpoint/TestStepOverWatchpoint.py (993 of 2142)
PASS: lldb-api :: python_api/lldbutil/TestSwigVersion.py (994 of 2142)
PASS: lldb-api :: lang/objc/objc-runtime-ivars/TestRuntimeIvars.py (995 of 2142)
PASS: lldb-shell :: SymbolFile/DWARF/dir-separator-windows.s (996 of 2142)
PASS: lldb-api :: functionalities/data-formatter/data-formatter-objc/TestDataFormatterObjCKVO.py (997 of 2142)
UNSUPPORTED: lldb-shell :: SymbolFile/PDB/vbases.test (998 of 2142)
PASS: lldb-unit :: UnwindAssembly/x86/./UnwindAssemblyx86Tests/Testx86AssemblyInspectionEngine.TestPushEAX (999 of 2142)
PASS: lldb-unit :: Utility/./UtilityTests/ArgsTest.StringListConstructor (1000 of 2142)
PASS: lldb-shell :: Reproducer/TestReuseDirectory.test (1001 of 2142)
PASS: lldb-api :: functionalities/data-formatter/data-formatter-stl/libcxx/unique_ptr/TestDataFormatterLibcxxUniquePtr.py (1002 of 2142)
PASS: lldb-api :: lang/cpp/breakpoint_in_member_func_w_non_primitive_params/TestBreakpointInMemberFuncWNonPrimitiveParams.py (1003 of 2142)
PASS: lldb-api :: macosx/lc-note/kern-ver-str/TestKernVerStrLCNOTE.py (1004 of 2142)
PASS: lldb-api :: lang/cpp/multiple-inheritance/TestCppMultipleInheritance.py (1005 of 2142)
PASS: lldb-unit :: Process/gdb-remote/./ProcessGdbRemoteTests/GDBRemoteCommunicationClientTest.GetQOffsets (1006 of 2142)
UNSUPPORTED: lldb-api :: functionalities/ubsan/user-expression/TestUbsanUserExpression.py (1007 of 2142)
PASS: lldb-unit :: Symbol/./SymbolTests/PostfixExpression.ParseOneExpression (1008 of 2142)
PASS: lldb-unit :: UnwindAssembly/x86/./UnwindAssemblyx86Tests/Testx86AssemblyInspectionEngine.Testi386IgnoredRegisters (1009 of 2142)
PASS: lldb-api :: commands/expression/timeout/TestCallWithTimeout.py (1010 of 2142)
PASS: lldb-unit :: Expression/./ExpressionTests/DiagnosticManagerTest.HasFixits (1011 of 2142)
PASS: lldb-unit :: Utility/./UtilityTests/VASprintfTest.BufferResize (1012 of 2142)
PASS: lldb-unit :: Utility/./UtilityTests/SerializationRountripTest.SerializeDeserializeCStringArray (1013 of 2142)
PASS: lldb-api :: lang/cpp/this_class_type_mixing/TestThisClassTypeMixing.py (1014 of 2142)
PASS: lldb-unit :: Utility/./UtilityTests/SerializationRountripTest.SerializeDeserializeCString (1015 of 2142)
PASS: lldb-api :: commands/expression/po_verbosity/TestPoVerbosity.py (1016 of 2142)
PASS: lldb-api :: tools/lldb-vscode/breakpoint/TestVSCode_setFunctionBreakpoints.py (1017 of 2142)
PASS: lldb-unit :: Host/./HostTests/NativeProcessProtocolTest.ReadCStringFromMemory_CrossPageBoundary (1018 of 2142)
PASS: lldb-unit :: Utility/./UtilityTests/ScalarTest.APIntConstructor (1019 of 2142)
PASS: lldb-unit :: debugserver/./debugserverTests/RNBSocket.LoopBackConnectIPv6 (1020 of 2142)
PASS: lldb-unit :: Symbol/./SymbolTests/TestTypeSystemClang.TestGetEnumIntegerTypeBasicTypes (1021 of 2142)
PASS: lldb-unit :: Utility/./UtilityTests/StringListTest.InsertStringAtIndexOutOfBounds (1022 of 2142)
PASS: lldb-unit :: DataFormatter/./LLDBFormatterTests/TypeMatcherTests.CreatedBySameMatchStringExactNamePrefixes (1023 of 2142)
PASS: lldb-unit :: Utility/./UtilityTests/DataExtractorTest.GetSLEB128_bit63 (1024 of 2142)
PASS: lldb-api :: lang/c/anonymous/TestAnonymous.py (1025 of 2142)
PASS: lldb-api :: functionalities/thread/concurrent_events/TestConcurrentSignalDelayWatch.py (1026 of 2142)
PASS: lldb-unit :: Utility/./UtilityTests/StringExtractorTest.GetHexBytes_OddPair2 (1027 of 2142)
PASS: lldb-api :: commands/watchpoints/watchpoint_disable/TestWatchpointDisable.py (1028 of 2142)
PASS: lldb-unit :: Utility/./UtilityTests/UriParserTest.LongPath (1029 of 2142)
PASS: lldb-unit :: SymbolFile/DWARF/./SymbolFileDWARFTests/SymbolFileDWARFTests.ParseAranges (1030 of 2142)
PASS: lldb-unit :: Process/minidump/./LLDBMinidumpTests/MinidumpParserTest.GetExceptionStream (1031 of 2142)
PASS: lldb-api :: lang/cpp/virtual-overload/TestVirtualOverload.py (1032 of 2142)
PASS: lldb-shell :: Quit/TestQuitExitCodeHex0.test (1033 of 2142)
PASS: lldb-unit :: UnwindAssembly/x86/./UnwindAssemblyx86Tests/Testx86AssemblyInspectionEngine.TestStackRealign8BitDisp_i386 (1034 of 2142)
PASS: lldb-api :: lang/c/enum_types/TestEnumTypes.py (1035 of 2142)
PASS: lldb-unit :: Host/./HostTests/FileSystemTest.MakeAbsolute (1036 of 2142)
PASS: lldb-unit :: Utility/./UtilityTests/SubsystemRAIITest.NormalSubsystem (1037 of 2142)
PASS: lldb-unit :: Symbol/./SymbolTests/PostfixExpression.ParseFPOProgram (1038 of 2142)
PASS: lldb-unit :: Process/minidump/./LLDBMinidumpTests/MinidumpParserTest.GetArchitecture (1039 of 2142)
PASS: lldb-api :: functionalities/data-formatter/parray/TestPrintArray.py (1040 of 2142)
UNSUPPORTED: lldb-shell :: ScriptInterpreter/Lua/lua.test (1041 of 2142)
PASS: lldb-api :: lang/cpp/const_this/TestConstThis.py (1042 of 2142)
PASS: lldb-shell :: ObjectFile/ELF/section-overlap.yaml (1043 of 2142)
PASS: lldb-unit :: Utility/./UtilityTests/StreamTest.PutBytesAsRawHex8ToLittleEndian (1044 of 2142)
PASS: lldb-api :: functionalities/thread/concurrent_events/TestConcurrentManyCrash.py (1045 of 2142)
PASS: lldb-shell :: Reproducer/TestDriverOptions.test (1046 of 2142)
UNSUPPORTED: lldb-api :: commands/expression/macros/TestMacros.py (1047 of 2142)
PASS: lldb-unit :: SymbolFile/NativePDB/./SymbolFileNativePDBTests/PDBFPOProgramToDWARFExpressionTests.MultipleDependentAssignments (1048 of 2142)
PASS: lldb-api :: lang/objc/objc-super/TestObjCSuper.py (1049 of 2142)
PASS: lldb-unit :: UnwindAssembly/x86/./UnwindAssemblyx86Tests/Testx86AssemblyInspectionEngine.TestPushRBX (1050 of 2142)
PASS: lldb-shell :: SymbolFile/DWARF/debug_rnglists-dwo.s (1051 of 2142)
PASS: lldb-api :: functionalities/data-formatter/data-formatter-caching/TestDataFormatterCaching.py (1052 of 2142)
PASS: lldb-shell :: SymbolFile/DWARF/gnu-style-compression.cpp (1053 of 2142)
PASS: lldb-unit :: Utility/./UtilityTests/SerializationRountripTest.SerializeDeserializePodReferences (1054 of 2142)
UNSUPPORTED: lldb-shell :: Unwind/eh-frame-augment-noop.test (1055 of 2142)
PASS: lldb-unit :: Utility/./UtilityTests/SerializationRountripTest.SerializeDeserializePod (1056 of 2142)
PASS: lldb-api :: types/TestFloatTypesExpr.py (1057 of 2142)
PASS: lldb-unit :: Utility/./UtilityTests/LogTest.LLDB_LOG_nullptr (1058 of 2142)
PASS: lldb-api :: lang/cpp/inlines/TestInlines.py (1059 of 2142)
UNSUPPORTED: lldb-shell :: Unwind/unwind-plan-dwarf-dump.test (1060 of 2142)
PASS: lldb-api :: functionalities/breakpoint/breakpoint_command/TestBreakpointCommandsFromPython.py (1061 of 2142)
PASS: lldb-unit :: Symbol/./SymbolTests/TestTypeSystemClang.TestGetBasicTypeFromEnum (1062 of 2142)
PASS: lldb-shell :: Settings/TestFrameFormatNoColor.test (1063 of 2142)
PASS: lldb-api :: functionalities/thread/concurrent_events/TestConcurrentDelayWatchBreak.py (1064 of 2142)
PASS: lldb-api :: functionalities/target-new-solib-notifications/TestModuleLoadedNotifys.py (1065 of 2142)
PASS: lldb-api :: functionalities/data-formatter/data-formatter-stl/libcxx/tuple/TestDataFormatterLibcxxTuple.py (1066 of 2142)
PASS: lldb-api :: functionalities/set-data/TestSetData.py (1067 of 2142)
PASS: lldb-unit :: API/./APITests/SBCommandInterpreterTest.SingleWordCommand (1068 of 2142)
PASS: lldb-api :: functionalities/data-formatter/data-formatter-objc/TestDataFormatterObjCNSBundle.py (1069 of 2142)
PASS: lldb-shell :: SymbolFile/DWARF/debug-names-compressed.cpp (1070 of 2142)
UNSUPPORTED: lldb-api :: benchmarks/libcxxlist/TestBenchmarkLibcxxList.py (1071 of 2142)
PASS: lldb-api :: functionalities/data-formatter/data-formatter-named-summaries/TestDataFormatterNamedSummaries.py (1072 of 2142)
PASS: lldb-unit :: Signals/./SignalsTests/UnixSignalsTest.GetFilteredSignals (1073 of 2142)
PASS: lldb-api :: functionalities/inferior-assert/TestInferiorAssert.py (1074 of 2142)
PASS: lldb-api :: tools/lldb-server/TestGdbRemoteKill.py (1075 of 2142)
PASS: lldb-unit :: Utility/./UtilityTests/SubsystemRAIITest.SubsystemWithErrorSuccess (1076 of 2142)
PASS: lldb-api :: functionalities/inferior-crashing/recursive-inferior/TestRecursiveInferiorStep.py (1077 of 2142)
PASS: lldb-unit :: Utility/./UtilityTests/StringExtractorTest.InitEmpty (1078 of 2142)
PASS: lldb-unit :: SymbolFile/DWARF/./SymbolFileDWARFTests/SymbolFileDWARFTests.TestAbbrevMissingTerminator (1079 of 2142)
PASS: lldb-api :: types/TestRecursiveTypes.py (1080 of 2142)
PASS: lldb-unit :: Core/./LLDBCoreTests/UniqueCStringMap.NoDefaultConstructor (1081 of 2142)
PASS: lldb-shell :: Watchpoint/SetErrorCases.test (1082 of 2142)
PASS: lldb-api :: functionalities/breakpoint/breakpoint_language/TestBreakpointLanguage.py (1083 of 2142)
PASS: lldb-shell :: SymbolFile/DWARF/clang-ast-from-dwarf-objc-property.m (1084 of 2142)
PASS: lldb-api :: functionalities/postmortem/netbsd-core/TestNetBSDCore.py (1085 of 2142)
PASS: lldb-unit :: Utility/./UtilityTests/ReproducerTest.SetCapture (1086 of 2142)
PASS: lldb-api :: commands/frame/diagnose/bad-reference/TestBadReference.py (1087 of 2142)
PASS: lldb-api :: python_api/debugger/TestDebuggerAPI.py (1088 of 2142)
PASS: lldb-unit :: Target/./TargetTests/MemoryRegionInfoTest.Formatv (1089 of 2142)
PASS: lldb-api :: lang/objc/objc-stepping/TestObjCStepping.py (1090 of 2142)
PASS: lldb-unit :: ObjectFile/ELF/./ObjectFileELFTests/ObjectFileELFTest.GetModuleSpecifications_EarlySectionHeaders (1091 of 2142)
PASS: lldb-unit :: Utility/./UtilityTests/ArgsTest.DoubleQuotedItem (1092 of 2142)
PASS: lldb-api :: python_api/class_members/TestSBTypeClassMembers.py (1093 of 2142)
PASS: lldb-unit :: Utility/./UtilityTests/StreamTeeTest.Assignment (1094 of 2142)
PASS: lldb-shell :: ObjectFile/ELF/PT_LOAD-overlap-PT_TLS.yaml (1095 of 2142)
PASS: lldb-shell :: SymbolFile/NativePDB/nested-types.cpp (1096 of 2142)
PASS: lldb-shell :: ObjectFile/ELF/PT_LOAD.yaml (1097 of 2142)
UNSUPPORTED: lldb-shell :: ScriptInterpreter/Lua/convenience_variables.test (1098 of 2142)
PASS: lldb-unit :: Utility/./UtilityTests/RangeTest.Clear (1099 of 2142)
PASS: lldb-api :: lang/cpp/namespace/TestNamespaceLookup.py (1100 of 2142)
PASS: lldb-shell :: ObjectFile/ELF/compressed-sections.yaml (1101 of 2142)
PASS: lldb-api :: functionalities/fat_archives/TestFatArchives.py (1102 of 2142)
UNSUPPORTED: lldb-api :: benchmarks/expression/TestExpressionCmd.py (1103 of 2142)
PASS: lldb-unit :: Utility/./UtilityTests/StringExtractorTest.DecodeHexU8_InvalidHex (1104 of 2142)
PASS: lldb-unit :: Utility/./UtilityTests/StringListTest.Join (1105 of 2142)
PASS: lldb-api :: types/TestCharTypeExpr.py (1106 of 2142)
PASS: lldb-api :: commands/session/save/TestSessionSave.py (1107 of 2142)
PASS: lldb-api :: commands/gui/invalid-args/TestInvalidArgsGui.py (1108 of 2142)
PASS: lldb-unit :: Symbol/./SymbolTests/TestTypeSystemClang.TestFunctionTemplateConstruction (1109 of 2142)
PASS: lldb-unit :: Utility/./UtilityTests/StringListTest.AppendStringStdString (1110 of 2142)
PASS: lldb-unit :: Symbol/./SymbolTests/TestTypeSystemClang.TestFunctionTemplateInRecordConstruction (1111 of 2142)
PASS: lldb-unit :: Utility/./UtilityTests/StreamTest.PutMaxHex64ByteOrderLittle (1112 of 2142)
PASS: lldb-unit :: Interpreter/./InterpreterTests/OptionArgParserTest.toScriptLanguage (1113 of 2142)
PASS: lldb-api :: functionalities/thread/create_after_attach/TestCreateAfterAttach.py (1114 of 2142)
UNSUPPORTED: lldb-api :: linux/add-symbols/TestTargetSymbolsAddCommand.py (1115 of 2142)
PASS: lldb-unit :: SymbolFile/DWARF/./SymbolFileDWARFTests/XcodeSDKModuleTests.TestModuleGetXcodeSDK (1116 of 2142)
PASS: lldb-shell :: SymbolFile/DWARF/find-qualified-variable.cpp (1117 of 2142)
PASS: lldb-unit :: Language/CPlusPlus/./LanguageCPlusPlusTests/CPlusPlusLanguage.ExtractContextAndIdentifier (1118 of 2142)
PASS: lldb-api :: functionalities/gdb_remote_client/TestJLink6Armv7RegisterDefinition.py (1119 of 2142)
PASS: lldb-unit :: Process/gdb-remote/./ProcessGdbRemoteTests/GDBRemoteClientBaseTest.SendContinueAndLateInterrupt (1120 of 2142)
PASS: lldb-unit :: UnwindAssembly/x86/./UnwindAssemblyx86Tests/Testx86AssemblyInspectionEngine.TestPushExtended (1121 of 2142)
PASS: lldb-unit :: Utility/./UtilityTests/StreamTest.PutCString (1122 of 2142)
PASS: lldb-unit :: Utility/./UtilityTests/Predicate.WaitForValueEqualTo (1123 of 2142)
PASS: lldb-unit :: Utility/./UtilityTests/UriParserTest.PortOverflow (1124 of 2142)
PASS: lldb-unit :: Interpreter/./InterpreterTests/OptionArgParserTest.toChar (1125 of 2142)
PASS: lldb-api :: commands/frame/select/TestFrameSelect.py (1126 of 2142)
PASS: lldb-unit :: Utility/./UtilityTests/StreamTest.PutCStringWithStringRef (1127 of 2142)
PASS: lldb-api :: functionalities/process_group/TestChangeProcessGroup.py (1128 of 2142)
PASS: lldb-api :: functionalities/float-display/TestFloatDisplay.py (1129 of 2142)
PASS: lldb-unit :: Utility/./UtilityTests/StringListTest.DefaultConstructor (1130 of 2142)
PASS: lldb-unit :: Language/Highlighting/./HighlighterTests/HighlighterTest.ClangSquareBrackets (1131 of 2142)
PASS: lldb-unit :: Utility/./UtilityTests/CompletionRequest.TryCompleteCurrentArgMode (1132 of 2142)
PASS: lldb-unit :: Expression/./ExpressionTests/DiagnosticManagerTest.FixedExpression (1133 of 2142)
PASS: lldb-api :: commands/watchpoints/watchpoint_size/TestWatchpointSizes.py (1134 of 2142)
PASS: lldb-unit :: Breakpoint/./LLDBBreakpointTests/BreakpointIDTest.StringIsBreakpointName (1135 of 2142)
PASS: lldb-unit :: Symbol/./SymbolTests/TestClangASTImporter.MetadataPropagation (1136 of 2142)
PASS: lldb-unit :: Host/./HostTests/NativeProcessProtocolTest.SetBreakpointFailVerify (1137 of 2142)
UNSUPPORTED: lldb-shell :: Register/x86-ymm-read.test (1138 of 2142)
PASS: lldb-shell :: Quit/TestQuitExitCodeHexA.test (1139 of 2142)
FAIL: lldb-api :: commands/target/stop-hooks/TestStopHookScripted.py (1140 of 2142)
******************** TEST 'lldb-api :: commands/target/stop-hooks/TestStopHookScripted.py' FAILED ********************
Script:
--
/Users/buildslave/jenkins/workspace/lldb-cmake-sanitized/lldb-build/lldb-test-build.noindex/copied-python /Users/buildslave/jenkins/workspace/lldb-cmake-sanitized/llvm-project/lldb/test/API/dotest.py -s /Users/buildslave/jenkins/workspace/lldb-cmake-sanitized/lldb-build/lldb-test-traces -S nm -u CXXFLAGS -u CFLAGS --codesign-identity lldb_codesign --server /Users/buildslave/jenkins/workspace/lldb-cmake-sanitized/lldb-build/./bin/debugserver --arch x86_64 --build-dir /Users/buildslave/jenkins/workspace/lldb-cmake-sanitized/lldb-build/lldb-test-build.noindex -s=/Users/buildslave/jenkins/workspace/lldb-cmake-sanitized/test/logs -t --env TERM=vt100 --env LLVM_LIBS_DIR=/Users/buildslave/jenkins/workspace/lldb-cmake-sanitized/lldb-build/./lib --inferior-env ASAN_OPTIONS=detect_stack_use_after_return=1 --inferior-env DYLD_INSERT_LIBRARIES=/Users/buildslave/jenkins/workspace/lldb-cmake-sanitized/host-compiler/lib/clang/12.0.0/lib/darwin/libclang_rt.asan_osx_dynamic.dylib --arch x86_64 --build-dir /Users/buildslave/jenkins/workspace/lldb-cmake-sanitized/lldb-build/lldb-test-build.noindex --lldb-module-cache-dir /Users/buildslave/jenkins/workspace/lldb-cmake-sanitized/lldb-build/lldb-test-build.noindex/module-cache-lldb/lldb-api --clang-module-cache-dir /Users/buildslave/jenkins/workspace/lldb-cmake-sanitized/lldb-build/lldb-test-build.noindex/module-cache-clang/lldb-api --executable /Users/buildslave/jenkins/workspace/lldb-cmake-sanitized/lldb-build/./bin/lldb --compiler /Users/buildslave/jenkins/workspace/lldb-cmake-sanitized/lldb-build/./bin/clang --dsymutil /Users/buildslave/jenkins/workspace/lldb-cmake-sanitized/lldb-build/./bin/dsymutil --filecheck /Users/buildslave/jenkins/workspace/lldb-cmake-sanitized/lldb-build/./bin/FileCheck --yaml2obj /Users/buildslave/jenkins/workspace/lldb-cmake-sanitized/lldb-build/./bin/yaml2obj --lldb-libs-dir /Users/buildslave/jenkins/workspace/lldb-cmake-sanitized/lldb-build/./lib /Users/buildslave/jenkins/workspace/lldb-cmake-sanitized/llvm-project/lldb/test/API/commands/target/stop-hooks -p TestStopHookScripted.py
--
Exit Code: 1

Hide Details

Command Output (stdout): -- lldb version 12.0.99 clang revision 546e460a00a985ce6fca323fe509f7d4e893b621 llvm revision 546e460a00a985ce6fca323fe509f7d4e893b621 libstdcxx tests will not be run because: Don't know how to build with libstdcxx on macosx Skipping following debug info categories: ['dwo'] Running command: target stop-hook add -P stop_hook.stop_handler -k increment -v 5 -k return_false -v 1 -n step_out_of_me I have stopped 1 times.

Hide Details

-- Command Output (stderr): --

Hide Details

Session logs for test failures/errors/unexpected successes will go into directory '/Users/buildslave/jenkins/workspace/lldb-cmake-sanitized/test/logs' Change dir to: /Users/buildslave/jenkins/workspace/lldb-cmake-sanitized/llvm-project/lldb/test/API/commands/target/stop-hooks runCmd: settings clear -all output:

Hide Details

runCmd: settings set symbols.enable-external-lookup false output:

Hide Details

runCmd: settings set target.inherit-tcc true output:

Hide Details

runCmd: settings set target.auto-apply-fixits false output:

Hide Details

runCmd: settings set plugin.process.gdb-remote.packet-timeout 60 output:

Hide Details

runCmd: settings set symbols.clang-modules-cache-path "/Users/buildslave/jenkins/workspace/lldb-cmake-sanitized/lldb-build/lldb-test-build.noindex/module-cache-lldb/lldb-api" output:

Hide Details

runCmd: settings set use-color false output:

Hide Details

runCmd: setting set target.prefer-dynamic-value no-dynamic-values output:

Hide Details

runCmd: settings set target.env-vars ASAN_OPTIONS=detect_stack_use_after_return=1 DYLD_INSERT_LIBRARIES=/Users/buildslave/jenkins/workspace/lldb-cmake-sanitized/host-compiler/lib/clang/12.0.0/lib/darwin/libclang_rt.asan_osx_dynamic.dylib output:

Hide Details

runCmd: settings set target.env-vars ASAN_OPTIONS=detect_stack_use_after_return=1 DYLD_INSERT_LIBRARIES=/Users/buildslave/jenkins/workspace/lldb-cmake-sanitized/host-compiler/lib/clang/12.0.0/lib/darwin/libclang_rt.asan_osx_dynamic.dylib output:

Hide Details

FAIL: LLDB (/Users/buildslave/jenkins/workspace/lldb-cmake-sanitized/lldb-build/bin/clang-x86_64) :: test_stop_hooks_scripted_return_false (TestStopHookScripted.TestStopHooks) <bound method SBProcess.Kill of <lldb.SBProcess; proxy of <Swig Object of type 'lldb::SBProcess *' at 0x11467b6c0> >>: success

Hide Details

Restore dir to: /Users/buildslave/jenkins/workspace/lldb-cmake-sanitized/lldb-build/tools/lldb/test ====================================================================== FAIL: test_stop_hooks_scripted_return_false (TestStopHookScripted.TestStopHooks) Test that the returning False from a stop hook works ---------------------------------------------------------------------- Traceback (most recent call last): File "/Users/buildslave/jenkins/workspace/lldb-cmake-sanitized/llvm-project/lldb/test/API/commands/target/stop-hooks/TestStopHookScripted.py", line 54, in test_stop_hooks_scripted_return_false self.do_test_auto_continue(True) File "/Users/buildslave/jenkins/workspace/lldb-cmake-sanitized/llvm-project/lldb/test/API/commands/target/stop-hooks/TestStopHookScripted.py", line 91, in do_test_auto_continue self.assertEqual("main", func_name, "Didn't stop at the expected function.") AssertionError: 'main' != 'step_out_of_me' - main+ step_out_of_me : Didn't stop at the expected function. Config=x86_64-/Users/buildslave/jenkins/workspace/lldb-cmake-sanitized/lldb-build/bin/clang ---------------------------------------------------------------------- Ran 1 test in 3.155s

Hide Details

RESULT: FAILED (0 passes, 1 failures, 0 errors, 0 skipped, 0 expected failures, 0 unexpected successes)

Hide Details

--

Hide Details

******************** PASS: lldb-api :: python_api/frame/inlines/TestInlinedFrame.py (1141 of 2142) PASS: lldb-unit :: Expression/./ExpressionTests/DiagnosticManagerTest.GetStringPreserveOrder (1142 of 2142) PASS: lldb-unit :: Process/gdb-remote/./ProcessGdbRemoteTests/GDBRemoteClientBaseTest.SendContinueAndInterrupt2PacketBug (1143 of 2142) PASS: lldb-unit :: Utility/./UtilityTests/StreamTest.AddressPrefix (1144 of 2142) PASS: lldb-unit :: SymbolFile/DWARF/./SymbolFileDWARFTests/SymbolFileDWARFTests.TestAbilitiesForDWARF (1145 of 2142) PASS: lldb-unit :: Language/Highlighting/./HighlighterTests/HighlighterTest.DefaultHighlighterWithCursor (1146 of 2142) PASS: lldb-unit :: Utility/./UtilityTests/IndexToObjectTest.ObjectForIndex (1147 of 2142) PASS: lldb-unit :: Utility/./UtilityTests/StringExtractorTest.GetHexU8_Extra (1148 of 2142) PASS: lldb-shell :: Breakpoint/case-sensitive.test (1149 of 2142) PASS: lldb-api :: functionalities/value_md5_crash/TestValueMD5Crash.py (1150 of 2142) UNSUPPORTED: lldb-shell :: Watchpoint/netbsd-nouserdbregs.test (1151 of 2142) PASS: lldb-unit :: Process/gdb-remote/./ProcessGdbRemoteTests/GDBRemoteClientBaseTest.SendPacketAndReceiveResponseWithOutputSupport (1152 of 2142) PASS: lldb-shell :: Minidump/memory-region.yaml (1153 of 2142) PASS: lldb-shell :: Reproducer/TestHomeDir.test (1154 of 2142) PASS: lldb-api :: functionalities/data-formatter/pyobjsynthprovider/TestPyObjSynthProvider.py (1155 of 2142) UNSUPPORTED: lldb-api :: linux/mix-dwo-and-regular-objects/TestMixedDwarfBinary.py (1156 of 2142) PASS: lldb-api :: lang/cpp/exceptions/TestCPPExceptionBreakpoints.py (1157 of 2142) PASS: lldb-api :: lang/objc/modules-app-update/TestClangModulesAppUpdate.py (1158 of 2142) PASS: lldb-unit :: Utility/./UtilityTests/StringExtractorTest.GetHexBytes_OddPair (1159 of 2142) PASS: lldb-api :: lang/objc/variadic_methods/TestVariadicMethods.py (1160 of 2142) PASS: lldb-unit :: Language/Highlighting/./HighlighterTests/HighlighterTest.Colons (1161 of 2142) PASS: lldb-unit :: Utility/./UtilityTests/FileSpecTest.EqualSeparator (1162 of 2142) PASS: lldb-unit :: Utility/./UtilityTests/FileSpecTest.GetPath (1163 of 2142) PASS: lldb-unit :: Utility/./UtilityTests/StreamTeeTest.GetStreamAtIndexOutOfBoundsEmpty (1164 of 2142) PASS: lldb-unit :: Utility/./UtilityTests/ScalarTest.GetBytes (1165 of 2142) PASS: lldb-unit :: UnwindAssembly/x86/./UnwindAssemblyx86Tests/Testx86AssemblyInspectionEngine.Test32bitFramelessBigStackFrame (1166 of 2142) PASS: lldb-api :: functionalities/thread/backtrace_limit/TestBacktraceLimit.py (1167 of 2142) PASS: lldb-api :: functionalities/breakpoint/cpp/TestCPPBreakpointLocations.py (1168 of 2142) PASS: lldb-unit :: Utility/./UtilityTests/ArgsTest.TestSingleArg (1169 of 2142) PASS: lldb-api :: functionalities/data-formatter/data-formatter-objc/cmtime/TestDataFormatterCMTime.py (1170 of 2142) PASS: lldb-unit :: Symbol/./SymbolTests/TestClangASTImporter.MetadataPropagationIndirectImport (1171 of 2142) PASS: lldb-unit :: ScriptInterpreter/Python/./ScriptInterpreterPythonTests/PythonDataObjectsTest.TestPythonListValueEquality (1172 of 2142) PASS: lldb-unit :: Host/./HostTests/FileSystemTest.OpenErrno (1173 of 2142) PASS: lldb-api :: commands/expression/rdar42038760/TestScalarURem.py (1174 of 2142) PASS: lldb-unit :: Utility/./UtilityTests/LogChannelTest.EnableOptions (1175 of 2142) PASS: lldb-unit :: Utility/./UtilityTests/UUIDTest.RelationalOperators (1176 of 2142) PASS: lldb-unit :: Process/gdb-remote/./ProcessGdbRemoteTests/GDBRemoteClientBaseTest.SendContinueDelegateStructuredDataReceipt (1177 of 2142) PASS: lldb-api :: functionalities/breakpoint/breakpoint_options/TestBreakpointOptions.py (1178 of 2142) PASS: lldb-unit :: UnwindAssembly/x86/./UnwindAssemblyx86Tests/Testx86AssemblyInspectionEngine.Test32bitFramelessSmallStackFrame (1179 of 2142) PASS: lldb-api :: functionalities/data-formatter/builtin-formats/TestBuiltinFormats.py (1180 of 2142) PASS: lldb-api :: commands/expression/char/TestExprsChar.py (1181 of 2142) PASS: lldb-api :: functionalities/data-formatter/type_summary_list_script/TestTypeSummaryListScript.py (1182 of 2142) PASS: lldb-api :: functionalities/data-formatter/data-formatter-stl/libstdcpp/unique_ptr/invalid/TestDataFormatterInvalidStdUniquePtr.py (1183 of 2142) PASS: lldb-api :: lang/c/function_types/TestFunctionTypes.py (1184 of 2142) PASS: lldb-unit :: Utility/./UtilityTests/PassiveReplayTest.InstrumentedBarRef (1185 of 2142) PASS: lldb-api :: lang/objcxx/class-name-clash/TestNameClash.py (1186 of 2142) PASS: lldb-shell :: SymbolFile/DWARF/find-method.cpp (1187 of 2142) PASS: lldb-unit :: Process/minidump/./LLDBMinidumpTests/MinidumpParserTest.GetThreadContext_x86_64 (1188 of 2142) PASS: lldb-unit :: Utility/./UtilityTests/StringExtractorTest.GetHexBytesAvail_Underflow (1189 of 2142) PASS: lldb-api :: lang/objc/exceptions/TestObjCExceptions.py (1190 of 2142) PASS: lldb-api :: functionalities/thread/concurrent_events/TestConcurrentTwoWatchpointThreads.py (1191 of 2142) PASS: lldb-unit :: Utility/./UtilityTests/StreamTest.PutHex64ByteOrderLittle (1192 of 2142) PASS: lldb-unit :: ScriptInterpreter/Python/./ScriptInterpreterPythonTests/PythonDataObjectsTest.TestScript (1193 of 2142) PASS: lldb-unit :: ObjectFile/ELF/./ObjectFileELFTests/ObjectFileELFTest.GetSymtab_NoSymEntryPointArmThumbAddressClass (1194 of 2142) PASS: lldb-unit :: Utility/./UtilityTests/StringLexerTest.GetUnlexed (1195 of 2142) PASS: lldb-unit :: Process/gdb-remote/./ProcessGdbRemoteTests/GDBRemoteCommunicationServerTest.SendErrorResponse_UnimplementedError (1196 of 2142) PASS: lldb-api :: lang/cpp/frame-var-anon-unions/TestFrameVariableAnonymousUnions.py (1197 of 2142) PASS: lldb-unit :: Utility/./UtilityTests/RecordReplayTest.InstrumentedBar (1198 of 2142) UNSUPPORTED: lldb-api :: functionalities/breakpoint/hardware_breakpoints/hardware_breakpoint_on_multiple_threads/TestHWBreakMultiThread.py (1199 of 2142) PASS: lldb-shell :: BuildScript/toolchain-clang.test (1200 of 2142) UNSUPPORTED: lldb-shell :: SymbolFile/PDB/type-quals.test (1201 of 2142) PASS: lldb-api :: functionalities/rerun/TestRerun.py (1202 of 2142) PASS: lldb-unit :: Utility/./UtilityTests/DataExtractorTest.PeekData (1203 of 2142) PASS: lldb-shell :: Reproducer/TestDump.test (1204 of 2142) PASS: lldb-unit :: ScriptInterpreter/Python/./ScriptInterpreterPythonTests/PythonDataObjectsTest.TestRun (1205 of 2142) PASS: lldb-shell :: ObjectFile/wasm/stripped-debug-sections.yaml (1206 of 2142) PASS: lldb-api :: lang/objc/objc-dyn-sbtype/TestObjCDynamicSBType.py (1207 of 2142) PASS: lldb-api :: functionalities/data-formatter/data-formatter-stl/libcxx/list/TestDataFormatterLibcxxList.py (1208 of 2142) UNSUPPORTED: lldb-api :: functionalities/data-formatter/data-formatter-stl/libstdcpp/vbool/TestDataFormatterStdVBool.py (1209 of 2142) PASS: lldb-api :: lang/objc/objc-new-syntax/TestObjCNewSyntaxDictionary.py (1210 of 2142) PASS: lldb-api :: commands/process/attach/attach_denied/TestAttachDenied.py (1211 of 2142) PASS: lldb-shell :: ObjectFile/PECOFF/basic-info-arm64.yaml (1212 of 2142) PASS: lldb-unit :: DataFormatter/./LLDBFormatterTests/StringPrinterTests.CxxASCII (1213 of 2142) PASS: lldb-shell :: SymbolFile/DWARF/array-sizes.s (1214 of 2142) PASS: lldb-unit :: ScriptInterpreter/Python/./ScriptInterpreterPythonTests/PythonDataObjectsTest.TestPythonByteArray (1215 of 2142) PASS: lldb-api :: commands/frame/diagnose/complicated-expression/TestComplicatedExpression.py (1216 of 2142) PASS: lldb-unit :: SymbolFile/NativePDB/./SymbolFileNativePDBTests/PDBFPOProgramToDWARFExpressionTests.InvalidOpBinary (1217 of 2142) PASS: lldb-api :: functionalities/breakpoint/comp_dir_symlink/TestCompDirSymLink.py (1218 of 2142) UNSUPPORTED: lldb-api :: functionalities/thread/concurrent_events/TestConcurrentManySignals.py (1219 of 2142) PASS: lldb-api :: commands/expression/persistent_ptr_update/TestPersistentPtrUpdate.py (1220 of 2142) PASS: lldb-api :: commands/expression/import-std-module/pair/TestPairFromStdModule.py (1221 of 2142) PASS: lldb-api :: functionalities/inferior-crashing/TestInferiorCrashing.py (1222 of 2142) PASS: lldb-unit :: Utility/./UtilityTests/BinaryStreamTest.PutULEB128EightBytes (1223 of 2142) PASS: lldb-unit :: Utility/./UtilityTests/BinaryStreamTest.PutULEB128ThreeBytes (1224 of 2142) PASS: lldb-unit :: Utility/./UtilityTests/UriParserTest.BadPort (1225 of 2142) PASS: lldb-api :: functionalities/stats_api/TestStatisticsAPI.py (1226 of 2142) PASS: lldb-shell :: ObjectFile/Breakpad/discontiguous-sections.test (1227 of 2142) PASS: lldb-unit :: Utility/./UtilityTests/RangeTest.SetRangeBase (1228 of 2142) PASS: lldb-api :: types/TestFloatTypes.py (1229 of 2142) PASS: lldb-unit :: ScriptInterpreter/Python/./ScriptInterpreterPythonTests/PythonDataObjectsTest.TestPythonStringToStr (1230 of 2142) PASS: lldb-api :: functionalities/data-formatter/data-formatter-script/TestDataFormatterScript.py (1231 of 2142) PASS: lldb-unit :: Utility/./UtilityTests/TimerTest.CategoryTimesNested (1232 of 2142) PASS: lldb-shell :: SymbolFile/Breakpad/line-table-discontinuous-file-ids.test (1233 of 2142) PASS: lldb-api :: tools/lldb-server/TestGdbRemoteRegisterState.py (1234 of 2142) PASS: lldb-unit :: Utility/./UtilityTests/StatusTest.ErrorCodeConstructor (1235 of 2142) PASS: lldb-api :: functionalities/dead-strip/TestDeadStrip.py (1236 of 2142) PASS: lldb-api :: functionalities/data-formatter/language_category_updates/TestDataFormatterLanguageCategoryUpdates.py (1237 of 2142) UNSUPPORTED: lldb-api :: tools/lldb-server/TestGdbRemoteAuxvSupport.py (1238 of 2142) PASS: lldb-unit :: DataFormatter/./LLDBFormatterTests/TypeMatcherTests.CreatedBySameMatchString (1239 of 2142) PASS: lldb-unit :: Utility/./UtilityTests/StringLexerTest.NextIfList (1240 of 2142) PASS: lldb-shell :: Reproducer/Functionalities/TestStepping.test (1241 of 2142) PASS: lldb-shell :: ObjectFile/ELF/PT_LOAD-overlap-PT_INTERP.yaml (1242 of 2142) PASS: lldb-api :: macosx/add-dsym/TestAddDsymMidExecutionCommand.py (1243 of 2142) PASS: lldb-unit :: DataFormatter/./LLDBFormatterTests/StringPrinterTests.SwiftUTF8 (1244 of 2142) PASS: lldb-api :: functionalities/tail_call_frames/inlining_and_tail_calls/TestInliningAndTailCalls.py (1245 of 2142) PASS: lldb-unit :: ScriptInterpreter/Python/./ScriptInterpreterPythonTests/PythonDataObjectsTest.TestPythonStringToStructuredString (1246 of 2142) PASS: lldb-api :: commands/expression/class_template_specialization_empty_pack/TestClassTemplateSpecializationParametersHandling.py (1247 of 2142) PASS: lldb-api :: functionalities/thread/crash_during_step/TestCrashDuringStep.py (1248 of 2142) PASS: lldb-unit :: Expression/./ExpressionTests/DiagnosticManagerTest.PutStringMultiple (1249 of 2142) UNSUPPORTED: lldb-api :: lang/c/typedef/Testtypedef.py (1250 of 2142) PASS: lldb-shell :: ObjectFile/PECOFF/basic-info-arm.yaml (1251 of 2142) PASS: lldb-unit :: Host/./HostTests/File.GetStreamFromDescriptor (1252 of 2142) PASS: lldb-unit :: Utility/./UtilityTests/StringListTest.InsertStringAtIndexMove (1253 of 2142) PASS: lldb-unit :: Language/Highlighting/./HighlighterTests/HighlighterTest.Keywords (1254 of 2142) PASS: lldb-api :: functionalities/gdb_remote_client/TestGDBRemoteDiskFileCompletion.py (1255 of 2142) PASS: lldb-unit :: Host/./HostTests/SocketTest.UDPGetConnectURI (1256 of 2142) PASS: lldb-api :: functionalities/inferior-changed/TestInferiorChanged.py (1257 of 2142) PASS: lldb-unit :: Process/gdb-remote/./ProcessGdbRemoteTests/GDBRemoteCommunicationServerTest.SendErrorResponse_ErrorList (1258 of 2142) PASS: lldb-unit :: Process/gdb-remote/./ProcessGdbRemoteTests/GDBRemoteCommunicationClientTest.SendStopTracePacket (1259 of 2142) PASS: lldb-api :: python_api/watchpoint/TestSetWatchpoint.py (1260 of 2142) PASS: lldb-api :: functionalities/var_path/TestVarPath.py (1261 of 2142) PASS: lldb-api :: commands/help/TestHelp.py (1262 of 2142) PASS: lldb-unit :: SymbolFile/NativePDB/./SymbolFileNativePDBTests/PDBFPOProgramToDWARFExpressionTests.InvalidAssignmentMultiple (1263 of 2142) PASS: lldb-unit :: Utility/./UtilityTests/StringExtractorTest.InitMisc (1264 of 2142) PASS: lldb-unit :: Utility/./UtilityTests/StringListTest.AppendStringCString (1265 of 2142) PASS: lldb-unit :: Utility/./UtilityTests/StringListTest.AppendListCStringArrayEmpty (1266 of 2142) UNSUPPORTED: lldb-api :: tools/lldb-server/registers-target-xml-reading/TestGdbRemoteTargetXmlPacket.py (1267 of 2142) PASS: lldb-api :: commands/expression/dollar-in-variable/TestDollarInVariable.py (1268 of 2142) PASS: lldb-api :: python_api/interpreter/TestCommandInterpreterAPI.py (1269 of 2142) PASS: lldb-shell :: Commands/command-stop-hook-output.test (1270 of 2142) PASS: lldb-unit :: Utility/./UtilityTests/LogChannelEnabledTest.LogVerboseThread (1271 of 2142) PASS: lldb-shell :: Recognizer/assert.test (1272 of 2142) PASS: lldb-shell :: Breakpoint/implicit_const_form_support.test (1273 of 2142) PASS: lldb-api :: functionalities/data-formatter/data-formatter-objc/nsstring/TestDataFormatterNSString.py (1274 of 2142) PASS: lldb-unit :: Utility/./UtilityTests/AnsiTerminal.Incomplete (1275 of 2142) PASS: lldb-api :: commands/command/nested_alias/TestNestedAlias.py (1276 of 2142) UNSUPPORTED: lldb-api :: commands/expression/completion-crash-invalid-iterator/TestInvalidIteratorCompletionCrash.py (1277 of 2142) PASS: lldb-unit :: Process/gdb-remote/./ProcessGdbRemoteTests/GDBRemoteCommunicationClientTest.TestPacketSpeedJSON (1278 of 2142) PASS: lldb-unit :: Utility/./UtilityTests/CompletionRequest.TryCompleteCurrentArgGood (1279 of 2142) PASS: lldb-api :: python_api/thread/TestThreadAPI.py (1280 of 2142) PASS: lldb-unit :: Utility/./UtilityTests/TimerTest.CategoryTimesStats (1281 of 2142) PASS: lldb-unit :: Utility/./UtilityTests/GeneratorTest.Get (1282 of 2142) PASS: lldb-unit :: Core/./LLDBCoreTests/MangledTest.ResultForValidName (1283 of 2142) PASS: lldb-api :: python_api/watchpoint/TestWatchpointIter.py (1284 of 2142) PASS: lldb-shell :: SymbolFile/NativePDB/ast-methods.cpp (1285 of 2142) PASS: lldb-unit :: Utility/./UtilityTests/StringExtractorTest.GetHexBytesAvail (1286 of 2142) PASS: lldb-api :: commands/expression/two-files/TestObjCTypeQueryFromOtherCompileUnit.py (1287 of 2142) UNSUPPORTED: lldb-api :: functionalities/darwin_log/filter/exact_match/message/TestDarwinLogFilterMatchMessage.py (1288 of 2142) PASS: lldb-api :: functionalities/thread/concurrent_events/TestConcurrentDelaySignalWatch.py (1289 of 2142) PASS: lldb-unit :: Utility/./UtilityTests/ArchSpecTest.MergeFrom (1290 of 2142) PASS: lldb-api :: functionalities/thread/concurrent_events/TestConcurrentTwoBreakpointsOneWatchpoint.py (1291 of 2142) PASS: lldb-unit :: Utility/./UtilityTests/UriParserTest.SchemeHostSeparator4 (1292 of 2142) PASS: lldb-shell :: Commands/command-source.test (1293 of 2142) PASS: lldb-unit :: Symbol/./SymbolTests/TestClangASTImporter.CopyTypeTagDecl (1294 of 2142) PASS: lldb-unit :: UnwindAssembly/x86/./UnwindAssemblyx86Tests/Testx86AssemblyInspectionEngine.Test64bitFramelessSmallStackFrame (1295 of 2142) PASS: lldb-api :: python_api/lldbutil/frame/TestFrameUtils.py (1296 of 2142) PASS: lldb-shell :: Reproducer/TestVersionCheck.test (1297 of 2142) PASS: lldb-unit :: Utility/./UtilityTests/UriParserTest.TypicalPortPathIPv6 (1298 of 2142) PASS: lldb-api :: lang/cpp/global_operators/TestCppGlobalOperators.py (1299 of 2142) PASS: lldb-api :: commands/expression/import-std-module/forward_list/TestForwardListFromStdModule.py (1300 of 2142) PASS: lldb-unit :: Host/./HostTests/FileSystemTest.FileAndDirectoryComponents (1301 of 2142) PASS: lldb-api :: functionalities/thread/concurrent_events/TestConcurrentBreakpointDelayBreakpointOneSignal.py (1302 of 2142) PASS: lldb-api :: lang/cpp/char8_t/TestCxxChar8_t.py (1303 of 2142) PASS: lldb-unit :: Utility/./UtilityTests/BinaryStreamTest.PutSLEB128SevenBytes (1304 of 2142) UNSUPPORTED: lldb-api :: functionalities/breakpoint/breakpoint_in_delayslot/TestAvoidBreakpointInDelaySlot.py (1305 of 2142) PASS: lldb-api :: lang/cpp/enum_types/TestCPP11EnumTypes.py (1306 of 2142) PASS: lldb-api :: commands/expression/regression-access-function-template-in-record/TestRegressionAccessFunctionTemplateInRecord.py (1307 of 2142) UNSUPPORTED: lldb-api :: functionalities/darwin_log/filter/regex/category/TestDarwinLogFilterRegexCategory.py (1308 of 2142) PASS: lldb-unit :: UnwindAssembly/x86/./UnwindAssemblyx86Tests/Testx86AssemblyInspectionEngine.TestPushImm (1309 of 2142) PASS: lldb-unit :: Utility/./UtilityTests/ListenerTest.GetEventWait (1310 of 2142) PASS: lldb-api :: python_api/watchpoint/condition/TestWatchpointConditionAPI.py (1311 of 2142) PASS: lldb-shell :: SymbolFile/DWARF/inline-function-address.ll (1312 of 2142) PASS: lldb-unit :: Utility/./UtilityTests/RangeTest.ContainsRange (1313 of 2142) PASS: lldb-unit :: Utility/./UtilityTests/BinaryStreamTest.PutSLEB128TwoBytes (1314 of 2142) UNSUPPORTED: lldb-api :: benchmarks/startup/TestStartupDelays.py (1315 of 2142) UNSUPPORTED: lldb-api :: commands/watchpoints/multi_watchpoint_slots/TestWatchpointMultipleSlots.py (1316 of 2142) PASS: lldb-shell :: SymbolFile/NativePDB/break-by-line.cpp (1317 of 2142) PASS: lldb-api :: functionalities/breakpoint/breakpoint_command/TestBreakpointCommand.py (1318 of 2142) PASS: lldb-unit :: Host/./HostTests/ConnectionFileDescriptorTest.TCPGetURIv4 (1319 of 2142) PASS: lldb-unit :: Utility/./UtilityTests/FileSpecTest.EqualDotsPosixRoot (1320 of 2142) PASS: lldb-api :: sample_test/TestSampleInlineTest.py (1321 of 2142) PASS: lldb-api :: python_api/interpreter/TestRunCommandInterpreterAPI.py (1322 of 2142) PASS: lldb-unit :: Host/./HostTests/MainLoopTest.TerminatesImmediately (1323 of 2142) PASS: lldb-api :: api/multiple-debuggers/TestMultipleDebuggers.py (1324 of 2142) PASS: lldb-api :: functionalities/multiword-commands/TestMultiWordCommands.py (1325 of 2142) PASS: lldb-unit :: UnwindAssembly/x86/./UnwindAssemblyx86Tests/Testx86AssemblyInspectionEngine.TestPush0 (1326 of 2142) PASS: lldb-unit :: Utility/./UtilityTests/StringExtractorTest.GetHexBytes (1327 of 2142) PASS: lldb-shell :: SymbolFile/Breakpad/line-table-edgecases.test (1328 of 2142) PASS: lldb-api :: tools/lldb-server/inferior-crash/TestGdbRemoteSegFault.py (1329 of 2142) PASS: lldb-api :: functionalities/data-formatter/data-formatter-stl/libcxx/bitset/TestDataFormatterLibcxxBitset.py (1330 of 2142) PASS: lldb-api :: commands/frame/recognizer/TestFrameRecognizer.py (1331 of 2142) PASS: lldb-shell :: Settings/TestLineMarkerColor.test (1332 of 2142) PASS: lldb-api :: commands/expression/import-std-module/conflicts/TestStdModuleWithConflicts.py (1333 of 2142) PASS: lldb-shell :: SymbolFile/DWARF/DW_TAG_basic_type_DW_ATE_UTF_nonC.ll (1334 of 2142) PASS: lldb-unit :: Utility/./UtilityTests/DataExtractorTest.GetDoubleUnaligned (1335 of 2142) UNSUPPORTED: lldb-api :: functionalities/breakpoint/breakpoint_callback_command_source/TestBreakpointCallbackCommandSource.py (1336 of 2142) PASS: lldb-api :: functionalities/data-formatter/data-formatter-stl/libcxx/vbool/TestDataFormatterLibcxxVBool.py (1337 of 2142) PASS: lldb-api :: commands/frame/diagnose/dereference-function-return/TestDiagnoseDereferenceFunctionReturn.py (1338 of 2142) PASS: lldb-api :: commands/expression/call-function/TestCallStdStringFunction.py (1339 of 2142) PASS: lldb-unit :: Utility/./UtilityTests/UUIDTest.StringConverion (1340 of 2142) PASS: lldb-unit :: Language/Highlighting/./HighlighterTests/HighlighterTest.ClangOperators (1341 of 2142) PASS: lldb-unit :: Symbol/./SymbolTests/TestTypeSystemClang.TestGetTypeClassNested (1342 of 2142) PASS: lldb-unit :: Utility/./UtilityTests/StringListTest.AppendStringMove (1343 of 2142) PASS: lldb-api :: functionalities/breakpoint/serialize/TestBreakpointSerialization.py (1344 of 2142) PASS: lldb-api :: lang/objc/objc-struct-return/TestObjCStructReturn.py (1345 of 2142) PASS: lldb-api :: commands/watchpoints/multiple_hits/TestMultipleHits.py (1346 of 2142) UNSUPPORTED: lldb-shell :: Register/x86-64-zmm-write.test (1347 of 2142) PASS: lldb-unit :: SymbolFile/DWARF/./SymbolFileDWARFTests/SymbolFileDWARFTests.TestAbbrevOrder1Start1 (1348 of 2142) PASS: lldb-unit :: Platform/./LLDBPlatformTests/PlatformAppleSimulatorTest.TestHostPlatformToSim (1349 of 2142) PASS: lldb-unit :: Utility/./UtilityTests/StringListTest.SplitIntoLinesEmpty (1350 of 2142) PASS: lldb-api :: commands/expression/call-function/TestCallUserDefinedFunction.py (1351 of 2142) PASS: lldb-shell :: ObjectFile/wasm/basic.yaml (1352 of 2142) PASS: lldb-api :: macosx/DBGSourcePathRemapping/TestDSYMSourcePathRemapping.py (1353 of 2142) PASS: lldb-unit :: UnwindAssembly/x86/./UnwindAssemblyx86Tests/Testx86AssemblyInspectionEngine.TestPushR15 (1354 of 2142) UNSUPPORTED: lldb-api :: iohandler/completion/TestIOHandlerCompletion.py (1355 of 2142) PASS: lldb-shell :: Minidump/Windows/Sigsegv/sigsegv.test (1356 of 2142) PASS: lldb-api :: macosx/safe-to-func-call/TestSafeFuncCalls.py (1357 of 2142) PASS: lldb-unit :: Utility/./UtilityTests/GeneratorTest.Create (1358 of 2142) PASS: lldb-unit :: UnwindAssembly/x86/./UnwindAssemblyx86Tests/Testx86AssemblyInspectionEngine.TestReturnDetect (1359 of 2142) PASS: lldb-api :: macosx/profile_vrs_detach/TestDetachVrsProfile.py (1360 of 2142) PASS: lldb-shell :: Minidump/Windows/broken-unwind.test (1361 of 2142) PASS: lldb-unit :: Utility/./UtilityTests/ConstStringTest.NullAndEmptyStates (1362 of 2142) PASS: lldb-api :: commands/command/invalid-args/TestInvalidArgsCommand.py (1363 of 2142) PASS: lldb-shell :: SymbolFile/DWARF/debug_loclists-dwo.s (1364 of 2142) PASS: lldb-unit :: Utility/./UtilityTests/StringListTest.GetMaxStringLengthIncreasingSize (1365 of 2142) PASS: lldb-api :: functionalities/data-formatter/data-formatter-synthtype/TestDataFormatterSynthType.py (1366 of 2142) PASS: lldb-api :: python_api/value/TestValueAPI.py (1367 of 2142) PASS: lldb-unit :: Utility/./UtilityTests/ArgsTest.ReplaceArgumentAtIndexEqual (1368 of 2142) PASS: lldb-shell :: SymbolFile/NativePDB/locate-pdb.cpp (1369 of 2142) PASS: lldb-shell :: SymbolFile/DWARF/DW_TAG_variable-DW_AT_const_value.s (1370 of 2142) PASS: lldb-api :: lang/cpp/breakpoint-commands/TestCPPBreakpointCommands.py (1371 of 2142) PASS: lldb-unit :: Utility/./UtilityTests/StatusTest.Formatv (1372 of 2142) PASS: lldb-api :: api/command-return-object/TestSBCommandReturnObject.py (1373 of 2142) PASS: lldb-api :: lang/objcxx/hide-runtime-values/TestObjCXXHideRuntimeValues.py (1374 of 2142) PASS: lldb-shell :: SymbolFile/DWARF/debug_ranges.s (1375 of 2142) PASS: lldb-unit :: UnwindAssembly/x86/./UnwindAssemblyx86Tests/Testx86AssemblyInspectionEngine.TestPushR12 (1376 of 2142) PASS: lldb-unit :: Utility/./UtilityTests/RangeTest.Constructor (1377 of 2142) PASS: lldb-api :: commands/expression/import-std-module/shared_ptr-dbg-info-content/TestSharedPtrDbgInfoContentFromStdModule.py (1378 of 2142) PASS: lldb-unit :: ScriptInterpreter/Python/./ScriptInterpreterPythonTests/PythonDataObjectsTest.TestResetting (1379 of 2142) PASS: lldb-api :: functionalities/data-formatter/setvaluefromcstring/TestSetValueFromCString.py (1380 of 2142) PASS: lldb-shell :: Register/x86-64-gp-read.test (1381 of 2142) PASS: lldb-unit :: Utility/./UtilityTests/StringListTest.ForRangeEmpty (1382 of 2142) PASS: lldb-unit :: Process/gdb-remote/./ProcessGdbRemoteTests/GDBRemoteCommunicationServerTest.SendErrorResponse_Status (1383 of 2142) PASS: lldb-unit :: Platform/Android/./AdbClientTests/AdbClientTest.CreateByDeviceId (1384 of 2142) PASS: lldb-api :: lang/cpp/unicode-literals/TestUnicodeLiterals.py (1385 of 2142) PASS: lldb-unit :: DataFormatter/./LLDBFormatterTests/TypeMatcherTests.ExactName (1386 of 2142) PASS: lldb-unit :: Host/./HostTests/FileSystemTest.Resolve (1387 of 2142) PASS: lldb-unit :: Utility/./UtilityTests/Flags.AnySet (1388 of 2142) PASS: lldb-api :: functionalities/archives/TestBSDArchives.py (1389 of 2142) PASS: lldb-api :: lang/cpp/stl/TestStdCXXDisassembly.py (1390 of 2142) PASS: lldb-unit :: Core/./LLDBCoreTests/ModuleSpecTest.TestELFFile (1391 of 2142) UNSUPPORTED: lldb-api :: commands/watchpoints/variable_out_of_scope/TestWatchedVarHitWhenInScope.py (1392 of 2142) PASS: lldb-api :: functionalities/thread/concurrent_events/TestConcurrentDelayedCrashWithBreakpointSignal.py (1393 of 2142) PASS: lldb-api :: functionalities/step-avoids-no-debug/TestStepNoDebug.py (1394 of 2142) PASS: lldb-api :: lang/cpp/std-function-step-into-callable/TestStdFunctionStepIntoCallable.py (1395 of 2142) PASS: lldb-unit :: Utility/./UtilityTests/ArchSpecTest.OperatorBool (1396 of 2142) PASS: lldb-unit :: Utility/./UtilityTests/XcodeSDKTest.ParseTest (1397 of 2142) PASS: lldb-unit :: SymbolFile/NativePDB/./SymbolFileNativePDBTests/PDBFPOProgramToDWARFExpressionTests.DependencyChain (1398 of 2142) PASS: lldb-api :: functionalities/load_unload/TestLoadUnload.py (1399 of 2142) UNSUPPORTED: lldb-api :: functionalities/thread/break_after_join/TestBreakAfterJoin.py (1400 of 2142) PASS: lldb-shell :: ObjectFile/PECOFF/basic-info.yaml (1401 of 2142) PASS: lldb-unit :: Utility/./UtilityTests/FileSpecTest.IsRelative (1402 of 2142) PASS: lldb-unit :: Symbol/./SymbolTests/TestTypeSystemClang.TestGetTypeClassDeclType (1403 of 2142) PASS: lldb-api :: functionalities/thread/concurrent_events/TestConcurrentDelayedCrashWithBreakpointWatchpoint.py (1404 of 2142) PASS: lldb-api :: python_api/function_symbol/TestSymbolAPI.py (1405 of 2142) PASS: lldb-unit :: Process/minidump/./LLDBMinidumpTests/MinidumpParserTest.FindMemoryRangeWithFullMemoryMinidump (1406 of 2142) PASS: lldb-api :: lang/objc/bitfield_ivars/TestBitfieldIvars.py (1407 of 2142) UNSUPPORTED: lldb-api :: functionalities/darwin_log/filter/exact_match/activity-chain/TestDarwinLogFilterMatchActivityChain.py (1408 of 2142) PASS: lldb-unit :: Utility/./UtilityTests/StreamTest.AddressNoSuffix (1409 of 2142) PASS: lldb-api :: commands/expression/radar_9531204/TestPrintfAfterUp.py (1410 of 2142) PASS: lldb-api :: lang/cpp/llvm-style/TestLLVMStyle.py (1411 of 2142) PASS: lldb-shell :: Unwind/thread-step-out-ret-addr-check.test (1412 of 2142) PASS: lldb-unit :: UnwindAssembly/x86/./UnwindAssemblyx86Tests/Testx86AssemblyInspectionEngine.TestPushEBX (1413 of 2142) PASS: lldb-shell :: Breakpoint/debug_rnglist_basic.test (1414 of 2142) PASS: lldb-api :: lang/cpp/trivial_abi/TestTrivialABI.py (1415 of 2142) PASS: lldb-api :: lang/cpp/auto/TestCPPAuto.py (1416 of 2142) PASS: lldb-api :: functionalities/breakpoint/breakpoint_locations/TestBreakpointLocations.py (1417 of 2142) PASS: lldb-shell :: Breakpoint/single-file-split-dwarf.test (1418 of 2142) UNSUPPORTED: lldb-api :: commands/expression/multiline-navigation/TestMultilineNavigation.py (1419 of 2142) PASS: lldb-shell :: SymbolFile/Breakpad/symtab.test (1420 of 2142) PASS: lldb-unit :: ObjectFile/PECOFF/./ObjectFilePECOFFTests/PECallFrameInfoTest.Basic_eh (1421 of 2142) PASS: lldb-api :: lang/objc/objc-optimized/TestObjcOptimized.py (1422 of 2142) PASS: lldb-api :: functionalities/data-formatter/data-formatter-stl/libcxx/variant/TestDataFormatterLibcxxVariant.py (1423 of 2142) PASS: lldb-api :: commands/expression/argument_passing_restrictions/TestArgumentPassingRestrictions.py (1424 of 2142) PASS: lldb-api :: functionalities/tail_call_frames/thread_step_out_message/TestArtificialFrameStepOutMessage.py (1425 of 2142) PASS: lldb-api :: python_api/value/empty_class/TestValueAPIEmptyClass.py (1426 of 2142) PASS: lldb-shell :: SymbolFile/DWARF/DW_AT_low_pc-addrx.s (1427 of 2142) PASS: lldb-api :: commands/command/script/import/rdar-12586188/TestRdar12586188.py (1428 of 2142) PASS: lldb-unit :: Host/./HostTests/SocketTest.TCPGetConnectURI (1429 of 2142) PASS: lldb-api :: python_api/hello_world/TestHelloWorld.py (1430 of 2142) PASS: lldb-unit :: Language/Highlighting/./HighlighterTests/HighlighterTest.ClangCursorPosInOtherToken (1431 of 2142) PASS: lldb-api :: python_api/sbstructureddata/TestStructuredDataAPI.py (1432 of 2142) PASS: lldb-unit :: Utility/./UtilityTests/LogChannelTest.Disable (1433 of 2142) PASS: lldb-unit :: Utility/./UtilityTests/StringListTest.InsertStringAtIndexStart (1434 of 2142) PASS: lldb-api :: commands/expression/completion-in-lambda-and-unnamed-class/TestCompletionInLambdaAndUnnamedClass.py (1435 of 2142) PASS: lldb-api :: macosx/lc-note/firmware-corefile/TestFirmwareCorefiles.py (1436 of 2142) PASS: lldb-unit :: ScriptInterpreter/Python/./ScriptInterpreterPythonTests/PythonDataObjectsTest.TestPythonTupleToStructuredList (1437 of 2142) PASS: lldb-unit :: Target/./TargetTests/ModuleCacheTest.GetAndPutUuidExists (1438 of 2142) PASS: lldb-api :: commands/expression/persistent_variables/TestPersistentVariables.py (1439 of 2142) PASS: lldb-unit :: Process/minidump/./LLDBMinidumpTests/MinidumpParserTest.GetMemory (1440 of 2142) PASS: lldb-shell :: SymbolFile/DWARF/debug_ranges-missing-section.s (1441 of 2142) PASS: lldb-unit :: Symbol/./SymbolTests/TestClangASTImporter.ImportInvalidType (1442 of 2142) PASS: lldb-unit :: API/./APITests/SBCommandInterpreterTest.MultiWordCommand (1443 of 2142) PASS: lldb-unit :: Utility/./UtilityTests/ScalarTest.SetValueFromData (1444 of 2142) PASS: lldb-unit :: Utility/./UtilityTests/StreamTeeTest.Flush (1445 of 2142) PASS: lldb-api :: lang/cpp/alignas_base_class/TestAlignAsBaseClass.py (1446 of 2142) PASS: lldb-unit :: Expression/./ExpressionTests/ClangHostTest.ComputeClangResourceDirectory (1447 of 2142) PASS: lldb-shell :: Driver/TestTarget.test (1448 of 2142) PASS: lldb-unit :: Utility/./UtilityTests/StreamTest.PutHex16ByteOrderLittle (1449 of 2142) UNSUPPORTED: lldb-api :: lang/objc/rdar-12408181/TestRdar12408181.py (1450 of 2142) PASS: lldb-api :: functionalities/data-formatter/refpointer-recursion/TestDataFormatterRefPtrRecursion.py (1451 of 2142) PASS: lldb-shell :: ObjectFile/MachO/symtab.yaml (1452 of 2142) PASS: lldb-api :: commands/expression/import_base_class_when_class_has_derived_member/TestImportBaseClassWhenClassHasDerivedMember.py (1453 of 2142) PASS: lldb-unit :: ScriptInterpreter/Python/./ScriptInterpreterPythonTests/PythonDataObjectsTest.TestPythonBytes (1454 of 2142) PASS: lldb-shell :: SymbolFile/DWARF/debug_rnglists.s (1455 of 2142) UNSUPPORTED: lldb-shell :: SymbolFile/PDB/pointers.test (1456 of 2142) PASS: lldb-shell :: SymbolFile/DWARF/debug-types-dwo-cross-reference.cpp (1457 of 2142) PASS: lldb-shell :: Driver/TestCore.test (1458 of 2142) UNSUPPORTED: lldb-shell :: ScriptInterpreter/Lua/independent_state.test (1459 of 2142) PASS: lldb-unit :: SymbolFile/NativePDB/./SymbolFileNativePDBTests/PDBFPOProgramToDWARFExpressionTests.SingleAssignmentRegisterRef (1460 of 2142) PASS: lldb-api :: functionalities/breakpoint/inlined_breakpoints/TestInlinedBreakpoints.py (1461 of 2142) PASS: lldb-api :: functionalities/data-formatter/data-formatter-stl/libcxx/multiset/TestDataFormatterLibcxxMultiSet.py (1462 of 2142) PASS: lldb-unit :: Interpreter/./InterpreterTests/CompletionTest.FileCompletionAbsolute (1463 of 2142) PASS: lldb-api :: lang/objc/foundation/TestObjCMethods2.py (1464 of 2142) PASS: lldb-api :: lang/objc/objc-foundation-dictionary-empty/TestNSDictionary0.py (1465 of 2142) PASS: lldb-api :: types/TestIntegerTypeExpr.py (1466 of 2142) PASS: lldb-api :: lang/cpp/operators/TestCppOperators.py (1467 of 2142) PASS: lldb-unit :: Utility/./UtilityTests/ScalarTest.SetValueFromCString (1468 of 2142) PASS: lldb-unit :: Process/minidump/./LLDBMinidumpTests/MinidumpParserTest.GetArchitectureWindows (1469 of 2142) PASS: lldb-unit :: Utility/./UtilityTests/OptionsWithRawTest.EmptyArgsOnlySuffix (1470 of 2142) PASS: lldb-api :: python_api/symbol-context/TestSymbolContext.py (1471 of 2142) PASS: lldb-api :: lang/objc/objc-ivar-protocols/TestIvarProtocols.py (1472 of 2142) PASS: lldb-unit :: ScriptInterpreter/Python/./ScriptInterpreterPythonTests/PythonDataObjectsTest.TestGlobalNameResolutionNoDot (1473 of 2142) PASS: lldb-unit :: Language/Highlighting/./HighlighterTests/HighlighterTest.ClangCursorPosAfterOtherToken (1474 of 2142) PASS: lldb-api :: macosx/thread_suspend/TestInternalThreadSuspension.py (1475 of 2142) PASS: lldb-api :: commands/process/launch-with-shellexpand/TestLaunchWithShellExpand.py (1476 of 2142) PASS: lldb-unit :: Utility/./UtilityTests/BinaryStreamTest.PutULEB128SevenBytes (1477 of 2142) PASS: lldb-unit :: Utility/./UtilityTests/ScalarTest.Equality (1478 of 2142) PASS: lldb-api :: lang/objc/modules-incomplete/TestIncompleteModules.py (1479 of 2142) PASS: lldb-api :: lang/cpp/symbols/TestSymbols.py (1480 of 2142) PASS: lldb-api :: functionalities/data-formatter/varscript_formatting/TestDataFormatterVarScriptFormatting.py (1481 of 2142) UNSUPPORTED: lldb-shell :: SymbolFile/PDB/expressions.test (1482 of 2142) PASS: lldb-api :: lang/cpp/gmodules-templates/TestGModules.py (1483 of 2142) PASS: lldb-unit :: Host/./HostTests/ConnectionFileDescriptorTest.TCPGetURIv6 (1484 of 2142) PASS: lldb-api :: lang/cpp/overloaded-functions/TestOverloadedFunctions.py (1485 of 2142) PASS: lldb-shell :: Commands/command-regex-delete.test (1486 of 2142) UNSUPPORTED: lldb-api :: lang/cpp/function-template-parameter-pack/TestFunctionTemplateParameterPack.py (1487 of 2142) PASS: lldb-api :: lang/c/vla/TestVLA.py (1488 of 2142) UNSUPPORTED: lldb-api :: tools/lldb-server/platform-process-connect/TestPlatformProcessConnect.py (1489 of 2142) PASS: lldb-api :: functionalities/signal/TestSendSignal.py (1490 of 2142) PASS: lldb-api :: functionalities/data-formatter/data-formatter-smart-array/TestDataFormatterSmartArray.py (1491 of 2142) PASS: lldb-unit :: Language/Highlighting/./HighlighterTests/HighlighterTest.ClangCursorPos (1492 of 2142) PASS: lldb-api :: python_api/sbvalue_persist/TestSBValuePersist.py (1493 of 2142) PASS: lldb-unit :: Utility/./UtilityTests/StreamTest.AddressEmptyPrefix (1494 of 2142) PASS: lldb-unit :: Utility/./UtilityTests/PassiveReplayTest.InstrumentedBar (1495 of 2142) PASS: lldb-api :: lang/objc/single-entry-dictionary/TestObjCSingleEntryDictionary.py (1496 of 2142) UNSUPPORTED: lldb-shell :: Reproducer/TestLuaImport.test (1497 of 2142) PASS: lldb-shell :: Commands/CommandScriptImmediateOutput/CommandScriptImmediateOutputConsole.test (1498 of 2142) UNSUPPORTED: lldb-api :: functionalities/darwin_log/filter/exact_match/activity/TestDarwinLogFilterMatchActivity.py (1499 of 2142) PASS: lldb-shell :: Reproducer/TestDebugSymbols.test (1500 of 2142) PASS: lldb-api :: lang/cpp/chained-calls/TestCppChainedCalls.py (1501 of 2142) PASS: lldb-api :: functionalities/data-formatter/data-formatter-objc/TestDataFormatterObjCNSURL.py (1502 of 2142) PASS: lldb-unit :: tools/lldb-server/tests/./LLDBServerTests/StandardStartupTest.TestStopReplyContainsThreadPcs (1503 of 2142) UNSUPPORTED: lldb-shell :: ObjectFile/ELF/minidebuginfo-set-and-hit-breakpoint.test (1504 of 2142) PASS: lldb-unit :: Utility/./UtilityTests/StringListTest.SetSize (1505 of 2142) UNSUPPORTED: lldb-api :: commands/expression/multiline-completion/TestMultilineCompletion.py (1506 of 2142) UNSUPPORTED: lldb-api :: functionalities/data-formatter/data-formatter-stl/libstdcpp/iterator/TestDataFormatterStdIterator.py (1507 of 2142) PASS: lldb-unit :: Process/gdb-remote/./ProcessGdbRemoteTests/GDBRemoteCommunicationClientTest.GetModulesInfo_UUID20 (1508 of 2142) PASS: lldb-unit :: Utility/./UtilityTests/BinaryStreamTest.PutULEB128NineBytes (1509 of 2142) PASS: lldb-api :: commands/apropos/basic/TestApropos.py (1510 of 2142) PASS: lldb-shell :: SymbolFile/DWARF/debug_loc-aslr.s (1511 of 2142) PASS: lldb-unit :: Utility/./UtilityTests/StringExtractorTest.GetU32LittleEndian (1512 of 2142) PASS: lldb-unit :: Process/minidump/./LLDBMinidumpTests/MinidumpParserTest.GetLinuxProcStatus_no_stream (1513 of 2142) PASS: lldb-unit :: Utility/./UtilityTests/OptionsWithRawTest.WhitespaceInput (1514 of 2142) PASS: lldb-api :: commands/expression/invalid-args/TestInvalidArgsExpression.py (1515 of 2142) PASS: lldb-shell :: SymbolFile/DWARF/compilercontext.ll (1516 of 2142) UNSUPPORTED: lldb-api :: tools/lldb-server/thread-name/TestGdbRemoteThreadName.py (1517 of 2142) PASS: lldb-unit :: Utility/./UtilityTests/StringListTest.JoinMultiCharSeparator (1518 of 2142) UNSUPPORTED: lldb-api :: functionalities/thread/thread_specific_break_plus_condition/TestThreadSpecificBpPlusCondition.py (1519 of 2142) PASS: lldb-api :: commands/expression/import-std-module/stack/TestStackFromStdModule.py (1520 of 2142) XFAIL: lldb-shell :: Register/x86-64-write.test (1521 of 2142) PASS: lldb-api :: python_api/signals/TestSignalsAPI.py (1522 of 2142) PASS: lldb-api :: sample_test/TestSampleTest.py (1523 of 2142) PASS: lldb-unit :: Host/./HostTests/SocketTest.TCPListen0GetPort (1524 of 2142) UNSUPPORTED: lldb-api :: functionalities/thread/create_during_step/TestCreateDuringStep.py (1525 of 2142) PASS: lldb-api :: tools/lldb-server/inferior-crash/TestGdbRemoteAbort.py (1526 of 2142) UNSUPPORTED: lldb-api :: functionalities/thread/state/TestThreadStates.py (1527 of 2142) PASS: lldb-unit :: ScriptInterpreter/Python/./ScriptInterpreterPythonTests/PythonDataObjectsTest.TestPythonCallableCheck (1528 of 2142) UNSUPPORTED: lldb-api :: lang/cpp/printf/TestPrintf.py (1529 of 2142) PASS: lldb-unit :: Utility/./UtilityTests/StreamTest.PutHex32ByteOrderBig (1530 of 2142) PASS: lldb-api :: macosx/thread-names/TestInterruptThreadNames.py (1531 of 2142) PASS: lldb-unit :: Utility/./UtilityTests/BinaryStreamTest.PutSLEB128ThreeBytes (1532 of 2142) PASS: lldb-shell :: Breakpoint/jitbp_elf.test (1533 of 2142) PASS: lldb-unit :: Utility/./UtilityTests/ArgsTest.TestArgv (1534 of 2142) PASS: lldb-api :: functionalities/postmortem/minidump/TestMiniDump.py (1535 of 2142) PASS: lldb-api :: functionalities/object-file/TestImageListMultiArchitecture.py (1536 of 2142) PASS: lldb-api :: commands/expression/test/TestExprs2.py (1537 of 2142) PASS: lldb-api :: functionalities/thread/concurrent_events/TestConcurrentTwoWatchpointsOneDelayBreakpoint.py (1538 of 2142) PASS: lldb-shell :: SymbolFile/DWARF/debug-types-dwarf5.s (1539 of 2142) PASS: lldb-api :: functionalities/breakpoint/breakpoint_conditions/TestBreakpointConditions.py (1540 of 2142) PASS: lldb-api :: commands/expression/persist_objc_pointeetype/TestPersistObjCPointeeType.py (1541 of 2142) PASS: lldb-shell :: SymbolFile/NativePDB/break-by-function.cpp (1542 of 2142) UNSUPPORTED: lldb-shell :: Register/arm-gp-read.test (1543 of 2142) PASS: lldb-unit :: ScriptInterpreter/Python/./ScriptInterpreterPythonTests/PythonDataObjectsTest.TestPythonInteger (1544 of 2142) PASS: lldb-shell :: Commands/command-thread-select.test (1545 of 2142) PASS: lldb-shell :: Reproducer/TestCaptureEnvOverride.test (1546 of 2142) UNSUPPORTED: lldb-api :: lang/objc/objc-dynamic-value/TestObjCDynamicValue.py (1547 of 2142) PASS: lldb-shell :: Quit/TestQuitExitCodeTooManyArgs.test (1548 of 2142) PASS: lldb-api :: functionalities/data-formatter/data-formatter-disabling/TestDataFormatterDisabling.py (1549 of 2142) PASS: lldb-unit :: Process/minidump/./LLDBMinidumpTests/MinidumpParserTest.GetLinuxProcStatus (1550 of 2142) PASS: lldb-shell :: SymbolFile/DWARF/dwp-separate-debug-file.cpp (1551 of 2142) PASS: lldb-api :: tools/lldb-vscode/launch/TestVSCode_launch.py (1552 of 2142) PASS: lldb-unit :: ScriptInterpreter/Python/./ScriptInterpreterPythonTests/PythonDataObjectsTest.TestPythonListToStructuredList (1553 of 2142) UNSUPPORTED: lldb-api :: python_api/disassemble-raw-data/TestDisassemble_VST1_64.py (1554 of 2142) PASS: lldb-unit :: UnwindAssembly/x86/./UnwindAssemblyx86Tests/Testx86AssemblyInspectionEngine.TestPopR13 (1555 of 2142) PASS: lldb-unit :: Utility/./UtilityTests/LogChannelEnabledTest.LLDB_LOG_ERROR (1556 of 2142) PASS: lldb-unit :: Utility/./UtilityTests/ArgsTest.ReplaceArgumentAtIndexFarOutOfRange (1557 of 2142) PASS: lldb-unit :: Symbol/./SymbolTests/TestTypeSystemClang.TemplateArguments (1558 of 2142) PASS: lldb-unit :: Utility/./UtilityTests/StringExtractorTest.GetNameColonValueNoSemicolon (1559 of 2142) PASS: lldb-unit :: Utility/./UtilityTests/UriParserTest.SchemeHostSeparator3 (1560 of 2142) PASS: lldb-api :: commands/expression/import-std-module/weak_ptr-dbg-info-content/TestDbgInfoContentWeakPtrFromStdModule.py (1561 of 2142) PASS: lldb-shell :: Commands/command-disassemble-process.yaml (1562 of 2142) PASS: lldb-unit :: Process/gdb-remote/./ProcessGdbRemoteTests/GDBRemoteCommunicationClientTest.SendGetTraceConfigPacket (1563 of 2142) PASS: lldb-unit :: Utility/./UtilityTests/RangeTest.Slide (1564 of 2142) PASS: lldb-api :: lang/cpp/rvalue-references/TestRvalueReferences.py (1565 of 2142) PASS: lldb-unit :: SymbolFile/NativePDB/./SymbolFileNativePDBTests/PDBFPOProgramToDWARFExpressionTests.MultipleIndependentAssignments (1566 of 2142) PASS: lldb-api :: functionalities/show_location/TestShowLocationDwarf5.py (1567 of 2142) UNSUPPORTED: lldb-api :: functionalities/breakpoint/hardware_breakpoints/write_memory_with_hw_breakpoint/TestWriteMemoryWithHWBreakpoint.py (1568 of 2142) PASS: lldb-unit :: Utility/./UtilityTests/CompletionRequest.Constructor (1569 of 2142) PASS: lldb-unit :: ObjectFile/Breakpad/./ObjectFileBreakpadTests/PublicRecord.parse (1570 of 2142) PASS: lldb-api :: functionalities/data-formatter/compactvectors/TestCompactVectors.py (1571 of 2142) UNSUPPORTED: lldb-shell :: SymbolFile/PDB/class-layout.test (1572 of 2142) PASS: lldb-shell :: Driver/TestNoUseColor.test (1573 of 2142) UNSUPPORTED: lldb-api :: functionalities/tsan/multiple/TestTsanMultiple.py (1574 of 2142) PASS: lldb-api :: commands/platform/file/read/TestPlatformFileRead.py (1575 of 2142) PASS: lldb-unit :: Utility/./UtilityTests/BinaryStreamTest.PutSLEB128MaxValue (1576 of 2142) PASS: lldb-unit :: Process/minidump/./LLDBMinidumpTests/RegisterContextMinidump.ConvertMinidumpContext_x86_32 (1577 of 2142) PASS: lldb-api :: functionalities/postmortem/wow64_minidump/TestWow64MiniDump.py (1578 of 2142) PASS: lldb-api :: lang/c/bitfields/TestBitfields.py (1579 of 2142) PASS: lldb-api :: functionalities/data-formatter/data-formatter-stl/libcxx/queue/TestDataFormatterLibcxxQueue.py (1580 of 2142) PASS: lldb-api :: functionalities/data-formatter/data-formatter-objc/TestDataFormatterObjNSException.py (1581 of 2142) UNSUPPORTED: lldb-api :: functionalities/unwind/standard/TestStandardUnwind.py (1582 of 2142) PASS: lldb-unit :: Utility/./UtilityTests/XcodeSDKTest.SDKSupportsSwift (1583 of 2142) PASS: lldb-unit :: Utility/./UtilityTests/RangeDataVector.FindEntryIndexesThatContain (1584 of 2142) PASS: lldb-api :: lang/cpp/bitfields/TestCppBitfields.py (1585 of 2142) PASS: lldb-shell :: SymbolFile/DWARF/limit-debug-info.s (1586 of 2142) PASS: lldb-unit :: Utility/./UtilityTests/RangeTest.DoesIntersect (1587 of 2142) PASS: lldb-api :: functionalities/gdb_remote_client/TestWriteMemory.py (1588 of 2142) PASS: lldb-unit :: Utility/./UtilityTests/ArgsTest.GetQuotedCommandString (1589 of 2142) PASS: lldb-api :: functionalities/data-formatter/data-formatter-objc/TestDataFormatterObjCNSError.py (1590 of 2142) PASS: lldb-unit :: Core/./LLDBCoreTests/ModuleSpecTest.TestMachOFile (1591 of 2142) PASS: lldb-unit :: Utility/./UtilityTests/StreamTest.PutStringAsRawHex8 (1592 of 2142) PASS: lldb-unit :: Utility/./UtilityTests/StreamTest.PutCharWhitespace (1593 of 2142) PASS: lldb-api :: commands/expression/context-object-objc/TestContextObjectObjc.py (1594 of 2142) UNSUPPORTED: lldb-api :: functionalities/data-formatter/data-formatter-stl/libstdcpp/unique_ptr/TestDataFormatterStdUniquePtr.py (1595 of 2142) PASS: lldb-api :: lang/c/local_variables/TestLocalVariables.py (1596 of 2142) PASS: lldb-unit :: Process/minidump/./LLDBMinidumpTests/MinidumpParserTest.GetMemoryRegionInfoFromMemory64List (1597 of 2142) PASS: lldb-api :: commands/frame/diagnose/dereference-this/TestDiagnoseDereferenceThis.py (1598 of 2142) PASS: lldb-unit :: Core/./LLDBCoreTests/MangledTest.ResultForBlockInvocation (1599 of 2142) PASS: lldb-api :: python_api/formatters/TestFormattersSBAPI.py (1600 of 2142) PASS: lldb-unit :: Host/./HostTests/HostInfoTest.GetAugmentedArchSpec (1601 of 2142) PASS: lldb-shell :: Driver/LocalLLDBInit.test (1602 of 2142) PASS: lldb-api :: commands/expression/import-std-module/deque-dbg-info-content/TestDbgInfoContentDequeFromStdModule.py (1603 of 2142) PASS: lldb-unit :: Process/gdb-remote/./ProcessGdbRemoteTests/GDBRemoteCommunicationClientTest.WriteRegister (1604 of 2142) UNSUPPORTED: lldb-api :: tools/lldb-server/TestGdbRemoteModuleInfo.py (1605 of 2142) PASS: lldb-api :: functionalities/unwind/zeroth_frame/TestZerothFrame.py (1606 of 2142) PASS: lldb-unit :: Core/./LLDBCoreTests/SourceFileCache.FindSourceFileFound (1607 of 2142) PASS: lldb-unit :: Utility/./UtilityTests/DataExtractorTest.GetMaxS64 (1608 of 2142) PASS: lldb-shell :: Process/UnsupportedLanguage.test (1609 of 2142) PASS: lldb-unit :: Language/Highlighting/./HighlighterTests/HighlighterTest.ClangEmptyInput (1610 of 2142) PASS: lldb-api :: lang/c/strings/TestCStrings.py (1611 of 2142) PASS: lldb-unit :: ObjectFile/Breakpad/./ObjectFileBreakpadTests/FileRecord.parse (1612 of 2142) PASS: lldb-unit :: Utility/./UtilityTests/UriParserTest.Empty (1613 of 2142) PASS: lldb-api :: lang/objc/objc-baseclass-sbtype/TestObjCBaseClassSBType.py (1614 of 2142) XFAIL: lldb-shell :: Register/x86-64-ymm-write.test (1615 of 2142) PASS: lldb-unit :: Symbol/./SymbolTests/TestTypeSystemClang.TestGetEnumIntegerTypeInvalid (1616 of 2142) PASS: lldb-unit :: Utility/./UtilityTests/StringLexerTest.Next (1617 of 2142) PASS: lldb-api :: functionalities/thread/jump/TestThreadJump.py (1618 of 2142) PASS: lldb-api :: commands/command/delete/TestCommandDelete.py (1619 of 2142) UNSUPPORTED: lldb-shell :: Register/x86-64-xmm16-write.test (1620 of 2142) PASS: lldb-api :: lang/cpp/typeof/TestTypeOfDeclTypeExpr.py (1621 of 2142) UNSUPPORTED: lldb-api :: commands/trace/TestTraceLoad.py (1622 of 2142) PASS: lldb-api :: functionalities/postmortem/elf-core/gcore/TestGCore.py (1623 of 2142) PASS: lldb-unit :: UnwindAssembly/x86/./UnwindAssemblyx86Tests/Testx86AssemblyInspectionEngine.TestPopR14 (1624 of 2142) PASS: lldb-unit :: Utility/./UtilityTests/RangeVector.CombineConsecutiveRanges (1625 of 2142) PASS: lldb-api :: lang/cpp/call-function/TestCallCPPFunction.py (1626 of 2142) PASS: lldb-shell :: SymbolFile/DWARF/DW_AT_const_value.s (1627 of 2142) PASS: lldb-unit :: Host/./HostTests/SocketAddressTest.GetAddressInfo (1628 of 2142) PASS: lldb-shell :: SymbolFile/Breakpad/line-table.test (1629 of 2142) PASS: lldb-api :: commands/expression/static-initializers/TestStaticInitializers.py (1630 of 2142) PASS: lldb-api :: functionalities/breakpoint/breakpoint_set_restart/TestBreakpointSetRestart.py (1631 of 2142) PASS: lldb-api :: types/TestLongTypes.py (1632 of 2142) PASS: lldb-unit :: Expression/./ExpressionTests/DiagnosticManagerTest.AppendMessageNoDiag (1633 of 2142) PASS: lldb-unit :: Utility/./UtilityTests/UriParserTest.BracketedHostnameWithColon (1634 of 2142) PASS: lldb-unit :: Utility/./UtilityTests/UriParserTest.BracketedHostnameWithPortIPv4 (1635 of 2142) PASS: lldb-unit :: Utility/./UtilityTests/UriParserTest.BracketedHostname (1636 of 2142) PASS: lldb-api :: lang/cpp/class_types/TestClassTypesDisassembly.py (1637 of 2142) PASS: lldb-api :: functionalities/data-formatter/vector-types/TestVectorTypesFormatting.py (1638 of 2142) PASS: lldb-api :: terminal/TestSTTYBeforeAndAfter.py (1639 of 2142) PASS: lldb-unit :: Utility/./UtilityTests/DataExtractorTest.GetCStrAtNullOffset (1640 of 2142) PASS: lldb-unit :: Utility/./UtilityTests/Predicate.WaitForValueNotEqualTo (1641 of 2142) PASS: lldb-shell :: Minidump/breakpad-symbols.test (1642 of 2142) PASS: lldb-unit :: UnwindAssembly/x86/./UnwindAssemblyx86Tests/Testx86AssemblyInspectionEngine.TestAddRSP (1643 of 2142) PASS: lldb-unit :: Utility/./UtilityTests/ArchSpecTest.Compatibility (1644 of 2142) PASS: lldb-api :: commands/settings/TestSettings.py (1645 of 2142) PASS: lldb-unit :: Utility/./UtilityTests/DataExtractorTest.GetCStrUnterminated (1646 of 2142) PASS: lldb-unit :: Symbol/./SymbolTests/Type.CompilerContextPattern (1647 of 2142) PASS: lldb-unit :: Utility/./UtilityTests/PassiveReplayTest.InstrumentedFooInvalid (1648 of 2142) PASS: lldb-shell :: Settings/TestStopCommandSourceOnError.test (1649 of 2142) PASS: lldb-api :: lang/cpp/dynamic-value/TestCppValueCast.py (1650 of 2142) UNSUPPORTED: lldb-api :: functionalities/darwin_log/filter/exact_match/subsystem/TestDarwinLogFilterMatchSubsystem.py (1651 of 2142) PASS: lldb-api :: commands/expression/import-std-module/vector/TestVectorFromStdModule.py (1652 of 2142) PASS: lldb-api :: lang/objc/rdar-10967107/TestRdar10967107.py (1653 of 2142) PASS: lldb-unit :: Expression/./ExpressionTests/DiagnosticManagerTest.AppendMessageAttachToLastDiag (1654 of 2142) PASS: lldb-api :: functionalities/dynamic_value_child_count/TestDynamicValueChildCount.py (1655 of 2142) PASS: lldb-unit :: SymbolFile/NativePDB/./SymbolFileNativePDBTests/PDBFPOProgramToDWARFExpressionTests.UnresolvedRegisterReference (1656 of 2142) PASS: lldb-unit :: Utility/./UtilityTests/UriParserTest.BadPort2 (1657 of 2142) PASS: lldb-shell :: ScriptInterpreter/None/none.test (1658 of 2142) PASS: lldb-unit :: Utility/./UtilityTests/ProcessInstanceInfoList.Yaml (1659 of 2142) PASS: lldb-unit :: Utility/./UtilityTests/ArgsTest.TestTrailingBackslash (1660 of 2142) PASS: lldb-api :: functionalities/data-formatter/data-formatter-objc/TestDataFormatterObjCNSData.py (1661 of 2142) PASS: lldb-unit :: Utility/./UtilityTests/SerializationRountripTest.SerializeDeserializeCStringArrayNullptrElem (1662 of 2142) PASS: lldb-unit :: Host/./HostTests/FileActionTest.Open (1663 of 2142) PASS: lldb-unit :: ScriptInterpreter/Python/./ScriptInterpreterPythonTests/PythonDataObjectsTest.TestTypeNameResolutionNoDot (1664 of 2142) PASS: lldb-api :: lang/cpp/type_lookup/TestCppTypeLookup.py (1665 of 2142) PASS: lldb-api :: functionalities/data-formatter/cstring-utf8-summary/TestCstringUnicode.py (1666 of 2142) PASS: lldb-unit :: Expression/./ExpressionTests/DWARFExpression.DW_OP_pick (1667 of 2142) PASS: lldb-unit :: Utility/./UtilityTests/ArgsTest.Yaml (1668 of 2142) PASS: lldb-api :: commands/platform/basic/TestPlatformPython.py (1669 of 2142) PASS: lldb-unit :: Utility/./UtilityTests/ArgsTest.TestSingleQuotedArgWithSpace (1670 of 2142) UNSUPPORTED: lldb-api :: commands/expression/call-restarts/TestCallThatRestarts.py (1671 of 2142) PASS: lldb-api :: lang/objc/foundation/TestObjCMethodsNSError.py (1672 of 2142) UNSUPPORTED: lldb-api :: functionalities/darwin_log/filter/regex/message/TestDarwinLogFilterRegexMessage.py (1673 of 2142) PASS: lldb-shell :: Reproducer/TestSynchronous.test (1674 of 2142) PASS: lldb-unit :: ScriptInterpreter/Python/./ScriptInterpreterPythonTests/PythonDataObjectsTest.TestCallable (1675 of 2142) PASS: lldb-unit :: Utility/./UtilityTests/XcodeSDKTest.SDKSupportsModules (1676 of 2142) PASS: lldb-api :: functionalities/thread/concurrent_events/TestConcurrentCrashWithWatchpoint.py (1677 of 2142) PASS: lldb-api :: macosx/save_crashlog/TestSaveCrashlog.py (1678 of 2142) PASS: lldb-api :: functionalities/data-formatter/data-formatter-objc/TestDataFormatterObjCNSContainer.py (1679 of 2142) PASS: lldb-api :: tools/lldb-server/TestGdbRemoteAttach.py (1680 of 2142) PASS: lldb-api :: lang/objc/radar-9691614/TestObjCMethodReturningBOOL.py (1681 of 2142) UNSUPPORTED: lldb-api :: functionalities/tsan/basic/TestTsanBasic.py (1682 of 2142) PASS: lldb-api :: lang/objc/objc-new-syntax/TestObjCNewSyntaxLiteral.py (1683 of 2142) PASS: lldb-unit :: Platform/Android/./AdbClientTests/AdbClientTest.CreateByDeviceId_ByEnvVar (1684 of 2142) PASS: lldb-unit :: Utility/./UtilityTests/ArgsTest.TestMultipleArgs (1685 of 2142) PASS: lldb-unit :: Symbol/./SymbolTests/TestClangASTImporter.DeportDeclTagDecl (1686 of 2142) PASS: lldb-unit :: Utility/./UtilityTests/ProcessInstanceInfo.DumpTable (1687 of 2142) PASS: lldb-shell :: ObjectFile/PECOFF/sections-names.yaml (1688 of 2142) UNSUPPORTED: lldb-shell :: SymbolFile/DWARF/split-dwarf-expression-eval-bug.cpp (1689 of 2142) PASS: lldb-shell :: ObjectFile/Breakpad/sections-trailing-func.test (1690 of 2142) PASS: lldb-api :: macosx/dyld-trie-symbols/TestDyldTrieSymbols.py (1691 of 2142) UNSUPPORTED: lldb-shell :: Register/x86-64-zmm-read.test (1692 of 2142) PASS: lldb-unit :: Expression/./ExpressionTests/CppModuleConfigurationTest.LinuxLocalLibCpp (1693 of 2142) PASS: lldb-api :: functionalities/breakpoint/breakpoint_ignore_count/TestBreakpointIgnoreCount.py (1694 of 2142) PASS: lldb-unit :: Target/./TargetTests/StackFrameRecognizerTest.NullModuleRegex (1695 of 2142) PASS: lldb-unit :: Process/minidump/./LLDBMinidumpTests/RegisterContextMinidump.ConvertMinidumpContext_x86_64 (1696 of 2142) PASS: lldb-unit :: Utility/./UtilityTests/StringListTest.LongestCommonPrefixNoPrefix (1697 of 2142) PASS: lldb-unit :: Process/gdb-remote/./ProcessGdbRemoteTests/GDBRemoteCommunicationClientTest.SendSignalsToIgnore (1698 of 2142) PASS: lldb-shell :: SymbolFile/DWARF/dwarf5_locations.s (1699 of 2142) PASS: lldb-unit :: Utility/./UtilityTests/DataExtractorTest.GetFloatUnaligned (1700 of 2142) PASS: lldb-shell :: SymbolFile/NativePDB/globals-fundamental.cpp (1701 of 2142) PASS: lldb-unit :: Target/./TargetTests/PathMappingListTest.AbsoluteTests (1702 of 2142) PASS: lldb-unit :: ObjectFile/PECOFF/./ObjectFilePECOFFTests/PECallFrameInfoTest.Frame_reg_eh (1703 of 2142) PASS: lldb-api :: arm/emulation/TestEmulations.py (1704 of 2142) UNSUPPORTED: lldb-shell :: SymbolFile/DWARF/debug-types-expressions.test (1705 of 2142) PASS: lldb-shell :: ExecControl/StopHook/stop-hook.test (1706 of 2142) PASS: lldb-unit :: Utility/./UtilityTests/StringListTest.LongestCommonPrefixEmpty (1707 of 2142) PASS: lldb-unit :: UnwindAssembly/x86/./UnwindAssemblyx86Tests/Testx86AssemblyInspectionEngine.TestStackRealign32BitDisp_x86_64 (1708 of 2142) PASS: lldb-api :: linux/builtin_trap/TestBuiltinTrap.py (1709 of 2142) PASS: lldb-unit :: Interpreter/./InterpreterTests/OptionArgParserTest.toBoolean (1710 of 2142) PASS: lldb-api :: functionalities/thread_plan/TestThreadPlanCommands.py (1711 of 2142) PASS: lldb-api :: functionalities/data-formatter/data-formatter-python-synth/TestDataFormatterPythonSynth.py (1712 of 2142) PASS: lldb-api :: functionalities/thread/concurrent_events/TestConcurrentManyWatchpoints.py (1713 of 2142) PASS: lldb-api :: functionalities/thread/concurrent_events/TestConcurrentDelaySignalBreak.py (1714 of 2142) PASS: lldb-unit :: Language/Highlighting/./HighlighterTests/HighlighterTest.ClangTrailingBackslashMissingNewLine (1715 of 2142) PASS: lldb-shell :: SymbolFile/DWARF/apple-index-is-used.cpp (1716 of 2142) PASS: lldb-unit :: Host/./HostTests/Host.WaitStatusFormat (1717 of 2142) PASS: lldb-unit :: Utility/./UtilityTests/ArchSpecTest.TestParseMachCPUDashSubtypeTripleSimple (1718 of 2142) PASS: lldb-api :: tools/lldb-vscode/console/TestVSCode_console.py (1719 of 2142) PASS: lldb-api :: commands/watchpoints/watchpoint_commands/command/TestWatchpointCommandPython.py (1720 of 2142) PASS: lldb-shell :: SymbolFile/DWARF/dwarf5-debug_line.s (1721 of 2142) PASS: lldb-unit :: Utility/./UtilityTests/VMRange.Clear (1722 of 2142) PASS: lldb-shell :: SymbolFile/DWARF/debug_loc_and_loclists.s (1723 of 2142) PASS: lldb-unit :: tools/lldb-server/tests/./LLDBServerTests/TestBase.LaunchModePreservesEnvironment (1724 of 2142) PASS: lldb-unit :: Utility/./UtilityTests/BinaryStreamTest.PutSLEB128FourBytes (1725 of 2142) PASS: lldb-api :: functionalities/data-formatter/data-formatter-stl/libcxx/function/TestLibCxxFunction.py (1726 of 2142) PASS: lldb-api :: functionalities/data-formatter/ostypeformatting/TestFormattersOsType.py (1727 of 2142) PASS: lldb-unit :: Utility/./UtilityTests/RangeDataVector.FindEntryThatContains (1728 of 2142) PASS: lldb-unit :: Utility/./UtilityTests/CompletionRequest.FakeLastArg (1729 of 2142) PASS: lldb-unit :: Utility/./UtilityTests/BinaryStreamTest.PutSLEB128Zero (1730 of 2142) PASS: lldb-unit :: Utility/./UtilityTests/FileSpecTest.EqualDotsWindows (1731 of 2142) PASS: lldb-api :: functionalities/load_using_paths/TestLoadUsingPaths.py (1732 of 2142) PASS: lldb-api :: api/check_public_api_headers/TestPublicAPIHeaders.py (1733 of 2142) PASS: lldb-unit :: Utility/./UtilityTests/StringExtractorTest.GetHexBytesAvail_Partial (1734 of 2142) PASS: lldb-api :: functionalities/multidebugger_commands/TestMultipleDebuggersCommands.py (1735 of 2142) PASS: lldb-api :: tools/lldb-server/TestGdbRemote_vCont.py (1736 of 2142) PASS: lldb-shell :: SymbolFile/DWARF/split-dwarf-multiple-cu.ll (1737 of 2142) PASS: lldb-unit :: Utility/./UtilityTests/RecordReplayTest.InstrumentedBarPtr (1738 of 2142) PASS: lldb-api :: sanity/TestSettingSkipping.py (1739 of 2142) UNSUPPORTED: lldb-api :: functionalities/tsan/thread_numbers/TestTsanThreadNumbers.py (1740 of 2142) PASS: lldb-shell :: SymbolFile/NativePDB/ast-types.cpp (1741 of 2142) PASS: lldb-unit :: Utility/./UtilityTests/DataExtractorTest.GetDouble (1742 of 2142) PASS: lldb-api :: macosx/macCatalyst/TestMacCatalyst.py (1743 of 2142) PASS: lldb-unit :: ScriptInterpreter/Python/./ScriptInterpreterPythonTests/PythonDataObjectsTest.TestPythonBoolean (1744 of 2142) XFAIL: lldb-shell :: Register/x86-mm-xmm-write.test (1745 of 2142) UNSUPPORTED: lldb-api :: lang/objc/ptr_refs/TestPtrRefsObjC.py (1746 of 2142) PASS: lldb-unit :: tools/lldb-server/tests/./LLDBServerTests/TestBase.DebugserverEnv (1747 of 2142) UNSUPPORTED: lldb-api :: android/platform/TestDefaultCacheLineSize.py (1748 of 2142) PASS: lldb-unit :: Process/minidump/./LLDBMinidumpTests/MinidumpParserTest.MinidumpModuleOrder (1749 of 2142) PASS: lldb-unit :: Utility/./UtilityTests/VASprintfTest.NoBufferResize (1750 of 2142) PASS: lldb-unit :: Target/./TargetTests/ModuleCacheTest.GetAndPut (1751 of 2142) PASS: lldb-api :: functionalities/pointer_num_children/TestPointerNumChildren.py (1752 of 2142) PASS: lldb-shell :: ObjectFile/ELF/netbsd-exec-8.99.30-amd64.yaml (1753 of 2142) PASS: lldb-unit :: Utility/./UtilityTests/StreamTest.PutRawBytesToMixedEndian (1754 of 2142) PASS: lldb-unit :: Utility/./UtilityTests/StringListTest.CopyListEmpty (1755 of 2142) PASS: lldb-shell :: Heap/heap-cstr.test (1756 of 2142) PASS: lldb-api :: commands/expression/formatters/TestFormatters.py (1757 of 2142) PASS: lldb-api :: commands/reproducer/invalid-args/TestInvalidArgsReproducer.py (1758 of 2142) PASS: lldb-api :: macosx/duplicate-archive-members/TestDuplicateMembers.py (1759 of 2142) PASS: lldb-unit :: Utility/./UtilityTests/StringListTest.ShiftMove (1760 of 2142) PASS: lldb-unit :: Utility/./UtilityTests/NameMatchesTest.Equals (1761 of 2142) PASS: lldb-unit :: Host/./HostTests/NativeProcessProtocolTest.ReadCStringFromMemory (1762 of 2142) PASS: lldb-unit :: Expression/./ExpressionTests/CppModuleConfigurationTest.AmbiguousLibCpp (1763 of 2142) PASS: lldb-unit :: Utility/./UtilityTests/StringLexerTest.HasAtLeast (1764 of 2142) PASS: lldb-api :: lang/cpp/elaborated-types/TestElaboratedTypes.py (1765 of 2142) PASS: lldb-unit :: UnwindAssembly/x86/./UnwindAssemblyx86Tests/Testx86AssemblyInspectionEngine.TestPushR13 (1766 of 2142) PASS: lldb-unit :: Language/Highlighting/./HighlighterTests/HighlighterTest.ClangCommas (1767 of 2142) PASS: lldb-unit :: Language/CPlusPlus/./LanguageCPlusPlusTests/CPlusPlusLanguage.CPlusPlusNameParser (1768 of 2142) PASS: lldb-api :: functionalities/tail_call_frames/cross_object/TestCrossObjectTailCalls.py (1769 of 2142) UNSUPPORTED: lldb-api :: benchmarks/frame_variable/TestFrameVariableResponse.py (1770 of 2142) PASS: lldb-api :: commands/target/modules/search-paths/insert/TestTargetModulesSearchpathsInsert.py (1771 of 2142) PASS: lldb-shell :: SymbolFile/Breakpad/symtab-macho.test (1772 of 2142) PASS: lldb-unit :: Utility/./UtilityTests/ArgsTest.TestOverwriteArgs (1773 of 2142) PASS: lldb-api :: commands/disassemble/basic/TestDisassembleBreakpoint.py (1774 of 2142) PASS: lldb-api :: lang/c/find_struct_type/TestFindStructTypes.py (1775 of 2142) PASS: lldb-unit :: Expression/./ExpressionTests/CppModuleConfigurationTest.MissingLibCpp (1776 of 2142) PASS: lldb-unit :: Utility/./UtilityTests/FileSpecTest.GuessPathStyle (1777 of 2142) PASS: lldb-api :: lang/mixed/TestMixedLanguages.py (1778 of 2142) PASS: lldb-shell :: ObjectFile/Breakpad/sections.test (1779 of 2142) PASS: lldb-api :: lang/objc/foundation/TestObjCMethods.py (1780 of 2142) PASS: lldb-shell :: SymbolFile/NativePDB/ast-functions.cpp (1781 of 2142) PASS: lldb-api :: functionalities/thread/concurrent_events/TestConcurrentTwoBreakpointsOneSignal.py (1782 of 2142) PASS: lldb-unit :: Utility/./UtilityTests/StreamTest.PutRawBytesToBigEndian (1783 of 2142) PASS: lldb-unit :: UnwindAssembly/x86/./UnwindAssemblyx86Tests/Testx86AssemblyInspectionEngine.TestSimplex86_64Augmented (1784 of 2142) PASS: lldb-api :: types/TestShortType.py (1785 of 2142) PASS: lldb-unit :: Process/minidump/./LLDBMinidumpTests/MinidumpParserTest.InvalidMinidump (1786 of 2142) PASS: lldb-unit :: Utility/./UtilityTests/ArgsTest.ReplaceArgumentAtIndexShort (1787 of 2142) UNSUPPORTED: lldb-shell :: SymbolFile/PDB/typedefs.test (1788 of 2142) PASS: lldb-unit :: Utility/./UtilityTests/RangeTest.Union (1789 of 2142) PASS: lldb-api :: macosx/version_zero/TestGetVersionZeroVersion.py (1790 of 2142) PASS: lldb-shell :: ScriptInterpreter/Python/python.test (1791 of 2142) PASS: lldb-unit :: Utility/./UtilityTests/ConstStringTest.format_provider (1792 of 2142) PASS: lldb-unit :: Platform/./LLDBPlatformTests/PlatformDarwinTest.TestParseVersionBuildDir (1793 of 2142) PASS: lldb-unit :: Utility/./UtilityTests/BinaryStreamTest.PutULEB128TwoBytes (1794 of 2142) PASS: lldb-api :: python_api/target/TestTargetAPI.py (1795 of 2142) PASS: lldb-shell :: SymbolFile/DWARF/dwarf5-index-is-used.cpp (1796 of 2142) PASS: lldb-api :: python_api/sbenvironment/TestSBEnvironment.py (1797 of 2142) PASS: lldb-unit :: Utility/./UtilityTests/ScalarTest.GetValue (1798 of 2142) PASS: lldb-shell :: Reproducer/TestMultipleTargets.test (1799 of 2142) PASS: lldb-unit :: Utility/./UtilityTests/RangeTest.DefaultConstructor (1800 of 2142) PASS: lldb-api :: functionalities/tail_call_frames/ambiguous_tail_call_seq1/TestAmbiguousTailCallSeq1.py (1801 of 2142) PASS: lldb-unit :: Utility/./UtilityTests/DataExtractorTest.GetCStr (1802 of 2142) PASS: lldb-unit :: Utility/./UtilityTests/StringListTest.RemoveBlankLines (1803 of 2142) UNSUPPORTED: lldb-api :: iohandler/autosuggestion/TestAutosuggestion.py (1804 of 2142) PASS: lldb-unit :: Utility/./UtilityTests/RangeTest.DoesAdjoinOrIntersect (1805 of 2142) PASS: lldb-shell :: SymbolFile/DWARF/deterministic-build.cpp (1806 of 2142) PASS: lldb-api :: functionalities/breakpoint/dummy_target_breakpoints/TestBreakpointsWithNoTargets.py (1807 of 2142) PASS: lldb-unit :: Utility/./UtilityTests/StreamTest.PutHex64ByteOrderBig (1808 of 2142) PASS: lldb-unit :: ObjectFile/MachO/./ObjectFileMachOTests/ObjectFileMachOTest.ModuleFromSharedCacheInfo (1809 of 2142) PASS: lldb-unit :: ObjectFile/Breakpad/./ObjectFileBreakpadTests/Record.classify (1810 of 2142) PASS: lldb-unit :: debugserver/./debugserverTests/JSON.Parse (1811 of 2142) PASS: lldb-api :: functionalities/postmortem/elf-core/TestLinuxCore.py (1812 of 2142) UNSUPPORTED: lldb-api :: arm/breakpoint-it/TestBreakpointIt.py (1813 of 2142) PASS: lldb-api :: commands/watchpoints/multiple_threads/TestWatchpointMultipleThreads.py (1814 of 2142) UNSUPPORTED: lldb-shell :: Register/x86-gp-write.test (1815 of 2142) PASS: lldb-api :: lang/objc/modules-hash-mismatch/TestClangModulesHashMismatch.py (1816 of 2142) PASS: lldb-api :: commands/platform/basic/TestPlatformCommand.py (1817 of 2142) PASS: lldb-api :: functionalities/tail_call_frames/sbapi_support/TestTailCallFrameSBAPI.py (1818 of 2142) PASS: lldb-api :: functionalities/jitloader_gdb/TestJITLoaderGDB.py (1819 of 2142) PASS: lldb-shell :: Settings/TestSettingsSet.test (1820 of 2142) PASS: lldb-shell :: SymbolFile/DWARF/parallel-indexing-stress.s (1821 of 2142) PASS: lldb-shell :: ObjectFile/ELF/avr-basic-info.yaml (1822 of 2142) PASS: lldb-unit :: Utility/./UtilityTests/BinaryStreamTest.PutULEB128Zero (1823 of 2142) PASS: lldb-api :: python_api/section/TestSectionAPI.py (1824 of 2142) UNSUPPORTED: lldb-api :: functionalities/data-formatter/data-formatter-stl/libstdcpp/string/TestDataFormatterStdString.py (1825 of 2142) PASS: lldb-unit :: Utility/./UtilityTests/BinaryStreamTest.PutULEB128FourBytes (1826 of 2142) PASS: lldb-unit :: Process/minidump/./LLDBMinidumpTests/MinidumpParserTest.MinidumpDuplicateModuleSeparateCode (1827 of 2142) PASS: lldb-unit :: Utility/./UtilityTests/StringListTest.CopyListSingle (1828 of 2142) PASS: lldb-api :: functionalities/thread/state_after_expression/TestStateAfterExpression.py (1829 of 2142) PASS: lldb-unit :: Utility/./UtilityTests/StringListTest.InsertStringAtIndexStdString (1830 of 2142) PASS: lldb-shell :: Process/TestAbortExitCode.test (1831 of 2142) UNSUPPORTED: lldb-api :: functionalities/darwin_log/source/info/TestDarwinLogSourceInfo.py (1832 of 2142) PASS: lldb-shell :: SymbolFile/DWARF/debug_line-relative_path.s (1833 of 2142) PASS: lldb-api :: lang/cpp/namespace/TestNamespace.py (1834 of 2142) PASS: lldb-api :: commands/watchpoints/watchpoint_on_vectors/TestValueOfVectorVariable.py (1835 of 2142) PASS: lldb-api :: lang/cpp/function-qualifiers/TestCppFunctionQualifiers.py (1836 of 2142) UNSUPPORTED: lldb-api :: functionalities/data-formatter/data-formatter-stl/libstdcpp/smart_ptr/TestDataFormatterStdSmartPtr.py (1837 of 2142) PASS: lldb-api :: commands/watchpoints/watchpoint_events/TestWatchpointEvents.py (1838 of 2142) PASS: lldb-api :: functionalities/postmortem/minidump-new/TestMiniDumpNew.py (1839 of 2142) PASS: lldb-api :: commands/add-dsym/uuid/TestAddDsymCommand.py (1840 of 2142) PASS: lldb-unit :: Target/./TargetTests/PathMappingListTest.RelativeTests (1841 of 2142) PASS: lldb-shell :: Host/TestCustomShell.test (1842 of 2142) UNSUPPORTED: lldb-shell :: Register/x86-64-gp-write.test (1843 of 2142) PASS: lldb-unit :: Utility/./UtilityTests/AnsiTerminal.WhiteSpace (1844 of 2142) PASS: lldb-shell :: SymbolFile/Breakpad/line-table-mixed-path-styles.test (1845 of 2142) PASS: lldb-unit :: SymbolFile/NativePDB/./SymbolFileNativePDBTests/PDBFPOProgramToDWARFExpressionTests.InvalidOpUnary (1846 of 2142) PASS: lldb-unit :: Symbol/./SymbolTests/TestClangASTImporter.MetadataPropagationAfterCopying (1847 of 2142) PASS: lldb-shell :: SymbolFile/Breakpad/unwind-via-stack-win.test (1848 of 2142) PASS: lldb-unit :: Utility/./UtilityTests/GeneratorTest.GetOrCreate (1849 of 2142) PASS: lldb-unit :: UnwindAssembly/x86/./UnwindAssemblyx86Tests/Testx86AssemblyInspectionEngine.TestSubRSP (1850 of 2142) PASS: lldb-api :: driver/batch_mode/TestBatchMode.py (1851 of 2142) PASS: lldb-shell :: SymbolFile/DWARF/DW_AT_location-DW_AT_const_value.s (1852 of 2142) PASS: lldb-unit :: Utility/./UtilityTests/UserIDResolver.GetGroupName (1853 of 2142) PASS: lldb-unit :: Utility/./UtilityTests/LogTest.Register (1854 of 2142) PASS: lldb-unit :: Target/./TargetTests/ExecutionContextTest.GetByteOrderProcess (1855 of 2142) PASS: lldb-unit :: Utility/./UtilityTests/VMRange.IsValid (1856 of 2142) PASS: lldb-shell :: SymbolFile/DWARF/debug_aranges-empty-section.s (1857 of 2142) UNSUPPORTED: lldb-api :: linux/sepdebugsymlink/TestTargetSymbolsSepDebugSymlink.py (1858 of 2142) UNSUPPORTED: lldb-shell :: Minidump/Windows/arm-fp-unwind.test (1859 of 2142) PASS: lldb-unit :: UnwindAssembly/x86/./UnwindAssemblyx86Tests/Testx86AssemblyInspectionEngine.TestStackRealignMSVC_i386 (1860 of 2142) PASS: lldb-unit :: Utility/./UtilityTests/ArgsTest.TestQuotedUnknownEscape (1861 of 2142) PASS: lldb-api :: commands/expression/radar_9673664/TestExprHelpExamples.py (1862 of 2142) PASS: lldb-shell :: SymbolFile/DWARF/dwarf5-atomic.s (1863 of 2142) PASS: lldb-shell :: SymbolFile/DWARF/static_scope.s (1864 of 2142) PASS: lldb-api :: lang/objc/objc-ivar-offsets/TestObjCIvarOffsets.py (1865 of 2142) PASS: lldb-shell :: Commands/command-target-modules-dump-sections.yaml (1866 of 2142) PASS: lldb-api :: commands/expression/import_builtin_fileid/TestImportBuiltinFileID.py (1867 of 2142) PASS: lldb-api :: lang/objc/foundation/TestObjCMethodsString.py (1868 of 2142) PASS: lldb-unit :: Utility/./UtilityTests/UriParserTest.SchemeHostSeparator (1869 of 2142) PASS: lldb-unit :: Utility/./UtilityTests/StringLexerTest.AdvanceIf (1870 of 2142) PASS: lldb-unit :: Utility/./UtilityTests/StreamTeeTest.SetStreamAtIndexOutOfBounds (1871 of 2142) PASS: lldb-unit :: Utility/./UtilityTests/LogChannelTest.Enable (1872 of 2142) PASS: lldb-unit :: Utility/./UtilityTests/RangeTest.SizeTypes (1873 of 2142) PASS: lldb-api :: functionalities/thread/concurrent_events/TestConcurrentWatchpointDelayWatchpointOneBreakpoint.py (1874 of 2142) PASS: lldb-unit :: Symbol/./SymbolTests/TestTypeSystemClang.TestGetBasicTypeFromName (1875 of 2142) PASS: lldb-unit :: Utility/./UtilityTests/AnsiTerminal.Empty (1876 of 2142) PASS: lldb-unit :: Utility/./UtilityTests/PassiveReplayTest.InstrumentedFoo (1877 of 2142) PASS: lldb-unit :: Process/minidump/./LLDBMinidumpTests/MinidumpParserTest.GetMiscInfo_no_stream (1878 of 2142) PASS: lldb-api :: commands/expression/no-deadlock/TestExprDoesntBlock.py (1879 of 2142) PASS: lldb-unit :: Utility/./UtilityTests/FileSpecTest.OperatorBool (1880 of 2142) PASS: lldb-api :: functionalities/postmortem/minidump-new/TestMiniDumpUUID.py (1881 of 2142) PASS: lldb-api :: functionalities/data-formatter/data-formatter-stl/libcxx/string/TestDataFormatterLibcxxString.py (1882 of 2142) PASS: lldb-api :: commands/target/basic/TestTargetCommand.py (1883 of 2142) PASS: lldb-api :: python_api/type/TestTypeList.py (1884 of 2142) PASS: lldb-api :: lang/cpp/namespace_conflicts/TestNamespaceConflicts.py (1885 of 2142) PASS: lldb-shell :: SymbolFile/DWARF/dwp.s (1886 of 2142) PASS: lldb-unit :: UnwindAssembly/x86/./UnwindAssemblyx86Tests/Testx86AssemblyInspectionEngine.TestPushR14 (1887 of 2142) PASS: lldb-unit :: Utility/./UtilityTests/XcodeSDKTest.GetSDKTypeForTriple (1888 of 2142) PASS: lldb-shell :: ObjectFile/ELF/minidebuginfo-corrupt-xz.yaml (1889 of 2142) PASS: lldb-unit :: Process/gdb-remote/./ProcessGdbRemoteTests/GDBRemoteCommunicationClientTest.GetMemoryRegionInfo (1890 of 2142) PASS: lldb-unit :: Utility/./UtilityTests/OptionsWithRawTest.EmptySuffixSingleWhitespace (1891 of 2142) PASS: lldb-api :: lang/cpp/template-specialization-type/TestTemplateSpecializationType.py (1892 of 2142) PASS: lldb-unit :: Symbol/./SymbolTests/SymbolsTest.LocateExecutableSymbolFileForUnknownExecutableAndMissingSymbolFile (1893 of 2142) PASS: lldb-unit :: Editline/./EditlineTests/EditlineTestFixture.EditlineReceivesMultiLineText (1894 of 2142) PASS: lldb-unit :: Utility/./UtilityTests/OptionsWithRawTest.SingleWhitespaceInput (1895 of 2142) PASS: lldb-shell :: SymbolFile/DWARF/debug-types-basic.test (1896 of 2142) PASS: lldb-unit :: ScriptInterpreter/Python/./ScriptInterpreterPythonTests/PythonDataObjectsTest.TestPythonTupleInitializerList (1897 of 2142) PASS: lldb-unit :: Expression/./ExpressionTests/DiagnosticManagerTest.GetStringMultipleDiags (1898 of 2142) PASS: lldb-shell :: ScriptInterpreter/Python/sb_address_exception.test (1899 of 2142) PASS: lldb-api :: commands/expression/import-std-module/basic/TestImportStdModule.py (1900 of 2142) PASS: lldb-unit :: Utility/./UtilityTests/StringListTest.CopyList (1901 of 2142) PASS: lldb-api :: commands/expression/codegen-crash-import-def-arraytype-element/TestImportDefinitionArrayType.py (1902 of 2142) PASS: lldb-api :: functionalities/data-formatter/data-formatter-synthval/TestDataFormatterSynthVal.py (1903 of 2142) PASS: lldb-unit :: Utility/./UtilityTests/ConstStringTest.FromMidOfBufferStringRef (1904 of 2142) PASS: lldb-unit :: Utility/./UtilityTests/StringExtractorTest.GetHexU8_Exact (1905 of 2142) PASS: lldb-unit :: Utility/./UtilityTests/StringExtractorTest.GetU32BigEndian (1906 of 2142) PASS: lldb-api :: python_api/value/change_values/TestChangeValueAPI.py (1907 of 2142) PASS: lldb-unit :: Utility/./UtilityTests/ScalarTest.Promotion (1908 of 2142) PASS: lldb-api :: functionalities/inferior-crashing/recursive-inferior/TestRecursiveInferior.py (1909 of 2142) PASS: lldb-api :: functionalities/thread/exit_during_step/TestExitDuringStep.py (1910 of 2142) PASS: lldb-unit :: Expression/./ExpressionTests/DWARFExpression.DW_OP_stack_value (1911 of 2142) PASS: lldb-shell :: SymbolFile/DWARF/split-dwarf-inlining.cpp (1912 of 2142) PASS: lldb-shell :: SymbolFile/DWARF/clang-ast-from-dwarf-unamed-and-anon-structs.cpp (1913 of 2142) PASS: lldb-unit :: Utility/./UtilityTests/StringListTest.SplitIntoLinesSingleTrailingCR (1914 of 2142) PASS: lldb-api :: commands/command/script/TestCommandScript.py (1915 of 2142) PASS: lldb-api :: assert_messages_test/TestAssertMessages.py (1916 of 2142) PASS: lldb-unit :: Process/gdb-remote/./ProcessGdbRemoteTests/GDBRemoteCommunicationClientTest.SyncThreadState (1917 of 2142) PASS: lldb-unit :: Utility/./UtilityTests/SerializationRountripTest.SerializeDeserializeCStringArrayNullptr (1918 of 2142) PASS: lldb-api :: python_api/watchpoint/TestWatchpointIgnoreCount.py (1919 of 2142) PASS: lldb-api :: commands/breakpoint/set/func-regex/TestBreakpointRegexError.py (1920 of 2142) PASS: lldb-unit :: Utility/./UtilityTests/StringExtractorTest.GetNameColonValueNoColon (1921 of 2142) PASS: lldb-api :: commands/expression/entry-bp/TestExprEntryBP.py (1922 of 2142) PASS: lldb-api :: commands/expression/import-std-module/vector-dbg-info-content/TestDbgInfoContentVectorFromStdModule.py (1923 of 2142) PASS: lldb-api :: functionalities/thread/step_out/TestThreadStepOut.py (1924 of 2142) PASS: lldb-unit :: Process/gdb-remote/./ProcessGdbRemoteTests/GDBRemoteClientBaseTest.SendContinueDelegateInterface (1925 of 2142) UNSUPPORTED: lldb-api :: commands/gui/basic/TestGuiBasic.py (1926 of 2142) PASS: lldb-unit :: Utility/./UtilityTests/ScalarTest.LongLongAssigmentOperator (1927 of 2142) PASS: lldb-unit :: Utility/./UtilityTests/FileSpecTest.AppendPathComponent (1928 of 2142) PASS: lldb-unit :: Utility/./UtilityTests/StreamTest.PutMaxHex64ByteOrderBig (1929 of 2142) PASS: lldb-unit :: Utility/./UtilityTests/UriParserTest.MinimalPort (1930 of 2142) UNSUPPORTED: lldb-api :: macosx/macCatalystAppMacOSFramework/TestMacCatalystAppWithMacOSFramework.py (1931 of 2142) PASS: lldb-api :: commands/expression/namespace_local_var_same_name_obj_c/TestNamespaceLocalVarSameNameObjC.py (1932 of 2142) PASS: lldb-shell :: Driver/TestPositionalArgs.test (1933 of 2142) PASS: lldb-unit :: Utility/./UtilityTests/StreamTest.PutHex16ByteOrderBig (1934 of 2142) PASS: lldb-unit :: Expression/./ExpressionTests/CppModuleConfigurationTest.MissingUsrInclude (1935 of 2142) PASS: lldb-unit :: ScriptInterpreter/Python/./ScriptInterpreterPythonTests/PythonDataObjectsTest.TestPythonDictionaryToStructuredDictionary (1936 of 2142) PASS: lldb-unit :: Symbol/./SymbolTests/TestTypeSystemClang.TestNotDeletingUserCopyCstrDueToMoveCStr (1937 of 2142) PASS: lldb-unit :: Process/minidump/./LLDBMinidumpTests/MinidumpParserTest.GetMemoryRegionInfo (1938 of 2142) PASS: lldb-api :: tools/lldb-server/TestGdbRemoteExpeditedRegisters.py (1939 of 2142) PASS: lldb-api :: lang/objc/objc-struct-argument/TestObjCStructArgument.py (1940 of 2142) PASS: lldb-api :: commands/statistics/basic/TestStats.py (1941 of 2142) PASS: lldb-api :: functionalities/data-formatter/poarray/TestPrintObjectArray.py (1942 of 2142) PASS: lldb-unit :: UnwindAssembly/x86/./UnwindAssemblyx86Tests/Testx86AssemblyInspectionEngine.TestDisassemblyJunkBytes (1943 of 2142) PASS: lldb-unit :: UnwindAssembly/x86/./UnwindAssemblyx86Tests/Testx86AssemblyInspectionEngine.TestSpillRegToStackViaMOVx86_64 (1944 of 2142) PASS: lldb-unit :: Expression/./ExpressionTests/DiagnosticManagerTest.PutStringSeverities (1945 of 2142) PASS: lldb-api :: commands/expression/inline-namespace/TestInlineNamespace.py (1946 of 2142) PASS: lldb-api :: lang/c/inlines/TestRedefinitionsInInlines.py (1947 of 2142) PASS: lldb-unit :: Utility/./UtilityTests/ProcessInstanceInfo.DumpTable_invalidUID (1948 of 2142) PASS: lldb-unit :: Utility/./UtilityTests/ProcessInstanceInfo.Dump (1949 of 2142) PASS: lldb-unit :: Utility/./UtilityTests/StreamTest.PutNHex8 (1950 of 2142) PASS: lldb-shell :: SymbolFile/Breakpad/unwind-via-stack-win-no-memory-info.yaml (1951 of 2142) PASS: lldb-api :: lang/cpp/offsetof/TestOffsetofCpp.py (1952 of 2142) PASS: lldb-unit :: Utility/./UtilityTests/ConstStringTest.YAML (1953 of 2142) PASS: lldb-unit :: Utility/./UtilityTests/StreamTest.PutULEB128 (1954 of 2142) PASS: lldb-shell :: Breakpoint/dummy-target.test (1955 of 2142) PASS: lldb-api :: functionalities/data-formatter/typedef_array/TestTypedefArray.py (1956 of 2142) PASS: lldb-api :: lang/c/conflicting-symbol/TestConflictingSymbol.py (1957 of 2142) PASS: lldb-unit :: DataFormatter/./LLDBFormatterTests/TypeMatcherTests.GetMatchStringExactName (1958 of 2142) PASS: lldb-api :: functionalities/gdb_remote_client/TestNestedRegDefinitions.py (1959 of 2142) PASS: lldb-unit :: Utility/./UtilityTests/BroadcasterTest.EventTypeHasListeners (1960 of 2142) UNSUPPORTED: lldb-api :: terminal/TestEditline.py (1961 of 2142) PASS: lldb-unit :: Language/Highlighting/./HighlighterTests/HighlighterTest.HighlighterSelectionType (1962 of 2142) PASS: lldb-api :: python_api/watchpoint/watchlocation/TestSetWatchlocation.py (1963 of 2142) PASS: lldb-api :: commands/expression/radar_8638051/Test8638051.py (1964 of 2142) PASS: lldb-shell :: Settings/TestDisableColor.test (1965 of 2142) PASS: lldb-unit :: ObjectFile/Breakpad/./ObjectFileBreakpadTests/InfoRecord.parse (1966 of 2142) PASS: lldb-unit :: Utility/./UtilityTests/AnsiTerminal.Unknown (1967 of 2142) PASS: lldb-unit :: Language/Highlighting/./HighlighterTests/HighlighterTest.ClangTrailingBackslashBeforeNewline (1968 of 2142) UNSUPPORTED: lldb-api :: commands/trace/TestTraceSchema.py (1969 of 2142) PASS: lldb-unit :: UnwindAssembly/x86/./UnwindAssemblyx86Tests/Testx86AssemblyInspectionEngine.TestPushESI (1970 of 2142) PASS: lldb-api :: commands/expression/vector_of_enums/TestVectorOfEnums.py (1971 of 2142) PASS: lldb-unit :: Utility/./UtilityTests/BinaryStreamTest.PutULEB128FiveBytes (1972 of 2142) PASS: lldb-unit :: SymbolFile/NativePDB/./SymbolFileNativePDBTests/PDBFPOProgramToDWARFExpressionTests.UnresolvedRegisterAssignmentReference (1973 of 2142) PASS: lldb-api :: commands/target/create-deps/TestTargetCreateDeps.py (1974 of 2142) PASS: lldb-unit :: Utility/./UtilityTests/FileSpecTest.CopyByAppendingPathComponent (1975 of 2142) PASS: lldb-shell :: SymbolFile/Breakpad/unwind-via-stack-cfi.test (1976 of 2142) PASS: lldb-unit :: Host/./HostTests/FileSystemTest.Exists (1977 of 2142) PASS: lldb-unit :: ObjectFile/Breakpad/./ObjectFileBreakpadTests/FuncRecord.parse (1978 of 2142) PASS: lldb-unit :: SymbolFile/NativePDB/./SymbolFileNativePDBTests/PDBFPOProgramToDWARFExpressionTests.MissingTargetRegister (1979 of 2142) PASS: lldb-api :: functionalities/gdb_remote_client/TestRecognizeBreakpoint.py (1980 of 2142) PASS: lldb-unit :: Utility/./UtilityTests/StringListTest.JoinSingle (1981 of 2142) PASS: lldb-api :: functionalities/conditional_break/TestConditionalBreak.py (1982 of 2142) PASS: lldb-unit :: Symbol/./SymbolTests/Type.GetTypeScopeAndBasename (1983 of 2142) PASS: lldb-api :: functionalities/thread/concurrent_events/TestConcurrentSignalDelayBreak.py (1984 of 2142) PASS: lldb-unit :: Utility/./UtilityTests/XcodeSDKTest.GetCanonicalNameAndConstruct (1985 of 2142) UNSUPPORTED: lldb-api :: functionalities/signal/handle-segv/TestHandleSegv.py (1986 of 2142) PASS: lldb-unit :: Process/minidump/./LLDBMinidumpTests/MinidumpParserTest.GetFilteredModuleList (1987 of 2142) PASS: lldb-api :: lang/objc/self/TestObjCSelf.py (1988 of 2142) PASS: lldb-shell :: Breakpoint/debug_rnglist_rlestartend.test (1989 of 2142) UNSUPPORTED: lldb-shell :: BuildScript/toolchain-clang-cl.test (1990 of 2142) PASS: lldb-api :: functionalities/breakpoint/global_constructor/TestBreakpointInGlobalConstructor.py (1991 of 2142) PASS: lldb-api :: lang/c/unions/TestUnionMembers.py (1992 of 2142) UNSUPPORTED: lldb-api :: functionalities/tsan/cpp_global_location/TestTsanCPPGlobalLocation.py (1993 of 2142) PASS: lldb-api :: lang/objc/modules-update/TestClangModulesUpdate.py (1994 of 2142) PASS: lldb-unit :: Utility/./UtilityTests/OptionsWithRawTest.SingleWordSuffix (1995 of 2142) PASS: lldb-shell :: Reproducer/Functionalities/TestImageList.test (1996 of 2142) PASS: lldb-unit :: Language/Highlighting/./HighlighterTests/HighlighterTest.ClangPPDirectives (1997 of 2142) PASS: lldb-api :: commands/settings/use_source_cache/TestUseSourceCache.py (1998 of 2142) PASS: lldb-shell :: SymbolFile/DWARF/debug-line-basic.s (1999 of 2142) PASS: lldb-unit :: Utility/./UtilityTests/RangeTest.ContainsEndInclusive (2000 of 2142) PASS: lldb-shell :: Register/x86-64-read.test (2001 of 2142) PASS: lldb-unit :: Expression/./ExpressionTests/DWARFExpression.DW_OP_unknown (2002 of 2142) PASS: lldb-unit :: Utility/./UtilityTests/StringExtractorTest.GetU64LittleEndian (2003 of 2142) PASS: lldb-shell :: Driver/TestFile.test (2004 of 2142) PASS: lldb-api :: lang/objc/direct-dispatch-step/TestObjCDirectDispatchStepping.py (2005 of 2142) PASS: lldb-api :: tools/lldb-server/TestGdbRemoteSingleStep.py (2006 of 2142) UNSUPPORTED: lldb-api :: commands/target/auto-install-main-executable/TestAutoInstallMainExecutable.py (2007 of 2142) PASS: lldb-unit :: Process/gdb-remote/./ProcessGdbRemoteTests/GDBRemoteClientBaseTest.SendContinueAndAsyncPacket (2008 of 2142) PASS: lldb-unit :: UnwindAssembly/x86/./UnwindAssemblyx86Tests/Testx86AssemblyInspectionEngine.TestPushECX (2009 of 2142) PASS: lldb-shell :: BuildScript/script-args.test (2010 of 2142) PASS: lldb-unit :: ScriptInterpreter/Python/./ScriptInterpreterPythonTests/PythonDataObjectsTest.TestPythonString (2011 of 2142) PASS: lldb-shell :: Driver/TestUseColor.test (2012 of 2142) PASS: lldb-unit :: Host/./HostTests/NativeProcessProtocolTest.SetBreakpointFailRead (2013 of 2142) PASS: lldb-unit :: Process/minidump/./LLDBMinidumpTests/MinidumpParserTest.GetThreadContext_x86_32_wow64 (2014 of 2142) PASS: lldb-unit :: Process/./ProcessEventDataTests/ProcessEventDataTest.ShouldStop (2015 of 2142) PASS: lldb-unit :: Signals/./SignalsTests/UnixSignalsTest.Iteration (2016 of 2142) PASS: lldb-api :: commands/expression/import-std-module/deque-basic/TestDequeFromStdModule.py (2017 of 2142) PASS: lldb-api :: lang/c/struct_types/TestStructTypes.py (2018 of 2142) PASS: lldb-unit :: Utility/./UtilityTests/RangeDataVector.FindEntryThatContains_Overlap (2019 of 2142) UNSUPPORTED: lldb-shell :: SymbolFile/NativePDB/typedefs.cpp (2020 of 2142) PASS: lldb-api :: python_api/process/io/TestProcessIO.py (2021 of 2142) PASS: lldb-unit :: Utility/./UtilityTests/StringListTest.GetMaxStringLengthDecreasingSize (2022 of 2142) PASS: lldb-unit :: ScriptInterpreter/Python/./ScriptInterpreterPythonTests/PythonDataObjectsTest.TestBorrowedReferences (2023 of 2142) PASS: lldb-unit :: Process/gdb-remote/./ProcessGdbRemoteTests/GDBRemoteCommunicationClientTest.GetModulesInfo (2024 of 2142) UNSUPPORTED: lldb-api :: benchmarks/stepping/TestSteppingSpeed.py (2025 of 2142) PASS: lldb-api :: functionalities/thread/ignore_suspended/TestIgnoreSuspendedThread.py (2026 of 2142) PASS: lldb-api :: functionalities/thread/concurrent_events/TestConcurrentCrashWithWatchpointBreakpointSignal.py (2027 of 2142) PASS: lldb-unit :: ObjectFile/PECOFF/./ObjectFilePECOFFTests/PECallFrameInfoTest.Chained_eh (2028 of 2142) PASS: lldb-api :: lang/cpp/class_static/TestStaticVariables.py (2029 of 2142) PASS: lldb-shell :: ObjectFile/PECOFF/uuid.yaml (2030 of 2142) PASS: lldb-shell :: Commands/command-breakpoint-col.test (2031 of 2142) PASS: lldb-unit :: UnwindAssembly/x86/./UnwindAssemblyx86Tests/Testx86AssemblyInspectionEngine.TestPopRBP (2032 of 2142) PASS: lldb-api :: commands/watchpoints/watchpoint_commands/condition/TestWatchpointConditionCmd.py (2033 of 2142) PASS: lldb-api :: tools/lldb-vscode/breakpoint/TestVSCode_setBreakpoints.py (2034 of 2142) PASS: lldb-unit :: Symbol/./SymbolTests/TestTypeSystemClang.TestGetEnumIntegerTypeUnexpectedType (2035 of 2142) PASS: lldb-api :: functionalities/data-formatter/data-formatter-stl/libcxx/atomic/TestLibCxxAtomic.py (2036 of 2142) PASS: lldb-shell :: Quit/TestQuitExitCode0.test (2037 of 2142) PASS: lldb-api :: commands/expression/call-function/TestCallBuiltinFunction.py (2038 of 2142) PASS: lldb-unit :: Process/gdb-remote/./ProcessGdbRemoteTests/GDBRemoteClientBaseTest.InterruptNoResponse (2039 of 2142) PASS: lldb-api :: commands/expression/unicode-in-variable/TestUnicodeInVariable.py (2040 of 2142) PASS: lldb-unit :: Utility/./UtilityTests/StringListTest.GetMaxStringLengthMixed (2041 of 2142) PASS: lldb-unit :: Utility/./UtilityTests/RangeTest.ContainsAddr (2042 of 2142) PASS: lldb-api :: lang/objc/modules/TestObjCModules.py (2043 of 2142) PASS: lldb-unit :: Utility/./UtilityTests/StringExtractorTest.GetHexBytesAvail_OddPair (2044 of 2142) PASS: lldb-unit :: Utility/./UtilityTests/SerializationRountripTest.SerializeDeserializeObjectPointer (2045 of 2142) PASS: lldb-shell :: ObjectFile/ELF/aarch64-relocations.yaml (2046 of 2142) PASS: lldb-api :: commands/expression/namespace_local_var_same_name_cpp_and_c/TestNamespaceLocalVarSameNameCppAndC.py (2047 of 2142) PASS: lldb-unit :: Expression/./ExpressionTests/DiagnosticManagerTest.GetStringNoDiags (2048 of 2142) PASS: lldb-unit :: Symbol/./SymbolTests/TestTypeSystemClang.TestGetTypeClassTypeOfExpr (2049 of 2142) PASS: lldb-unit :: Utility/./UtilityTests/NameMatchesTest.Contains (2050 of 2142) UNSUPPORTED: lldb-api :: functionalities/darwin_log/basic/TestDarwinLogBasic.py (2051 of 2142) UNSUPPORTED: lldb-shell :: ScriptInterpreter/Lua/persistent_state.test (2052 of 2142) PASS: lldb-api :: python_api/file_handle/TestFileHandle.py (2053 of 2142) PASS: lldb-unit :: Target/./TargetTests/ModuleCacheTest.GetAndPutStrangeHostname (2054 of 2142) PASS: lldb-shell :: Driver/TestRepl.test (2055 of 2142) PASS: lldb-api :: lang/c/unicode/TestUnicodeSymbols.py (2056 of 2142) PASS: lldb-unit :: Symbol/./SymbolTests/TestTypeSystemClang.TestUnifyAccessSpecifiers (2057 of 2142) PASS: lldb-unit :: Utility/./UtilityTests/OptionsWithRawTest.QuotedSuffix (2058 of 2142) PASS: lldb-unit :: Symbol/./SymbolTests/TestClangASTImporter.DeportTypeTagDecl (2059 of 2142) UNSUPPORTED: lldb-shell :: Register/x86-ymm-write.test (2060 of 2142) PASS: lldb-api :: functionalities/data-formatter/data-formatter-stl/libcxx/forward_list/TestDataFormatterLibcxxForwardList.py (2061 of 2142) PASS: lldb-unit :: Host/./HostTests/SocketAddressTest.Set (2062 of 2142) PASS: lldb-shell :: SymbolFile/DWARF/module-ownership.mm (2063 of 2142) PASS: lldb-api :: python_api/watchpoint/watchlocation/TestTargetWatchAddress.py (2064 of 2142) PASS: lldb-api :: functionalities/data-formatter/data-formatter-cpp/TestDataFormatterCpp.py (2065 of 2142) PASS: lldb-api :: functionalities/thread/concurrent_events/TestConcurrentBreakpointOneDelayBreakpointThreads.py (2066 of 2142) PASS: lldb-shell :: SymbolFile/DWARF/find-basic-namespace.cpp (2067 of 2142) PASS: lldb-shell :: BuildScript/compiler-full-path.test (2068 of 2142) PASS: lldb-api :: commands/quit/TestQuit.py (2069 of 2142) UNSUPPORTED: lldb-api :: functionalities/asan/TestReportData.py (2070 of 2142) PASS: lldb-api :: functionalities/data-formatter/data-formatter-stl/libcxx/initializerlist/TestInitializerList.py (2071 of 2142) PASS: lldb-unit :: Utility/./UtilityTests/UriParserTest.BracketedHostnamePort (2072 of 2142) PASS: lldb-api :: lang/cpp/lambdas/TestLambdas.py (2073 of 2142) UNSUPPORTED: lldb-shell :: ScriptInterpreter/Lua/nested_sessions.test (2074 of 2142) PASS: lldb-unit :: UnwindAssembly/x86/./UnwindAssemblyx86Tests/Testx86AssemblyInspectionEngine.TestAddESP (2075 of 2142) PASS: lldb-api :: lang/cpp/function_refs/TestFunctionRefs.py (2076 of 2142) PASS: lldb-unit :: Utility/./UtilityTests/OptionsWithRawTest.MultiWordSuffix (2077 of 2142) PASS: lldb-api :: commands/expression/import-std-module/shared_ptr/TestSharedPtrFromStdModule.py (2078 of 2142) PASS: lldb-api :: lang/cpp/operator-overload/TestOperatorOverload.py (2079 of 2142) PASS: lldb-unit :: Utility/./UtilityTests/VMRange.Comparison (2080 of 2142) UNSUPPORTED: lldb-shell :: Register/x86-zmm-write.test (2081 of 2142) PASS: lldb-api :: functionalities/testid/TestTestId.py (2082 of 2142) UNSUPPORTED: lldb-shell :: SymbolFile/NativePDB/local-variables.cpp (2083 of 2142) PASS: lldb-unit :: Utility/./UtilityTests/SubsystemRAIITest.SubsystemWithErrorFailure (2084 of 2142) PASS: lldb-api :: functionalities/data-formatter/data-formatter-globals/TestDataFormatterGlobals.py (2085 of 2142) PASS: lldb-unit :: SymbolFile/NativePDB/./SymbolFileNativePDBTests/PDBFPOProgramToDWARFExpressionTests.InvalidAssignmentSingle (2086 of 2142) PASS: lldb-api :: lang/c/const_variables/TestConstVariables.py (2087 of 2142) PASS: lldb-unit :: Symbol/./SymbolTests/TestTypeSystemClang.TestGetTypeClassTypeOf (2088 of 2142) PASS: lldb-unit :: Expression/./ExpressionTests/DiagnosticManagerTest.GetStringMultiline (2089 of 2142) PASS: lldb-api :: python_api/sbdata/TestSBData.py (2090 of 2142) PASS: lldb-unit :: Host/./HostTests/HostInfoTest.GetHostname (2091 of 2142) PASS: lldb-api :: python_api/default-constructor/TestDefaultConstructorForAPIObjects.py (2092 of 2142) PASS: lldb-api :: lang/cpp/unique-types/TestUniqueTypes.py (2093 of 2142) UNSUPPORTED: lldb-api :: functionalities/data-formatter/data-formatter-stl/libstdcpp/list/TestDataFormatterStdList.py (2094 of 2142) PASS: lldb-unit :: ScriptInterpreter/Python/./ScriptInterpreterPythonTests/PythonDataObjectsTest.TestPythonTupleInitializerList2 (2095 of 2142) PASS: lldb-shell :: SymbolFile/DWARF/dir-separator-posix.s (2096 of 2142) PASS: lldb-unit :: Target/./TargetTests/MCBasedABI.MapRegisterName (2097 of 2142) PASS: lldb-api :: commands/expression/function_template_specialization_temp_args/TestFunctionTemplateSpecializationTempArgs.py (2098 of 2142) PASS: lldb-api :: lang/objc/forward-decl/TestForwardDecl.py (2099 of 2142) PASS: lldb-unit :: Utility/./UtilityTests/StringListTest.SplitIntoLines (2100 of 2142) PASS: lldb-api :: macosx/order/TestOrderFile.py (2101 of 2142) PASS: lldb-unit :: Utility/./UtilityTests/VMRange.SetEndAddress (2102 of 2142) PASS: lldb-api :: functionalities/tail_call_frames/disambiguate_tail_call_seq/TestDisambiguateTailCallSeq.py (2103 of 2142) PASS: lldb-api :: commands/expression/weak_symbols/TestWeakSymbols.py (2104 of 2142) PASS: lldb-api :: tools/lldb-server/TestGdbRemoteProcessInfo.py (2105 of 2142) PASS: lldb-unit :: Utility/./UtilityTests/ArgsTest.ReplaceArgumentAtIndexLonger (2106 of 2142) PASS: lldb-unit :: Utility/./UtilityTests/RegularExpression.Match (2107 of 2142) PASS: lldb-shell :: SymbolFile/Breakpad/stack-cfi-parsing.test (2108 of 2142) PASS: lldb-unit :: Utility/./UtilityTests/StreamTest.AddressSize (2109 of 2142) PASS: lldb-shell :: ObjectFile/ELF/short-build-id.yaml (2110 of 2142) PASS: lldb-api :: tools/lldb-server/TestAppleSimulatorOSType.py (2111 of 2142) PASS: lldb-api :: commands/expression/import-std-module/queue/TestQueueFromStdModule.py (2112 of 2142) PASS: lldb-unit :: Process/gdb-remote/./ProcessGdbRemoteTests/GDBRemoteCommunicationServerTest.SendErrorResponse_StringError (2113 of 2142) PASS: lldb-unit :: Utility/./UtilityTests/ScalarTest.Division (2114 of 2142) PASS: lldb-unit :: SymbolFile/NativePDB/./SymbolFileNativePDBTests/PDBFPOProgramToDWARFExpressionTests.UnsupportedRASearch (2115 of 2142) XFAIL: lldb-shell :: Unwind/prefer-debug-over-eh-frame.test (2116 of 2142) PASS: lldb-api :: commands/expression/call-function/TestCallStopAndContinue.py (2117 of 2142) PASS: lldb-api :: functionalities/thread/concurrent_events/TestConcurrentSignalBreak.py (2118 of 2142) PASS: lldb-unit :: Utility/./UtilityTests/LogTest.Unregister (2119 of 2142) PASS: lldb-shell :: VSCode/TestOptions.test (2120 of 2142) PASS: lldb-unit :: ScriptInterpreter/Python/./ScriptInterpreterPythonTests/PythonDataObjectsTest.TestPythonTupleValues (2121 of 2142) PASS: lldb-shell :: SymbolFile/DWARF/find-variable-dwo.cpp (2122 of 2142) UNSUPPORTED: lldb-shell :: Register/aarch64-fp-read.test (2123 of 2142) PASS: lldb-api :: lang/cpp/virtual-functions/TestCppVirtualFunctions.py (2124 of 2142) PASS: lldb-shell :: SymbolFile/NativePDB/tag-types.cpp (2125 of 2142) PASS: lldb-unit :: Expression/./ExpressionTests/DiagnosticManagerTest.PutString (2126 of 2142) PASS: lldb-unit :: Utility/./UtilityTests/StreamTeeTest.AppendStream (2127 of 2142) PASS: lldb-api :: functionalities/data-formatter/data-formatter-objc/TestDataFormatterObjCExpr.py (2128 of 2142) PASS: lldb-api :: commands/frame/var/TestFrameVar.py (2129 of 2142) PASS: lldb-api :: macosx/find-app-in-bundle/TestFindAppInBundle.py (2130 of 2142) PASS: lldb-api :: functionalities/thread/concurrent_events/TestConcurrentBreakpointsDelayedBreakpointOneWatchpoint.py (2131 of 2142) PASS: lldb-api :: lang/cpp/class-template-parameter-pack/TestClassTemplateParameterPack.py (2132 of 2142) PASS: lldb-api :: commands/command/script_alias/TestCommandScriptAlias.py (2133 of 2142) PASS: lldb-unit :: Utility/./UtilityTests/StreamTest.ShiftOperatorChars (2134 of 2142) UNSUPPORTED: lldb-shell :: BuildScript/toolchain-msvc.test (2135 of 2142) PASS: lldb-api :: functionalities/mtc/simple/TestMTCSimple.py (2136 of 2142) PASS: lldb-api :: functionalities/data-formatter/data-formatter-objc/nsindexpath/TestDataFormatterNSIndexPath.py (2137 of 2142) PASS: lldb-api :: python_api/lldbutil/iter/TestRegistersIterator.py (2138 of 2142) PASS: lldb-unit :: Utility/./UtilityTests/EnvironmentTest.EnvpConversion (2139 of 2142) PASS: lldb-api :: commands/expression/fixits/TestFixIts.py (2140 of 2142) PASS: lldb-api :: api/multithreaded/TestMultithreaded.py (2141 of 2142) Cancelling nested steps due to timeout Sending interrupt signal to process ninja: build stopped: interrupted by user. script returned exit code 143 [Pipeline] } [Pipeline] // timeout [Pipeline] } [Pipeline] // stage [Pipeline] stage [Pipeline] { (Declarative: Post Actions) [Pipeline] scanForIssues [Clang (LLVM based)] Sleeping for 5 seconds due to JENKINS-32191... [Clang (LLVM based)] Parsing console log (workspace: '/Users/buildslave/jenkins/workspace/lldb-cmake-sanitized') [Clang (LLVM based)] Successfully parsed console log [Clang (LLVM based)] -> found 1 issue (skipped 0 duplicates) [Clang (LLVM based)] Post processing issues on 'green-dragon-23' with source code encoding 'UTF-8' [Clang (LLVM based)] Creating SCM blamer to obtain author and commit information for affected files [Clang (LLVM based)] Creating SCM miner to obtain statistics for affected repository files [Clang (LLVM based)] Resolving file names for all issues in source directory '/Users/buildslave/jenkins/workspace/lldb-cmake-sanitized' [Clang (LLVM based)] -> resolved paths in source directory (1 found, 0 not found) [Clang (LLVM based)] Resolving module names from module definitions (build.xml, pom.xml, or Manifest.mf files) [Clang (LLVM based)] -> resolved module names for 1 issues [Clang (LLVM based)] Resolving package names (or namespaces) by parsing the affected files [Clang (LLVM based)] -> resolved package names of 1 affected files [Clang (LLVM based)] No filter has been set, publishing all 1 issues [Clang (LLVM based)] Creating fingerprints for all affected code blocks to track issues over different builds [Clang (LLVM based)] -> created fingerprints for 1 issues (skipped 0 issues) [Clang (LLVM based)] Copying affected files to Jenkins' build folder '/Users/Shared/Jenkins/Home/jobs/lldb-cmake-sanitized/builds/1819/files-with-issues' [Clang (LLVM based)] -> 1 copied, 0 not in workspace, 0 not-found, 0 with I/O error [Pipeline] junit Recording test results No test report files were found. Configuration error? Error when executing always post condition: Also: hudson.remoting.Channel$CallSiteStackTrace: Remote call to green-dragon-23 at hudson.remoting.Channel.attachCallSiteStackTrace(Channel.java:1788) at hudson.remoting.UserRequest$ExceptionResponse.retrieve(UserRequest.java:356) at hudson.remoting.Channel.call(Channel.java:998) at hudson.FilePath.act(FilePath.java:1069) at hudson.FilePath.act(FilePath.java:1058) at hudson.tasks.junit.JUnitParser.parseResult(JUnitParser.java:114) at hudson.tasks.junit.JUnitResultArchiver.parse(JUnitResultArchiver.java:137) at hudson.tasks.junit.JUnitResultArchiver.parseAndAttach(JUnitResultArchiver.java:167) at hudson.tasks.junit.pipeline.JUnitResultsStepExecution.run(JUnitResultsStepExecution.java:52) at hudson.tasks.junit.pipeline.JUnitResultsStepExecution.run(JUnitResultsStepExecution.java:25) at org.jenkinsci.plugins.workflow.steps.SynchronousNonBlockingStepExecution.lambda$start$0(SynchronousNonBlockingStepExecution.java:47) at java.util.concurrent.Executors$RunnableAdapter.call(Executors.java:511) hudson.AbortException: No test report files were found. Configuration error? at hudson.tasks.junit.JUnitParser$ParseResultCallable.invoke(JUnitParser.java:154) at hudson.tasks.junit.JUnitParser$ParseResultCallable.invoke(JUnitParser.java:118) at hudson.FilePath$FileCallableWrapper.call(FilePath.java:3073) at hudson.remoting.UserRequest.perform(UserRequest.java:211) at hudson.remoting.UserRequest.perform(UserRequest.java:54) at hudson.remoting.Request$2.run(Request.java:369) at hudson.remoting.InterceptingExecutorService$1.call(InterceptingExecutorService.java:72) at java.util.concurrent.FutureTask.run(FutureTask.java:266) at java.util.concurrent.ThreadPoolExecutor.runWorker(ThreadPoolExecutor.java:1149) at java.util.concurrent.ThreadPoolExecutor$Worker.run(ThreadPoolExecutor.java:624) at java.lang.Thread.run(Thread.java:748)

Hide Details

[Pipeline] } [Pipeline] // stage [Pipeline] } [Pipeline] // withEnv [Pipeline] } [Pipeline] // node [Pipeline] End of Pipeline Timeout has been exceeded Finished: ABORTED