FailedConsole Output

Skipping 15,849 KB.. Full Log
ighlighterTest.HighlighterSelectionType (1425 of 2216)
PASS: lldb-unit :: Language/Highlighting/Release/HighlighterTests/HighlighterTest.Keywords (1426 of 2216)
PASS: lldb-unit :: ObjectFile/Breakpad/Release/ObjectFileBreakpadTests/FileRecord.parse (1427 of 2216)
PASS: lldb-unit :: ObjectFile/Breakpad/Release/ObjectFileBreakpadTests/FuncRecord.parse (1428 of 2216)
PASS: lldb-unit :: ObjectFile/Breakpad/Release/ObjectFileBreakpadTests/InfoRecord.parse (1429 of 2216)
PASS: lldb-unit :: ObjectFile/Breakpad/Release/ObjectFileBreakpadTests/LineRecord.parse (1430 of 2216)
PASS: lldb-unit :: ObjectFile/Breakpad/Release/ObjectFileBreakpadTests/ModuleRecord.parse (1431 of 2216)
PASS: lldb-unit :: ObjectFile/Breakpad/Release/ObjectFileBreakpadTests/PublicRecord.parse (1432 of 2216)
PASS: lldb-unit :: ObjectFile/Breakpad/Release/ObjectFileBreakpadTests/Record.classify (1433 of 2216)
PASS: lldb-unit :: ObjectFile/Breakpad/Release/ObjectFileBreakpadTests/StackCFIRecord.parse (1434 of 2216)
PASS: lldb-unit :: ObjectFile/Breakpad/Release/ObjectFileBreakpadTests/StackWinRecord.parse (1435 of 2216)
PASS: lldb-unit :: ObjectFile/ELF/Release/ObjectFileELFTests/ObjectFileELFTest.GetModuleSpecifications_EarlySectionHeaders (1436 of 2216)
PASS: lldb-unit :: ObjectFile/ELF/Release/ObjectFileELFTests/ObjectFileELFTest.GetSymtab_NoSymEntryPointArmAddressClass (1437 of 2216)
PASS: lldb-unit :: ObjectFile/ELF/Release/ObjectFileELFTests/ObjectFileELFTest.GetSymtab_NoSymEntryPointArmThumbAddressClass (1438 of 2216)
PASS: lldb-unit :: ObjectFile/ELF/Release/ObjectFileELFTests/ObjectFileELFTest.SectionsResolveConsistently (1439 of 2216)
PASS: lldb-unit :: ObjectFile/MachO/Release/ObjectFileMachOTests/ObjectFileMachOTest.ModuleFromSharedCacheInfo (1440 of 2216)
PASS: lldb-unit :: ObjectFile/PECOFF/Release/ObjectFilePECOFFTests/PECallFrameInfoTest.Basic_eh (1441 of 2216)
PASS: lldb-unit :: ObjectFile/PECOFF/Release/ObjectFilePECOFFTests/PECallFrameInfoTest.Chained_eh (1442 of 2216)
PASS: lldb-unit :: ObjectFile/PECOFF/Release/ObjectFilePECOFFTests/PECallFrameInfoTest.Frame_reg_eh (1443 of 2216)
PASS: lldb-unit :: Platform/Android/Release/AdbClientTests/AdbClientTest.CreateByDeviceId (1444 of 2216)
PASS: lldb-unit :: Platform/Android/Release/AdbClientTests/AdbClientTest.CreateByDeviceId_ByEnvVar (1445 of 2216)
PASS: lldb-unit :: Platform/Release/LLDBPlatformTests/PlatformAppleSimulatorTest.TestHostPlatformToSim (1446 of 2216)
PASS: lldb-unit :: Platform/Release/LLDBPlatformTests/PlatformAppleSimulatorTest.TestSimHasSimEnvionament (1447 of 2216)
PASS: lldb-unit :: Platform/Release/LLDBPlatformTests/PlatformDarwinTest.FindComponentInPath (1448 of 2216)
PASS: lldb-unit :: Platform/Release/LLDBPlatformTests/PlatformDarwinTest.TestParseVersionBuildDir (1449 of 2216)
PASS: lldb-unit :: Process/Release/ProcessEventDataTests/ProcessEventDataTest.DoOnRemoval (1450 of 2216)
PASS: lldb-unit :: Process/Release/ProcessEventDataTests/ProcessEventDataTest.ShouldStop (1451 of 2216)
PASS: lldb-unit :: Process/Utility/Release/ProcessUtilityTests/ProcMapTests/LinuxProcMapsTestFixture.ParseMapRegions/0 (1452 of 2216)
PASS: lldb-unit :: Process/Utility/Release/ProcessUtilityTests/ProcMapTests/LinuxProcMapsTestFixture.ParseMapRegions/1 (1453 of 2216)
PASS: lldb-unit :: Process/Utility/Release/ProcessUtilityTests/ProcMapTests/LinuxProcMapsTestFixture.ParseMapRegions/2 (1454 of 2216)
PASS: lldb-unit :: Process/Utility/Release/ProcessUtilityTests/ProcMapTests/LinuxProcMapsTestFixture.ParseMapRegions/3 (1455 of 2216)
PASS: lldb-unit :: Process/Utility/Release/ProcessUtilityTests/ProcMapTests/LinuxProcMapsTestFixture.ParseMapRegions/4 (1456 of 2216)
PASS: lldb-unit :: Process/Utility/Release/ProcessUtilityTests/ProcMapTests/LinuxProcMapsTestFixture.ParseMapRegions/5 (1457 of 2216)
PASS: lldb-unit :: Process/Utility/Release/ProcessUtilityTests/ProcMapTests/LinuxProcMapsTestFixture.ParseMapRegions/6 (1458 of 2216)
PASS: lldb-unit :: Process/Utility/Release/ProcessUtilityTests/ProcMapTests/LinuxProcMapsTestFixture.ParseMapRegions/7 (1459 of 2216)
PASS: lldb-unit :: Process/Utility/Release/ProcessUtilityTests/ProcMapTests/LinuxProcMapsTestFixture.ParseMapRegions/8 (1460 of 2216)
PASS: lldb-unit :: Process/Utility/Release/ProcessUtilityTests/ProcSMapTests/LinuxProcSMapsTestFixture.ParseSMapRegions/0 (1461 of 2216)
PASS: lldb-unit :: Process/Utility/Release/ProcessUtilityTests/ProcSMapTests/LinuxProcSMapsTestFixture.ParseSMapRegions/1 (1462 of 2216)
PASS: lldb-unit :: Process/Utility/Release/ProcessUtilityTests/ProcSMapTests/LinuxProcSMapsTestFixture.ParseSMapRegions/2 (1463 of 2216)
PASS: lldb-unit :: Process/Utility/Release/ProcessUtilityTests/ProcSMapTests/LinuxProcSMapsTestFixture.ParseSMapRegions/3 (1464 of 2216)
PASS: lldb-unit :: Process/Utility/Release/ProcessUtilityTests/ProcSMapTests/LinuxProcSMapsTestFixture.ParseSMapRegions/4 (1465 of 2216)
PASS: lldb-unit :: Process/Utility/Release/ProcessUtilityTests/ProcSMapTests/LinuxProcSMapsTestFixture.ParseSMapRegions/5 (1466 of 2216)
PASS: lldb-unit :: Process/Utility/Release/ProcessUtilityTests/ProcSMapTests/LinuxProcSMapsTestFixture.ParseSMapRegions/6 (1467 of 2216)
PASS: lldb-unit :: Process/Utility/Release/ProcessUtilityTests/ProcSMapTests/LinuxProcSMapsTestFixture.ParseSMapRegions/7 (1468 of 2216)
PASS: lldb-unit :: Process/Utility/Release/ProcessUtilityTests/ProcSMapTests/LinuxProcSMapsTestFixture.ParseSMapRegions/8 (1469 of 2216)
PASS: lldb-unit :: Process/Utility/Release/ProcessUtilityTests/ProcSMapTests/LinuxProcSMapsTestFixture.ParseSMapRegions/9 (1470 of 2216)
PASS: lldb-unit :: Process/Utility/Release/ProcessUtilityTests/RegisterContext_x86Test.AbridgedToFullTagWord (1471 of 2216)
PASS: lldb-unit :: Process/Utility/Release/ProcessUtilityTests/RegisterContext_x86Test.FullToAbridgedTagWord (1472 of 2216)
PASS: lldb-api :: lang/objc/foundation/TestFoundationDisassembly.py (1473 of 2216)
PASS: lldb-unit :: Process/gdb-remote/Release/ProcessGdbRemoteTests/GDBRemoteClientBaseTest.SendContinueAndAsyncPacket (1474 of 2216)
PASS: lldb-unit :: Process/gdb-remote/Release/ProcessGdbRemoteTests/GDBRemoteClientBaseTest.SendContinueAndAsyncSignal (1475 of 2216)
PASS: lldb-unit :: Process/gdb-remote/Release/ProcessGdbRemoteTests/GDBRemoteClientBaseTest.SendContinueAndInterrupt (1476 of 2216)
PASS: lldb-unit :: Process/gdb-remote/Release/ProcessGdbRemoteTests/GDBRemoteClientBaseTest.SendContinueAndInterrupt2PacketBug (1477 of 2216)
PASS: lldb-unit :: Process/gdb-remote/Release/ProcessGdbRemoteTests/GDBRemoteClientBaseTest.SendContinueAndLateInterrupt (1478 of 2216)
PASS: lldb-unit :: Process/gdb-remote/Release/ProcessGdbRemoteTests/GDBRemoteClientBaseTest.SendContinueAndWait (1479 of 2216)
PASS: lldb-unit :: Process/gdb-remote/Release/ProcessGdbRemoteTests/GDBRemoteClientBaseTest.SendContinueDelegateInterface (1480 of 2216)
PASS: lldb-unit :: Process/gdb-remote/Release/ProcessGdbRemoteTests/GDBRemoteClientBaseTest.SendContinueDelegateStructuredDataReceipt (1481 of 2216)
PASS: lldb-unit :: Process/gdb-remote/Release/ProcessGdbRemoteTests/GDBRemoteClientBaseTest.SendPacketAndReceiveResponseWithOutputSupport (1482 of 2216)
PASS: lldb-unit :: Process/gdb-remote/Release/ProcessGdbRemoteTests/GDBRemoteCommunicationClientTest.GetMemoryRegionInfo (1483 of 2216)
PASS: lldb-unit :: Process/gdb-remote/Release/ProcessGdbRemoteTests/GDBRemoteCommunicationClientTest.GetMemoryRegionInfoInvalidResponse (1484 of 2216)
PASS: lldb-unit :: Process/gdb-remote/Release/ProcessGdbRemoteTests/GDBRemoteCommunicationClientTest.GetModulesInfo (1485 of 2216)
PASS: lldb-unit :: Process/gdb-remote/Release/ProcessGdbRemoteTests/GDBRemoteCommunicationClientTest.GetModulesInfoInvalidResponse (1486 of 2216)
PASS: lldb-unit :: Process/gdb-remote/Release/ProcessGdbRemoteTests/GDBRemoteCommunicationClientTest.GetModulesInfo_UUID20 (1487 of 2216)
PASS: lldb-unit :: Process/gdb-remote/Release/ProcessGdbRemoteTests/GDBRemoteCommunicationClientTest.GetQOffsets (1488 of 2216)
PASS: lldb-unit :: Process/gdb-remote/Release/ProcessGdbRemoteTests/GDBRemoteCommunicationClientTest.ReadRegister (1489 of 2216)
PASS: lldb-unit :: Process/gdb-remote/Release/ProcessGdbRemoteTests/GDBRemoteCommunicationClientTest.SaveRestoreRegistersNoSuffix (1490 of 2216)
PASS: lldb-unit :: Process/gdb-remote/Release/ProcessGdbRemoteTests/GDBRemoteCommunicationClientTest.SendGetDataPacket (1491 of 2216)
PASS: lldb-unit :: Process/gdb-remote/Release/ProcessGdbRemoteTests/GDBRemoteCommunicationClientTest.SendGetMetaDataPacket (1492 of 2216)
PASS: lldb-unit :: Process/gdb-remote/Release/ProcessGdbRemoteTests/GDBRemoteCommunicationClientTest.SendGetTraceConfigPacket (1493 of 2216)
PASS: lldb-unit :: Process/gdb-remote/Release/ProcessGdbRemoteTests/GDBRemoteCommunicationClientTest.SendSignalsToIgnore (1494 of 2216)
PASS: lldb-unit :: Process/gdb-remote/Release/ProcessGdbRemoteTests/GDBRemoteCommunicationClientTest.SendStartTracePacket (1495 of 2216)
PASS: lldb-unit :: Process/gdb-remote/Release/ProcessGdbRemoteTests/GDBRemoteCommunicationClientTest.SendStopTracePacket (1496 of 2216)
FAIL: lldb-api :: lang/objc/foundation/TestObjCMethods.py (1497 of 2216)
******************** TEST 'lldb-api :: lang/objc/foundation/TestObjCMethods.py' FAILED ********************
Script:
--
/usr/local/Frameworks/Python.framework/Versions/3.7/bin/python3.7 /Users/buildslave/jenkins/workspace/lldb-cmake-standalone/llvm-project/lldb/test/API/dotest.py -S nm -u CXXFLAGS -u CFLAGS --codesign-identity lldb_codesign --env LLVM_LIBS_DIR=/Users/buildslave/jenkins/workspace/lldb-cmake-standalone/clang-build/./lib --arch x86_64 --build-dir /Users/buildslave/jenkins/workspace/lldb-cmake-standalone/lldb-xcode-build/lldb-test-build.noindex -s /Users/buildslave/jenkins/workspace/lldb-cmake-standalone/lldb-xcode-build/lldb-test-traces --lldb-module-cache-dir /Users/buildslave/jenkins/workspace/lldb-cmake-standalone/lldb-xcode-build/lldb-test-build.noindex/module-cache-lldb/lldb-api --clang-module-cache-dir /Users/buildslave/jenkins/workspace/lldb-cmake-standalone/lldb-xcode-build/lldb-test-build.noindex/module-cache-clang/lldb-api --executable /Users/buildslave/jenkins/workspace/lldb-cmake-standalone/lldb-xcode-build/Release/bin/lldb --compiler /Users/buildslave/jenkins/workspace/lldb-cmake-standalone/clang-build/./bin/clang --dsymutil /Users/buildslave/jenkins/workspace/lldb-cmake-standalone/clang-build/./bin/dsymutil --filecheck /Users/buildslave/jenkins/workspace/lldb-cmake-standalone/clang-build/./bin/FileCheck --yaml2obj /Users/buildslave/jenkins/workspace/lldb-cmake-standalone/clang-build/./bin/yaml2obj --server /Users/buildslave/jenkins/workspace/lldb-cmake-standalone/lldb-xcode-build/Release/bin/debugserver --lldb-libs-dir /Users/buildslave/jenkins/workspace/lldb-cmake-standalone/lldb-xcode-build/Release/lib --framework /Users/buildslave/jenkins/workspace/lldb-cmake-standalone/lldb-xcode-build/Release/bin/LLDB.framework /Users/buildslave/jenkins/workspace/lldb-cmake-standalone/llvm-project/lldb/test/API/lang/objc/foundation -p TestObjCMethods.py
--
Exit Code: 1

Hide Details

Command Output (stdout): -- lldb version 12.0.0 (http://labmaster3.local/git/llvm-project.git revision fba0b65f727134e8d05c785b04b7b574f852d49e) clang revision fba0b65f727134e8d05c785b04b7b574f852d49e llvm revision fba0b65f727134e8d05c785b04b7b574f852d49e libstdcxx tests will not be run because: Don't know how to build with libstdcxx on macosx Skipping following debug info categories: ['dwo']

Hide Details

-- Command Output (stderr): --

Hide Details

Session logs for test failures/errors/unexpected successes will go into directory '/Users/buildslave/jenkins/workspace/lldb-cmake-standalone/lldb-xcode-build/lldb-test-traces' FAIL: LLDB (/Users/buildslave/jenkins/workspace/lldb-cmake-standalone/clang-build/bin/clang-x86_64) :: test_break_dsym (TestObjCMethods.FoundationTestCase) PASS: LLDB (/Users/buildslave/jenkins/workspace/lldb-cmake-standalone/clang-build/bin/clang-x86_64) :: test_break_dwarf (TestObjCMethods.FoundationTestCase) UNSUPPORTED: LLDB (/Users/buildslave/jenkins/workspace/lldb-cmake-standalone/clang-build/bin/clang-x86_64) :: test_break_dwo (TestObjCMethods.FoundationTestCase) (test case does not fall in any category of interest for this run) PASS: LLDB (/Users/buildslave/jenkins/workspace/lldb-cmake-standalone/clang-build/bin/clang-x86_64) :: test_break_gmodules (TestObjCMethods.FoundationTestCase) PASS: LLDB (/Users/buildslave/jenkins/workspace/lldb-cmake-standalone/clang-build/bin/clang-x86_64) :: test_data_type_and_expr_dsym (TestObjCMethods.FoundationTestCase) PASS: LLDB (/Users/buildslave/jenkins/workspace/lldb-cmake-standalone/clang-build/bin/clang-x86_64) :: test_data_type_and_expr_dwarf (TestObjCMethods.FoundationTestCase) UNSUPPORTED: LLDB (/Users/buildslave/jenkins/workspace/lldb-cmake-standalone/clang-build/bin/clang-x86_64) :: test_data_type_and_expr_dwo (TestObjCMethods.FoundationTestCase) (test case does not fall in any category of interest for this run) PASS: LLDB (/Users/buildslave/jenkins/workspace/lldb-cmake-standalone/clang-build/bin/clang-x86_64) :: test_data_type_and_expr_gmodules (TestObjCMethods.FoundationTestCase) PASS: LLDB (/Users/buildslave/jenkins/workspace/lldb-cmake-standalone/clang-build/bin/clang-x86_64) :: test_expression_lookups_objc_dsym (TestObjCMethods.FoundationTestCase) PASS: LLDB (/Users/buildslave/jenkins/workspace/lldb-cmake-standalone/clang-build/bin/clang-x86_64) :: test_expression_lookups_objc_dwarf (TestObjCMethods.FoundationTestCase) UNSUPPORTED: LLDB (/Users/buildslave/jenkins/workspace/lldb-cmake-standalone/clang-build/bin/clang-x86_64) :: test_expression_lookups_objc_dwo (TestObjCMethods.FoundationTestCase) (test case does not fall in any category of interest for this run) PASS: LLDB (/Users/buildslave/jenkins/workspace/lldb-cmake-standalone/clang-build/bin/clang-x86_64) :: test_expression_lookups_objc_gmodules (TestObjCMethods.FoundationTestCase) PASS: LLDB (/Users/buildslave/jenkins/workspace/lldb-cmake-standalone/clang-build/bin/clang-x86_64) :: test_print_ivars_correctly_dsym (TestObjCMethods.FoundationTestCase) PASS: LLDB (/Users/buildslave/jenkins/workspace/lldb-cmake-standalone/clang-build/bin/clang-x86_64) :: test_print_ivars_correctly_dwarf (TestObjCMethods.FoundationTestCase) UNSUPPORTED: LLDB (/Users/buildslave/jenkins/workspace/lldb-cmake-standalone/clang-build/bin/clang-x86_64) :: test_print_ivars_correctly_dwo (TestObjCMethods.FoundationTestCase) (test case does not fall in any category of interest for this run) PASS: LLDB (/Users/buildslave/jenkins/workspace/lldb-cmake-standalone/clang-build/bin/clang-x86_64) :: test_print_ivars_correctly_gmodules (TestObjCMethods.FoundationTestCase) ====================================================================== FAIL: test_break_dsym (TestObjCMethods.FoundationTestCase) Test setting objc breakpoints using '_regexp-break' and 'breakpoint set'. ---------------------------------------------------------------------- Traceback (most recent call last): File "/Users/buildslave/jenkins/workspace/lldb-cmake-standalone/llvm-project/lldb/packages/Python/lldbsuite/test/lldbtest.py", line 1853, in test_method return attrvalue(self) File "/Users/buildslave/jenkins/workspace/lldb-cmake-standalone/llvm-project/lldb/test/API/lang/objc/foundation/TestObjCMethods.py", line 70, in test_break self.runCmd("run", RUN_SUCCEEDED) File "/Users/buildslave/jenkins/workspace/lldb-cmake-standalone/llvm-project/lldb/packages/Python/lldbsuite/test/lldbtest.py", line 2184, in runCmd msg if (msg) else CMD_MSG(cmd)) AssertionError: False is not True : Process is launched successfully Error output: error: process exited with status -1 (developer mode is not enabled on this machine and this is a non-interactive debug session.)

Hide Details

Config=x86_64-/Users/buildslave/jenkins/workspace/lldb-cmake-standalone/clang-build/bin/clang ---------------------------------------------------------------------- Ran 16 tests in 62.455s

Hide Details

RESULT: FAILED (11 passes, 1 failures, 0 errors, 4 skipped, 0 expected failures, 0 unexpected successes)

Hide Details

--

Hide Details

******************** PASS: lldb-unit :: Process/gdb-remote/Release/ProcessGdbRemoteTests/GDBRemoteCommunicationClientTest.SendTraceSupportedTypePacket (1498 of 2216) PASS: lldb-unit :: Process/gdb-remote/Release/ProcessGdbRemoteTests/GDBRemoteCommunicationClientTest.SyncThreadState (1499 of 2216) PASS: lldb-unit :: Process/gdb-remote/Release/ProcessGdbRemoteTests/GDBRemoteCommunicationClientTest.WriteRegister (1500 of 2216) PASS: lldb-unit :: Process/gdb-remote/Release/ProcessGdbRemoteTests/GDBRemoteCommunicationClientTest.WriteRegisterNoSuffix (1501 of 2216) PASS: lldb-unit :: Process/gdb-remote/Release/ProcessGdbRemoteTests/GDBRemoteCommunicationClientTest.TestPacketSpeedJSON (1502 of 2216) PASS: lldb-unit :: Process/gdb-remote/Release/ProcessGdbRemoteTests/GDBRemoteCommunicationServerTest.SendErrorResponse_ErrorList (1503 of 2216) PASS: lldb-unit :: Process/gdb-remote/Release/ProcessGdbRemoteTests/GDBRemoteCommunicationServerTest.SendErrorResponse_ErrorNumber (1504 of 2216) PASS: lldb-unit :: Process/gdb-remote/Release/ProcessGdbRemoteTests/GDBRemoteCommunicationServerTest.SendErrorResponse_Status (1505 of 2216) PASS: lldb-unit :: Process/gdb-remote/Release/ProcessGdbRemoteTests/GDBRemoteCommunicationServerTest.SendErrorResponse_StringError (1506 of 2216) PASS: lldb-unit :: Process/gdb-remote/Release/ProcessGdbRemoteTests/GDBRemoteCommunicationServerTest.SendErrorResponse_UnimplementedError (1507 of 2216) PASS: lldb-unit :: Process/gdb-remote/Release/ProcessGdbRemoteTests/GDBRemoteCommunicationTest.ReadPacket_checksum (1508 of 2216) PASS: lldb-unit :: Process/minidump/Release/LLDBMinidumpTests/MinidumpParserTest.FindMemoryRange (1509 of 2216) PASS: lldb-unit :: Process/minidump/Release/LLDBMinidumpTests/MinidumpParserTest.FindMemoryRangeWithFullMemoryMinidump (1510 of 2216) PASS: lldb-unit :: Process/minidump/Release/LLDBMinidumpTests/MinidumpParserTest.GetArchitecture (1511 of 2216) PASS: lldb-unit :: Process/minidump/Release/LLDBMinidumpTests/MinidumpParserTest.GetArchitectureWindows (1512 of 2216) PASS: lldb-unit :: Process/minidump/Release/LLDBMinidumpTests/MinidumpParserTest.GetExceptionStream (1513 of 2216) PASS: lldb-unit :: Process/minidump/Release/LLDBMinidumpTests/MinidumpParserTest.GetFilteredModuleList (1514 of 2216) PASS: lldb-unit :: Process/minidump/Release/LLDBMinidumpTests/MinidumpParserTest.GetLinuxProcStatus (1515 of 2216) PASS: lldb-unit :: Process/minidump/Release/LLDBMinidumpTests/MinidumpParserTest.GetLinuxProcStatus_no_stream (1516 of 2216) PASS: lldb-unit :: Process/minidump/Release/LLDBMinidumpTests/MinidumpParserTest.GetMemory (1517 of 2216) PASS: lldb-unit :: Process/minidump/Release/LLDBMinidumpTests/MinidumpParserTest.GetMemoryRegionInfo (1518 of 2216) PASS: lldb-unit :: Process/minidump/Release/LLDBMinidumpTests/MinidumpParserTest.GetMemoryRegionInfoFromMemory64List (1519 of 2216) PASS: lldb-unit :: Process/minidump/Release/LLDBMinidumpTests/MinidumpParserTest.GetMemoryRegionInfoFromMemoryList (1520 of 2216) PASS: lldb-unit :: Process/minidump/Release/LLDBMinidumpTests/MinidumpParserTest.GetMemoryRegionInfoLinuxMaps (1521 of 2216) PASS: lldb-unit :: Process/minidump/Release/LLDBMinidumpTests/MinidumpParserTest.GetMemoryRegionInfoLinuxMapsError (1522 of 2216) PASS: lldb-unit :: Process/minidump/Release/LLDBMinidumpTests/MinidumpParserTest.GetMiscInfoWindows (1523 of 2216) PASS: lldb-unit :: Process/minidump/Release/LLDBMinidumpTests/MinidumpParserTest.GetMiscInfo_no_stream (1524 of 2216) PASS: lldb-unit :: Process/minidump/Release/LLDBMinidumpTests/MinidumpParserTest.GetPid (1525 of 2216) PASS: lldb-unit :: Process/minidump/Release/LLDBMinidumpTests/MinidumpParserTest.GetPidWindows (1526 of 2216) PASS: lldb-unit :: Process/minidump/Release/LLDBMinidumpTests/MinidumpParserTest.GetPidWow64 (1527 of 2216) PASS: lldb-unit :: Process/minidump/Release/LLDBMinidumpTests/MinidumpParserTest.GetThreadContext_x86_32 (1528 of 2216) PASS: lldb-unit :: Process/minidump/Release/LLDBMinidumpTests/MinidumpParserTest.GetThreadContext_x86_32_wow64 (1529 of 2216) PASS: lldb-unit :: Process/minidump/Release/LLDBMinidumpTests/MinidumpParserTest.GetThreadContext_x86_64 (1530 of 2216) PASS: lldb-unit :: Process/minidump/Release/LLDBMinidumpTests/MinidumpParserTest.GetThreadsAndGetThreadContext (1531 of 2216) PASS: lldb-unit :: Process/minidump/Release/LLDBMinidumpTests/MinidumpParserTest.InvalidMinidump (1532 of 2216) PASS: lldb-unit :: Process/minidump/Release/LLDBMinidumpTests/MinidumpParserTest.MinidumpDuplicateModuleMappedFirst (1533 of 2216) PASS: lldb-unit :: Process/minidump/Release/LLDBMinidumpTests/MinidumpParserTest.MinidumpDuplicateModuleMappedSecond (1534 of 2216) PASS: lldb-unit :: Process/minidump/Release/LLDBMinidumpTests/MinidumpParserTest.MinidumpDuplicateModuleMinAddress (1535 of 2216) PASS: lldb-unit :: Process/minidump/Release/LLDBMinidumpTests/MinidumpParserTest.MinidumpDuplicateModuleSeparateCode (1536 of 2216) PASS: lldb-unit :: Process/minidump/Release/LLDBMinidumpTests/MinidumpParserTest.MinidumpModuleOrder (1537 of 2216) PASS: lldb-unit :: Process/minidump/Release/LLDBMinidumpTests/RegisterContextMinidump.CheckRegisterContextMinidump_ARM (1538 of 2216) PASS: lldb-unit :: Process/minidump/Release/LLDBMinidumpTests/RegisterContextMinidump.ConvertMinidumpContext_x86_32 (1539 of 2216) PASS: lldb-unit :: Process/minidump/Release/LLDBMinidumpTests/RegisterContextMinidump.ConvertMinidumpContext_x86_64 (1540 of 2216) PASS: lldb-unit :: ScriptInterpreter/Python/Release/ScriptInterpreterPythonTests/PythonDataObjectsTest.TestBorrowedReferences (1541 of 2216) PASS: lldb-unit :: ScriptInterpreter/Python/Release/ScriptInterpreterPythonTests/PythonDataObjectsTest.TestCallable (1542 of 2216) PASS: lldb-unit :: ScriptInterpreter/Python/Release/ScriptInterpreterPythonTests/PythonDataObjectsTest.TestDictionaryResolutionWithDot (1543 of 2216) PASS: lldb-unit :: ScriptInterpreter/Python/Release/ScriptInterpreterPythonTests/PythonDataObjectsTest.TestExceptions (1544 of 2216) PASS: lldb-unit :: ScriptInterpreter/Python/Release/ScriptInterpreterPythonTests/PythonDataObjectsTest.TestExtractingUInt64ThroughStructuredData (1545 of 2216) PASS: lldb-unit :: ScriptInterpreter/Python/Release/ScriptInterpreterPythonTests/PythonDataObjectsTest.TestGlobalNameResolutionNoDot (1546 of 2216) PASS: lldb-unit :: ScriptInterpreter/Python/Release/ScriptInterpreterPythonTests/PythonDataObjectsTest.TestGlobalNameResolutionWithDot (1547 of 2216) PASS: lldb-unit :: ScriptInterpreter/Python/Release/ScriptInterpreterPythonTests/PythonDataObjectsTest.TestInstanceNameResolutionNoDot (1548 of 2216) PASS: lldb-unit :: ScriptInterpreter/Python/Release/ScriptInterpreterPythonTests/PythonDataObjectsTest.TestModuleNameResolutionNoDot (1549 of 2216) PASS: lldb-unit :: ScriptInterpreter/Python/Release/ScriptInterpreterPythonTests/PythonDataObjectsTest.TestObjectAttributes (1550 of 2216) PASS: lldb-unit :: ScriptInterpreter/Python/Release/ScriptInterpreterPythonTests/PythonDataObjectsTest.TestOwnedReferences (1551 of 2216) PASS: lldb-unit :: ScriptInterpreter/Python/Release/ScriptInterpreterPythonTests/PythonDataObjectsTest.TestPythonBoolean (1552 of 2216) PASS: lldb-unit :: ScriptInterpreter/Python/Release/ScriptInterpreterPythonTests/PythonDataObjectsTest.TestPythonByteArray (1553 of 2216) PASS: lldb-unit :: ScriptInterpreter/Python/Release/ScriptInterpreterPythonTests/PythonDataObjectsTest.TestPythonBytes (1554 of 2216) PASS: lldb-unit :: ScriptInterpreter/Python/Release/ScriptInterpreterPythonTests/PythonDataObjectsTest.TestPythonCallableCheck (1555 of 2216) PASS: lldb-unit :: ScriptInterpreter/Python/Release/ScriptInterpreterPythonTests/PythonDataObjectsTest.TestPythonCallableInvoke (1556 of 2216) PASS: lldb-unit :: ScriptInterpreter/Python/Release/ScriptInterpreterPythonTests/PythonDataObjectsTest.TestPythonDictionaryManipulation (1557 of 2216) PASS: lldb-unit :: ScriptInterpreter/Python/Release/ScriptInterpreterPythonTests/PythonDataObjectsTest.TestPythonDictionaryToStructuredDictionary (1558 of 2216) PASS: lldb-unit :: ScriptInterpreter/Python/Release/ScriptInterpreterPythonTests/PythonDataObjectsTest.TestPythonDictionaryValueEquality (1559 of 2216) PASS: lldb-unit :: ScriptInterpreter/Python/Release/ScriptInterpreterPythonTests/PythonDataObjectsTest.TestPythonFile (1560 of 2216) PASS: lldb-unit :: ScriptInterpreter/Python/Release/ScriptInterpreterPythonTests/PythonDataObjectsTest.TestPythonInteger (1561 of 2216) PASS: lldb-unit :: ScriptInterpreter/Python/Release/ScriptInterpreterPythonTests/PythonDataObjectsTest.TestPythonIntegerToStr (1562 of 2216) PASS: lldb-unit :: ScriptInterpreter/Python/Release/ScriptInterpreterPythonTests/PythonDataObjectsTest.TestPythonIntegerToStructuredInteger (1563 of 2216) PASS: lldb-unit :: ScriptInterpreter/Python/Release/ScriptInterpreterPythonTests/PythonDataObjectsTest.TestPythonListManipulation (1564 of 2216) PASS: lldb-unit :: ScriptInterpreter/Python/Release/ScriptInterpreterPythonTests/PythonDataObjectsTest.TestPythonListToStructuredList (1565 of 2216) PASS: lldb-unit :: ScriptInterpreter/Python/Release/ScriptInterpreterPythonTests/PythonDataObjectsTest.TestPythonListValueEquality (1566 of 2216) PASS: lldb-unit :: ScriptInterpreter/Python/Release/ScriptInterpreterPythonTests/PythonDataObjectsTest.TestPythonString (1567 of 2216) PASS: lldb-unit :: ScriptInterpreter/Python/Release/ScriptInterpreterPythonTests/PythonDataObjectsTest.TestPythonStringToStr (1568 of 2216) PASS: lldb-unit :: ScriptInterpreter/Python/Release/ScriptInterpreterPythonTests/PythonDataObjectsTest.TestPythonStringToStructuredString (1569 of 2216) PASS: lldb-unit :: ScriptInterpreter/Python/Release/ScriptInterpreterPythonTests/PythonDataObjectsTest.TestPythonTupleInitializerList (1570 of 2216) PASS: lldb-unit :: ScriptInterpreter/Python/Release/ScriptInterpreterPythonTests/PythonDataObjectsTest.TestPythonTupleInitializerList2 (1571 of 2216) PASS: lldb-unit :: ScriptInterpreter/Python/Release/ScriptInterpreterPythonTests/PythonDataObjectsTest.TestPythonTupleSize (1572 of 2216) PASS: lldb-unit :: ScriptInterpreter/Python/Release/ScriptInterpreterPythonTests/PythonDataObjectsTest.TestPythonTupleToStructuredList (1573 of 2216) PASS: lldb-unit :: ScriptInterpreter/Python/Release/ScriptInterpreterPythonTests/PythonDataObjectsTest.TestPythonTupleValues (1574 of 2216) PASS: lldb-unit :: ScriptInterpreter/Python/Release/ScriptInterpreterPythonTests/PythonDataObjectsTest.TestResetting (1575 of 2216) PASS: lldb-unit :: ScriptInterpreter/Python/Release/ScriptInterpreterPythonTests/PythonDataObjectsTest.TestRun (1576 of 2216) PASS: lldb-unit :: ScriptInterpreter/Python/Release/ScriptInterpreterPythonTests/PythonDataObjectsTest.TestScript (1577 of 2216) PASS: lldb-unit :: Process/gdb-remote/Release/ProcessGdbRemoteTests/GDBRemoteClientBaseTest.InterruptNoResponse (1578 of 2216) PASS: lldb-unit :: Signals/Release/SignalsTests/UnixSignalsTest.GetFilteredSignals (1579 of 2216) PASS: lldb-unit :: Signals/Release/SignalsTests/UnixSignalsTest.GetInfo (1580 of 2216) PASS: lldb-unit :: Signals/Release/SignalsTests/UnixSignalsTest.Iteration (1581 of 2216) PASS: lldb-unit :: ScriptInterpreter/Python/Release/ScriptInterpreterPythonTests/PythonDataObjectsTest.TestTypeNameResolutionNoDot (1582 of 2216) PASS: lldb-unit :: Signals/Release/SignalsTests/UnixSignalsTest.VersionChange (1583 of 2216) PASS: lldb-unit :: Symbol/Release/SymbolTests/DWARFCallFrameInfoTest.Basic_dwarf3 (1584 of 2216) PASS: lldb-unit :: Symbol/Release/SymbolTests/DWARFCallFrameInfoTest.Basic_dwarf4 (1585 of 2216) PASS: lldb-unit :: Symbol/Release/SymbolTests/DWARFCallFrameInfoTest.Basic_eh (1586 of 2216) PASS: lldb-unit :: Symbol/Release/SymbolTests/LineEntryTest.GetSameLineContiguousAddressRangeNoInlines (1587 of 2216) PASS: lldb-unit :: Symbol/Release/SymbolTests/LineEntryTest.GetSameLineContiguousAddressRangeNestedInline (1588 of 2216) PASS: lldb-unit :: Symbol/Release/SymbolTests/LineEntryTest.GetSameLineContiguousAddressRangeOneInline (1589 of 2216) PASS: lldb-unit :: Symbol/Release/SymbolTests/PostfixExpression.ParseFPOProgram (1590 of 2216) PASS: lldb-unit :: Symbol/Release/SymbolTests/PostfixExpression.ParseOneExpression (1591 of 2216) PASS: lldb-unit :: Symbol/Release/SymbolTests/PostfixExpression.ToDWARF (1592 of 2216) PASS: lldb-unit :: Symbol/Release/SymbolTests/SymbolsTest.LocateExecutableSymbolFileForUnknownExecutableAndMissingSymbolFile (1593 of 2216) PASS: lldb-unit :: Symbol/Release/SymbolTests/SymbolsTest.TerminateLocateExecutableSymbolFileForUnknownExecutableAndUnknownSymbolFile (1594 of 2216) PASS: lldb-unit :: Symbol/Release/SymbolTests/TestClangASTImporter.CanImportInvalidType (1595 of 2216) PASS: lldb-unit :: Symbol/Release/SymbolTests/TestClangASTImporter.CopyDeclTagDecl (1596 of 2216) PASS: lldb-unit :: Symbol/Release/SymbolTests/TestClangASTImporter.CompleteFwdDeclWithOtherOrigin (1597 of 2216) PASS: lldb-unit :: Symbol/Release/SymbolTests/TestClangASTImporter.CopyTypeTagDecl (1598 of 2216) PASS: lldb-unit :: Symbol/Release/SymbolTests/TestClangASTImporter.DeportDeclTagDecl (1599 of 2216) PASS: lldb-unit :: Symbol/Release/SymbolTests/TestClangASTImporter.ImportInvalidType (1600 of 2216) PASS: lldb-unit :: Symbol/Release/SymbolTests/TestClangASTImporter.DeportTypeTagDecl (1601 of 2216) PASS: lldb-unit :: Symbol/Release/SymbolTests/TestClangASTImporter.MetadataPropagationAfterCopying (1602 of 2216) PASS: lldb-unit :: Symbol/Release/SymbolTests/TestClangASTImporter.MetadataPropagation (1603 of 2216) PASS: lldb-unit :: Symbol/Release/SymbolTests/TestClangASTImporter.MetadataPropagationIndirectImport (1604 of 2216) PASS: lldb-unit :: Symbol/Release/SymbolTests/TestTypeSystemClang.AddMethodToObjCObjectType (1605 of 2216) PASS: lldb-unit :: Symbol/Release/SymbolTests/TestTypeSystemClang.TemplateArguments (1606 of 2216) PASS: lldb-unit :: Symbol/Release/SymbolTests/TestClangASTImporter.RecordLayout (1607 of 2216) PASS: lldb-unit :: Symbol/Release/SymbolTests/TestTypeSystemClang.TestBuiltinTypeForEncodingAndBitSize (1608 of 2216) PASS: lldb-unit :: Symbol/Release/SymbolTests/TestTypeSystemClang.TestConvertAccessTypeToAccessSpecifier (1609 of 2216) PASS: lldb-unit :: Symbol/Release/SymbolTests/TestTypeSystemClang.TestDeletingImplicitCopyCstrDueToMoveCStr (1610 of 2216) PASS: lldb-unit :: Symbol/Release/SymbolTests/TestTypeSystemClang.TestDisplayNameEmpty (1611 of 2216) PASS: lldb-unit :: Symbol/Release/SymbolTests/TestTypeSystemClang.TestDisplayName (1612 of 2216) PASS: lldb-unit :: Symbol/Release/SymbolTests/TestTypeSystemClang.TestFunctionTemplateConstruction (1613 of 2216) PASS: lldb-unit :: Symbol/Release/SymbolTests/TestTypeSystemClang.TestGetBasicTypeFromEnum (1614 of 2216) PASS: lldb-unit :: Symbol/Release/SymbolTests/TestTypeSystemClang.TestFunctionTemplateInRecordConstruction (1615 of 2216) PASS: lldb-unit :: Symbol/Release/SymbolTests/TestTypeSystemClang.TestGetBasicTypeFromName (1616 of 2216) PASS: lldb-unit :: Symbol/Release/SymbolTests/TestTypeSystemClang.TestGetEnumIntegerTypeUnexpectedType (1617 of 2216) PASS: lldb-unit :: Symbol/Release/SymbolTests/TestTypeSystemClang.TestGetEnumIntegerTypeInvalid (1618 of 2216) PASS: lldb-unit :: Symbol/Release/SymbolTests/TestTypeSystemClang.TestGetEnumIntegerTypeBasicTypes (1619 of 2216) PASS: lldb-unit :: Symbol/Release/SymbolTests/TestTypeSystemClang.TestGetTypeClassNested (1620 of 2216) PASS: lldb-unit :: Symbol/Release/SymbolTests/TestTypeSystemClang.TestGetTypeClassTypeOf (1621 of 2216) PASS: lldb-unit :: Symbol/Release/SymbolTests/TestTypeSystemClang.TestGetTypeClassDeclType (1622 of 2216) PASS: lldb-unit :: Symbol/Release/SymbolTests/TestTypeSystemClang.TestGetTypeClassTypeOfExpr (1623 of 2216) PASS: lldb-unit :: Symbol/Release/SymbolTests/TestTypeSystemClang.TestNotDeletingUserCopyCstrDueToMoveCStr (1624 of 2216) PASS: lldb-unit :: Symbol/Release/SymbolTests/TestTypeSystemClang.TestIsClangType (1625 of 2216) PASS: lldb-unit :: Symbol/Release/SymbolTests/TestTypeSystemClang.TestRemoveFastQualifiers (1626 of 2216) PASS: lldb-unit :: Symbol/Release/SymbolTests/TestTypeSystemClang.TestRecordHasFields (1627 of 2216) PASS: lldb-unit :: Symbol/Release/SymbolTests/TestTypeSystemClang.TestOwningModule (1628 of 2216) PASS: lldb-unit :: Symbol/Release/SymbolTests/Type.CompilerContextPattern (1629 of 2216) PASS: lldb-unit :: Symbol/Release/SymbolTests/TestTypeSystemClang.TestUnifyAccessSpecifiers (1630 of 2216) PASS: lldb-unit :: Symbol/Release/SymbolTests/Type.GetTypeScopeAndBasename (1631 of 2216) PASS: lldb-unit :: SymbolFile/DWARF/Release/SymbolFileDWARFTests/SymbolFileDWARFTests.ParseAranges (1632 of 2216) PASS: lldb-unit :: SymbolFile/DWARF/Release/SymbolFileDWARFTests/SymbolFileDWARFTests.ParseArangesNonzeroSegmentSize (1633 of 2216) PASS: lldb-unit :: SymbolFile/DWARF/Release/SymbolFileDWARFTests/DWARFASTParserClangTests.EnsureAllDIEsInDeclContextHaveBeenParsedParsesOnlyMatchingEntries (1634 of 2216) PASS: lldb-unit :: SymbolFile/DWARF/Release/SymbolFileDWARFTests/SymbolFileDWARFTests.TestAbbrevInvalidNULLTag (1635 of 2216) PASS: lldb-unit :: SymbolFile/DWARF/Release/SymbolFileDWARFTests/SymbolFileDWARFTests.TestAbbrevMissingTerminator (1636 of 2216) PASS: lldb-unit :: SymbolFile/DWARF/Release/SymbolFileDWARFTests/SymbolFileDWARFTests.TestAbbrevNullAttrValidForm (1637 of 2216) PASS: lldb-unit :: SymbolFile/DWARF/Release/SymbolFileDWARFTests/SymbolFileDWARFTests.TestAbbrevOrder1Start1 (1638 of 2216) PASS: lldb-unit :: SymbolFile/DWARF/Release/SymbolFileDWARFTests/SymbolFileDWARFTests.TestAbbrevOrder1Start5 (1639 of 2216) PASS: lldb-unit :: SymbolFile/DWARF/Release/SymbolFileDWARFTests/SymbolFileDWARFTests.TestAbbrevOutOfOrder (1640 of 2216) PASS: lldb-unit :: SymbolFile/DWARF/Release/SymbolFileDWARFTests/SymbolFileDWARFTests.TestAbbrevValidAttrNullForm (1641 of 2216) PASS: lldb-unit :: SymbolFile/DWARF/Release/SymbolFileDWARFTests/SymbolFileDWARFTests.TestAbilitiesForDWARF (1642 of 2216) PASS: lldb-unit :: SymbolFile/NativePDB/Release/SymbolFileNativePDBTests/PDBFPOProgramToDWARFExpressionTests.DependencyChain (1643 of 2216) PASS: lldb-unit :: SymbolFile/NativePDB/Release/SymbolFileNativePDBTests/PDBFPOProgramToDWARFExpressionTests.InvalidAssignmentMultiple (1644 of 2216) PASS: lldb-unit :: SymbolFile/NativePDB/Release/SymbolFileNativePDBTests/PDBFPOProgramToDWARFExpressionTests.InvalidAssignmentSingle (1645 of 2216) PASS: lldb-unit :: SymbolFile/NativePDB/Release/SymbolFileNativePDBTests/PDBFPOProgramToDWARFExpressionTests.InvalidOpBinary (1646 of 2216) PASS: lldb-unit :: SymbolFile/NativePDB/Release/SymbolFileNativePDBTests/PDBFPOProgramToDWARFExpressionTests.InvalidOpUnary (1647 of 2216) PASS: lldb-unit :: SymbolFile/NativePDB/Release/SymbolFileNativePDBTests/PDBFPOProgramToDWARFExpressionTests.MissingTargetRegister (1648 of 2216) PASS: lldb-unit :: SymbolFile/NativePDB/Release/SymbolFileNativePDBTests/PDBFPOProgramToDWARFExpressionTests.MultipleDependentAssignments (1649 of 2216) PASS: lldb-unit :: SymbolFile/NativePDB/Release/SymbolFileNativePDBTests/PDBFPOProgramToDWARFExpressionTests.MultipleIndependentAssignments (1650 of 2216) PASS: lldb-unit :: SymbolFile/NativePDB/Release/SymbolFileNativePDBTests/PDBFPOProgramToDWARFExpressionTests.SingleAssignmentRegisterRef (1651 of 2216) PASS: lldb-unit :: SymbolFile/NativePDB/Release/SymbolFileNativePDBTests/PDBFPOProgramToDWARFExpressionTests.UnknownOp (1652 of 2216) PASS: lldb-unit :: SymbolFile/NativePDB/Release/SymbolFileNativePDBTests/PDBFPOProgramToDWARFExpressionTests.UnresolvedCyclicRegisterAssignmentReference (1653 of 2216) PASS: lldb-unit :: SymbolFile/NativePDB/Release/SymbolFileNativePDBTests/PDBFPOProgramToDWARFExpressionTests.UnresolvedDependentCyclicRegisterAssignmentReference (1654 of 2216) PASS: lldb-unit :: SymbolFile/NativePDB/Release/SymbolFileNativePDBTests/PDBFPOProgramToDWARFExpressionTests.UnresolvedRegisterReference (1655 of 2216) PASS: lldb-unit :: SymbolFile/NativePDB/Release/SymbolFileNativePDBTests/PDBFPOProgramToDWARFExpressionTests.UnresolvedRegisterAssignmentReference (1656 of 2216) PASS: lldb-unit :: SymbolFile/NativePDB/Release/SymbolFileNativePDBTests/PDBFPOProgramToDWARFExpressionTests.UnsupportedRASearch (1657 of 2216) PASS: lldb-unit :: Target/Release/TargetTests/ExecutionContextTest.GetByteOrder (1658 of 2216) PASS: lldb-unit :: Target/Release/TargetTests/ExecutionContextTest.GetByteOrderTarget (1659 of 2216) PASS: lldb-unit :: Target/Release/TargetTests/ExecutionContextTest.GetByteOrderProcess (1660 of 2216) PASS: lldb-unit :: Target/Release/TargetTests/MCBasedABI.MapRegisterName (1661 of 2216) PASS: lldb-unit :: Target/Release/TargetTests/MemoryRegionInfoTest.Formatv (1662 of 2216) PASS: lldb-unit :: Target/Release/TargetTests/ModuleCacheTest.GetAndPutStrangeHostname (1663 of 2216) PASS: lldb-unit :: Target/Release/TargetTests/ModuleCacheTest.GetAndPut (1664 of 2216) PASS: lldb-unit :: Target/Release/TargetTests/PathMappingListTest.AbsoluteTests (1665 of 2216) PASS: lldb-unit :: Target/Release/TargetTests/ModuleCacheTest.GetAndPutUuidExists (1666 of 2216) PASS: lldb-unit :: Target/Release/TargetTests/PathMappingListTest.RelativeTests (1667 of 2216) PASS: lldb-unit :: Target/Release/TargetTests/PathMappingListTest.RemapRoot (1668 of 2216) PASS: lldb-unit :: Target/Release/TargetTests/RemoteAwarePlatformTest.TestResolveExecutabelOnClientByPlatform (1669 of 2216) PASS: lldb-unit :: Target/Release/TargetTests/StackFrameRecognizerTest.NullModuleRegex (1670 of 2216) PASS: lldb-unit :: Thread/Release/ThreadTests/ThreadTest.GetPrivateStopInfo (1671 of 2216) PASS: lldb-unit :: Thread/Release/ThreadTests/ThreadTest.SetStopInfo (1672 of 2216) PASS: lldb-unit :: UnwindAssembly/x86/Release/UnwindAssemblyx86Tests/Testx86AssemblyInspectionEngine.Test32BitOnlyInstruction (1673 of 2216) PASS: lldb-unit :: UnwindAssembly/x86/Release/UnwindAssemblyx86Tests/Testx86AssemblyInspectionEngine.Test32bitFramelessBigStackFrame (1674 of 2216) PASS: lldb-unit :: UnwindAssembly/x86/Release/UnwindAssemblyx86Tests/Testx86AssemblyInspectionEngine.Test32bitFramelessSmallStackFrame (1675 of 2216) PASS: lldb-unit :: UnwindAssembly/x86/Release/UnwindAssemblyx86Tests/Testx86AssemblyInspectionEngine.Test64bitFramelessBigStackFrame (1676 of 2216) PASS: lldb-unit :: UnwindAssembly/x86/Release/UnwindAssemblyx86Tests/Testx86AssemblyInspectionEngine.Test64bitFramelessSmallStackFrame (1677 of 2216) PASS: lldb-unit :: UnwindAssembly/x86/Release/UnwindAssemblyx86Tests/Testx86AssemblyInspectionEngine.TestAddESP (1678 of 2216) PASS: lldb-unit :: UnwindAssembly/x86/Release/UnwindAssemblyx86Tests/Testx86AssemblyInspectionEngine.TestAddRSP (1679 of 2216) PASS: lldb-unit :: UnwindAssembly/x86/Release/UnwindAssemblyx86Tests/Testx86AssemblyInspectionEngine.TestCALLNextInsn (1680 of 2216) PASS: lldb-unit :: UnwindAssembly/x86/Release/UnwindAssemblyx86Tests/Testx86AssemblyInspectionEngine.TestDisassemblyJunkBytes (1681 of 2216) PASS: lldb-unit :: UnwindAssembly/x86/Release/UnwindAssemblyx86Tests/Testx86AssemblyInspectionEngine.TestDisassemblyMidFunctionEpilogues (1682 of 2216) PASS: lldb-unit :: UnwindAssembly/x86/Release/UnwindAssemblyx86Tests/Testx86AssemblyInspectionEngine.TestMovRSPtoRBP (1683 of 2216) PASS: lldb-unit :: UnwindAssembly/x86/Release/UnwindAssemblyx86Tests/Testx86AssemblyInspectionEngine.TestLEAVE (1684 of 2216) PASS: lldb-unit :: UnwindAssembly/x86/Release/UnwindAssemblyx86Tests/Testx86AssemblyInspectionEngine.TestPopEBX (1685 of 2216) PASS: lldb-unit :: UnwindAssembly/x86/Release/UnwindAssemblyx86Tests/Testx86AssemblyInspectionEngine.TestPopEBP (1686 of 2216) PASS: lldb-unit :: UnwindAssembly/x86/Release/UnwindAssemblyx86Tests/Testx86AssemblyInspectionEngine.TestPopESI (1687 of 2216) PASS: lldb-unit :: UnwindAssembly/x86/Release/UnwindAssemblyx86Tests/Testx86AssemblyInspectionEngine.TestPopEDI (1688 of 2216) PASS: lldb-unit :: UnwindAssembly/x86/Release/UnwindAssemblyx86Tests/Testx86AssemblyInspectionEngine.TestPopR12 (1689 of 2216) PASS: lldb-unit :: UnwindAssembly/x86/Release/UnwindAssemblyx86Tests/Testx86AssemblyInspectionEngine.TestPopR13 (1690 of 2216) PASS: lldb-unit :: UnwindAssembly/x86/Release/UnwindAssemblyx86Tests/Testx86AssemblyInspectionEngine.TestPopR15 (1691 of 2216) PASS: lldb-unit :: UnwindAssembly/x86/Release/UnwindAssemblyx86Tests/Testx86AssemblyInspectionEngine.TestPopR14 (1692 of 2216) PASS: lldb-unit :: UnwindAssembly/x86/Release/UnwindAssemblyx86Tests/Testx86AssemblyInspectionEngine.TestPopRBP (1693 of 2216) PASS: lldb-unit :: UnwindAssembly/x86/Release/UnwindAssemblyx86Tests/Testx86AssemblyInspectionEngine.TestPopRBPWithREX (1694 of 2216) PASS: lldb-unit :: UnwindAssembly/x86/Release/UnwindAssemblyx86Tests/Testx86AssemblyInspectionEngine.TestPopRBX (1695 of 2216) PASS: lldb-unit :: UnwindAssembly/x86/Release/UnwindAssemblyx86Tests/Testx86AssemblyInspectionEngine.TestPush0 (1696 of 2216) PASS: lldb-unit :: UnwindAssembly/x86/Release/UnwindAssemblyx86Tests/Testx86AssemblyInspectionEngine.TestPushEBP (1697 of 2216) PASS: lldb-unit :: UnwindAssembly/x86/Release/UnwindAssemblyx86Tests/Testx86AssemblyInspectionEngine.TestPushEAX (1698 of 2216) PASS: lldb-unit :: UnwindAssembly/x86/Release/UnwindAssemblyx86Tests/Testx86AssemblyInspectionEngine.TestPushEBX (1699 of 2216) PASS: lldb-unit :: UnwindAssembly/x86/Release/UnwindAssemblyx86Tests/Testx86AssemblyInspectionEngine.TestPushECX (1700 of 2216) PASS: lldb-unit :: UnwindAssembly/x86/Release/UnwindAssemblyx86Tests/Testx86AssemblyInspectionEngine.TestPushEDX (1701 of 2216) PASS: lldb-unit :: UnwindAssembly/x86/Release/UnwindAssemblyx86Tests/Testx86AssemblyInspectionEngine.TestPushEDI (1702 of 2216) PASS: lldb-unit :: UnwindAssembly/x86/Release/UnwindAssemblyx86Tests/Testx86AssemblyInspectionEngine.TestPushESI (1703 of 2216) PASS: lldb-unit :: UnwindAssembly/x86/Release/UnwindAssemblyx86Tests/Testx86AssemblyInspectionEngine.TestPushExtended (1704 of 2216) PASS: lldb-unit :: UnwindAssembly/x86/Release/UnwindAssemblyx86Tests/Testx86AssemblyInspectionEngine.TestPushImm (1705 of 2216) PASS: lldb-unit :: UnwindAssembly/x86/Release/UnwindAssemblyx86Tests/Testx86AssemblyInspectionEngine.TestPushR12 (1706 of 2216) PASS: lldb-unit :: UnwindAssembly/x86/Release/UnwindAssemblyx86Tests/Testx86AssemblyInspectionEngine.TestPushR13 (1707 of 2216) PASS: lldb-unit :: UnwindAssembly/x86/Release/UnwindAssemblyx86Tests/Testx86AssemblyInspectionEngine.TestPushR14 (1708 of 2216) PASS: lldb-unit :: UnwindAssembly/x86/Release/UnwindAssemblyx86Tests/Testx86AssemblyInspectionEngine.TestPushR15 (1709 of 2216) PASS: lldb-unit :: UnwindAssembly/x86/Release/UnwindAssemblyx86Tests/Testx86AssemblyInspectionEngine.TestPushRBP (1710 of 2216) PASS: lldb-unit :: UnwindAssembly/x86/Release/UnwindAssemblyx86Tests/Testx86AssemblyInspectionEngine.TestPushRBX (1711 of 2216) PASS: lldb-unit :: UnwindAssembly/x86/Release/UnwindAssemblyx86Tests/Testx86AssemblyInspectionEngine.TestPushRBPWithREX (1712 of 2216) PASS: lldb-unit :: UnwindAssembly/x86/Release/UnwindAssemblyx86Tests/Testx86AssemblyInspectionEngine.TestSimple32bitFrameFunction (1713 of 2216) PASS: lldb-unit :: UnwindAssembly/x86/Release/UnwindAssemblyx86Tests/Testx86AssemblyInspectionEngine.TestReturnDetect (1714 of 2216) PASS: lldb-unit :: UnwindAssembly/x86/Release/UnwindAssemblyx86Tests/Testx86AssemblyInspectionEngine.TestSimple64bitFrameFunction (1715 of 2216) PASS: lldb-unit :: UnwindAssembly/x86/Release/UnwindAssemblyx86Tests/Testx86AssemblyInspectionEngine.TestSimplei386ugmented (1716 of 2216) PASS: lldb-unit :: UnwindAssembly/x86/Release/UnwindAssemblyx86Tests/Testx86AssemblyInspectionEngine.TestSpArithx86_64Augmented (1717 of 2216) PASS: lldb-unit :: UnwindAssembly/x86/Release/UnwindAssemblyx86Tests/Testx86AssemblyInspectionEngine.TestSimplex86_64Augmented (1718 of 2216) PASS: lldb-unit :: UnwindAssembly/x86/Release/UnwindAssemblyx86Tests/Testx86AssemblyInspectionEngine.TestSpillRegToStackViaMOVi386 (1719 of 2216) PASS: lldb-unit :: UnwindAssembly/x86/Release/UnwindAssemblyx86Tests/Testx86AssemblyInspectionEngine.TestSpillRegToStackViaMOVx86_64 (1720 of 2216) PASS: lldb-unit :: UnwindAssembly/x86/Release/UnwindAssemblyx86Tests/Testx86AssemblyInspectionEngine.TestStackRealign8BitDisp_i386 (1721 of 2216) PASS: lldb-unit :: UnwindAssembly/x86/Release/UnwindAssemblyx86Tests/Testx86AssemblyInspectionEngine.TestStackRealign32BitDisp_x86_64 (1722 of 2216) PASS: lldb-unit :: UnwindAssembly/x86/Release/UnwindAssemblyx86Tests/Testx86AssemblyInspectionEngine.TestSubESP (1723 of 2216) PASS: lldb-unit :: UnwindAssembly/x86/Release/UnwindAssemblyx86Tests/Testx86AssemblyInspectionEngine.TestStackRealignMSVC_i386 (1724 of 2216) PASS: lldb-unit :: UnwindAssembly/x86/Release/UnwindAssemblyx86Tests/Testx86AssemblyInspectionEngine.Testi386IgnoredRegisters (1725 of 2216) PASS: lldb-unit :: UnwindAssembly/x86/Release/UnwindAssemblyx86Tests/Testx86AssemblyInspectionEngine.TestSubRSP (1726 of 2216) PASS: lldb-unit :: Utility/Release/UtilityTests/AnsiTerminal.AtEnd (1727 of 2216) PASS: lldb-unit :: Utility/Release/UtilityTests/AnsiTerminal.AtStart (1728 of 2216) PASS: lldb-unit :: Utility/Release/UtilityTests/AnsiTerminal.Basic (1729 of 2216) PASS: lldb-unit :: Utility/Release/UtilityTests/AnsiTerminal.Empty (1730 of 2216) PASS: lldb-unit :: Utility/Release/UtilityTests/AnsiTerminal.Incomplete (1731 of 2216) PASS: lldb-unit :: Utility/Release/UtilityTests/AnsiTerminal.KnownPrefix (1732 of 2216) PASS: lldb-unit :: Utility/Release/UtilityTests/AnsiTerminal.Unknown (1733 of 2216) PASS: lldb-unit :: Utility/Release/UtilityTests/AnsiTerminal.Twice (1734 of 2216) PASS: lldb-unit :: Utility/Release/UtilityTests/AnsiTerminal.WhiteSpace (1735 of 2216) PASS: lldb-unit :: Utility/Release/UtilityTests/ArchSpecTest.Compatibility (1736 of 2216) PASS: lldb-unit :: Utility/Release/UtilityTests/ArchSpecTest.MergeFromMachOUnknown (1737 of 2216) PASS: lldb-unit :: Utility/Release/UtilityTests/ArchSpecTest.MergeFrom (1738 of 2216) PASS: lldb-unit :: Utility/Release/UtilityTests/ArchSpecTest.OperatorBool (1739 of 2216) PASS: lldb-unit :: Utility/Release/UtilityTests/ArchSpecTest.TestParseMachCPUDashSubtypeTripleExtra (1740 of 2216) PASS: lldb-unit :: Utility/Release/UtilityTests/ArchSpecTest.TestSetTriple (1741 of 2216) PASS: lldb-unit :: Utility/Release/UtilityTests/ArchSpecTest.TestParseMachCPUDashSubtypeTripleSimple (1742 of 2216) PASS: lldb-unit :: Utility/Release/UtilityTests/ArchSpecTest.TripleComponentsWereSpecified (1743 of 2216) PASS: lldb-unit :: Utility/Release/UtilityTests/ArchSpecTest.YAML (1744 of 2216) PASS: lldb-unit :: Utility/Release/UtilityTests/ArgsTest.AppendArguments (1745 of 2216) PASS: lldb-unit :: Utility/Release/UtilityTests/ArgsTest.BareSingleQuote (1746 of 2216) PASS: lldb-unit :: Utility/Release/UtilityTests/ArgsTest.DoubleQuotedItem (1747 of 2216) PASS: lldb-unit :: Utility/Release/UtilityTests/ArgsTest.EscapeLLDBCommandArgument (1748 of 2216) PASS: lldb-unit :: Utility/Release/UtilityTests/ArgsTest.GetArgumentArrayRef (1749 of 2216) PASS: lldb-unit :: Utility/Release/UtilityTests/ArgsTest.GetQuotedCommandString (1750 of 2216) PASS: lldb-unit :: Utility/Release/UtilityTests/ArgsTest.ReplaceArgumentAtIndexEqual (1751 of 2216) PASS: lldb-unit :: Utility/Release/UtilityTests/ArgsTest.GetShellSafeArgument (1752 of 2216) PASS: lldb-unit :: Utility/Release/UtilityTests/ArgsTest.ReplaceArgumentAtIndexFarOutOfRange (1753 of 2216) PASS: lldb-unit :: Utility/Release/UtilityTests/ArgsTest.ReplaceArgumentAtIndexLonger (1754 of 2216) PASS: lldb-unit :: Utility/Release/UtilityTests/ArgsTest.ReplaceArgumentAtIndexShort (1755 of 2216) PASS: lldb-unit :: Utility/Release/UtilityTests/ArgsTest.ReplaceArgumentAtIndexOutOfRange (1756 of 2216) PASS: lldb-unit :: Utility/Release/UtilityTests/ArgsTest.StringListConstructor (1757 of 2216) PASS: lldb-unit :: Utility/Release/UtilityTests/ArgsTest.TestAppendArg (1758 of 2216) PASS: lldb-unit :: Utility/Release/UtilityTests/ArgsTest.TestArgv (1759 of 2216) PASS: lldb-unit :: Utility/Release/UtilityTests/ArgsTest.TestInsertArg (1760 of 2216) PASS: lldb-unit :: Utility/Release/UtilityTests/ArgsTest.TestMultipleArgs (1761 of 2216) PASS: lldb-unit :: Utility/Release/UtilityTests/ArgsTest.TestOverwriteArgs (1762 of 2216) PASS: lldb-unit :: Utility/Release/UtilityTests/ArgsTest.TestQuotedTrailingBackslash (1763 of 2216) PASS: lldb-unit :: Utility/Release/UtilityTests/ArgsTest.TestQuotedUnknownEscape (1764 of 2216) PASS: lldb-unit :: Utility/Release/UtilityTests/ArgsTest.TestSingleArg (1765 of 2216) PASS: lldb-unit :: Utility/Release/UtilityTests/ArgsTest.TestSingleArgWithQuotedSpace (1766 of 2216) PASS: lldb-unit :: Utility/Release/UtilityTests/ArgsTest.TestSingleQuotedArgWithSpace (1767 of 2216) PASS: lldb-unit :: Utility/Release/UtilityTests/ArgsTest.TestTrailingBackslash (1768 of 2216) PASS: lldb-unit :: Utility/Release/UtilityTests/ArgsTest.Yaml (1769 of 2216) PASS: lldb-unit :: Utility/Release/UtilityTests/ArgsTest.TestUnknownEscape (1770 of 2216) PASS: lldb-unit :: Utility/Release/UtilityTests/BinaryStreamTest.PutSLEB128EightBytes (1771 of 2216) PASS: lldb-unit :: Utility/Release/UtilityTests/BinaryStreamTest.PutSLEB128FiveBytes (1772 of 2216) PASS: lldb-unit :: Utility/Release/UtilityTests/BinaryStreamTest.PutSLEB128FourBytes (1773 of 2216) PASS: lldb-unit :: Utility/Release/UtilityTests/BinaryStreamTest.PutSLEB128MaxValue (1774 of 2216) PASS: lldb-unit :: Utility/Release/UtilityTests/BinaryStreamTest.PutSLEB128NineBytes (1775 of 2216) PASS: lldb-unit :: Utility/Release/UtilityTests/BinaryStreamTest.PutSLEB128One (1776 of 2216) PASS: lldb-unit :: Utility/Release/UtilityTests/BinaryStreamTest.PutSLEB128OneByte (1777 of 2216) PASS: lldb-unit :: Utility/Release/UtilityTests/BinaryStreamTest.PutSLEB128SevenBytes (1778 of 2216) PASS: lldb-unit :: Utility/Release/UtilityTests/BinaryStreamTest.PutSLEB128SixBytes (1779 of 2216) PASS: lldb-unit :: Utility/Release/UtilityTests/BinaryStreamTest.PutSLEB128ThreeBytes (1780 of 2216) PASS: lldb-unit :: Utility/Release/UtilityTests/BinaryStreamTest.PutSLEB128TwoBytes (1781 of 2216) PASS: lldb-unit :: Utility/Release/UtilityTests/BinaryStreamTest.PutSLEB128Zero (1782 of 2216) PASS: lldb-unit :: Utility/Release/UtilityTests/BinaryStreamTest.PutULEB128EightBytes (1783 of 2216) PASS: lldb-unit :: Utility/Release/UtilityTests/BinaryStreamTest.PutULEB128FiveBytes (1784 of 2216) PASS: lldb-unit :: Utility/Release/UtilityTests/BinaryStreamTest.PutULEB128FourBytes (1785 of 2216) PASS: lldb-unit :: Utility/Release/UtilityTests/BinaryStreamTest.PutULEB128MaxValue (1786 of 2216) PASS: lldb-unit :: Utility/Release/UtilityTests/BinaryStreamTest.PutULEB128NineBytes (1787 of 2216) PASS: lldb-unit :: Utility/Release/UtilityTests/BinaryStreamTest.PutULEB128One (1788 of 2216) PASS: lldb-unit :: Utility/Release/UtilityTests/BinaryStreamTest.PutULEB128OneByte (1789 of 2216) PASS: lldb-unit :: Utility/Release/UtilityTests/BinaryStreamTest.PutULEB128SevenBytes (1790 of 2216) PASS: lldb-unit :: Utility/Release/UtilityTests/BinaryStreamTest.PutULEB128SixBytes (1791 of 2216) PASS: lldb-unit :: Utility/Release/UtilityTests/BinaryStreamTest.PutULEB128ThreeBytes (1792 of 2216) PASS: lldb-unit :: Utility/Release/UtilityTests/BinaryStreamTest.PutULEB128TwoBytes (1793 of 2216) PASS: lldb-unit :: Utility/Release/UtilityTests/BinaryStreamTest.PutULEB128Zero (1794 of 2216) PASS: lldb-unit :: Utility/Release/UtilityTests/BroadcasterTest.BroadcastEvent (1795 of 2216) PASS: lldb-unit :: Utility/Release/UtilityTests/BroadcasterTest.EventTypeHasListeners (1796 of 2216) PASS: lldb-unit :: Utility/Release/UtilityTests/CompletionRequest.Constructor (1797 of 2216) PASS: lldb-unit :: Utility/Release/UtilityTests/CompletionRequest.DuplicateFiltering (1798 of 2216) PASS: lldb-unit :: Utility/Release/UtilityTests/CompletionRequest.DuplicateFilteringWithComments (1799 of 2216) PASS: lldb-unit :: Utility/Release/UtilityTests/CompletionRequest.FakeLastArg (1800 of 2216) PASS: lldb-unit :: Utility/Release/UtilityTests/CompletionRequest.ShiftArguments (1801 of 2216) PASS: lldb-unit :: Utility/Release/UtilityTests/CompletionRequest.TestCompletionOwnership (1802 of 2216) PASS: lldb-unit :: Utility/Release/UtilityTests/CompletionRequest.TryCompleteCurrentArgBad (1803 of 2216) PASS: lldb-unit :: Utility/Release/UtilityTests/CompletionRequest.TryCompleteCurrentArgGood (1804 of 2216) PASS: lldb-unit :: Utility/Release/UtilityTests/CompletionRequest.TryCompleteCurrentArgMode (1805 of 2216) PASS: lldb-unit :: Utility/Release/UtilityTests/ConstStringTest.CompareConstString (1806 of 2216) PASS: lldb-unit :: Utility/Release/UtilityTests/ConstStringTest.CompareStringRef (1807 of 2216) PASS: lldb-unit :: Utility/Release/UtilityTests/ConstStringTest.FromMidOfBufferStringRef (1808 of 2216) PASS: lldb-unit :: Utility/Release/UtilityTests/ConstStringTest.MangledCounterpart (1809 of 2216) PASS: lldb-unit :: Utility/Release/UtilityTests/ConstStringTest.NullAndEmptyStates (1810 of 2216) PASS: lldb-unit :: Utility/Release/UtilityTests/ConstStringTest.UpdateMangledCounterpart (1811 of 2216) PASS: lldb-unit :: Utility/Release/UtilityTests/ConstStringTest.YAML (1812 of 2216) PASS: lldb-unit :: Utility/Release/UtilityTests/DataExtractorTest.GetBitfield (1813 of 2216) PASS: lldb-unit :: Utility/Release/UtilityTests/ConstStringTest.format_provider (1814 of 2216) PASS: lldb-unit :: Utility/Release/UtilityTests/DataExtractorTest.GetCStrAtEnd (1815 of 2216) PASS: lldb-unit :: Utility/Release/UtilityTests/DataExtractorTest.GetCStr (1816 of 2216) PASS: lldb-unit :: Utility/Release/UtilityTests/DataExtractorTest.GetCStrAtNullOffset (1817 of 2216) PASS: lldb-unit :: Utility/Release/UtilityTests/DataExtractorTest.GetCStrEmpty (1818 of 2216) PASS: lldb-unit :: Utility/Release/UtilityTests/DataExtractorTest.GetCStrUnterminated (1819 of 2216) PASS: lldb-unit :: Utility/Release/UtilityTests/DataExtractorTest.GetDouble (1820 of 2216) PASS: lldb-unit :: Utility/Release/UtilityTests/DataExtractorTest.GetDoubleUnaligned (1821 of 2216) PASS: lldb-unit :: Utility/Release/UtilityTests/DataExtractorTest.GetFloat (1822 of 2216) PASS: lldb-unit :: Utility/Release/UtilityTests/DataExtractorTest.GetMaxS64 (1823 of 2216) PASS: lldb-unit :: Utility/Release/UtilityTests/DataExtractorTest.GetFloatUnaligned (1824 of 2216) PASS: lldb-unit :: Utility/Release/UtilityTests/DataExtractorTest.GetMaxU64_unchecked (1825 of 2216) PASS: lldb-unit :: Utility/Release/UtilityTests/DataExtractorTest.GetMaxU64 (1826 of 2216) PASS: lldb-unit :: Utility/Release/UtilityTests/DataExtractorTest.GetSLEB128_bit63 (1827 of 2216) PASS: lldb-unit :: Utility/Release/UtilityTests/DataExtractorTest.GetULEB128_bit63 (1828 of 2216) PASS: lldb-unit :: Utility/Release/UtilityTests/DataExtractorTest.PeekData (1829 of 2216) PASS: lldb-unit :: Utility/Release/UtilityTests/DataExtractorTest.UncommonAddressSize (1830 of 2216) PASS: lldb-unit :: Utility/Release/UtilityTests/DeserializerTest.HasData (1831 of 2216) PASS: lldb-unit :: Utility/Release/UtilityTests/EnvironmentTest.EnvpConstruction (1832 of 2216) PASS: lldb-unit :: Utility/Release/UtilityTests/EnvironmentTest.EnvpConversion (1833 of 2216) PASS: lldb-unit :: Utility/Release/UtilityTests/EventTest.DumpEventDataBytes (1834 of 2216) PASS: lldb-unit :: Utility/Release/UtilityTests/FileSpecTest.AppendPathComponent (1835 of 2216) PASS: lldb-unit :: Utility/Release/UtilityTests/FileSpecTest.CopyByAppendingPathComponent (1836 of 2216) PASS: lldb-unit :: Utility/Release/UtilityTests/FileSpecTest.Equal (1837 of 2216) PASS: lldb-unit :: Utility/Release/UtilityTests/FileSpecTest.EqualDotsPosix (1838 of 2216) PASS: lldb-unit :: Utility/Release/UtilityTests/FileSpecTest.EqualDotsPosixRoot (1839 of 2216) PASS: lldb-unit :: Utility/Release/UtilityTests/FileSpecTest.EqualDotsWindows (1840 of 2216) PASS: lldb-unit :: Utility/Release/UtilityTests/FileSpecTest.EqualSeparator (1841 of 2216) PASS: lldb-unit :: Utility/Release/UtilityTests/FileSpecTest.FileAndDirectoryComponents (1842 of 2216) PASS: lldb-unit :: Utility/Release/UtilityTests/FileSpecTest.FormatFileSpec (1843 of 2216) PASS: lldb-unit :: Utility/Release/UtilityTests/FileSpecTest.GetPath (1844 of 2216) PASS: lldb-unit :: Utility/Release/UtilityTests/FileSpecTest.IsRelative (1845 of 2216) PASS: lldb-unit :: Utility/Release/UtilityTests/FileSpecTest.GuessPathStyle (1846 of 2216) PASS: lldb-unit :: Utility/Release/UtilityTests/FileSpecTest.Match (1847 of 2216) PASS: lldb-unit :: Utility/Release/UtilityTests/FileSpecTest.OperatorBool (1848 of 2216) PASS: lldb-unit :: Utility/Release/UtilityTests/FileSpecTest.RemoveLastPathComponent (1849 of 2216) PASS: lldb-unit :: Utility/Release/UtilityTests/FileSpecTest.PrependPathComponent (1850 of 2216) PASS: lldb-unit :: Utility/Release/UtilityTests/Flags.AllClear (1851 of 2216) PASS: lldb-unit :: Utility/Release/UtilityTests/FileSpecTest.Yaml (1852 of 2216) PASS: lldb-unit :: Utility/Release/UtilityTests/Flags.AnyClear (1853 of 2216) PASS: lldb-unit :: Utility/Release/UtilityTests/Flags.AllSet (1854 of 2216) PASS: lldb-unit :: Utility/Release/UtilityTests/Flags.AnySet (1855 of 2216) PASS: lldb-unit :: Utility/Release/UtilityTests/Flags.Clear (1856 of 2216) PASS: lldb-unit :: Utility/Release/UtilityTests/Flags.GetBitSize (1857 of 2216) PASS: lldb-unit :: Utility/Release/UtilityTests/Flags.IsClear (1858 of 2216) PASS: lldb-unit :: Utility/Release/UtilityTests/Flags.Reset (1859 of 2216) PASS: lldb-unit :: Utility/Release/UtilityTests/Flags.Test (1860 of 2216) PASS: lldb-unit :: Utility/Release/UtilityTests/GeneratorTest.Create (1861 of 2216) PASS: lldb-unit :: Utility/Release/UtilityTests/GeneratorTest.Get (1862 of 2216) PASS: lldb-unit :: Utility/Release/UtilityTests/GeneratorTest.GetOrCreate (1863 of 2216) PASS: lldb-unit :: Utility/Release/UtilityTests/GeneratorTest.YamlMultiProvider (1864 of 2216) PASS: lldb-unit :: Utility/Release/UtilityTests/IndexToObjectTest.ObjectForIndex (1865 of 2216) PASS: lldb-unit :: Utility/Release/UtilityTests/ListenerTest.GetEventImmediate (1866 of 2216) PASS: lldb-unit :: Utility/Release/UtilityTests/LogChannelEnabledTest.LLDB_LOG_ERROR (1867 of 2216) PASS: lldb-unit :: Utility/Release/UtilityTests/LogChannelEnabledTest.LogGetLogThread (1868 of 2216) PASS: lldb-unit :: Utility/Release/UtilityTests/LogChannelEnabledTest.LogThread (1869 of 2216) PASS: lldb-unit :: Utility/Release/UtilityTests/ListenerTest.GetEventWait (1870 of 2216) PASS: lldb-unit :: Utility/Release/UtilityTests/LogChannelEnabledTest.LogVerboseThread (1871 of 2216) PASS: lldb-unit :: Utility/Release/UtilityTests/LogChannelEnabledTest.log_options (1872 of 2216) PASS: lldb-unit :: Utility/Release/UtilityTests/LogChannelTest.Disable (1873 of 2216) PASS: lldb-unit :: Utility/Release/UtilityTests/LogChannelTest.Enable (1874 of 2216) PASS: lldb-unit :: Utility/Release/UtilityTests/LogChannelTest.EnableOptions (1875 of 2216) PASS: lldb-unit :: Utility/Release/UtilityTests/LogChannelTest.List (1876 of 2216) PASS: lldb-unit :: Utility/Release/UtilityTests/LogTest.LLDB_LOG_nullptr (1877 of 2216) PASS: lldb-unit :: Utility/Release/UtilityTests/LogTest.Register (1878 of 2216) PASS: lldb-unit :: Utility/Release/UtilityTests/LogTest.Unregister (1879 of 2216) PASS: lldb-unit :: Utility/Release/UtilityTests/NameMatchesTest.Contains (1880 of 2216) PASS: lldb-unit :: Utility/Release/UtilityTests/NameMatchesTest.EndsWith (1881 of 2216) PASS: lldb-unit :: Utility/Release/UtilityTests/NameMatchesTest.Equals (1882 of 2216) PASS: lldb-unit :: SymbolFile/DWARF/Release/SymbolFileDWARFTests/XcodeSDKModuleTests.TestModuleGetXcodeSDK (1883 of 2216) PASS: lldb-unit :: Utility/Release/UtilityTests/NameMatchesTest.Ignore (1884 of 2216) PASS: lldb-unit :: Utility/Release/UtilityTests/NameMatchesTest.RegularExpression (1885 of 2216) PASS: lldb-unit :: Utility/Release/UtilityTests/NameMatchesTest.StartsWith (1886 of 2216) PASS: lldb-unit :: Utility/Release/UtilityTests/OptionsWithRawTest.ArgsButNoDelimiter (1887 of 2216) PASS: lldb-unit :: Utility/Release/UtilityTests/OptionsWithRawTest.ArgsButNoLeadingDash (1888 of 2216) PASS: lldb-unit :: Utility/Release/UtilityTests/OptionsWithRawTest.EmptyArgsOnlySuffix (1889 of 2216) PASS: lldb-unit :: Utility/Release/UtilityTests/OptionsWithRawTest.EmptyInput (1890 of 2216) PASS: lldb-unit :: Utility/Release/UtilityTests/OptionsWithRawTest.EmptySuffix (1891 of 2216) PASS: lldb-unit :: Utility/Release/UtilityTests/OptionsWithRawTest.EmptySuffixSingleWhitespace (1892 of 2216) PASS: lldb-unit :: Utility/Release/UtilityTests/OptionsWithRawTest.LeadingSpaceArgs (1893 of 2216) PASS: lldb-unit :: Utility/Release/UtilityTests/OptionsWithRawTest.MultiWordSuffix (1894 of 2216) PASS: lldb-unit :: Utility/Release/UtilityTests/OptionsWithRawTest.QuotedSuffix (1895 of 2216) PASS: lldb-unit :: Utility/Release/UtilityTests/OptionsWithRawTest.SingleWhitespaceInput (1896 of 2216) PASS: lldb-unit :: Utility/Release/UtilityTests/OptionsWithRawTest.SingleWordSuffix (1897 of 2216) PASS: lldb-unit :: Utility/Release/UtilityTests/OptionsWithRawTest.TerminatedQuote (1898 of 2216) PASS: lldb-unit :: Utility/Release/UtilityTests/OptionsWithRawTest.UnterminatedQuote (1899 of 2216) PASS: lldb-unit :: Utility/Release/UtilityTests/OptionsWithRawTest.WhitespaceInput (1900 of 2216) PASS: lldb-unit :: Utility/Release/UtilityTests/OptionsWithRawTest.WhitespaceSuffix (1901 of 2216) PASS: lldb-unit :: Utility/Release/UtilityTests/PassiveReplayTest.InstrumentedBar (1902 of 2216) PASS: lldb-unit :: Utility/Release/UtilityTests/PassiveReplayTest.InstrumentedBarPtr (1903 of 2216) PASS: lldb-unit :: Utility/Release/UtilityTests/PassiveReplayTest.InstrumentedBarRef (1904 of 2216) PASS: lldb-unit :: Utility/Release/UtilityTests/PassiveReplayTest.InstrumentedFoo (1905 of 2216) PASS: lldb-unit :: Utility/Release/UtilityTests/PassiveReplayTest.InstrumentedFooInvalid (1906 of 2216) PASS: lldb-unit :: Utility/Release/UtilityTests/Predicate.WaitForValueNotEqualTo (1907 of 2216) PASS: lldb-unit :: Utility/Release/UtilityTests/ProcessInstanceInfo.Dump (1908 of 2216) PASS: lldb-unit :: Utility/Release/UtilityTests/ProcessInfoTest.Constructor (1909 of 2216) PASS: lldb-unit :: Utility/Release/UtilityTests/ProcessInstanceInfo.DumpTable_invalidUID (1910 of 2216) PASS: lldb-unit :: Utility/Release/UtilityTests/ProcessInstanceInfo.DumpTable (1911 of 2216) PASS: lldb-unit :: Utility/Release/UtilityTests/ProcessInstanceInfoList.Yaml (1912 of 2216) PASS: lldb-unit :: Utility/Release/UtilityTests/ProcessInstanceInfo.Yaml (1913 of 2216) PASS: lldb-unit :: Utility/Release/UtilityTests/ProcessInstanceInfoMatch.Name (1914 of 2216) PASS: lldb-unit :: Utility/Release/UtilityTests/RangeDataVector.CustomSort (1915 of 2216) PASS: lldb-unit :: Utility/Release/UtilityTests/RangeDataVector.FindEntryIndexesThatContain (1916 of 2216) PASS: lldb-unit :: Utility/Release/UtilityTests/RangeDataVector.FindEntryIndexesThatContain_Overlap (1917 of 2216) PASS: lldb-unit :: Utility/Release/UtilityTests/RangeDataVector.FindEntryThatContains (1918 of 2216) PASS: lldb-unit :: Utility/Release/UtilityTests/RangeDataVector.FindEntryThatContains_Overlap (1919 of 2216) PASS: lldb-unit :: Utility/Release/UtilityTests/RangeTest.Clear (1920 of 2216) PASS: lldb-unit :: Utility/Release/UtilityTests/RangeTest.ClearWithStarAddress (1921 of 2216) PASS: lldb-unit :: Utility/Release/UtilityTests/Predicate.WaitForValueEqualTo (1922 of 2216) PASS: lldb-unit :: Utility/Release/UtilityTests/RangeTest.Constructor (1923 of 2216) PASS: lldb-unit :: Utility/Release/UtilityTests/RangeTest.ContainsAddr (1924 of 2216) PASS: lldb-unit :: Utility/Release/UtilityTests/RangeTest.ContainsAddrInvalid (1925 of 2216) PASS: lldb-unit :: Utility/Release/UtilityTests/RangeTest.ContainsEndInclusive (1926 of 2216) PASS: lldb-unit :: Utility/Release/UtilityTests/RangeTest.ContainsEndInclusiveInvalid (1927 of 2216) PASS: lldb-unit :: Utility/Release/UtilityTests/RangeTest.ContainsRange (1928 of 2216) PASS: lldb-unit :: Utility/Release/UtilityTests/RangeTest.ContainsRangeStartingFromZero (1929 of 2216) PASS: lldb-unit :: Utility/Release/UtilityTests/RangeTest.Copy (1930 of 2216) PASS: lldb-unit :: Utility/Release/UtilityTests/RangeTest.DefaultConstructor (1931 of 2216) PASS: lldb-unit :: Utility/Release/UtilityTests/RangeTest.DoesAdjoinOrIntersect (1932 of 2216) PASS: lldb-unit :: Utility/Release/UtilityTests/RangeTest.DoesIntersect (1933 of 2216) PASS: lldb-unit :: Utility/Release/UtilityTests/RangeTest.Equal (1934 of 2216) PASS: lldb-unit :: Utility/Release/UtilityTests/RangeTest.EqualInvalid (1935 of 2216) PASS: lldb-unit :: Utility/Release/UtilityTests/RangeTest.LessThan (1936 of 2216) PASS: lldb-unit :: Utility/Release/UtilityTests/RangeTest.LessThanInvalid (1937 of 2216) PASS: lldb-unit :: Utility/Release/UtilityTests/RangeTest.NotEqual (1938 of 2216) PASS: lldb-unit :: Utility/Release/UtilityTests/RangeTest.NotEqualInvalid (1939 of 2216) PASS: lldb-unit :: Utility/Release/UtilityTests/RangeTest.SetRangeBase (1940 of 2216) PASS: lldb-unit :: Utility/Release/UtilityTests/RangeTest.SizeTypes (1941 of 2216) PASS: lldb-unit :: Utility/Release/UtilityTests/RangeTest.Slide (1942 of 2216) PASS: lldb-unit :: Utility/Release/UtilityTests/RangeTest.SlideZero (1943 of 2216) PASS: lldb-unit :: Utility/Release/UtilityTests/RangeTest.Union (1944 of 2216) PASS: lldb-unit :: Utility/Release/UtilityTests/RangeVector.CombineConsecutiveRanges (1945 of 2216) PASS: lldb-unit :: Utility/Release/UtilityTests/RecordReplayTest.InstrumentedBar (1946 of 2216) PASS: lldb-unit :: Utility/Release/UtilityTests/RecordReplayTest.InstrumentedBarPtr (1947 of 2216) PASS: lldb-unit :: Utility/Release/UtilityTests/RecordReplayTest.InstrumentedBarRef (1948 of 2216) PASS: lldb-unit :: Utility/Release/UtilityTests/RegisterValueTest.GetScalarValue (1949 of 2216) PASS: lldb-unit :: Utility/Release/UtilityTests/RegisterValueTest.GetSet8 (1950 of 2216) PASS: lldb-unit :: Utility/Release/UtilityTests/RegularExpression.CopyAssignment (1951 of 2216) PASS: lldb-unit :: Utility/Release/UtilityTests/RegularExpression.Empty (1952 of 2216) PASS: lldb-unit :: Utility/Release/UtilityTests/RegularExpression.Invalid (1953 of 2216) PASS: lldb-unit :: Utility/Release/UtilityTests/RegularExpression.Match (1954 of 2216) PASS: lldb-unit :: Utility/Release/UtilityTests/RegularExpression.Valid (1955 of 2216) PASS: lldb-unit :: Utility/Release/UtilityTests/ReproducerTest.SetCapture (1956 of 2216) PASS: lldb-unit :: Utility/Release/UtilityTests/ReproducerTest.SetReplay (1957 of 2216) PASS: lldb-unit :: Utility/Release/UtilityTests/RecordReplayTest.InstrumentedFoo (1958 of 2216) PASS: lldb-unit :: Utility/Release/UtilityTests/RecordReplayTest.InstrumentedFooSameThis (1959 of 2216) PASS: lldb-unit :: Utility/Release/UtilityTests/ScalarTest.APIntConstructor (1960 of 2216) PASS: lldb-unit :: Utility/Release/UtilityTests/ScalarTest.CastOperations (1961 of 2216) PASS: lldb-unit :: Utility/Release/UtilityTests/ScalarTest.Comparison (1962 of 2216) PASS: lldb-unit :: Utility/Release/UtilityTests/ScalarTest.ComparisonFloat (1963 of 2216) PASS: lldb-unit :: Utility/Release/UtilityTests/ScalarTest.Division (1964 of 2216) PASS: lldb-unit :: Utility/Release/UtilityTests/ScalarTest.Equality (1965 of 2216) PASS: lldb-unit :: Utility/Release/UtilityTests/ScalarTest.ExtractBitfield (1966 of 2216) PASS: lldb-unit :: Utility/Release/UtilityTests/ScalarTest.GetBytes (1967 of 2216) PASS: lldb-unit :: Utility/Release/UtilityTests/ScalarTest.GetValue (1968 of 2216) PASS: lldb-unit :: Utility/Release/UtilityTests/ScalarTest.Getters (1969 of 2216) PASS: lldb-unit :: Utility/Release/UtilityTests/ScalarTest.LongLongAssigmentOperator (1970 of 2216) PASS: lldb-unit :: Utility/Release/UtilityTests/ScalarTest.RightShiftOperator (1971 of 2216) PASS: lldb-unit :: Utility/Release/UtilityTests/ScalarTest.Promotion (1972 of 2216) PASS: lldb-unit :: Utility/Release/UtilityTests/ScalarTest.Scalar_512 (1973 of 2216) PASS: lldb-unit :: Utility/Release/UtilityTests/ScalarTest.SetValueFromCString (1974 of 2216) PASS: lldb-unit :: Utility/Release/UtilityTests/ScalarTest.SetValueFromData (1975 of 2216) PASS: lldb-unit :: Utility/Release/UtilityTests/ScalarTest.TruncOrExtendTo (1976 of 2216) PASS: lldb-unit :: Utility/Release/UtilityTests/SerializationRountripTest.SerializeDeserializeCStringArray (1977 of 2216) PASS: lldb-unit :: Utility/Release/UtilityTests/SerializationRountripTest.SerializeDeserializeCString (1978 of 2216) PASS: lldb-unit :: Utility/Release/UtilityTests/SerializationRountripTest.SerializeDeserializeCStringArrayNullptr (1979 of 2216) PASS: lldb-unit :: Utility/Release/UtilityTests/SerializationRountripTest.SerializeDeserializeCStringArrayNullptrElem (1980 of 2216) PASS: lldb-unit :: Utility/Release/UtilityTests/SerializationRountripTest.SerializeDeserializeCStringNull (1981 of 2216) PASS: lldb-unit :: Utility/Release/UtilityTests/SerializationRountripTest.SerializeDeserializeObjectPointer (1982 of 2216) PASS: lldb-unit :: Utility/Release/UtilityTests/SerializationRountripTest.SerializeDeserializeObjectReference (1983 of 2216) PASS: lldb-unit :: Utility/Release/UtilityTests/SerializationRountripTest.SerializeDeserializePod (1984 of 2216) PASS: lldb-unit :: Utility/Release/UtilityTests/SerializationRountripTest.SerializeDeserializePodPointers (1985 of 2216) PASS: lldb-unit :: Utility/Release/UtilityTests/SerializationRountripTest.SerializeDeserializePodReferences (1986 of 2216) PASS: lldb-unit :: Utility/Release/UtilityTests/SharedCluster.ClusterManager (1987 of 2216) PASS: lldb-unit :: Utility/Release/UtilityTests/StateTest.Formatv (1988 of 2216) PASS: lldb-unit :: Utility/Release/UtilityTests/StatusTest.ErrorCodeConstructor (1989 of 2216) PASS: lldb-unit :: Utility/Release/UtilityTests/StatusTest.ErrorConstructor (1990 of 2216) PASS: lldb-unit :: Utility/Release/UtilityTests/StatusTest.ErrorConversion (1991 of 2216) PASS: lldb-unit :: Utility/Release/UtilityTests/StatusTest.Formatv (1992 of 2216) PASS: lldb-unit :: Utility/Release/UtilityTests/StreamTeeTest.AppendStream (1993 of 2216) PASS: lldb-unit :: Utility/Release/UtilityTests/StreamTeeTest.Assignment (1994 of 2216) PASS: lldb-unit :: Utility/Release/UtilityTests/StreamTeeTest.Constructor1Stream (1995 of 2216) PASS: lldb-unit :: Utility/Release/UtilityTests/StreamTeeTest.Constructor2Streams (1996 of 2216) PASS: lldb-unit :: Utility/Release/UtilityTests/StreamTeeTest.CopyConstructor (1997 of 2216) PASS: lldb-unit :: Utility/Release/UtilityTests/StreamTeeTest.DefaultConstructor (1998 of 2216) PASS: lldb-unit :: Utility/Release/UtilityTests/StreamTeeTest.Flush (1999 of 2216) PASS: lldb-unit :: Utility/Release/UtilityTests/StreamTeeTest.GetStreamAtIndexOutOfBounds (2000 of 2216) PASS: lldb-unit :: Utility/Release/UtilityTests/StreamTeeTest.GetStreamAtIndexOutOfBoundsEmpty (2001 of 2216) PASS: lldb-unit :: Utility/Release/UtilityTests/StreamTeeTest.SetStreamAtIndexOutOfBounds (2002 of 2216) PASS: lldb-unit :: Utility/Release/UtilityTests/StreamTeeTest.SetStreamAtIndexOverwrite (2003 of 2216) PASS: lldb-unit :: Utility/Release/UtilityTests/StreamTeeTest.Write (2004 of 2216) PASS: lldb-unit :: Utility/Release/UtilityTests/StreamTest.AddressEmptyPrefix (2005 of 2216) PASS: lldb-unit :: Utility/Release/UtilityTests/StreamTest.AddressNoSuffix (2006 of 2216) PASS: lldb-unit :: Utility/Release/UtilityTests/StreamTest.AddressPrefix (2007 of 2216) PASS: lldb-unit :: Utility/Release/UtilityTests/StreamTest.AddressPrefixAndSuffix (2008 of 2216) PASS: lldb-unit :: Utility/Release/UtilityTests/StreamTest.AddressRange (2009 of 2216) PASS: lldb-unit :: Utility/Release/UtilityTests/StreamTest.AddressRangeEmptyRange (2010 of 2216) PASS: lldb-unit :: Utility/Release/UtilityTests/StreamTest.AddressRangeInvalidRange (2011 of 2216) PASS: lldb-unit :: Utility/Release/UtilityTests/StreamTest.AddressRangeSize (2012 of 2216) PASS: lldb-unit :: Utility/Release/UtilityTests/StreamTest.AddressSize (2013 of 2216) PASS: lldb-unit :: Utility/Release/UtilityTests/StreamTest.AddressSuffix (2014 of 2216) PASS: lldb-unit :: Utility/Release/UtilityTests/StreamTest.ChangingByteOrder (2015 of 2216) PASS: lldb-unit :: Utility/Release/UtilityTests/StreamTest.Indent (2016 of 2216) PASS: lldb-unit :: Utility/Release/UtilityTests/StreamTest.PutBytesAsRawHex8ToBigEndian (2017 of 2216) PASS: lldb-unit :: Utility/Release/UtilityTests/StreamTest.PutBytesAsRawHex8ToLittleEndian (2018 of 2216) PASS: lldb-unit :: Utility/Release/UtilityTests/StreamTest.PutBytesAsRawHex8ToMixedEndian (2019 of 2216) PASS: lldb-unit :: Utility/Release/UtilityTests/StreamTest.PutCString (2020 of 2216) PASS: lldb-unit :: Utility/Release/UtilityTests/StreamTest.PutCStringWithStringRef (2021 of 2216) PASS: lldb-unit :: Utility/Release/UtilityTests/StreamTest.PutCharNull (2022 of 2216) PASS: lldb-unit :: Utility/Release/UtilityTests/StreamTest.PutChar (2023 of 2216) PASS: lldb-unit :: Utility/Release/UtilityTests/StreamTest.PutCharWhitespace (2024 of 2216) PASS: lldb-unit :: Utility/Release/UtilityTests/StreamTest.PutHex16ByteOrderLittle (2025 of 2216) PASS: lldb-unit :: Utility/Release/UtilityTests/StreamTest.PutHex16ByteOrderBig (2026 of 2216) PASS: lldb-unit :: Utility/Release/UtilityTests/StreamTest.PutHex32ByteOrderBig (2027 of 2216) PASS: lldb-unit :: Utility/Release/UtilityTests/StreamTest.PutHex32ByteOrderLittle (2028 of 2216) PASS: lldb-unit :: Utility/Release/UtilityTests/StreamTest.PutHex64ByteOrderBig (2029 of 2216) PASS: lldb-unit :: Utility/Release/UtilityTests/StreamTest.PutHex64ByteOrderLittle (2030 of 2216) PASS: lldb-unit :: Utility/Release/UtilityTests/StreamTest.PutHex8 (2031 of 2216) PASS: lldb-unit :: Utility/Release/UtilityTests/StreamTest.PutMaxHex64ByteOrderBig (2032 of 2216) PASS: lldb-unit :: Utility/Release/UtilityTests/StreamTest.PutMaxHex64ByteOrderLittle (2033 of 2216) PASS: lldb-unit :: Utility/Release/UtilityTests/StreamTest.PutNHex8 (2034 of 2216) PASS: lldb-unit :: Utility/Release/UtilityTests/StreamTest.PutPtr (2035 of 2216) PASS: lldb-unit :: Utility/Release/UtilityTests/StreamTest.PutRawBytesToBigEndian (2036 of 2216) PASS: lldb-unit :: Utility/Release/UtilityTests/StreamTest.PutRawBytesToLittleEndian (2037 of 2216) PASS: lldb-unit :: Utility/Release/UtilityTests/StreamTest.PutRawBytesToMixedEndian (2038 of 2216) PASS: lldb-unit :: Utility/Release/UtilityTests/StreamTest.PutSLEB128 (2039 of 2216) PASS: lldb-unit :: Utility/Release/UtilityTests/StreamTest.PutStringAsRawHex8 (2040 of 2216) PASS: lldb-unit :: Utility/Release/UtilityTests/StreamTest.PutULEB128 (2041 of 2216) PASS: lldb-unit :: Utility/Release/UtilityTests/StreamTest.QuotedCString (2042 of 2216) PASS: lldb-unit :: Utility/Release/UtilityTests/StreamTest.ShiftOperatorChars (2043 of 2216) PASS: lldb-unit :: Utility/Release/UtilityTests/StreamTest.SetIndentLevel (2044 of 2216) PASS: lldb-unit :: Utility/Release/UtilityTests/StreamTest.ShiftOperatorPtr (2045 of 2216) PASS: lldb-unit :: Utility/Release/UtilityTests/StringExtractorTest.DecodeHexU8_Exact (2046 of 2216) PASS: lldb-unit :: Utility/Release/UtilityTests/StreamTest.ShiftOperatorStrings (2047 of 2216) PASS: lldb-unit :: Utility/Release/UtilityTests/StringExtractorTest.DecodeHexU8_Extra (2048 of 2216) PASS: lldb-unit :: Utility/Release/UtilityTests/StringExtractorTest.DecodeHexU8_InvalidHex2 (2049 of 2216) PASS: lldb-unit :: Utility/Release/UtilityTests/StringExtractorTest.DecodeHexU8_InvalidHex (2050 of 2216) PASS: lldb-unit :: Utility/Release/UtilityTests/StringExtractorTest.DecodeHexU8_Underflow (2051 of 2216) PASS: lldb-unit :: Utility/Release/UtilityTests/StringExtractorTest.DecodeHexU8_Underflow2 (2052 of 2216) PASS: lldb-unit :: Utility/Release/UtilityTests/StringExtractorTest.GetHexBytes (2053 of 2216) PASS: lldb-unit :: Utility/Release/UtilityTests/StringExtractorTest.GetHexBytesAvail (2054 of 2216) PASS: lldb-unit :: Utility/Release/UtilityTests/StringExtractorTest.GetHexBytesAvail_FullString (2055 of 2216) PASS: lldb-unit :: Utility/Release/UtilityTests/StringExtractorTest.GetHexBytesAvail_OddPair (2056 of 2216) PASS: lldb-unit :: Utility/Release/UtilityTests/StringExtractorTest.GetHexBytesAvail_OddPair2 (2057 of 2216) PASS: lldb-unit :: Utility/Release/UtilityTests/StringExtractorTest.GetHexBytesAvail_Partial (2058 of 2216) PASS: lldb-unit :: Utility/Release/UtilityTests/StringExtractorTest.GetHexBytesAvail_Underflow (2059 of 2216) PASS: lldb-unit :: Utility/Release/UtilityTests/StringExtractorTest.GetHexBytes_FullString (2060 of 2216) PASS: lldb-unit :: Utility/Release/UtilityTests/StringExtractorTest.GetHexBytes_Partial (2061 of 2216) PASS: lldb-unit :: Utility/Release/UtilityTests/StringExtractorTest.GetHexBytes_OddPair2 (2062 of 2216) PASS: lldb-unit :: Utility/Release/UtilityTests/StringExtractorTest.GetHexBytes_OddPair (2063 of 2216) PASS: lldb-unit :: Utility/Release/UtilityTests/StringExtractorTest.GetHexU8_Exact_NoEof (2064 of 2216) PASS: lldb-unit :: Utility/Release/UtilityTests/StringExtractorTest.GetHexBytes_Underflow (2065 of 2216) PASS: lldb-unit :: Utility/Release/UtilityTests/StringExtractorTest.GetHexU8_Exact (2066 of 2216) PASS: lldb-unit :: Utility/Release/UtilityTests/StringExtractorTest.GetHexU8_Extra_NoEof (2067 of 2216) PASS: lldb-unit :: Utility/Release/UtilityTests/StringExtractorTest.GetHexU8_Extra (2068 of 2216) PASS: lldb-unit :: Utility/Release/UtilityTests/StringExtractorTest.GetHexU8_InvalidHex (2069 of 2216) PASS: lldb-unit :: Utility/Release/UtilityTests/StringExtractorTest.GetHexU8_Underflow2 (2070 of 2216) PASS: lldb-unit :: Utility/Release/UtilityTests/StringExtractorTest.GetHexU8_InvalidHex_NoEof (2071 of 2216) PASS: lldb-unit :: Utility/Release/UtilityTests/StringExtractorTest.GetHexU8_Underflow (2072 of 2216) PASS: lldb-unit :: Utility/Release/UtilityTests/StringExtractorTest.GetNameColonValueContainsColon (2073 of 2216) PASS: lldb-unit :: Utility/Release/UtilityTests/StringExtractorTest.GetHexU8_Underflow2_NoEof (2074 of 2216) PASS: lldb-unit :: Utility/Release/UtilityTests/StringExtractorTest.GetHexU8_Underflow_NoEof (2075 of 2216) PASS: lldb-unit :: Utility/Release/UtilityTests/StringExtractorTest.GetNameColonValueNoColon (2076 of 2216) PASS: lldb-unit :: Utility/Release/UtilityTests/StringExtractorTest.GetNameColonValueNoSemicolon (2077 of 2216) PASS: lldb-unit :: Utility/Release/UtilityTests/StringExtractorTest.GetNameColonValueSuccess (2078 of 2216) PASS: lldb-unit :: Utility/Release/UtilityTests/StringExtractorTest.GetU32BigEndian (2079 of 2216) PASS: lldb-unit :: Utility/Release/UtilityTests/StringExtractorTest.GetU32LittleEndian (2080 of 2216) PASS: lldb-unit :: Utility/Release/UtilityTests/StringExtractorTest.GetU64BigEndian (2081 of 2216) PASS: lldb-unit :: Utility/Release/UtilityTests/StringExtractorTest.GetU64LittleEndian (2082 of 2216) PASS: lldb-unit :: Utility/Release/UtilityTests/StringExtractorTest.InitEmpty (2083 of 2216) PASS: lldb-unit :: Utility/Release/UtilityTests/StringExtractorTest.InitMisc (2084 of 2216) PASS: lldb-unit :: Utility/Release/UtilityTests/StringLexerTest.GetUnlexed (2085 of 2216) PASS: lldb-unit :: Utility/Release/UtilityTests/StringLexerTest.AdvanceIf (2086 of 2216) PASS: lldb-unit :: Utility/Release/UtilityTests/StringLexerTest.HasAtLeast (2087 of 2216) PASS: lldb-unit :: Utility/Release/UtilityTests/StringLexerTest.Next (2088 of 2216) PASS: lldb-unit :: Utility/Release/UtilityTests/StringLexerTest.NextIf (2089 of 2216) PASS: lldb-unit :: Utility/Release/UtilityTests/StringLexerTest.NextIfList (2090 of 2216) PASS: lldb-unit :: Utility/Release/UtilityTests/StringLexerTest.Peek (2091 of 2216) PASS: lldb-unit :: Utility/Release/UtilityTests/StringLexerTest.PutBack (2092 of 2216) PASS: lldb-unit :: Utility/Release/UtilityTests/StringListTest.AppendList (2093 of 2216) PASS: lldb-unit :: Utility/Release/UtilityTests/StringListTest.AppendListCStringArray (2094 of 2216) PASS: lldb-unit :: Utility/Release/UtilityTests/StringListTest.AppendListCStringArrayEmpty (2095 of 2216) PASS: lldb-unit :: Utility/Release/UtilityTests/StringListTest.AppendStringCString (2096 of 2216) PASS: lldb-unit :: Utility/Release/UtilityTests/StringListTest.AppendStringMove (2097 of 2216) PASS: lldb-unit :: Utility/Release/UtilityTests/StringListTest.AppendStringStdString (2098 of 2216) PASS: lldb-unit :: Utility/Release/UtilityTests/StringListTest.Assignment (2099 of 2216) PASS: lldb-unit :: Utility/Release/UtilityTests/StringListTest.Clear (2100 of 2216) PASS: lldb-unit :: Utility/Release/UtilityTests/StringListTest.CopyListEmpty (2101 of 2216) PASS: lldb-unit :: Utility/Release/UtilityTests/StringListTest.CopyList (2102 of 2216) PASS: lldb-unit :: Utility/Release/UtilityTests/StringListTest.CopyListSingle (2103 of 2216) PASS: lldb-unit :: Utility/Release/UtilityTests/StringListTest.DefaultConstructor (2104 of 2216) PASS: lldb-unit :: Utility/Release/UtilityTests/StringListTest.ForRange (2105 of 2216) PASS: lldb-unit :: Utility/Release/UtilityTests/StringListTest.ForRangeEmpty (2106 of 2216) PASS: lldb-unit :: Utility/Release/UtilityTests/StringListTest.GetMaxStringLengthDecreasingSize (2107 of 2216) PASS: lldb-unit :: Utility/Release/UtilityTests/StringListTest.GetMaxStringLengthEmpty (2108 of 2216) PASS: lldb-unit :: Utility/Release/UtilityTests/StringListTest.GetMaxStringLengthEqualSize (2109 of 2216) PASS: lldb-unit :: Utility/Release/UtilityTests/StringListTest.GetMaxStringLengthMixed (2110 of 2216) PASS: lldb-unit :: Utility/Release/UtilityTests/StringListTest.GetMaxStringLengthIncreasingSize (2111 of 2216) PASS: lldb-unit :: Utility/Release/UtilityTests/StringListTest.GetSize (2112 of 2216) PASS: lldb-unit :: Utility/Release/UtilityTests/StringListTest.InsertStringAtIndexEnd (2113 of 2216) PASS: lldb-unit :: Utility/Release/UtilityTests/StringListTest.InsertStringAtIndexMove (2114 of 2216) PASS: lldb-unit :: Utility/Release/UtilityTests/StringListTest.InsertStringAtIndexOutOfBounds (2115 of 2216) PASS: lldb-unit :: Utility/Release/UtilityTests/StringListTest.InsertStringAtIndexStdString (2116 of 2216) PASS: lldb-unit :: Utility/Release/UtilityTests/StringListTest.InsertStringAtIndexStart (2117 of 2216) PASS: lldb-unit :: Utility/Release/UtilityTests/StringListTest.Join (2118 of 2216) PASS: lldb-unit :: Utility/Release/UtilityTests/StringListTest.JoinEmpty (2119 of 2216) PASS: lldb-unit :: Utility/Release/UtilityTests/StringListTest.JoinMultiCharSeparator (2120 of 2216) PASS: lldb-unit :: Utility/Release/UtilityTests/StringListTest.JoinNonSpace (2121 of 2216) PASS: lldb-unit :: Utility/Release/UtilityTests/StringListTest.JoinSingle (2122 of 2216) PASS: lldb-unit :: Utility/Release/UtilityTests/StringListTest.JoinThree (2123 of 2216) PASS: lldb-unit :: Utility/Release/UtilityTests/StringListTest.LongestCommonPrefix (2124 of 2216) PASS: lldb-unit :: Utility/Release/UtilityTests/StringListTest.LongestCommonPrefixDuplicateElement (2125 of 2216) PASS: lldb-unit :: Utility/Release/UtilityTests/StringListTest.LongestCommonPrefixEmpty (2126 of 2216) PASS: lldb-unit :: Utility/Release/UtilityTests/StringListTest.LongestCommonPrefixNoPrefix (2127 of 2216) PASS: lldb-unit :: Utility/Release/UtilityTests/StringListTest.LongestCommonPrefixSingleElement (2128 of 2216) PASS: lldb-unit :: Utility/Release/UtilityTests/StringListTest.PopBack (2129 of 2216) PASS: lldb-unit :: Utility/Release/UtilityTests/StringListTest.RemoveBlankLines (2130 of 2216) PASS: lldb-unit :: Utility/Release/UtilityTests/StringListTest.SetSize (2131 of 2216) PASS: lldb-unit :: Utility/Release/UtilityTests/StringListTest.ShiftCString (2132 of 2216) PASS: lldb-unit :: Utility/Release/UtilityTests/StringListTest.ShiftMove (2133 of 2216) PASS: lldb-unit :: Utility/Release/UtilityTests/StringListTest.ShiftStdString (2134 of 2216) PASS: lldb-unit :: Utility/Release/UtilityTests/StringListTest.SplitIntoLines (2135 of 2216) PASS: lldb-unit :: Utility/Release/UtilityTests/StringListTest.SplitIntoLinesEmpty (2136 of 2216) PASS: lldb-unit :: Utility/Release/UtilityTests/StringListTest.SplitIntoLinesSingleTrailingCR (2137 of 2216) PASS: lldb-unit :: Utility/Release/UtilityTests/StructuredDataTest.ParseJSONFromFile (2138 of 2216) PASS: lldb-unit :: Utility/Release/UtilityTests/StructuredDataTest.StringDump (2139 of 2216) PASS: lldb-unit :: Utility/Release/UtilityTests/SubsystemRAIITest.NormalSubsystem (2140 of 2216) PASS: lldb-unit :: Utility/Release/UtilityTests/SubsystemRAIITest.SubsystemWithErrorFailure (2141 of 2216) PASS: lldb-unit :: Utility/Release/UtilityTests/SubsystemRAIITest.SubsystemWithErrorSuccess (2142 of 2216) PASS: lldb-unit :: Utility/Release/UtilityTests/TildeExpressionResolver.ResolveFullPath (2143 of 2216) PASS: lldb-unit :: Utility/Release/UtilityTests/TimeoutTest.Construction (2144 of 2216) PASS: lldb-unit :: Utility/Release/UtilityTests/TimeoutTest.Format (2145 of 2216) PASS: lldb-unit :: Utility/Release/UtilityTests/TimerTest.CategoryTimes (2146 of 2216) PASS: lldb-unit :: Utility/Release/UtilityTests/TimerTest.CategoryTimesNested (2147 of 2216) PASS: lldb-unit :: Utility/Release/UtilityTests/UUIDTest.RelationalOperators (2148 of 2216) PASS: lldb-unit :: Utility/Release/UtilityTests/UUIDTest.SetFromStringRef (2149 of 2216) PASS: lldb-unit :: Utility/Release/UtilityTests/UUIDTest.StringConverion (2150 of 2216) PASS: lldb-unit :: Utility/Release/UtilityTests/UUIDTest.Validity (2151 of 2216) PASS: lldb-unit :: Utility/Release/UtilityTests/UriParserTest.BadPort (2152 of 2216) PASS: lldb-unit :: Utility/Release/UtilityTests/UriParserTest.BadPort2 (2153 of 2216) PASS: lldb-unit :: Utility/Release/UtilityTests/TimerTest.CategoryTimes2 (2154 of 2216) PASS: lldb-unit :: Utility/Release/UtilityTests/UriParserTest.BracketedHostname (2155 of 2216) PASS: lldb-unit :: Utility/Release/UtilityTests/UriParserTest.BracketedHostnamePort (2156 of 2216) PASS: lldb-unit :: Utility/Release/UtilityTests/UriParserTest.BracketedHostnameWithColon (2157 of 2216) PASS: lldb-unit :: Utility/Release/UtilityTests/UriParserTest.BracketedHostnameWithPortIPv4 (2158 of 2216) PASS: lldb-unit :: Utility/Release/UtilityTests/TimerTest.CategoryTimesStats (2159 of 2216) PASS: lldb-unit :: Utility/Release/UtilityTests/UriParserTest.BracketedHostnameWithPortIPv6 (2160 of 2216) PASS: lldb-unit :: Utility/Release/UtilityTests/UriParserTest.LongPath (2161 of 2216) PASS: lldb-unit :: Utility/Release/UtilityTests/UriParserTest.Empty (2162 of 2216) PASS: lldb-unit :: Utility/Release/UtilityTests/UriParserTest.Minimal (2163 of 2216) PASS: lldb-unit :: Utility/Release/UtilityTests/UriParserTest.MinimalPort (2164 of 2216) PASS: lldb-unit :: Utility/Release/UtilityTests/UriParserTest.MinimalPath (2165 of 2216) PASS: lldb-unit :: Utility/Release/UtilityTests/UriParserTest.MinimalPortPath (2166 of 2216) PASS: lldb-unit :: Utility/Release/UtilityTests/UriParserTest.PortOverflow (2167 of 2216) PASS: lldb-unit :: Utility/Release/UtilityTests/UriParserTest.SchemeHostSeparator (2168 of 2216) PASS: lldb-unit :: Utility/Release/UtilityTests/UriParserTest.SchemeHostSeparator2 (2169 of 2216) PASS: lldb-unit :: Utility/Release/UtilityTests/UriParserTest.SchemeHostSeparator3 (2170 of 2216) PASS: lldb-unit :: Utility/Release/UtilityTests/UriParserTest.SchemeHostSeparator4 (2171 of 2216) PASS: lldb-unit :: Utility/Release/UtilityTests/UriParserTest.TypicalPortPathIPv4 (2172 of 2216) PASS: lldb-unit :: Utility/Release/UtilityTests/UriParserTest.TypicalPortPathIPv6 (2173 of 2216) PASS: lldb-unit :: Utility/Release/UtilityTests/UserIDResolver.GetGroupName (2174 of 2216) PASS: lldb-unit :: Utility/Release/UtilityTests/UserIDResolver.GetUserName (2175 of 2216) PASS: lldb-unit :: Utility/Release/UtilityTests/VASprintfTest.BufferResize (2176 of 2216) PASS: lldb-unit :: Utility/Release/UtilityTests/VASprintfTest.EncodingError (2177 of 2216) PASS: lldb-unit :: Utility/Release/UtilityTests/VASprintfTest.NoBufferResize (2178 of 2216) PASS: lldb-unit :: Utility/Release/UtilityTests/VMRange.Clear (2179 of 2216) PASS: lldb-unit :: Utility/Release/UtilityTests/VMRange.CollectionContains (2180 of 2216) PASS: lldb-unit :: Utility/Release/UtilityTests/VMRange.Comparison (2181 of 2216) PASS: lldb-unit :: Utility/Release/UtilityTests/VMRange.ContainsAddr (2182 of 2216) PASS: lldb-unit :: Utility/Release/UtilityTests/VMRange.ContainsRange (2183 of 2216) PASS: lldb-unit :: Utility/Release/UtilityTests/VMRange.IsValid (2184 of 2216) PASS: lldb-unit :: Utility/Release/UtilityTests/VMRange.Ordering (2185 of 2216) PASS: lldb-unit :: Utility/Release/UtilityTests/VMRange.Reset (2186 of 2216) PASS: lldb-unit :: Utility/Release/UtilityTests/VMRange.SetEndAddress (2187 of 2216) PASS: lldb-unit :: Utility/Release/UtilityTests/XcodeSDKTest.FindXcodeContentsDirectoryInPath (2188 of 2216) PASS: lldb-unit :: Utility/Release/UtilityTests/XcodeSDKTest.GetCanonicalNameAndConstruct (2189 of 2216) PASS: lldb-unit :: Utility/Release/UtilityTests/XcodeSDKTest.GetSDKTypeForTriple (2190 of 2216) PASS: lldb-unit :: Utility/Release/UtilityTests/XcodeSDKTest.MergeTest (2191 of 2216) PASS: lldb-unit :: Utility/Release/UtilityTests/XcodeSDKTest.ParseTest (2192 of 2216) PASS: lldb-unit :: Utility/Release/UtilityTests/XcodeSDKTest.SDKSupportsModules (2193 of 2216) PASS: lldb-unit :: Utility/Release/UtilityTests/XcodeSDKTest.SDKSupportsSwift (2194 of 2216) PASS: lldb-unit :: debugserver/Release/debugserverTests/JSON.Parse (2195 of 2216) PASS: lldb-unit :: debugserver/Release/debugserverTests/RNBSocket.AnyListen (2196 of 2216) PASS: lldb-unit :: debugserver/Release/debugserverTests/RNBSocket.LoopBackConnectIPv4 (2197 of 2216) PASS: lldb-unit :: debugserver/Release/debugserverTests/RNBSocket.LoopBackConnectIPv6 (2198 of 2216) PASS: lldb-unit :: debugserver/Release/debugserverTests/RNBSocket.LoopBackListenIPv4 (2199 of 2216) PASS: lldb-unit :: debugserver/Release/debugserverTests/RNBSocket.LoopBackListenIPv6 (2200 of 2216) PASS: lldb-unit :: tools/lldb-server/tests/Release/LLDBServerTests/StandardStartupTest.TestStopReplyContainsThreadPcs (2201 of 2216) PASS: lldb-unit :: tools/lldb-server/tests/Release/LLDBServerTests/TestBase.LaunchModePreservesEnvironment (2202 of 2216) PASS: lldb-unit :: tools/lldb-server/tests/Release/LLDBServerTests/TestBase.DebugserverEnv (2203 of 2216) TIMEOUT: lldb-shell :: Commands/command-backtrace.test (2204 of 2216) ******************** TEST 'lldb-shell :: Commands/command-backtrace.test' FAILED ******************** Script: -- : 'RUN: at line 2'; /Users/buildslave/jenkins/workspace/lldb-cmake-standalone/lldb-xcode-build/Release/bin/lldb --no-lldbinit -S /Users/buildslave/jenkins/workspace/lldb-cmake-standalone/lldb-xcode-build/test/Shell/lit-lldb-init -s /Users/buildslave/jenkins/workspace/lldb-cmake-standalone/llvm-project/lldb/test/Shell/Commands/command-backtrace.test 2>&1 | /Users/buildslave/jenkins/workspace/lldb-cmake-standalone/clang-build/bin/FileCheck /Users/buildslave/jenkins/workspace/lldb-cmake-standalone/llvm-project/lldb/test/Shell/Commands/command-backtrace.test -- Exit Code: -9 Timeout: Reached timeout of 600 seconds

Hide Details

Command Output (stderr): -- + : 'RUN: at line 2' + /Users/buildslave/jenkins/workspace/lldb-cmake-standalone/lldb-xcode-build/Release/bin/lldb --no-lldbinit -S /Users/buildslave/jenkins/workspace/lldb-cmake-standalone/lldb-xcode-build/test/Shell/lit-lldb-init -s /Users/buildslave/jenkins/workspace/lldb-cmake-standalone/llvm-project/lldb/test/Shell/Commands/command-backtrace.test + /Users/buildslave/jenkins/workspace/lldb-cmake-standalone/clang-build/bin/FileCheck /Users/buildslave/jenkins/workspace/lldb-cmake-standalone/llvm-project/lldb/test/Shell/Commands/command-backtrace.test

Hide Details

--

Hide Details

******************** TIMEOUT: lldb-shell :: Commands/command-regex-delete.test (2205 of 2216) ******************** TEST 'lldb-shell :: Commands/command-regex-delete.test' FAILED ******************** Script: -- : 'RUN: at line 2'; /Users/buildslave/jenkins/workspace/lldb-cmake-standalone/lldb-xcode-build/Release/bin/lldb --no-lldbinit -S /Users/buildslave/jenkins/workspace/lldb-cmake-standalone/lldb-xcode-build/test/Shell/lit-lldb-init -s /Users/buildslave/jenkins/workspace/lldb-cmake-standalone/llvm-project/lldb/test/Shell/Commands/command-regex-delete.test 2>&1 | /Users/buildslave/jenkins/workspace/lldb-cmake-standalone/clang-build/bin/FileCheck /Users/buildslave/jenkins/workspace/lldb-cmake-standalone/llvm-project/lldb/test/Shell/Commands/command-regex-delete.test -- Exit Code: -9 Timeout: Reached timeout of 600 seconds

Hide Details

Command Output (stderr): -- + : 'RUN: at line 2' + /Users/buildslave/jenkins/workspace/lldb-cmake-standalone/lldb-xcode-build/Release/bin/lldb --no-lldbinit -S /Users/buildslave/jenkins/workspace/lldb-cmake-standalone/lldb-xcode-build/test/Shell/lit-lldb-init -s /Users/buildslave/jenkins/workspace/lldb-cmake-standalone/llvm-project/lldb/test/Shell/Commands/command-regex-delete.test + /Users/buildslave/jenkins/workspace/lldb-cmake-standalone/clang-build/bin/FileCheck /Users/buildslave/jenkins/workspace/lldb-cmake-standalone/llvm-project/lldb/test/Shell/Commands/command-regex-delete.test

Hide Details

--

Hide Details

******************** TIMEOUT: lldb-shell :: Commands/command-regex-unalias.test (2206 of 2216) ******************** TEST 'lldb-shell :: Commands/command-regex-unalias.test' FAILED ******************** Script: -- : 'RUN: at line 2'; /Users/buildslave/jenkins/workspace/lldb-cmake-standalone/lldb-xcode-build/Release/bin/lldb --no-lldbinit -S /Users/buildslave/jenkins/workspace/lldb-cmake-standalone/lldb-xcode-build/test/Shell/lit-lldb-init -s /Users/buildslave/jenkins/workspace/lldb-cmake-standalone/llvm-project/lldb/test/Shell/Commands/command-regex-unalias.test 2>&1 | /Users/buildslave/jenkins/workspace/lldb-cmake-standalone/clang-build/bin/FileCheck /Users/buildslave/jenkins/workspace/lldb-cmake-standalone/llvm-project/lldb/test/Shell/Commands/command-regex-unalias.test -- Exit Code: -9 Timeout: Reached timeout of 600 seconds

Hide Details

Command Output (stderr): -- + : 'RUN: at line 2' + /Users/buildslave/jenkins/workspace/lldb-cmake-standalone/lldb-xcode-build/Release/bin/lldb --no-lldbinit -S /Users/buildslave/jenkins/workspace/lldb-cmake-standalone/lldb-xcode-build/test/Shell/lit-lldb-init -s /Users/buildslave/jenkins/workspace/lldb-cmake-standalone/llvm-project/lldb/test/Shell/Commands/command-regex-unalias.test + /Users/buildslave/jenkins/workspace/lldb-cmake-standalone/clang-build/bin/FileCheck /Users/buildslave/jenkins/workspace/lldb-cmake-standalone/llvm-project/lldb/test/Shell/Commands/command-regex-unalias.test

Hide Details

--

Hide Details

******************** TIMEOUT: lldb-shell :: Driver/LocalLLDBInit.test (2207 of 2216) ******************** TEST 'lldb-shell :: Driver/LocalLLDBInit.test' FAILED ******************** Script: -- : 'RUN: at line 4'; mkdir -p /Users/buildslave/jenkins/workspace/lldb-cmake-standalone/lldb-xcode-build/test/Driver/Output/LocalLLDBInit.test.tmp.root : 'RUN: at line 5'; mkdir -p /Users/buildslave/jenkins/workspace/lldb-cmake-standalone/lldb-xcode-build/test/Driver/Output/LocalLLDBInit.test.tmp.home : 'RUN: at line 6'; cp /Users/buildslave/jenkins/workspace/lldb-cmake-standalone/llvm-project/lldb/test/Shell/Driver/Inputs/.lldbinit /Users/buildslave/jenkins/workspace/lldb-cmake-standalone/lldb-xcode-build/test/Driver/Output/LocalLLDBInit.test.tmp.root : 'RUN: at line 7'; cp /Users/buildslave/jenkins/workspace/lldb-cmake-standalone/llvm-project/lldb/test/Shell/Driver/Inputs/syntax_error.py /Users/buildslave/jenkins/workspace/lldb-cmake-standalone/lldb-xcode-build/test/Driver/Output/LocalLLDBInit.test.tmp.root : 'RUN: at line 8'; cd /Users/buildslave/jenkins/workspace/lldb-cmake-standalone/lldb-xcode-build/test/Driver/Output/LocalLLDBInit.test.tmp.root : 'RUN: at line 9'; env HOME=/Users/buildslave/jenkins/workspace/lldb-cmake-standalone/lldb-xcode-build/test/Driver/Output/LocalLLDBInit.test.tmp.home /Users/buildslave/jenkins/workspace/lldb-cmake-standalone/lldb-xcode-build/Release/bin/lldb -S /Users/buildslave/jenkins/workspace/lldb-cmake-standalone/lldb-xcode-build/test/Shell/lit-lldb-init -o 'settings show frame-format' 2>&1 | /Users/buildslave/jenkins/workspace/lldb-cmake-standalone/clang-build/bin/FileCheck /Users/buildslave/jenkins/workspace/lldb-cmake-standalone/llvm-project/lldb/test/Shell/Driver/LocalLLDBInit.test --check-prefix=WARNINIT --check-prefix=CHECK : 'RUN: at line 10'; env HOME=/Users/buildslave/jenkins/workspace/lldb-cmake-standalone/lldb-xcode-build/test/Driver/Output/LocalLLDBInit.test.tmp.home /Users/buildslave/jenkins/workspace/lldb-cmake-standalone/lldb-xcode-build/Release/bin/lldb -S /Users/buildslave/jenkins/workspace/lldb-cmake-standalone/lldb-xcode-build/test/Shell/lit-lldb-init -local-lldbinit -o 'settings show frame-format' 2>&1 | /Users/buildslave/jenkins/workspace/lldb-cmake-standalone/clang-build/bin/FileCheck /Users/buildslave/jenkins/workspace/lldb-cmake-standalone/llvm-project/lldb/test/Shell/Driver/LocalLLDBInit.test --check-prefix=ALLOWINIT --check-prefix=NOINIT : 'RUN: at line 11'; /Users/buildslave/jenkins/workspace/lldb-cmake-standalone/lldb-xcode-build/Release/bin/lldb --no-lldbinit -S /Users/buildslave/jenkins/workspace/lldb-cmake-standalone/lldb-xcode-build/test/Shell/lit-lldb-init -o 'settings show frame-format' 2>&1 | /Users/buildslave/jenkins/workspace/lldb-cmake-standalone/clang-build/bin/FileCheck /Users/buildslave/jenkins/workspace/lldb-cmake-standalone/llvm-project/lldb/test/Shell/Driver/LocalLLDBInit.test --check-prefix=NOINIT --check-prefix=CHECK -- Exit Code: -9 Timeout: Reached timeout of 600 seconds

Hide Details

Command Output (stderr): -- + : 'RUN: at line 4' + mkdir -p /Users/buildslave/jenkins/workspace/lldb-cmake-standalone/lldb-xcode-build/test/Driver/Output/LocalLLDBInit.test.tmp.root + : 'RUN: at line 5' + mkdir -p /Users/buildslave/jenkins/workspace/lldb-cmake-standalone/lldb-xcode-build/test/Driver/Output/LocalLLDBInit.test.tmp.home + : 'RUN: at line 6' + cp /Users/buildslave/jenkins/workspace/lldb-cmake-standalone/llvm-project/lldb/test/Shell/Driver/Inputs/.lldbinit /Users/buildslave/jenkins/workspace/lldb-cmake-standalone/lldb-xcode-build/test/Driver/Output/LocalLLDBInit.test.tmp.root + : 'RUN: at line 7' + cp /Users/buildslave/jenkins/workspace/lldb-cmake-standalone/llvm-project/lldb/test/Shell/Driver/Inputs/syntax_error.py /Users/buildslave/jenkins/workspace/lldb-cmake-standalone/lldb-xcode-build/test/Driver/Output/LocalLLDBInit.test.tmp.root + : 'RUN: at line 8' + cd /Users/buildslave/jenkins/workspace/lldb-cmake-standalone/lldb-xcode-build/test/Driver/Output/LocalLLDBInit.test.tmp.root + : 'RUN: at line 9' + env HOME=/Users/buildslave/jenkins/workspace/lldb-cmake-standalone/lldb-xcode-build/test/Driver/Output/LocalLLDBInit.test.tmp.home /Users/buildslave/jenkins/workspace/lldb-cmake-standalone/lldb-xcode-build/Release/bin/lldb -S /Users/buildslave/jenkins/workspace/lldb-cmake-standalone/lldb-xcode-build/test/Shell/lit-lldb-init -o 'settings show frame-format' + /Users/buildslave/jenkins/workspace/lldb-cmake-standalone/clang-build/bin/FileCheck /Users/buildslave/jenkins/workspace/lldb-cmake-standalone/llvm-project/lldb/test/Shell/Driver/LocalLLDBInit.test --check-prefix=WARNINIT --check-prefix=CHECK

Hide Details

--

Hide Details

******************** TIMEOUT: lldb-shell :: Driver/TestCommands.test (2208 of 2216) ******************** TEST 'lldb-shell :: Driver/TestCommands.test' FAILED ******************** Script: -- : 'RUN: at line 1'; /Users/buildslave/jenkins/workspace/lldb-cmake-standalone/lldb-xcode-build/Release/bin/lldb --no-lldbinit -S /Users/buildslave/jenkins/workspace/lldb-cmake-standalone/lldb-xcode-build/test/Shell/lit-lldb-init -x -b -S /Users/buildslave/jenkins/workspace/lldb-cmake-standalone/llvm-project/lldb/test/Shell/Driver/Inputs/Print0.in -O 'expr 1' -S /Users/buildslave/jenkins/workspace/lldb-cmake-standalone/llvm-project/lldb/test/Shell/Driver/Inputs/Print2.in -O 'expr 3' -s /Users/buildslave/jenkins/workspace/lldb-cmake-standalone/llvm-project/lldb/test/Shell/Driver/Inputs/Print4.in -o 'expr 5' -s /Users/buildslave/jenkins/workspace/lldb-cmake-standalone/llvm-project/lldb/test/Shell/Driver/Inputs/Print6.in -o 'expr 7' | /Users/buildslave/jenkins/workspace/lldb-cmake-standalone/clang-build/bin/FileCheck /Users/buildslave/jenkins/workspace/lldb-cmake-standalone/llvm-project/lldb/test/Shell/Driver/TestCommands.test : 'RUN: at line 12'; /Users/buildslave/jenkins/workspace/lldb-cmake-standalone/lldb-xcode-build/Release/bin/lldb --no-lldbinit -S /Users/buildslave/jenkins/workspace/lldb-cmake-standalone/lldb-xcode-build/test/Shell/lit-lldb-init -x -b -s /Users/buildslave/jenkins/workspace/lldb-cmake-standalone/llvm-project/lldb/test/Shell/Driver/Inputs/Print4.in -o 'expr 5' -s /Users/buildslave/jenkins/workspace/lldb-cmake-standalone/llvm-project/lldb/test/Shell/Driver/Inputs/Print6.in -o 'expr 7' -S /Users/buildslave/jenkins/workspace/lldb-cmake-standalone/llvm-project/lldb/test/Shell/Driver/Inputs/Print0.in -O 'expr 1' -S /Users/buildslave/jenkins/workspace/lldb-cmake-standalone/llvm-project/lldb/test/Shell/Driver/Inputs/Print2.in -O 'expr 3' | /Users/buildslave/jenkins/workspace/lldb-cmake-standalone/clang-build/bin/FileCheck /Users/buildslave/jenkins/workspace/lldb-cmake-standalone/llvm-project/lldb/test/Shell/Driver/TestCommands.test : 'RUN: at line 23'; /Users/buildslave/jenkins/workspace/lldb-cmake-standalone/lldb-xcode-build/Release/bin/lldb --no-lldbinit -S /Users/buildslave/jenkins/workspace/lldb-cmake-standalone/lldb-xcode-build/test/Shell/lit-lldb-init -x -b -s /Users/buildslave/jenkins/workspace/lldb-cmake-standalone/llvm-project/lldb/test/Shell/Driver/Inputs/Print4.in -S /Users/buildslave/jenkins/workspace/lldb-cmake-standalone/llvm-project/lldb/test/Shell/Driver/Inputs/Print0.in -o 'expr 5' -O 'expr 1' -s /Users/buildslave/jenkins/workspace/lldb-cmake-standalone/llvm-project/lldb/test/Shell/Driver/Inputs/Print6.in -S /Users/buildslave/jenkins/workspace/lldb-cmake-standalone/llvm-project/lldb/test/Shell/Driver/Inputs/Print2.in -o 'expr 7' -O 'expr 3' | /Users/buildslave/jenkins/workspace/lldb-cmake-standalone/clang-build/bin/FileCheck /Users/buildslave/jenkins/workspace/lldb-cmake-standalone/llvm-project/lldb/test/Shell/Driver/TestCommands.test -- Exit Code: -9 Timeout: Reached timeout of 600 seconds

Hide Details

Command Output (stderr): -- + : 'RUN: at line 1' + /Users/buildslave/jenkins/workspace/lldb-cmake-standalone/lldb-xcode-build/Release/bin/lldb --no-lldbinit -S /Users/buildslave/jenkins/workspace/lldb-cmake-standalone/lldb-xcode-build/test/Shell/lit-lldb-init -x -b -S /Users/buildslave/jenkins/workspace/lldb-cmake-standalone/llvm-project/lldb/test/Shell/Driver/Inputs/Print0.in -O 'expr 1' -S /Users/buildslave/jenkins/workspace/lldb-cmake-standalone/llvm-project/lldb/test/Shell/Driver/Inputs/Print2.in -O 'expr 3' -s /Users/buildslave/jenkins/workspace/lldb-cmake-standalone/llvm-project/lldb/test/Shell/Driver/Inputs/Print4.in -o 'expr 5' -s /Users/buildslave/jenkins/workspace/lldb-cmake-standalone/llvm-project/lldb/test/Shell/Driver/Inputs/Print6.in -o 'expr 7' + /Users/buildslave/jenkins/workspace/lldb-cmake-standalone/clang-build/bin/FileCheck /Users/buildslave/jenkins/workspace/lldb-cmake-standalone/llvm-project/lldb/test/Shell/Driver/TestCommands.test

Hide Details

--

Hide Details

******************** TIMEOUT: lldb-shell :: Driver/TestRepl.test (2209 of 2216) ******************** TEST 'lldb-shell :: Driver/TestRepl.test' FAILED ******************** Script: -- : 'RUN: at line 3'; echo ':quit' | /Users/buildslave/jenkins/workspace/lldb-cmake-standalone/lldb-xcode-build/Release/bin/lldb --no-lldbinit -S /Users/buildslave/jenkins/workspace/lldb-cmake-standalone/lldb-xcode-build/test/Shell/lit-lldb-init -x --repl -O 'expr 42' -S /Users/buildslave/jenkins/workspace/lldb-cmake-standalone/llvm-project/lldb/test/Shell/Driver/Inputs/Print2.in -o 'expr 999999' -s /Users/buildslave/jenkins/workspace/lldb-cmake-standalone/llvm-project/lldb/test/Shell/Driver/TestRepl.test 2>&1 | /Users/buildslave/jenkins/workspace/lldb-cmake-standalone/clang-build/bin/FileCheck /Users/buildslave/jenkins/workspace/lldb-cmake-standalone/llvm-project/lldb/test/Shell/Driver/TestRepl.test -- Exit Code: -9 Timeout: Reached timeout of 600 seconds

Hide Details

Command Output (stderr): -- + : 'RUN: at line 3' + echo :quit + /Users/buildslave/jenkins/workspace/lldb-cmake-standalone/lldb-xcode-build/Release/bin/lldb --no-lldbinit -S /Users/buildslave/jenkins/workspace/lldb-cmake-standalone/lldb-xcode-build/test/Shell/lit-lldb-init -x --repl -O 'expr 42' -S /Users/buildslave/jenkins/workspace/lldb-cmake-standalone/llvm-project/lldb/test/Shell/Driver/Inputs/Print2.in -o 'expr 999999' -s /Users/buildslave/jenkins/workspace/lldb-cmake-standalone/llvm-project/lldb/test/Shell/Driver/TestRepl.test + /Users/buildslave/jenkins/workspace/lldb-cmake-standalone/clang-build/bin/FileCheck /Users/buildslave/jenkins/workspace/lldb-cmake-standalone/llvm-project/lldb/test/Shell/Driver/TestRepl.test

Hide Details

--

Hide Details

******************** TIMEOUT: lldb-shell :: Minidump/Windows/Sigsegv/sigsegv.test (2210 of 2216) ******************** TEST 'lldb-shell :: Minidump/Windows/Sigsegv/sigsegv.test' FAILED ******************** Script: -- : 'RUN: at line 1'; cd /Users/buildslave/jenkins/workspace/lldb-cmake-standalone/llvm-project/lldb/test/Shell/Minidump/Windows/Sigsegv/Inputs : 'RUN: at line 2'; env LLDB_USE_NATIVE_PDB_READER=1 /Users/buildslave/jenkins/workspace/lldb-cmake-standalone/lldb-xcode-build/Release/bin/lldb --no-lldbinit -S /Users/buildslave/jenkins/workspace/lldb-cmake-standalone/lldb-xcode-build/test/Shell/lit-lldb-init -c sigsegv.dmp -s sigsegv.lldbinit | /Users/buildslave/jenkins/workspace/lldb-cmake-standalone/clang-build/bin/FileCheck /Users/buildslave/jenkins/workspace/lldb-cmake-standalone/llvm-project/lldb/test/Shell/Minidump/Windows/Sigsegv/sigsegv.test -- Exit Code: -9 Timeout: Reached timeout of 600 seconds

Hide Details

Command Output (stderr): -- + : 'RUN: at line 1' + cd /Users/buildslave/jenkins/workspace/lldb-cmake-standalone/llvm-project/lldb/test/Shell/Minidump/Windows/Sigsegv/Inputs + : 'RUN: at line 2' + env LLDB_USE_NATIVE_PDB_READER=1 /Users/buildslave/jenkins/workspace/lldb-cmake-standalone/lldb-xcode-build/Release/bin/lldb --no-lldbinit -S /Users/buildslave/jenkins/workspace/lldb-cmake-standalone/lldb-xcode-build/test/Shell/lit-lldb-init -c sigsegv.dmp -s sigsegv.lldbinit + /Users/buildslave/jenkins/workspace/lldb-cmake-standalone/clang-build/bin/FileCheck /Users/buildslave/jenkins/workspace/lldb-cmake-standalone/llvm-project/lldb/test/Shell/Minidump/Windows/Sigsegv/sigsegv.test

Hide Details

--

Hide Details

******************** TIMEOUT: lldb-shell :: Reproducer/TestCaptureEnvOverride.test (2211 of 2216) ******************** TEST 'lldb-shell :: Reproducer/TestCaptureEnvOverride.test' FAILED ******************** Script: -- : 'RUN: at line 3'; /Users/buildslave/jenkins/workspace/lldb-cmake-standalone/lldb-xcode-build/Release/bin/lldb --no-lldbinit -S /Users/buildslave/jenkins/workspace/lldb-cmake-standalone/lldb-xcode-build/test/Shell/lit-lldb-init -b -o 'reproducer status' --capture --capture-path /Users/buildslave/jenkins/workspace/lldb-cmake-standalone/lldb-xcode-build/test/Reproducer/Output/TestCaptureEnvOverride.test.tmp.repro /bin/ls | /Users/buildslave/jenkins/workspace/lldb-cmake-standalone/clang-build/bin/FileCheck /Users/buildslave/jenkins/workspace/lldb-cmake-standalone/llvm-project/lldb/test/Shell/Reproducer/TestCaptureEnvOverride.test --check-prefix CAPTURE : 'RUN: at line 4'; /Users/buildslave/jenkins/workspace/lldb-cmake-standalone/lldb-xcode-build/Release/bin/lldb --no-lldbinit -S /Users/buildslave/jenkins/workspace/lldb-cmake-standalone/lldb-xcode-build/test/Shell/lit-lldb-init -b -o 'reproducer status' --capture | /Users/buildslave/jenkins/workspace/lldb-cmake-standalone/clang-build/bin/FileCheck /Users/buildslave/jenkins/workspace/lldb-cmake-standalone/llvm-project/lldb/test/Shell/Reproducer/TestCaptureEnvOverride.test --check-prefix CAPTURE : 'RUN: at line 6'; LLDB_CAPTURE_REPRODUCER=1 /Users/buildslave/jenkins/workspace/lldb-cmake-standalone/lldb-xcode-build/Release/bin/lldb --no-lldbinit -S /Users/buildslave/jenkins/workspace/lldb-cmake-standalone/lldb-xcode-build/test/Shell/lit-lldb-init -b -o 'reproducer status' | /Users/buildslave/jenkins/workspace/lldb-cmake-standalone/clang-build/bin/FileCheck /Users/buildslave/jenkins/workspace/lldb-cmake-standalone/llvm-project/lldb/test/Shell/Reproducer/TestCaptureEnvOverride.test --check-prefix CAPTURE : 'RUN: at line 7'; LLDB_CAPTURE_REPRODUCER=ON /Users/buildslave/jenkins/workspace/lldb-cmake-standalone/lldb-xcode-build/Release/bin/lldb --no-lldbinit -S /Users/buildslave/jenkins/workspace/lldb-cmake-standalone/lldb-xcode-build/test/Shell/lit-lldb-init -b -o 'reproducer status' | /Users/buildslave/jenkins/workspace/lldb-cmake-standalone/clang-build/bin/FileCheck /Users/buildslave/jenkins/workspace/lldb-cmake-standalone/llvm-project/lldb/test/Shell/Reproducer/TestCaptureEnvOverride.test --check-prefix CAPTURE : 'RUN: at line 8'; LLDB_CAPTURE_REPRODUCER=on /Users/buildslave/jenkins/workspace/lldb-cmake-standalone/lldb-xcode-build/Release/bin/lldb --no-lldbinit -S /Users/buildslave/jenkins/workspace/lldb-cmake-standalone/lldb-xcode-build/test/Shell/lit-lldb-init -b -o 'reproducer status' | /Users/buildslave/jenkins/workspace/lldb-cmake-standalone/clang-build/bin/FileCheck /Users/buildslave/jenkins/workspace/lldb-cmake-standalone/llvm-project/lldb/test/Shell/Reproducer/TestCaptureEnvOverride.test --check-prefix CAPTURE : 'RUN: at line 10'; LLDB_CAPTURE_REPRODUCER=0 /Users/buildslave/jenkins/workspace/lldb-cmake-standalone/lldb-xcode-build/Release/bin/lldb --no-lldbinit -S /Users/buildslave/jenkins/workspace/lldb-cmake-standalone/lldb-xcode-build/test/Shell/lit-lldb-init -b -o 'reproducer status' --capture --capture-path /Users/buildslave/jenkins/workspace/lldb-cmake-standalone/lldb-xcode-build/test/Reproducer/Output/TestCaptureEnvOverride.test.tmp.repro | /Users/buildslave/jenkins/workspace/lldb-cmake-standalone/clang-build/bin/FileCheck /Users/buildslave/jenkins/workspace/lldb-cmake-standalone/llvm-project/lldb/test/Shell/Reproducer/TestCaptureEnvOverride.test --check-prefix OFF : 'RUN: at line 11'; LLDB_CAPTURE_REPRODUCER=0 /Users/buildslave/jenkins/workspace/lldb-cmake-standalone/lldb-xcode-build/Release/bin/lldb --no-lldbinit -S /Users/buildslave/jenkins/workspace/lldb-cmake-standalone/lldb-xcode-build/test/Shell/lit-lldb-init -b -o 'reproducer status' --capture | /Users/buildslave/jenkins/workspace/lldb-cmake-standalone/clang-build/bin/FileCheck /Users/buildslave/jenkins/workspace/lldb-cmake-standalone/llvm-project/lldb/test/Shell/Reproducer/TestCaptureEnvOverride.test --check-prefix OFF : 'RUN: at line 13'; LLDB_CAPTURE_REPRODUCER=bogus /Users/buildslave/jenkins/workspace/lldb-cmake-standalone/lldb-xcode-build/Release/bin/lldb --no-lldbinit -S /Users/buildslave/jenkins/workspace/lldb-cmake-standalone/lldb-xcode-build/test/Shell/lit-lldb-init -b -o 'reproducer status' --capture | /Users/buildslave/jenkins/workspace/lldb-cmake-standalone/clang-build/bin/FileCheck /Users/buildslave/jenkins/workspace/lldb-cmake-standalone/llvm-project/lldb/test/Shell/Reproducer/TestCaptureEnvOverride.test --check-prefix CAPTURE : 'RUN: at line 14'; LLDB_CAPTURE_REPRODUCER=bogus /Users/buildslave/jenkins/workspace/lldb-cmake-standalone/lldb-xcode-build/Release/bin/lldb --no-lldbinit -S /Users/buildslave/jenkins/workspace/lldb-cmake-standalone/lldb-xcode-build/test/Shell/lit-lldb-init -b -o 'reproducer status' | /Users/buildslave/jenkins/workspace/lldb-cmake-standalone/clang-build/bin/FileCheck /Users/buildslave/jenkins/workspace/lldb-cmake-standalone/llvm-project/lldb/test/Shell/Reproducer/TestCaptureEnvOverride.test --check-prefix OFF -- Exit Code: -9 Timeout: Reached timeout of 600 seconds

Hide Details

Command Output (stderr): -- + : 'RUN: at line 3' + /Users/buildslave/jenkins/workspace/lldb-cmake-standalone/lldb-xcode-build/Release/bin/lldb --no-lldbinit -S /Users/buildslave/jenkins/workspace/lldb-cmake-standalone/lldb-xcode-build/test/Shell/lit-lldb-init -b -o 'reproducer status' --capture --capture-path /Users/buildslave/jenkins/workspace/lldb-cmake-standalone/lldb-xcode-build/test/Reproducer/Output/TestCaptureEnvOverride.test.tmp.repro /bin/ls + /Users/buildslave/jenkins/workspace/lldb-cmake-standalone/clang-build/bin/FileCheck /Users/buildslave/jenkins/workspace/lldb-cmake-standalone/llvm-project/lldb/test/Shell/Reproducer/TestCaptureEnvOverride.test --check-prefix CAPTURE

Hide Details

--

Hide Details

******************** TIMEOUT: lldb-shell :: Reproducer/TestHomeDir.test (2212 of 2216) ******************** TEST 'lldb-shell :: Reproducer/TestHomeDir.test' FAILED ******************** Script: -- : 'RUN: at line 1'; echo "CHECK: /Users/buildslave/jenkins/workspace/lldb-cmake-standalone/lldb-xcode-build/test/Reproducer/Output/TestHomeDir.test.tmp.home" > /Users/buildslave/jenkins/workspace/lldb-cmake-standalone/lldb-xcode-build/test/Reproducer/Output/TestHomeDir.test.tmp.check : 'RUN: at line 3'; rm -rf /Users/buildslave/jenkins/workspace/lldb-cmake-standalone/lldb-xcode-build/test/Reproducer/Output/TestHomeDir.test.tmp.repro : 'RUN: at line 4'; rm -rf /Users/buildslave/jenkins/workspace/lldb-cmake-standalone/lldb-xcode-build/test/Reproducer/Output/TestHomeDir.test.tmp.home : 'RUN: at line 5'; mkdir -p /Users/buildslave/jenkins/workspace/lldb-cmake-standalone/lldb-xcode-build/test/Reproducer/Output/TestHomeDir.test.tmp.repro : 'RUN: at line 6'; mkdir -p /Users/buildslave/jenkins/workspace/lldb-cmake-standalone/lldb-xcode-build/test/Reproducer/Output/TestHomeDir.test.tmp.home : 'RUN: at line 7'; echo "print 95000 + 126" > /Users/buildslave/jenkins/workspace/lldb-cmake-standalone/lldb-xcode-build/test/Reproducer/Output/TestHomeDir.test.tmp.home/.lldbinit : 'RUN: at line 8'; env HOME=/Users/buildslave/jenkins/workspace/lldb-cmake-standalone/lldb-xcode-build/test/Reproducer/Output/TestHomeDir.test.tmp.home /Users/buildslave/jenkins/workspace/lldb-cmake-standalone/lldb-xcode-build/Release/bin/lldb -S /Users/buildslave/jenkins/workspace/lldb-cmake-standalone/lldb-xcode-build/test/Shell/lit-lldb-init -b -s /Users/buildslave/jenkins/workspace/lldb-cmake-standalone/llvm-project/lldb/test/Shell/Reproducer/Inputs/HomeDir.in --capture --capture-path /Users/buildslave/jenkins/workspace/lldb-cmake-standalone/lldb-xcode-build/test/Reproducer/Output/TestHomeDir.test.tmp.repro | /Users/buildslave/jenkins/workspace/lldb-cmake-standalone/clang-build/bin/FileCheck /Users/buildslave/jenkins/workspace/lldb-cmake-standalone/llvm-project/lldb/test/Shell/Reproducer/TestHomeDir.test : 'RUN: at line 10'; cat /Users/buildslave/jenkins/workspace/lldb-cmake-standalone/lldb-xcode-build/test/Reproducer/Output/TestHomeDir.test.tmp.repro/home.txt | /Users/buildslave/jenkins/workspace/lldb-cmake-standalone/clang-build/bin/FileCheck /Users/buildslave/jenkins/workspace/lldb-cmake-standalone/lldb-xcode-build/test/Reproducer/Output/TestHomeDir.test.tmp.check : 'RUN: at line 11'; /Users/buildslave/jenkins/workspace/lldb-cmake-standalone/lldb-xcode-build/Release/bin/lldb --no-lldbinit -S /Users/buildslave/jenkins/workspace/lldb-cmake-standalone/lldb-xcode-build/test/Shell/lit-lldb-init -b -o 'reproducer dump -p home -f /Users/buildslave/jenkins/workspace/lldb-cmake-standalone/lldb-xcode-build/test/Reproducer/Output/TestHomeDir.test.tmp.repro' | /Users/buildslave/jenkins/workspace/lldb-cmake-standalone/clang-build/bin/FileCheck /Users/buildslave/jenkins/workspace/lldb-cmake-standalone/lldb-xcode-build/test/Reproducer/Output/TestHomeDir.test.tmp.check : 'RUN: at line 13'; /Users/buildslave/jenkins/workspace/lldb-cmake-standalone/lldb-xcode-build/Release/bin/lldb --no-lldbinit -S /Users/buildslave/jenkins/workspace/lldb-cmake-standalone/lldb-xcode-build/test/Shell/lit-lldb-init --replay /Users/buildslave/jenkins/workspace/lldb-cmake-standalone/lldb-xcode-build/test/Reproducer/Output/TestHomeDir.test.tmp.repro | /Users/buildslave/jenkins/workspace/lldb-cmake-standalone/clang-build/bin/FileCheck /Users/buildslave/jenkins/workspace/lldb-cmake-standalone/llvm-project/lldb/test/Shell/Reproducer/TestHomeDir.test -- Exit Code: -9 Timeout: Reached timeout of 600 seconds

Hide Details

Command Output (stderr): -- + : 'RUN: at line 1' + echo 'CHECK: /Users/buildslave/jenkins/workspace/lldb-cmake-standalone/lldb-xcode-build/test/Reproducer/Output/TestHomeDir.test.tmp.home' + : 'RUN: at line 3' + rm -rf /Users/buildslave/jenkins/workspace/lldb-cmake-standalone/lldb-xcode-build/test/Reproducer/Output/TestHomeDir.test.tmp.repro + : 'RUN: at line 4' + rm -rf /Users/buildslave/jenkins/workspace/lldb-cmake-standalone/lldb-xcode-build/test/Reproducer/Output/TestHomeDir.test.tmp.home + : 'RUN: at line 5' + mkdir -p /Users/buildslave/jenkins/workspace/lldb-cmake-standalone/lldb-xcode-build/test/Reproducer/Output/TestHomeDir.test.tmp.repro + : 'RUN: at line 6' + mkdir -p /Users/buildslave/jenkins/workspace/lldb-cmake-standalone/lldb-xcode-build/test/Reproducer/Output/TestHomeDir.test.tmp.home + : 'RUN: at line 7' + echo 'print 95000 + 126' + : 'RUN: at line 8' + env HOME=/Users/buildslave/jenkins/workspace/lldb-cmake-standalone/lldb-xcode-build/test/Reproducer/Output/TestHomeDir.test.tmp.home /Users/buildslave/jenkins/workspace/lldb-cmake-standalone/lldb-xcode-build/Release/bin/lldb -S /Users/buildslave/jenkins/workspace/lldb-cmake-standalone/lldb-xcode-build/test/Shell/lit-lldb-init -b -s /Users/buildslave/jenkins/workspace/lldb-cmake-standalone/llvm-project/lldb/test/Shell/Reproducer/Inputs/HomeDir.in --capture --capture-path /Users/buildslave/jenkins/workspace/lldb-cmake-standalone/lldb-xcode-build/test/Reproducer/Output/TestHomeDir.test.tmp.repro + /Users/buildslave/jenkins/workspace/lldb-cmake-standalone/clang-build/bin/FileCheck /Users/buildslave/jenkins/workspace/lldb-cmake-standalone/llvm-project/lldb/test/Shell/Reproducer/TestHomeDir.test

Hide Details

--

Hide Details

******************** TIMEOUT: lldb-shell :: Reproducer/TestPythonImport.test (2213 of 2216) ******************** TEST 'lldb-shell :: Reproducer/TestPythonImport.test' FAILED ******************** Script: -- : 'RUN: at line 5'; rm -rf /Users/buildslave/jenkins/workspace/lldb-cmake-standalone/lldb-xcode-build/test/Reproducer/Output/TestPythonImport.test.tmp.repro : 'RUN: at line 6'; /Users/buildslave/jenkins/workspace/lldb-cmake-standalone/lldb-xcode-build/Release/bin/lldb --no-lldbinit -S /Users/buildslave/jenkins/workspace/lldb-cmake-standalone/lldb-xcode-build/test/Shell/lit-lldb-init -x -b --capture --capture-path /Users/buildslave/jenkins/workspace/lldb-cmake-standalone/lldb-xcode-build/test/Reproducer/Output/TestPythonImport.test.tmp.repro -o 'command script import /Users/buildslave/jenkins/workspace/lldb-cmake-standalone/llvm-project/lldb/test/Shell/Reproducer/Inputs/foo.py' -o 'reproducer generate' | /Users/buildslave/jenkins/workspace/lldb-cmake-standalone/clang-build/bin/FileCheck /Users/buildslave/jenkins/workspace/lldb-cmake-standalone/llvm-project/lldb/test/Shell/Reproducer/TestPythonImport.test --check-prefix CAPTURE : 'RUN: at line 10'; /Users/buildslave/jenkins/workspace/lldb-cmake-standalone/lldb-xcode-build/Release/bin/lldb --no-lldbinit -S /Users/buildslave/jenkins/workspace/lldb-cmake-standalone/lldb-xcode-build/test/Shell/lit-lldb-init -b -o 'reproducer dump -p files -f /Users/buildslave/jenkins/workspace/lldb-cmake-standalone/lldb-xcode-build/test/Reproducer/Output/TestPythonImport.test.tmp.repro' | /Users/buildslave/jenkins/workspace/lldb-cmake-standalone/clang-build/bin/FileCheck /Users/buildslave/jenkins/workspace/lldb-cmake-standalone/llvm-project/lldb/test/Shell/Reproducer/TestPythonImport.test --check-prefix FILES -- Exit Code: -9 Timeout: Reached timeout of 600 seconds

Hide Details

Command Output (stderr): -- + : 'RUN: at line 5' + rm -rf /Users/buildslave/jenkins/workspace/lldb-cmake-standalone/lldb-xcode-build/test/Reproducer/Output/TestPythonImport.test.tmp.repro + : 'RUN: at line 6' + /Users/buildslave/jenkins/workspace/lldb-cmake-standalone/lldb-xcode-build/Release/bin/lldb --no-lldbinit -S /Users/buildslave/jenkins/workspace/lldb-cmake-standalone/lldb-xcode-build/test/Shell/lit-lldb-init -x -b --capture --capture-path /Users/buildslave/jenkins/workspace/lldb-cmake-standalone/lldb-xcode-build/test/Reproducer/Output/TestPythonImport.test.tmp.repro -o 'command script import /Users/buildslave/jenkins/workspace/lldb-cmake-standalone/llvm-project/lldb/test/Shell/Reproducer/Inputs/foo.py' -o 'reproducer generate' + /Users/buildslave/jenkins/workspace/lldb-cmake-standalone/clang-build/bin/FileCheck /Users/buildslave/jenkins/workspace/lldb-cmake-standalone/llvm-project/lldb/test/Shell/Reproducer/TestPythonImport.test --check-prefix CAPTURE

Hide Details

--

Hide Details

******************** TIMEOUT: lldb-shell :: Reproducer/TestSynchronous.test (2214 of 2216) ******************** TEST 'lldb-shell :: Reproducer/TestSynchronous.test' FAILED ******************** Script: -- : 'RUN: at line 4'; rm -rf /Users/buildslave/jenkins/workspace/lldb-cmake-standalone/lldb-xcode-build/test/Reproducer/Output/TestSynchronous.test.tmp.repro : 'RUN: at line 5'; /Users/buildslave/jenkins/workspace/lldb-cmake-standalone/lldb-xcode-build/Release/bin/lldb --no-lldbinit -S /Users/buildslave/jenkins/workspace/lldb-cmake-standalone/lldb-xcode-build/test/Shell/lit-lldb-init -x -b --capture --capture-path /Users/buildslave/jenkins/workspace/lldb-cmake-standalone/lldb-xcode-build/test/Reproducer/Output/TestSynchronous.test.tmp.repro -o 'script lldb.debugger.SetAsync(True)' -o 'script lldb.debugger.GetAsync()' -o 'reproducer generate' | /Users/buildslave/jenkins/workspace/lldb-cmake-standalone/clang-build/bin/FileCheck /Users/buildslave/jenkins/workspace/lldb-cmake-standalone/llvm-project/lldb/test/Shell/Reproducer/TestSynchronous.test --check-prefix CAPTURE : 'RUN: at line 6'; /Users/buildslave/jenkins/workspace/lldb-cmake-standalone/lldb-xcode-build/Release/bin/lldb --no-lldbinit -S /Users/buildslave/jenkins/workspace/lldb-cmake-standalone/lldb-xcode-build/test/Shell/lit-lldb-init --replay /Users/buildslave/jenkins/workspace/lldb-cmake-standalone/lldb-xcode-build/test/Reproducer/Output/TestSynchronous.test.tmp.repro | /Users/buildslave/jenkins/workspace/lldb-cmake-standalone/clang-build/bin/FileCheck /Users/buildslave/jenkins/workspace/lldb-cmake-standalone/llvm-project/lldb/test/Shell/Reproducer/TestSynchronous.test --check-prefix REPLAY -- Exit Code: -9 Timeout: Reached timeout of 600 seconds

Hide Details

Command Output (stderr): -- + : 'RUN: at line 4' + rm -rf /Users/buildslave/jenkins/workspace/lldb-cmake-standalone/lldb-xcode-build/test/Reproducer/Output/TestSynchronous.test.tmp.repro + : 'RUN: at line 5' + /Users/buildslave/jenkins/workspace/lldb-cmake-standalone/lldb-xcode-build/Release/bin/lldb --no-lldbinit -S /Users/buildslave/jenkins/workspace/lldb-cmake-standalone/lldb-xcode-build/test/Shell/lit-lldb-init -x -b --capture --capture-path /Users/buildslave/jenkins/workspace/lldb-cmake-standalone/lldb-xcode-build/test/Reproducer/Output/TestSynchronous.test.tmp.repro -o 'script lldb.debugger.SetAsync(True)' -o 'script lldb.debugger.GetAsync()' -o 'reproducer generate' + /Users/buildslave/jenkins/workspace/lldb-cmake-standalone/clang-build/bin/FileCheck /Users/buildslave/jenkins/workspace/lldb-cmake-standalone/llvm-project/lldb/test/Shell/Reproducer/TestSynchronous.test --check-prefix CAPTURE

Hide Details

--

Hide Details

******************** TIMEOUT: lldb-shell :: ScriptInterpreter/None/import_module.test (2215 of 2216) ******************** TEST 'lldb-shell :: ScriptInterpreter/None/import_module.test' FAILED ******************** Script: -- : 'RUN: at line 1'; /Users/buildslave/jenkins/workspace/lldb-cmake-standalone/lldb-xcode-build/Release/bin/lldb --no-lldbinit -S /Users/buildslave/jenkins/workspace/lldb-cmake-standalone/lldb-xcode-build/test/Shell/lit-lldb-init --script-language none -o 'command script import /Users/buildslave/jenkins/workspace/lldb-cmake-standalone/lldb-xcode-build/test/ScriptInterpreter/None/Output/import_module.test.tmp' 2>&1 | /Users/buildslave/jenkins/workspace/lldb-cmake-standalone/clang-build/bin/FileCheck /Users/buildslave/jenkins/workspace/lldb-cmake-standalone/llvm-project/lldb/test/Shell/ScriptInterpreter/None/import_module.test -- Exit Code: -9 Timeout: Reached timeout of 600 seconds

Hide Details

Command Output (stderr): -- + : 'RUN: at line 1' + /Users/buildslave/jenkins/workspace/lldb-cmake-standalone/lldb-xcode-build/Release/bin/lldb --no-lldbinit -S /Users/buildslave/jenkins/workspace/lldb-cmake-standalone/lldb-xcode-build/test/Shell/lit-lldb-init --script-language none -o 'command script import /Users/buildslave/jenkins/workspace/lldb-cmake-standalone/lldb-xcode-build/test/ScriptInterpreter/None/Output/import_module.test.tmp' + /Users/buildslave/jenkins/workspace/lldb-cmake-standalone/clang-build/bin/FileCheck /Users/buildslave/jenkins/workspace/lldb-cmake-standalone/llvm-project/lldb/test/Shell/ScriptInterpreter/None/import_module.test

Hide Details

--

Hide Details

******************** TIMEOUT: lldb-shell :: ScriptInterpreter/None/none.test (2216 of 2216) ******************** TEST 'lldb-shell :: ScriptInterpreter/None/none.test' FAILED ******************** Script: -- : 'RUN: at line 1'; /Users/buildslave/jenkins/workspace/lldb-cmake-standalone/lldb-xcode-build/Release/bin/lldb --no-lldbinit -S /Users/buildslave/jenkins/workspace/lldb-cmake-standalone/lldb-xcode-build/test/Shell/lit-lldb-init --script-language none -o 'script' 2>&1 | /Users/buildslave/jenkins/workspace/lldb-cmake-standalone/clang-build/bin/FileCheck /Users/buildslave/jenkins/workspace/lldb-cmake-standalone/llvm-project/lldb/test/Shell/ScriptInterpreter/None/none.test -- Exit Code: -9 Timeout: Reached timeout of 600 seconds

Hide Details

Command Output (stderr): -- + : 'RUN: at line 1' + /Users/buildslave/jenkins/workspace/lldb-cmake-standalone/lldb-xcode-build/Release/bin/lldb --no-lldbinit -S /Users/buildslave/jenkins/workspace/lldb-cmake-standalone/lldb-xcode-build/test/Shell/lit-lldb-init --script-language none -o script + /Users/buildslave/jenkins/workspace/lldb-cmake-standalone/clang-build/bin/FileCheck /Users/buildslave/jenkins/workspace/lldb-cmake-standalone/llvm-project/lldb/test/Shell/ScriptInterpreter/None/none.test

Hide Details

--

Hide Details

******************** ******************** Timed Out Tests (13): lldb-shell :: Commands/command-backtrace.test lldb-shell :: Commands/command-regex-delete.test lldb-shell :: Commands/command-regex-unalias.test lldb-shell :: Driver/LocalLLDBInit.test lldb-shell :: Driver/TestCommands.test lldb-shell :: Driver/TestRepl.test lldb-shell :: Minidump/Windows/Sigsegv/sigsegv.test lldb-shell :: Reproducer/TestCaptureEnvOverride.test lldb-shell :: Reproducer/TestHomeDir.test lldb-shell :: Reproducer/TestPythonImport.test lldb-shell :: Reproducer/TestSynchronous.test lldb-shell :: ScriptInterpreter/None/import_module.test lldb-shell :: ScriptInterpreter/None/none.test

Hide Details

******************** Failed Tests (367): lldb-api :: lang/cpp/namespace/TestNamespaceLookup.py lldb-api :: lang/cpp/virtual-functions/TestCppVirtualFunctions.py lldb-api :: lang/objc/bitfield_ivars/TestBitfieldIvars.py lldb-api :: lang/objc/blocks/TestObjCIvarsInBlocks.py lldb-api :: lang/objc/conflicting-definition/TestConflictingDefinition.py lldb-api :: lang/objc/exceptions/TestObjCExceptions.py lldb-api :: lang/objc/forward-decl/TestForwardDecl.py lldb-api :: lang/objc/foundation/TestConstStrings.py lldb-api :: lang/objc/foundation/TestObjCMethods.py lldb-api :: lang/objc/foundation/TestObjCMethods2.py lldb-api :: lang/objc/foundation/TestObjCMethodsNSArray.py lldb-api :: lang/objc/foundation/TestObjCMethodsNSError.py lldb-api :: lang/objc/foundation/TestObjCMethodsString.py lldb-api :: lang/objc/foundation/TestObjectDescriptionAPI.py lldb-api :: lang/objc/foundation/TestRuntimeTypes.py lldb-api :: lang/objc/foundation/TestSymbolTable.py lldb-api :: lang/objc/global_ptrs/TestGlobalObjects.py lldb-api :: lang/objc/hidden-ivars/TestHiddenIvars.py lldb-api :: lang/objc/ivar-IMP/TestObjCiVarIMP.py lldb-api :: lang/objc/modules-app-update/TestClangModulesAppUpdate.py lldb-api :: lang/objc/modules-auto-import/TestModulesAutoImport.py lldb-api :: lang/objc/modules-cache/TestClangModulesCache.py lldb-api :: lang/objc/modules-compile-error/TestModulesCompileError.py lldb-api :: lang/objc/modules-hash-mismatch/TestClangModulesHashMismatch.py lldb-api :: lang/objc/modules-incomplete/TestIncompleteModules.py lldb-api :: lang/objc/modules-inline-functions/TestModulesInlineFunctions.py lldb-api :: lang/objc/modules-non-objc-target/TestObjCModulesNonObjCTarget.py lldb-api :: lang/objc/modules-update/TestClangModulesUpdate.py lldb-api :: lang/objc/modules/TestObjCModules.py lldb-api :: lang/objc/objc++/TestObjCXX.py lldb-api :: lang/objc/objc-baseclass-sbtype/TestObjCBaseClassSBType.py lldb-api :: lang/objc/objc-checker/TestObjCCheckers.py lldb-api :: lang/objc/objc-class-method/TestObjCClassMethod.py lldb-api :: lang/objc/objc-dyn-sbtype/TestObjCDynamicSBType.py lldb-api :: lang/objc/objc-dynamic-value/TestObjCDynamicValue.py lldb-api :: lang/objc/objc-foundation-dictionary-empty/TestNSDictionary0.py lldb-api :: lang/objc/objc-ivar-offsets/TestObjCIvarOffsets.py lldb-api :: lang/objc/objc-ivar-protocols/TestIvarProtocols.py lldb-api :: lang/objc/objc-ivar-stripped/TestObjCIvarStripped.py lldb-api :: lang/objc/objc-new-syntax/TestObjCNewSyntaxArray.py lldb-api :: lang/objc/objc-new-syntax/TestObjCNewSyntaxDictionary.py lldb-api :: lang/objc/objc-new-syntax/TestObjCNewSyntaxLiteral.py lldb-api :: lang/objc/objc-optimized/TestObjcOptimized.py lldb-api :: lang/objc/objc-property/TestObjCProperty.py lldb-api :: lang/objc/objc-runtime-ivars/TestRuntimeIvars.py lldb-api :: lang/objc/objc-static-method-stripped/TestObjCStaticMethodStripped.py lldb-api :: lang/objc/objc-static-method/TestObjCStaticMethod.py lldb-api :: lang/objc/objc-stepping/TestObjCStepping.py lldb-api :: lang/objc/objc-struct-argument/TestObjCStructArgument.py lldb-api :: lang/objc/objc-struct-return/TestObjCStructReturn.py lldb-api :: lang/objc/objc-super/TestObjCSuper.py lldb-api :: lang/objc/objc_direct-methods/TestObjCDirectMethods.py lldb-api :: lang/objc/orderedset/TestOrderedSet.py lldb-api :: lang/objc/print-obj/TestPrintObj.py lldb-api :: lang/objc/ptr_refs/TestPtrRefsObjC.py lldb-api :: lang/objc/radar-9691614/TestObjCMethodReturningBOOL.py lldb-api :: lang/objc/rdar-10967107/TestRdar10967107.py lldb-api :: lang/objc/rdar-11355592/TestRdar11355592.py lldb-api :: lang/objc/rdar-12408181/TestRdar12408181.py lldb-api :: lang/objc/real-definition/TestRealDefinition.py lldb-api :: lang/objc/self/TestObjCSelf.py lldb-api :: lang/objc/single-entry-dictionary/TestObjCSingleEntryDictionary.py lldb-api :: lang/objc/unicode-string/TestUnicodeString.py lldb-api :: lang/objc/variadic_methods/TestVariadicMethods.py lldb-api :: lang/objcxx/class-name-clash/TestNameClash.py lldb-api :: lang/objcxx/cpp_keywords_enabled/TestObjCppKeywordsEnabled.py lldb-api :: lang/objcxx/cxx-bridged-po/TestObjCXXBridgedPO.py lldb-api :: lang/objcxx/hide-runtime-values/TestObjCXXHideRuntimeValues.py lldb-api :: lang/objcxx/objc-builtin-types/TestObjCBuiltinTypes.py lldb-api :: lang/objcxx/objcxx-ivar-vector/TestIvarVector.py lldb-api :: linux/aarch64/mte_memory_region/TestAArch64LinuxMTEMemoryRegion.py lldb-api :: linux/add-symbols/TestTargetSymbolsAddCommand.py lldb-api :: linux/builtin_trap/TestBuiltinTrap.py lldb-api :: linux/mix-dwo-and-regular-objects/TestMixedDwarfBinary.py lldb-api :: linux/sepdebugsymlink/TestTargetSymbolsSepDebugSymlink.py lldb-api :: linux/thread/create_during_instruction_step/TestCreateDuringInstructionStep.py lldb-api :: macosx/DBGSourcePathRemapping/TestDSYMSourcePathRemapping.py lldb-api :: macosx/add-dsym/TestAddDsymMidExecutionCommand.py lldb-api :: macosx/builtin-debugtrap/TestBuiltinDebugTrap.py lldb-api :: macosx/debugserver-exit-code/TestDebugServerExitCode.py lldb-api :: macosx/duplicate-archive-members/TestDuplicateMembers.py lldb-api :: macosx/dyld-trie-symbols/TestDyldTrieSymbols.py lldb-api :: macosx/find-app-in-bundle/TestFindAppInBundle.py lldb-api :: macosx/find-dsym/bundle-with-dot-in-filename/TestBundleWithDotInFilename.py lldb-api :: macosx/find-dsym/deep-bundle/TestDeepBundle.py lldb-api :: macosx/function-starts/TestFunctionStarts.py lldb-api :: macosx/indirect_symbol/TestIndirectSymbols.py lldb-api :: macosx/lc-note/firmware-corefile/TestFirmwareCorefiles.py lldb-api :: macosx/lc-note/kern-ver-str/TestKernVerStrLCNOTE.py lldb-api :: macosx/load-kext/TestLoadKext.py lldb-api :: macosx/macCatalyst/TestMacCatalyst.py lldb-api :: macosx/macCatalystAppMacOSFramework/TestMacCatalystAppWithMacOSFramework.py lldb-api :: macosx/nslog/TestDarwinNSLogOutput.py lldb-api :: macosx/order/TestOrderFile.py lldb-api :: macosx/profile_vrs_detach/TestDetachVrsProfile.py lldb-api :: macosx/queues/TestQueues.py lldb-api :: macosx/safe-to-func-call/TestSafeFuncCalls.py lldb-api :: macosx/save_crashlog/TestSaveCrashlog.py lldb-api :: macosx/simulator/TestSimulatorPlatform.py lldb-api :: macosx/thread-names/TestInterruptThreadNames.py lldb-api :: macosx/thread_suspend/TestInternalThreadSuspension.py lldb-api :: macosx/universal/TestUniversal.py lldb-api :: macosx/version_zero/TestGetVersionZeroVersion.py lldb-api :: python_api/breakpoint/TestBreakpointAPI.py lldb-api :: python_api/class_members/TestSBTypeClassMembers.py lldb-api :: python_api/debugger/TestDebuggerAPI.py lldb-api :: python_api/default-constructor/TestDefaultConstructorForAPIObjects.py lldb-api :: python_api/disassemble-raw-data/TestDisassembleRawData.py lldb-api :: python_api/disassemble-raw-data/TestDisassemble_VST1_64.py lldb-api :: python_api/event/TestEvents.py lldb-api :: python_api/exprpath_synthetic/TestExprPathSynthetic.py lldb-api :: python_api/file_handle/TestFileHandle.py lldb-api :: python_api/findvalue_duplist/TestSBFrameFindValue.py lldb-api :: python_api/formatters/TestFormattersSBAPI.py lldb-api :: python_api/frame/TestFrames.py lldb-api :: python_api/frame/get-variables/TestGetVariables.py lldb-api :: python_api/frame/inlines/TestInlinedFrame.py lldb-api :: python_api/function_symbol/TestDisasmAPI.py lldb-api :: python_api/function_symbol/TestSymbolAPI.py lldb-api :: python_api/get-value-32bit-int/TestGetValue32BitInt.py lldb-api :: python_api/hello_world/TestHelloWorld.py lldb-api :: python_api/interpreter/TestCommandInterpreterAPI.py lldb-api :: python_api/interpreter/TestRunCommandInterpreterAPI.py lldb-api :: python_api/lldbutil/TestSwigVersion.py lldb-api :: python_api/lldbutil/frame/TestFrameUtils.py lldb-api :: python_api/lldbutil/iter/TestLLDBIterator.py lldb-api :: python_api/lldbutil/iter/TestRegistersIterator.py lldb-api :: python_api/lldbutil/process/TestPrintStackTraces.py lldb-api :: python_api/module_section/TestModuleAndSection.py lldb-api :: python_api/name_lookup/TestNameLookup.py lldb-api :: python_api/objc_type/TestObjCType.py lldb-api :: python_api/process/TestProcessAPI.py lldb-api :: python_api/process/io/TestProcessIO.py lldb-api :: python_api/process/read-mem-cstring/TestReadMemCString.py lldb-api :: python_api/sbdata/TestSBData.py lldb-api :: python_api/sbenvironment/TestSBEnvironment.py lldb-api :: python_api/sberror/TestSBError.py lldb-api :: python_api/sblaunchinfo/TestSBLaunchInfo.py lldb-api :: python_api/sbplatform/TestSBPlatform.py lldb-api :: python_api/sbstructureddata/TestStructuredDataAPI.py lldb-api :: python_api/sbtype_typeclass/TestSBTypeTypeClass.py lldb-api :: python_api/sbvalue_const_addrof/TestSBValueConstAddrOf.py lldb-api :: python_api/sbvalue_persist/TestSBValuePersist.py lldb-api :: python_api/section/TestSectionAPI.py lldb-api :: python_api/signals/TestSignalsAPI.py lldb-api :: python_api/symbol-context/TestSymbolContext.py lldb-api :: python_api/symbol-context/two-files/TestSymbolContextTwoFiles.py lldb-api :: python_api/target/TestTargetAPI.py lldb-api :: python_api/thread/TestThreadAPI.py lldb-api :: python_api/type/TestTypeList.py lldb-api :: python_api/value/TestValueAPI.py lldb-api :: python_api/value/change_values/TestChangeValueAPI.py lldb-api :: python_api/value/empty_class/TestValueAPIEmptyClass.py lldb-api :: python_api/value/linked_list/TestValueAPILinkedList.py lldb-api :: python_api/value_var_update/TestValueVarUpdate.py lldb-api :: python_api/watchpoint/TestSetWatchpoint.py lldb-api :: python_api/watchpoint/TestWatchpointIgnoreCount.py lldb-api :: python_api/watchpoint/TestWatchpointIter.py lldb-api :: python_api/watchpoint/condition/TestWatchpointConditionAPI.py lldb-api :: python_api/watchpoint/watchlocation/TestSetWatchlocation.py lldb-api :: python_api/watchpoint/watchlocation/TestTargetWatchAddress.py lldb-api :: sample_test/TestSampleInlineTest.py lldb-api :: sample_test/TestSampleTest.py lldb-api :: sanity/TestModuleCacheSanity.py lldb-api :: sanity/TestSettingSkipping.py lldb-api :: source-manager/TestSourceManager.py lldb-api :: terminal/TestEditline.py lldb-api :: terminal/TestSTTYBeforeAndAfter.py lldb-api :: test_utils/TestPExpectTest.py lldb-api :: tools/intel-features/intel-pt/test/TestIntelPTSimpleBinary.py lldb-api :: tools/lldb-server/TestAppleSimulatorOSType.py lldb-api :: tools/lldb-server/TestGdbRemoteAttach.py lldb-api :: tools/lldb-server/TestGdbRemoteAuxvSupport.py lldb-api :: tools/lldb-server/TestGdbRemoteCompletion.py lldb-api :: tools/lldb-server/TestGdbRemoteExitCode.py lldb-api :: tools/lldb-server/TestGdbRemoteExpeditedRegisters.py lldb-api :: tools/lldb-server/TestGdbRemoteHostInfo.py lldb-api :: tools/lldb-server/TestGdbRemoteKill.py lldb-api :: tools/lldb-server/TestGdbRemoteModuleInfo.py lldb-api :: tools/lldb-server/TestGdbRemoteProcessInfo.py lldb-api :: tools/lldb-server/TestGdbRemoteRegisterState.py lldb-api :: tools/lldb-server/TestGdbRemoteSingleStep.py lldb-api :: tools/lldb-server/TestGdbRemoteThreadsInStopReply.py lldb-api :: tools/lldb-server/TestGdbRemote_qThreadStopInfo.py lldb-api :: tools/lldb-server/TestGdbRemote_vCont.py lldb-api :: tools/lldb-server/TestGdbRemote_vContThreads.py lldb-api :: tools/lldb-server/TestLldbGdbServer.py lldb-api :: tools/lldb-server/commandline/TestGdbRemoteConnection.py lldb-api :: tools/lldb-server/commandline/TestStubSetSID.py lldb-api :: tools/lldb-server/inferior-crash/TestGdbRemoteAbort.py lldb-api :: tools/lldb-server/inferior-crash/TestGdbRemoteSegFault.py lldb-api :: tools/lldb-server/libraries-svr4/TestGdbRemoteLibrariesSvr4Support.py lldb-api :: tools/lldb-server/memory-allocation/TestGdbRemoteMemoryAllocation.py lldb-api :: tools/lldb-server/platform-process-connect/TestPlatformProcessConnect.py lldb-api :: tools/lldb-server/register-reading/TestGdbRemoteGPacket.py lldb-api :: tools/lldb-server/registers-target-xml-reading/TestGdbRemoteTargetXmlPacket.py lldb-api :: tools/lldb-server/signal-filtering/TestGdbRemote_QPassSignals.py lldb-api :: tools/lldb-server/thread-name/TestGdbRemoteThreadName.py lldb-api :: tools/lldb-vscode/attach/TestVSCode_attach.py lldb-api :: tools/lldb-vscode/breakpoint-events/TestVSCode_breakpointEvents.py lldb-api :: tools/lldb-vscode/breakpoint/TestVSCode_setBreakpoints.py lldb-api :: tools/lldb-vscode/breakpoint/TestVSCode_setExceptionBreakpoints.py lldb-api :: tools/lldb-vscode/breakpoint/TestVSCode_setFunctionBreakpoints.py lldb-api :: tools/lldb-vscode/completions/TestVSCode_completions.py lldb-api :: tools/lldb-vscode/console/TestVSCode_console.py lldb-api :: tools/lldb-vscode/coreFile/TestVSCode_coreFile.py lldb-api :: tools/lldb-vscode/disconnect/TestVSCode_disconnect.py lldb-api :: tools/lldb-vscode/launch/TestVSCode_launch.py lldb-api :: tools/lldb-vscode/module/TestVSCode_module.py lldb-api :: tools/lldb-vscode/runInTerminal/TestVSCode_runInTerminal.py lldb-api :: tools/lldb-vscode/stackTrace/TestVSCode_stackTrace.py lldb-api :: tools/lldb-vscode/step/TestVSCode_step.py lldb-api :: tools/lldb-vscode/variables/TestVSCode_variables.py lldb-api :: types/TestCharType.py lldb-api :: types/TestCharTypeExpr.py lldb-api :: types/TestDoubleTypes.py lldb-api :: types/TestDoubleTypesExpr.py lldb-api :: types/TestFloatTypes.py lldb-api :: types/TestFloatTypesExpr.py lldb-api :: types/TestIntegerType.py lldb-api :: types/TestIntegerTypeExpr.py lldb-api :: types/TestLongTypes.py lldb-api :: types/TestLongTypesExpr.py lldb-api :: types/TestRecursiveTypes.py lldb-api :: types/TestShortType.py lldb-api :: types/TestShortTypeExpr.py lldb-shell :: Breakpoint/case-sensitive.test lldb-shell :: Breakpoint/debug_addrx.test lldb-shell :: Breakpoint/debug_rnglist_basic.test lldb-shell :: Breakpoint/debug_rnglist_offset_pair.test lldb-shell :: Breakpoint/debug_rnglist_rlestartend.test lldb-shell :: Breakpoint/debug_rnglistx_rlex.test lldb-shell :: Breakpoint/dummy-target.test lldb-shell :: Breakpoint/implicit_const_form_support.test lldb-shell :: Breakpoint/jitbp_elf.test lldb-shell :: Breakpoint/single-file-split-dwarf.test lldb-shell :: Breakpoint/split-dwarf-5-addrbase.test lldb-shell :: Breakpoint/split-dwarf5-debug-stroffsets.test lldb-shell :: BuildScript/compiler-full-path.test lldb-shell :: BuildScript/modes.test lldb-shell :: BuildScript/script-args.test lldb-shell :: BuildScript/toolchain-clang.test lldb-shell :: Commands/CommandScriptImmediateOutput/CommandScriptImmediateOutputConsole.test lldb-shell :: Commands/CommandScriptImmediateOutput/CommandScriptImmediateOutputFile.test lldb-shell :: Commands/command-breakpoint-col.test lldb-shell :: Commands/command-disassemble-process.yaml lldb-shell :: Commands/command-disassemble.s lldb-shell :: Commands/command-script-import.test lldb-shell :: Commands/command-source.test lldb-shell :: Commands/command-stop-hook-output.test lldb-shell :: Commands/command-target-modules-dump-sections.yaml lldb-shell :: Commands/command-thread-select.test lldb-shell :: Driver/TestConvenienceVariables.test lldb-shell :: Driver/TestCore.test lldb-shell :: Driver/TestError.test lldb-shell :: Driver/TestFile.test lldb-shell :: Driver/TestHelp.test lldb-shell :: Driver/TestNoUseColor.test lldb-shell :: Driver/TestPositionalArgs.test lldb-shell :: Driver/TestProcessAttach.test lldb-shell :: Driver/TestSingleQuote.test lldb-shell :: Driver/TestTarget.test lldb-shell :: Driver/TestUseColor.test lldb-shell :: ExecControl/StopHook/stop-hook.test lldb-shell :: Expr/TestIRMemoryMap.test lldb-shell :: Expr/TestMultilineExpr.test lldb-shell :: Heap/heap-cstr.test lldb-shell :: Host/TestCustomShell.test lldb-shell :: Minidump/Windows/broken-unwind.test lldb-shell :: Minidump/Windows/find-module.test lldb-shell :: Minidump/breakpad-symbols.test lldb-shell :: Minidump/disassemble-no-module.yaml lldb-shell :: Minidump/dump-all.test lldb-shell :: Minidump/fb-dump.test lldb-shell :: Minidump/memory-region-from-module.yaml lldb-shell :: Minidump/memory-region.yaml lldb-shell :: Minidump/no-process-id.yaml lldb-shell :: ObjectFile/Breakpad/breakpad-identification.test lldb-shell :: ObjectFile/Breakpad/discontiguous-sections.test lldb-shell :: ObjectFile/Breakpad/sections-trailing-func.test lldb-shell :: ObjectFile/Breakpad/sections.test lldb-shell :: ObjectFile/Breakpad/uuid-matching-mac.test lldb-shell :: ObjectFile/ELF/PT_LOAD-empty.yaml lldb-shell :: ObjectFile/ELF/PT_LOAD-overlap-PT_INTERP.yaml lldb-shell :: ObjectFile/ELF/PT_LOAD-overlap-PT_TLS.yaml lldb-shell :: ObjectFile/ELF/PT_LOAD-overlap-section.yaml lldb-shell :: ObjectFile/ELF/PT_LOAD-overlap.yaml lldb-shell :: ObjectFile/ELF/PT_LOAD.yaml lldb-shell :: ObjectFile/ELF/PT_TLS-overlap-PT_LOAD.yaml lldb-shell :: ObjectFile/ELF/aarch64-relocations.yaml lldb-shell :: ObjectFile/ELF/avr-basic-info.yaml lldb-shell :: ObjectFile/ELF/base-address.yaml lldb-shell :: ObjectFile/ELF/build-id-case.yaml lldb-shell :: ObjectFile/ELF/compressed-sections.yaml lldb-shell :: ObjectFile/ELF/duplicate-section.yaml lldb-shell :: ObjectFile/ELF/gnu-debuglink.yaml lldb-shell :: ObjectFile/ELF/many-sections.s lldb-shell :: ObjectFile/ELF/minidebuginfo-corrupt-xz.yaml lldb-shell :: ObjectFile/ELF/minidebuginfo-find-symbols.yaml lldb-shell :: ObjectFile/ELF/netbsd-core-amd64.test lldb-shell :: ObjectFile/ELF/netbsd-exec-8.99.30-amd64.yaml lldb-shell :: ObjectFile/ELF/section-addresses.yaml lldb-shell :: ObjectFile/ELF/section-overlap.yaml lldb-shell :: ObjectFile/ELF/section-permissions.yaml lldb-shell :: ObjectFile/ELF/section-types-edgecases.yaml lldb-shell :: ObjectFile/ELF/section-types.yaml lldb-shell :: ObjectFile/ELF/short-build-id.yaml lldb-shell :: ObjectFile/MachO/lc_build_version.yaml lldb-shell :: ObjectFile/MachO/lc_build_version_notools.yaml lldb-shell :: ObjectFile/MachO/lc_version_min.yaml lldb-shell :: ObjectFile/MachO/subsections.yaml lldb-shell :: ObjectFile/MachO/symtab.yaml lldb-shell :: ObjectFile/PDB/object.test lldb-shell :: ObjectFile/PECOFF/basic-info-arm.yaml lldb-shell :: ObjectFile/PECOFF/basic-info-arm64.yaml lldb-shell :: ObjectFile/PECOFF/basic-info.yaml lldb-shell :: ObjectFile/PECOFF/invalid-export-table.yaml lldb-shell :: ObjectFile/PECOFF/section-types.yaml lldb-shell :: ObjectFile/PECOFF/sections-names.yaml lldb-shell :: ObjectFile/PECOFF/sections.yaml lldb-shell :: ObjectFile/PECOFF/symbol.yaml lldb-shell :: ObjectFile/wasm/basic.yaml lldb-shell :: ObjectFile/wasm/embedded-debug-sections.yaml lldb-shell :: ObjectFile/wasm/stripped-debug-sections.yaml lldb-shell :: ObjectFile/wasm/unified-debug-sections.yaml lldb-shell :: Process/Optimization.test lldb-shell :: Process/TestEnvironment.test lldb-shell :: Process/UnsupportedLanguage.test lldb-shell :: Quit/TestQuitExitCode-30.test lldb-shell :: Quit/TestQuitExitCode30.test lldb-shell :: Quit/TestQuitExitCodeHexA.test lldb-shell :: Quit/TestQuitExitCodeNonInt.test lldb-shell :: Quit/TestQuitExitCodeTooManyArgs.test lldb-shell :: Recognizer/assert.test lldb-shell :: Register/x86-64-gp-read.test lldb-shell :: Register/x86-64-read.test lldb-shell :: Register/x86-64-ymm-read.test lldb-shell :: Register/x86-multithread-read.test lldb-shell :: Reproducer/Functionalities/TestDataFormatter.test lldb-shell :: Reproducer/Functionalities/TestExpressionEvaluation.test lldb-shell :: Reproducer/Functionalities/TestImageList.test lldb-shell :: Reproducer/Functionalities/TestStepping.test lldb-shell :: Reproducer/Modules/TestModuleCXX.test lldb-shell :: Reproducer/TestCrash.test lldb-shell :: Reproducer/TestDSYM.test lldb-shell :: Reproducer/TestDebugSymbols.test lldb-shell :: Reproducer/TestDiscard.test lldb-shell :: Reproducer/TestDriverOptions.test lldb-shell :: Reproducer/TestDump.test lldb-shell :: Reproducer/TestFileRepro.test lldb-shell :: Reproducer/TestFinalize.test lldb-shell :: Reproducer/TestGDBRemoteRepro.test lldb-shell :: Reproducer/TestMultipleTargets.test lldb-shell :: Reproducer/TestProcessList.test lldb-shell :: Reproducer/TestRelativePath.test lldb-shell :: Reproducer/TestReuseDirectory.test lldb-shell :: Reproducer/TestVerify.test lldb-shell :: Reproducer/TestVersionCheck.test lldb-shell :: Reproducer/TestWorkingDir.test lldb-shell :: ScriptInterpreter/Python/Crashlog/json.test lldb-shell :: ScriptInterpreter/Python/Crashlog/parser_json.test lldb-shell :: ScriptInterpreter/Python/Crashlog/parser_text.test lldb-shell :: ScriptInterpreter/Python/Crashlog/text.test lldb-shell :: ScriptInterpreter/Python/command_relative_import.test lldb-shell :: ScriptInterpreter/Python/eof.test lldb-shell :: ScriptInterpreter/Python/python.test lldb-shell :: ScriptInterpreter/Python/sb_address_exception.test

Hide Details

Hide Details

Testing Time: 852.20s Unsupported : 209 Passed : 1617 Expectedly Failed: 10 Timed Out : 13 Failed : 367 make: *** [/Users/buildslave/jenkins/workspace/lldb-cmake-standalone/lldb-xcode-build/test/CMakeFiles/check-lldb-lit] Error 1

Hide Details

** BUILD FAILED **

Hide Details

Hide Details

The following build commands failed: PhaseScriptExecution CMake\ Rules /Users/buildslave/jenkins/workspace/lldb-cmake-standalone/lldb-xcode-build/test/lldb.build/Release/check-lldb-lit.build/Script-C270679CC2E4456298CCE69A.sh (1 failure) Command failed: Command '['/usr/bin/env', 'TERM=vt100', '/usr/local/bin/cmake', '--build', '.', '--config', 'Release', '--target', 'check-lldb']' returned non-zero exit status 65. Command: ['/usr/bin/env', 'TERM=vt100', '/usr/local/bin/cmake', '--build', '.', '--config', 'Release', '--target', 'check-lldb'] [Pipeline] } [Pipeline] // timeout [Pipeline] } [Pipeline] // stage [Pipeline] stage [Pipeline] { (Declarative: Post Actions) [Pipeline] emailext Warning: harald@gigawatt.nl is not a recognized user, but sending mail anyway Warning: harald@gigawatt.nl is not a recognized user, but sending mail anyway

Hide Details

Begin Pre-Send Script... Sending email to: harald@gigawatt.nl Tim Northover <tnorthover@apple.com> Azhar Mohammed <azhar@apple.com>
[Pipeline] } [Pipeline] // stage [Pipeline] } [Pipeline] // withEnv [Pipeline] } [Pipeline] // node [Pipeline] End of Pipeline [Checks API] No suitable checks publisher found. ERROR: script returned exit code 1 Finished: FAILURE