FailedConsole Output

Skipping 144 KB.. Full Log
              ^

--

********************
PASS: AddressSanitizer-x86_64-iossim :: TestCases/lsan_annotations.cc (380 of 479)
PASS: AddressSanitizer-x86_64-iossim :: TestCases/malloc_fill.cc (381 of 479)
PASS: AddressSanitizer-x86_64-iossim :: TestCases/max_redzone.cc (382 of 479)
PASS: AddressSanitizer-x86_64-iossim :: TestCases/memcmp_strict_test.cc (383 of 479)
PASS: AddressSanitizer-x86_64-iossim :: TestCases/malloc_context_size.cc (384 of 479)
UNSUPPORTED: AddressSanitizer-x86_64-iossim :: TestCases/non-executable-pc.cpp (385 of 479)
PASS: AddressSanitizer-x86_64-iossim :: TestCases/null_deref.cc (386 of 479)
PASS: AddressSanitizer-x86_64-iossim :: TestCases/memcmp_test.cc (387 of 479)
PASS: AddressSanitizer-x86_64-iossim :: TestCases/on_error_callback.cc (388 of 479)
PASS: AddressSanitizer-x86_64-iossim :: TestCases/pass-object-byval.cc (389 of 479)
UNSUPPORTED: AddressSanitizer-x86_64-iossim :: TestCases/pass-struct-byval-uar.cc (390 of 479)
PASS: AddressSanitizer-x86_64-iossim :: TestCases/pass-struct-byval.cc (391 of 479)
PASS: AddressSanitizer-x86_64-iossim :: TestCases/partial_right.cc (392 of 479)
PASS: AddressSanitizer-x86_64-iossim :: TestCases/poison_partial.cc (393 of 479)
PASS: AddressSanitizer-x86_64-iossim :: TestCases/pr33372.cc (394 of 479)
FAIL: AddressSanitizer-x86_64-iossim :: TestCases/print_summary.cc (395 of 479)
******************** TEST 'AddressSanitizer-x86_64-iossim :: TestCases/print_summary.cc' FAILED ********************
Script:
--
: 'RUN: at line 1';     /Users/buildslave/jenkins/workspace/mr-clang-stage1-cmake-RA-expensive/llvm-project/compiler-rt/test/sanitizer_common/ios_commands/iossim_compile.py /Users/buildslave/jenkins/workspace/mr-clang-stage1-cmake-RA-expensive/clang-build/./bin/clang  --driver-mode=g++ -fsanitize=address -mno-omit-leaf-frame-pointer -fno-omit-frame-pointer -fno-optimize-sibling-calls -gline-tables-only  -arch x86_64 -isysroot /Applications/Xcode.app/Contents/Developer/Platforms/iPhoneSimulator.platform/Developer/SDKs/iPhoneSimulator12.1.sdk   -shared-libasan -O0 /Users/buildslave/jenkins/workspace/mr-clang-stage1-cmake-RA-expensive/llvm-project/compiler-rt/test/asan/TestCases/print_summary.cc -o /Users/buildslave/jenkins/workspace/mr-clang-stage1-cmake-RA-expensive/clang-build/tools/clang/runtime/compiler-rt-bins/test/asan/IOSSimX86_64Config/TestCases/Output/print_summary.cc.tmp
: 'RUN: at line 2';   not /Users/buildslave/jenkins/workspace/mr-clang-stage1-cmake-RA-expensive/llvm-project/compiler-rt/test/sanitizer_common/ios_commands/iossim_run.py /Users/buildslave/jenkins/workspace/mr-clang-stage1-cmake-RA-expensive/clang-build/tools/clang/runtime/compiler-rt-bins/test/asan/IOSSimX86_64Config/TestCases/Output/print_summary.cc.tmp 2>&1 | FileCheck /Users/buildslave/jenkins/workspace/mr-clang-stage1-cmake-RA-expensive/llvm-project/compiler-rt/test/asan/TestCases/print_summary.cc --check-prefix=SOURCE
: 'RUN: at line 3';   env ASAN_OPTIONS=abort_on_error=0:log_to_syslog=0:detect_leaks=1:symbolize=false not /Users/buildslave/jenkins/workspace/mr-clang-stage1-cmake-RA-expensive/llvm-project/compiler-rt/test/sanitizer_common/ios_commands/iossim_run.py /Users/buildslave/jenkins/workspace/mr-clang-stage1-cmake-RA-expensive/clang-build/tools/clang/runtime/compiler-rt-bins/test/asan/IOSSimX86_64Config/TestCases/Output/print_summary.cc.tmp 2>&1 | FileCheck /Users/buildslave/jenkins/workspace/mr-clang-stage1-cmake-RA-expensive/llvm-project/compiler-rt/test/asan/TestCases/print_summary.cc --check-prefix=MODULE
: 'RUN: at line 4';   env ASAN_OPTIONS=abort_on_error=0:log_to_syslog=0:detect_leaks=1:print_summary=false not /Users/buildslave/jenkins/workspace/mr-clang-stage1-cmake-RA-expensive/llvm-project/compiler-rt/test/sanitizer_common/ios_commands/iossim_run.py /Users/buildslave/jenkins/workspace/mr-clang-stage1-cmake-RA-expensive/clang-build/tools/clang/runtime/compiler-rt-bins/test/asan/IOSSimX86_64Config/TestCases/Output/print_summary.cc.tmp 2>&1 | FileCheck /Users/buildslave/jenkins/workspace/mr-clang-stage1-cmake-RA-expensive/llvm-project/compiler-rt/test/asan/TestCases/print_summary.cc --check-prefix=MISSING
--
Exit Code: 1

Command Output (stderr):
--
/Users/buildslave/jenkins/workspace/mr-clang-stage1-cmake-RA-expensive/llvm-project/compiler-rt/test/asan/TestCases/print_summary.cc:11:13: error: SOURCE: expected string not found in input
 // SOURCE: SUMMARY: AddressSanitizer: heap-use-after-free {{.*}}print_summary.cc:[[@LINE-2]]{{.*}} main
            ^
<stdin>:2:55: note: scanning from here
==23573==ERROR: AddressSanitizer: heap-use-after-free on address 0x603000000400 at pc 0x00010b0fef3b bp 0x7ffee4b00bc0 sp 0x7ffee4b00bb8
                                                      ^
<stdin>:2:55: note: with "@LINE-2" equal to "9"
==23573==ERROR: AddressSanitizer: heap-use-after-free on address 0x603000000400 at pc 0x00010b0fef3b bp 0x7ffee4b00bc0 sp 0x7ffee4b00bb8
                                                      ^
<stdin>:27:1: note: possible intended match here
SUMMARY: AddressSanitizer: heap-use-after-free (/Users/buildslave/jenkins/workspace/mr-clang-stage1-cmake-RA-expensive/clang-build/tools/clang/runtime/compiler-rt-bins/test/asan/IOSSimX86_64Config/TestCases/Output/print_summary.cc.tmp:x86_64+0x100000f3a) in main
^

--

********************
PASS: AddressSanitizer-x86_64-iossim :: TestCases/printf-1.c (396 of 479)
PASS: AddressSanitizer-x86_64-iossim :: TestCases/printf-2.c (397 of 479)
PASS: AddressSanitizer-x86_64-iossim :: TestCases/printf-3.c (398 of 479)
PASS: AddressSanitizer-x86_64-iossim :: TestCases/printf-4.c (399 of 479)
PASS: AddressSanitizer-x86_64-iossim :: TestCases/printf-m.c (400 of 479)
PASS: AddressSanitizer-x86_64-iossim :: TestCases/memset_test.cc (401 of 479)
PASS: AddressSanitizer-x86_64-iossim :: TestCases/printf-5.c (402 of 479)
FAIL: AddressSanitizer-x86_64-iossim :: TestCases/sanity_check_pure_c.c (403 of 479)
******************** TEST 'AddressSanitizer-x86_64-iossim :: TestCases/sanity_check_pure_c.c' FAILED ********************
Script:
--
: 'RUN: at line 2';     /Users/buildslave/jenkins/workspace/mr-clang-stage1-cmake-RA-expensive/llvm-project/compiler-rt/test/sanitizer_common/ios_commands/iossim_compile.py /Users/buildslave/jenkins/workspace/mr-clang-stage1-cmake-RA-expensive/clang-build/./bin/clang  -fsanitize=address -mno-omit-leaf-frame-pointer -fno-omit-frame-pointer -fno-optimize-sibling-calls -gline-tables-only  -arch x86_64 -isysroot /Applications/Xcode.app/Contents/Developer/Platforms/iPhoneSimulator.platform/Developer/SDKs/iPhoneSimulator12.1.sdk   -shared-libasan -O2 /Users/buildslave/jenkins/workspace/mr-clang-stage1-cmake-RA-expensive/llvm-project/compiler-rt/test/asan/TestCases/sanity_check_pure_c.c -o /Users/buildslave/jenkins/workspace/mr-clang-stage1-cmake-RA-expensive/clang-build/tools/clang/runtime/compiler-rt-bins/test/asan/IOSSimX86_64Config/TestCases/Output/sanity_check_pure_c.c.tmp
: 'RUN: at line 3';   not /Users/buildslave/jenkins/workspace/mr-clang-stage1-cmake-RA-expensive/llvm-project/compiler-rt/test/sanitizer_common/ios_commands/iossim_run.py /Users/buildslave/jenkins/workspace/mr-clang-stage1-cmake-RA-expensive/clang-build/tools/clang/runtime/compiler-rt-bins/test/asan/IOSSimX86_64Config/TestCases/Output/sanity_check_pure_c.c.tmp 2>&1 | FileCheck /Users/buildslave/jenkins/workspace/mr-clang-stage1-cmake-RA-expensive/llvm-project/compiler-rt/test/asan/TestCases/sanity_check_pure_c.c
: 'RUN: at line 6';     /Users/buildslave/jenkins/workspace/mr-clang-stage1-cmake-RA-expensive/llvm-project/compiler-rt/test/sanitizer_common/ios_commands/iossim_compile.py /Users/buildslave/jenkins/workspace/mr-clang-stage1-cmake-RA-expensive/clang-build/./bin/clang  -fsanitize=address -mno-omit-leaf-frame-pointer -fno-omit-frame-pointer -fno-optimize-sibling-calls -gline-tables-only  -arch x86_64 -isysroot /Applications/Xcode.app/Contents/Developer/Platforms/iPhoneSimulator.platform/Developer/SDKs/iPhoneSimulator12.1.sdk   -shared-libasan -O2 /Users/buildslave/jenkins/workspace/mr-clang-stage1-cmake-RA-expensive/llvm-project/compiler-rt/test/asan/TestCases/sanity_check_pure_c.c -pie -fPIE -o /Users/buildslave/jenkins/workspace/mr-clang-stage1-cmake-RA-expensive/clang-build/tools/clang/runtime/compiler-rt-bins/test/asan/IOSSimX86_64Config/TestCases/Output/sanity_check_pure_c.c.tmp
: 'RUN: at line 7';   not /Users/buildslave/jenkins/workspace/mr-clang-stage1-cmake-RA-expensive/llvm-project/compiler-rt/test/sanitizer_common/ios_commands/iossim_run.py /Users/buildslave/jenkins/workspace/mr-clang-stage1-cmake-RA-expensive/clang-build/tools/clang/runtime/compiler-rt-bins/test/asan/IOSSimX86_64Config/TestCases/Output/sanity_check_pure_c.c.tmp 2>&1 | FileCheck /Users/buildslave/jenkins/workspace/mr-clang-stage1-cmake-RA-expensive/llvm-project/compiler-rt/test/asan/TestCases/sanity_check_pure_c.c
--
Exit Code: 1

Command Output (stderr):
--
/Users/buildslave/jenkins/workspace/mr-clang-stage1-cmake-RA-expensive/llvm-project/compiler-rt/test/asan/TestCases/sanity_check_pure_c.c:17:12: error: CHECK: expected string not found in input
 // CHECK: main{{.*}}sanity_check_pure_c.c:[[@LINE-4]]
           ^
<stdin>:17:5: note: scanning from here
freed by thread T0 here:
    ^
<stdin>:17:5: note: with "@LINE-4" equal to "13"
freed by thread T0 here:
    ^
<stdin>:19:183: note: possible intended match here
 #1 0x10ae6ef05 in main (/Users/buildslave/jenkins/workspace/mr-clang-stage1-cmake-RA-expensive/clang-build/tools/clang/runtime/compiler-rt-bins/test/asan/IOSSimX86_64Config/TestCases/Output/sanity_check_pure_c.c.tmp:x86_64+0x100000f05)
                                                                                                                                                                                      ^

--

********************
PASS: AddressSanitizer-x86_64-iossim :: TestCases/realloc.cc (404 of 479)
PASS: AddressSanitizer-x86_64-iossim :: TestCases/sleep_after_init.c (405 of 479)
PASS: AddressSanitizer-x86_64-iossim :: TestCases/sleep_before_dying.c (406 of 479)
PASS: AddressSanitizer-x86_64-iossim :: TestCases/set_shadow_test.c (407 of 479)
PASS: AddressSanitizer-x86_64-iossim :: TestCases/speculative_load.cc (408 of 479)
PASS: AddressSanitizer-x86_64-iossim :: TestCases/small_memcpy_test.cc (409 of 479)
PASS: AddressSanitizer-x86_64-iossim :: TestCases/speculative_load2.cc (410 of 479)
FAIL: AddressSanitizer-x86_64-iossim :: TestCases/stack-buffer-overflow.cc (411 of 479)
******************** TEST 'AddressSanitizer-x86_64-iossim :: TestCases/stack-buffer-overflow.cc' FAILED ********************
Script:
--
: 'RUN: at line 1';     /Users/buildslave/jenkins/workspace/mr-clang-stage1-cmake-RA-expensive/llvm-project/compiler-rt/test/sanitizer_common/ios_commands/iossim_compile.py /Users/buildslave/jenkins/workspace/mr-clang-stage1-cmake-RA-expensive/clang-build/./bin/clang  --driver-mode=g++ -fsanitize=address -mno-omit-leaf-frame-pointer -fno-omit-frame-pointer -fno-optimize-sibling-calls -gline-tables-only  -arch x86_64 -isysroot /Applications/Xcode.app/Contents/Developer/Platforms/iPhoneSimulator.platform/Developer/SDKs/iPhoneSimulator12.1.sdk   -shared-libasan -O0 /Users/buildslave/jenkins/workspace/mr-clang-stage1-cmake-RA-expensive/llvm-project/compiler-rt/test/asan/TestCases/stack-buffer-overflow.cc -o /Users/buildslave/jenkins/workspace/mr-clang-stage1-cmake-RA-expensive/clang-build/tools/clang/runtime/compiler-rt-bins/test/asan/IOSSimX86_64Config/TestCases/Output/stack-buffer-overflow.cc.tmp && not /Users/buildslave/jenkins/workspace/mr-clang-stage1-cmake-RA-expensive/llvm-project/compiler-rt/test/sanitizer_common/ios_commands/iossim_run.py /Users/buildslave/jenkins/workspace/mr-clang-stage1-cmake-RA-expensive/clang-build/tools/clang/runtime/compiler-rt-bins/test/asan/IOSSimX86_64Config/TestCases/Output/stack-buffer-overflow.cc.tmp 2>&1 | FileCheck /Users/buildslave/jenkins/workspace/mr-clang-stage1-cmake-RA-expensive/llvm-project/compiler-rt/test/asan/TestCases/stack-buffer-overflow.cc
: 'RUN: at line 2';     /Users/buildslave/jenkins/workspace/mr-clang-stage1-cmake-RA-expensive/llvm-project/compiler-rt/test/sanitizer_common/ios_commands/iossim_compile.py /Users/buildslave/jenkins/workspace/mr-clang-stage1-cmake-RA-expensive/clang-build/./bin/clang  --driver-mode=g++ -fsanitize=address -mno-omit-leaf-frame-pointer -fno-omit-frame-pointer -fno-optimize-sibling-calls -gline-tables-only  -arch x86_64 -isysroot /Applications/Xcode.app/Contents/Developer/Platforms/iPhoneSimulator.platform/Developer/SDKs/iPhoneSimulator12.1.sdk   -shared-libasan -O1 /Users/buildslave/jenkins/workspace/mr-clang-stage1-cmake-RA-expensive/llvm-project/compiler-rt/test/asan/TestCases/stack-buffer-overflow.cc -o /Users/buildslave/jenkins/workspace/mr-clang-stage1-cmake-RA-expensive/clang-build/tools/clang/runtime/compiler-rt-bins/test/asan/IOSSimX86_64Config/TestCases/Output/stack-buffer-overflow.cc.tmp && not /Users/buildslave/jenkins/workspace/mr-clang-stage1-cmake-RA-expensive/llvm-project/compiler-rt/test/sanitizer_common/ios_commands/iossim_run.py /Users/buildslave/jenkins/workspace/mr-clang-stage1-cmake-RA-expensive/clang-build/tools/clang/runtime/compiler-rt-bins/test/asan/IOSSimX86_64Config/TestCases/Output/stack-buffer-overflow.cc.tmp 2>&1 | FileCheck /Users/buildslave/jenkins/workspace/mr-clang-stage1-cmake-RA-expensive/llvm-project/compiler-rt/test/asan/TestCases/stack-buffer-overflow.cc
: 'RUN: at line 3';     /Users/buildslave/jenkins/workspace/mr-clang-stage1-cmake-RA-expensive/llvm-project/compiler-rt/test/sanitizer_common/ios_commands/iossim_compile.py /Users/buildslave/jenkins/workspace/mr-clang-stage1-cmake-RA-expensive/clang-build/./bin/clang  --driver-mode=g++ -fsanitize=address -mno-omit-leaf-frame-pointer -fno-omit-frame-pointer -fno-optimize-sibling-calls -gline-tables-only  -arch x86_64 -isysroot /Applications/Xcode.app/Contents/Developer/Platforms/iPhoneSimulator.platform/Developer/SDKs/iPhoneSimulator12.1.sdk   -shared-libasan -O2 /Users/buildslave/jenkins/workspace/mr-clang-stage1-cmake-RA-expensive/llvm-project/compiler-rt/test/asan/TestCases/stack-buffer-overflow.cc -o /Users/buildslave/jenkins/workspace/mr-clang-stage1-cmake-RA-expensive/clang-build/tools/clang/runtime/compiler-rt-bins/test/asan/IOSSimX86_64Config/TestCases/Output/stack-buffer-overflow.cc.tmp && not /Users/buildslave/jenkins/workspace/mr-clang-stage1-cmake-RA-expensive/llvm-project/compiler-rt/test/sanitizer_common/ios_commands/iossim_run.py /Users/buildslave/jenkins/workspace/mr-clang-stage1-cmake-RA-expensive/clang-build/tools/clang/runtime/compiler-rt-bins/test/asan/IOSSimX86_64Config/TestCases/Output/stack-buffer-overflow.cc.tmp 2>&1 | FileCheck /Users/buildslave/jenkins/workspace/mr-clang-stage1-cmake-RA-expensive/llvm-project/compiler-rt/test/asan/TestCases/stack-buffer-overflow.cc
: 'RUN: at line 4';     /Users/buildslave/jenkins/workspace/mr-clang-stage1-cmake-RA-expensive/llvm-project/compiler-rt/test/sanitizer_common/ios_commands/iossim_compile.py /Users/buildslave/jenkins/workspace/mr-clang-stage1-cmake-RA-expensive/clang-build/./bin/clang  --driver-mode=g++ -fsanitize=address -mno-omit-leaf-frame-pointer -fno-omit-frame-pointer -fno-optimize-sibling-calls -gline-tables-only  -arch x86_64 -isysroot /Applications/Xcode.app/Contents/Developer/Platforms/iPhoneSimulator.platform/Developer/SDKs/iPhoneSimulator12.1.sdk   -shared-libasan -O3 /Users/buildslave/jenkins/workspace/mr-clang-stage1-cmake-RA-expensive/llvm-project/compiler-rt/test/asan/TestCases/stack-buffer-overflow.cc -o /Users/buildslave/jenkins/workspace/mr-clang-stage1-cmake-RA-expensive/clang-build/tools/clang/runtime/compiler-rt-bins/test/asan/IOSSimX86_64Config/TestCases/Output/stack-buffer-overflow.cc.tmp && not /Users/buildslave/jenkins/workspace/mr-clang-stage1-cmake-RA-expensive/llvm-project/compiler-rt/test/sanitizer_common/ios_commands/iossim_run.py /Users/buildslave/jenkins/workspace/mr-clang-stage1-cmake-RA-expensive/clang-build/tools/clang/runtime/compiler-rt-bins/test/asan/IOSSimX86_64Config/TestCases/Output/stack-buffer-overflow.cc.tmp 2>&1 | FileCheck /Users/buildslave/jenkins/workspace/mr-clang-stage1-cmake-RA-expensive/llvm-project/compiler-rt/test/asan/TestCases/stack-buffer-overflow.cc
--
Exit Code: 1

Command Output (stderr):
--
/Users/buildslave/jenkins/workspace/mr-clang-stage1-cmake-RA-expensive/llvm-project/compiler-rt/test/asan/TestCases/stack-buffer-overflow.cc:12:12: error: CHECK: expected string not found in input
 // CHECK: {{ #0 0x.* in main .*stack-buffer-overflow.cc:}}[[@LINE-2]]
           ^
<stdin>:4:1: note: scanning from here
atos[24285]: atos cannot examine process 24283 (stack-buffer-overflow.cc.tmp) for unknown reasons, even though it appears to exist; try running with `sudo`.
^
<stdin>:4:1: note: with "@LINE-2" equal to "10"
atos[24285]: atos cannot examine process 24283 (stack-buffer-overflow.cc.tmp) for unknown reasons, even though it appears to exist; try running with `sudo`.
^
<stdin>:4:29: note: possible intended match here
atos[24285]: atos cannot examine process 24283 (stack-buffer-overflow.cc.tmp) for unknown reasons, even though it appears to exist; try running with `sudo`.
                            ^

--

********************
PASS: AddressSanitizer-x86_64-iossim :: TestCases/stack-frame-demangle.cc (412 of 479)
PASS: AddressSanitizer-x86_64-iossim :: TestCases/stack-oob-frames.cc (413 of 479)
PASS: AddressSanitizer-x86_64-iossim :: TestCases/strcasestr-1.c (414 of 479)
PASS: AddressSanitizer-x86_64-iossim :: TestCases/strcasestr-2.c (415 of 479)
PASS: AddressSanitizer-x86_64-iossim :: TestCases/strcasestr_strict.c (416 of 479)
PASS: AddressSanitizer-x86_64-iossim :: TestCases/stack-buffer-overflow-with-position.cc (417 of 479)
FAIL: AddressSanitizer-x86_64-iossim :: TestCases/strcat-overlap.cc (418 of 479)
******************** TEST 'AddressSanitizer-x86_64-iossim :: TestCases/strcat-overlap.cc' FAILED ********************
Script:
--
: 'RUN: at line 1';     /Users/buildslave/jenkins/workspace/mr-clang-stage1-cmake-RA-expensive/llvm-project/compiler-rt/test/sanitizer_common/ios_commands/iossim_compile.py /Users/buildslave/jenkins/workspace/mr-clang-stage1-cmake-RA-expensive/clang-build/./bin/clang  --driver-mode=g++ -fsanitize=address -mno-omit-leaf-frame-pointer -fno-omit-frame-pointer -fno-optimize-sibling-calls -gline-tables-only  -arch x86_64 -isysroot /Applications/Xcode.app/Contents/Developer/Platforms/iPhoneSimulator.platform/Developer/SDKs/iPhoneSimulator12.1.sdk   -shared-libasan -O0 /Users/buildslave/jenkins/workspace/mr-clang-stage1-cmake-RA-expensive/llvm-project/compiler-rt/test/asan/TestCases/strcat-overlap.cc -o /Users/buildslave/jenkins/workspace/mr-clang-stage1-cmake-RA-expensive/clang-build/tools/clang/runtime/compiler-rt-bins/test/asan/IOSSimX86_64Config/TestCases/Output/strcat-overlap.cc.tmp
: 'RUN: at line 2';   not /Users/buildslave/jenkins/workspace/mr-clang-stage1-cmake-RA-expensive/llvm-project/compiler-rt/test/sanitizer_common/ios_commands/iossim_run.py /Users/buildslave/jenkins/workspace/mr-clang-stage1-cmake-RA-expensive/clang-build/tools/clang/runtime/compiler-rt-bins/test/asan/IOSSimX86_64Config/TestCases/Output/strcat-overlap.cc.tmp 2>&1 | FileCheck /Users/buildslave/jenkins/workspace/mr-clang-stage1-cmake-RA-expensive/llvm-project/compiler-rt/test/asan/TestCases/strcat-overlap.cc
: 'RUN: at line 3';   echo "interceptor_via_fun:bad_function" > /Users/buildslave/jenkins/workspace/mr-clang-stage1-cmake-RA-expensive/clang-build/tools/clang/runtime/compiler-rt-bins/test/asan/IOSSimX86_64Config/TestCases/Output/strcat-overlap.cc.tmp.supp
: 'RUN: at line 4';   env ASAN_OPTIONS=abort_on_error=0:log_to_syslog=0:detect_leaks=1:suppressions='"/Users/buildslave/jenkins/workspace/mr-clang-stage1-cmake-RA-expensive/clang-build/tools/clang/runtime/compiler-rt-bins/test/asan/IOSSimX86_64Config/TestCases/Output/strcat-overlap.cc.tmp.supp"' /Users/buildslave/jenkins/workspace/mr-clang-stage1-cmake-RA-expensive/llvm-project/compiler-rt/test/sanitizer_common/ios_commands/iossim_run.py /Users/buildslave/jenkins/workspace/mr-clang-stage1-cmake-RA-expensive/clang-build/tools/clang/runtime/compiler-rt-bins/test/asan/IOSSimX86_64Config/TestCases/Output/strcat-overlap.cc.tmp
: 'RUN: at line 5';   echo "interceptor_name:strcat" > /Users/buildslave/jenkins/workspace/mr-clang-stage1-cmake-RA-expensive/clang-build/tools/clang/runtime/compiler-rt-bins/test/asan/IOSSimX86_64Config/TestCases/Output/strcat-overlap.cc.tmp.supp
: 'RUN: at line 6';   env ASAN_OPTIONS=abort_on_error=0:log_to_syslog=0:detect_leaks=1:suppressions='"/Users/buildslave/jenkins/workspace/mr-clang-stage1-cmake-RA-expensive/clang-build/tools/clang/runtime/compiler-rt-bins/test/asan/IOSSimX86_64Config/TestCases/Output/strcat-overlap.cc.tmp.supp"' /Users/buildslave/jenkins/workspace/mr-clang-stage1-cmake-RA-expensive/llvm-project/compiler-rt/test/sanitizer_common/ios_commands/iossim_run.py /Users/buildslave/jenkins/workspace/mr-clang-stage1-cmake-RA-expensive/clang-build/tools/clang/runtime/compiler-rt-bins/test/asan/IOSSimX86_64Config/TestCases/Output/strcat-overlap.cc.tmp
: 'RUN: at line 8';     /Users/buildslave/jenkins/workspace/mr-clang-stage1-cmake-RA-expensive/llvm-project/compiler-rt/test/sanitizer_common/ios_commands/iossim_compile.py /Users/buildslave/jenkins/workspace/mr-clang-stage1-cmake-RA-expensive/clang-build/./bin/clang  --driver-mode=g++ -fsanitize=address -mno-omit-leaf-frame-pointer -fno-omit-frame-pointer -fno-optimize-sibling-calls -gline-tables-only  -arch x86_64 -isysroot /Applications/Xcode.app/Contents/Developer/Platforms/iPhoneSimulator.platform/Developer/SDKs/iPhoneSimulator12.1.sdk   -shared-libasan -O1 /Users/buildslave/jenkins/workspace/mr-clang-stage1-cmake-RA-expensive/llvm-project/compiler-rt/test/asan/TestCases/strcat-overlap.cc -o /Users/buildslave/jenkins/workspace/mr-clang-stage1-cmake-RA-expensive/clang-build/tools/clang/runtime/compiler-rt-bins/test/asan/IOSSimX86_64Config/TestCases/Output/strcat-overlap.cc.tmp
: 'RUN: at line 9';   not /Users/buildslave/jenkins/workspace/mr-clang-stage1-cmake-RA-expensive/llvm-project/compiler-rt/test/sanitizer_common/ios_commands/iossim_run.py /Users/buildslave/jenkins/workspace/mr-clang-stage1-cmake-RA-expensive/clang-build/tools/clang/runtime/compiler-rt-bins/test/asan/IOSSimX86_64Config/TestCases/Output/strcat-overlap.cc.tmp 2>&1 | FileCheck /Users/buildslave/jenkins/workspace/mr-clang-stage1-cmake-RA-expensive/llvm-project/compiler-rt/test/asan/TestCases/strcat-overlap.cc
: 'RUN: at line 10';   echo "interceptor_via_fun:bad_function" > /Users/buildslave/jenkins/workspace/mr-clang-stage1-cmake-RA-expensive/clang-build/tools/clang/runtime/compiler-rt-bins/test/asan/IOSSimX86_64Config/TestCases/Output/strcat-overlap.cc.tmp.supp
: 'RUN: at line 11';   env ASAN_OPTIONS=abort_on_error=0:log_to_syslog=0:detect_leaks=1:suppressions='"/Users/buildslave/jenkins/workspace/mr-clang-stage1-cmake-RA-expensive/clang-build/tools/clang/runtime/compiler-rt-bins/test/asan/IOSSimX86_64Config/TestCases/Output/strcat-overlap.cc.tmp.supp"' /Users/buildslave/jenkins/workspace/mr-clang-stage1-cmake-RA-expensive/llvm-project/compiler-rt/test/sanitizer_common/ios_commands/iossim_run.py /Users/buildslave/jenkins/workspace/mr-clang-stage1-cmake-RA-expensive/clang-build/tools/clang/runtime/compiler-rt-bins/test/asan/IOSSimX86_64Config/TestCases/Output/strcat-overlap.cc.tmp
: 'RUN: at line 12';   echo "interceptor_name:strcat" > /Users/buildslave/jenkins/workspace/mr-clang-stage1-cmake-RA-expensive/clang-build/tools/clang/runtime/compiler-rt-bins/test/asan/IOSSimX86_64Config/TestCases/Output/strcat-overlap.cc.tmp.supp
: 'RUN: at line 13';   env ASAN_OPTIONS=abort_on_error=0:log_to_syslog=0:detect_leaks=1:suppressions='"/Users/buildslave/jenkins/workspace/mr-clang-stage1-cmake-RA-expensive/clang-build/tools/clang/runtime/compiler-rt-bins/test/asan/IOSSimX86_64Config/TestCases/Output/strcat-overlap.cc.tmp.supp"' /Users/buildslave/jenkins/workspace/mr-clang-stage1-cmake-RA-expensive/llvm-project/compiler-rt/test/sanitizer_common/ios_commands/iossim_run.py /Users/buildslave/jenkins/workspace/mr-clang-stage1-cmake-RA-expensive/clang-build/tools/clang/runtime/compiler-rt-bins/test/asan/IOSSimX86_64Config/TestCases/Output/strcat-overlap.cc.tmp
: 'RUN: at line 15';     /Users/buildslave/jenkins/workspace/mr-clang-stage1-cmake-RA-expensive/llvm-project/compiler-rt/test/sanitizer_common/ios_commands/iossim_compile.py /Users/buildslave/jenkins/workspace/mr-clang-stage1-cmake-RA-expensive/clang-build/./bin/clang  --driver-mode=g++ -fsanitize=address -mno-omit-leaf-frame-pointer -fno-omit-frame-pointer -fno-optimize-sibling-calls -gline-tables-only  -arch x86_64 -isysroot /Applications/Xcode.app/Contents/Developer/Platforms/iPhoneSimulator.platform/Developer/SDKs/iPhoneSimulator12.1.sdk   -shared-libasan -O2 /Users/buildslave/jenkins/workspace/mr-clang-stage1-cmake-RA-expensive/llvm-project/compiler-rt/test/asan/TestCases/strcat-overlap.cc -o /Users/buildslave/jenkins/workspace/mr-clang-stage1-cmake-RA-expensive/clang-build/tools/clang/runtime/compiler-rt-bins/test/asan/IOSSimX86_64Config/TestCases/Output/strcat-overlap.cc.tmp
: 'RUN: at line 16';   not /Users/buildslave/jenkins/workspace/mr-clang-stage1-cmake-RA-expensive/llvm-project/compiler-rt/test/sanitizer_common/ios_commands/iossim_run.py /Users/buildslave/jenkins/workspace/mr-clang-stage1-cmake-RA-expensive/clang-build/tools/clang/runtime/compiler-rt-bins/test/asan/IOSSimX86_64Config/TestCases/Output/strcat-overlap.cc.tmp 2>&1 | FileCheck /Users/buildslave/jenkins/workspace/mr-clang-stage1-cmake-RA-expensive/llvm-project/compiler-rt/test/asan/TestCases/strcat-overlap.cc
: 'RUN: at line 17';   echo "interceptor_via_fun:bad_function" > /Users/buildslave/jenkins/workspace/mr-clang-stage1-cmake-RA-expensive/clang-build/tools/clang/runtime/compiler-rt-bins/test/asan/IOSSimX86_64Config/TestCases/Output/strcat-overlap.cc.tmp.supp
: 'RUN: at line 18';   env ASAN_OPTIONS=abort_on_error=0:log_to_syslog=0:detect_leaks=1:suppressions='"/Users/buildslave/jenkins/workspace/mr-clang-stage1-cmake-RA-expensive/clang-build/tools/clang/runtime/compiler-rt-bins/test/asan/IOSSimX86_64Config/TestCases/Output/strcat-overlap.cc.tmp.supp"' /Users/buildslave/jenkins/workspace/mr-clang-stage1-cmake-RA-expensive/llvm-project/compiler-rt/test/sanitizer_common/ios_commands/iossim_run.py /Users/buildslave/jenkins/workspace/mr-clang-stage1-cmake-RA-expensive/clang-build/tools/clang/runtime/compiler-rt-bins/test/asan/IOSSimX86_64Config/TestCases/Output/strcat-overlap.cc.tmp
: 'RUN: at line 19';   echo "interceptor_name:strcat" > /Users/buildslave/jenkins/workspace/mr-clang-stage1-cmake-RA-expensive/clang-build/tools/clang/runtime/compiler-rt-bins/test/asan/IOSSimX86_64Config/TestCases/Output/strcat-overlap.cc.tmp.supp
: 'RUN: at line 20';   env ASAN_OPTIONS=abort_on_error=0:log_to_syslog=0:detect_leaks=1:suppressions='"/Users/buildslave/jenkins/workspace/mr-clang-stage1-cmake-RA-expensive/clang-build/tools/clang/runtime/compiler-rt-bins/test/asan/IOSSimX86_64Config/TestCases/Output/strcat-overlap.cc.tmp.supp"' /Users/buildslave/jenkins/workspace/mr-clang-stage1-cmake-RA-expensive/llvm-project/compiler-rt/test/sanitizer_common/ios_commands/iossim_run.py /Users/buildslave/jenkins/workspace/mr-clang-stage1-cmake-RA-expensive/clang-build/tools/clang/runtime/compiler-rt-bins/test/asan/IOSSimX86_64Config/TestCases/Output/strcat-overlap.cc.tmp
: 'RUN: at line 22';     /Users/buildslave/jenkins/workspace/mr-clang-stage1-cmake-RA-expensive/llvm-project/compiler-rt/test/sanitizer_common/ios_commands/iossim_compile.py /Users/buildslave/jenkins/workspace/mr-clang-stage1-cmake-RA-expensive/clang-build/./bin/clang  --driver-mode=g++ -fsanitize=address -mno-omit-leaf-frame-pointer -fno-omit-frame-pointer -fno-optimize-sibling-calls -gline-tables-only  -arch x86_64 -isysroot /Applications/Xcode.app/Contents/Developer/Platforms/iPhoneSimulator.platform/Developer/SDKs/iPhoneSimulator12.1.sdk   -shared-libasan -O3 /Users/buildslave/jenkins/workspace/mr-clang-stage1-cmake-RA-expensive/llvm-project/compiler-rt/test/asan/TestCases/strcat-overlap.cc -o /Users/buildslave/jenkins/workspace/mr-clang-stage1-cmake-RA-expensive/clang-build/tools/clang/runtime/compiler-rt-bins/test/asan/IOSSimX86_64Config/TestCases/Output/strcat-overlap.cc.tmp
: 'RUN: at line 23';   not /Users/buildslave/jenkins/workspace/mr-clang-stage1-cmake-RA-expensive/llvm-project/compiler-rt/test/sanitizer_common/ios_commands/iossim_run.py /Users/buildslave/jenkins/workspace/mr-clang-stage1-cmake-RA-expensive/clang-build/tools/clang/runtime/compiler-rt-bins/test/asan/IOSSimX86_64Config/TestCases/Output/strcat-overlap.cc.tmp 2>&1 | FileCheck /Users/buildslave/jenkins/workspace/mr-clang-stage1-cmake-RA-expensive/llvm-project/compiler-rt/test/asan/TestCases/strcat-overlap.cc
: 'RUN: at line 24';   echo "interceptor_via_fun:bad_function" > /Users/buildslave/jenkins/workspace/mr-clang-stage1-cmake-RA-expensive/clang-build/tools/clang/runtime/compiler-rt-bins/test/asan/IOSSimX86_64Config/TestCases/Output/strcat-overlap.cc.tmp.supp
: 'RUN: at line 25';   env ASAN_OPTIONS=abort_on_error=0:log_to_syslog=0:detect_leaks=1:suppressions='"/Users/buildslave/jenkins/workspace/mr-clang-stage1-cmake-RA-expensive/clang-build/tools/clang/runtime/compiler-rt-bins/test/asan/IOSSimX86_64Config/TestCases/Output/strcat-overlap.cc.tmp.supp"' /Users/buildslave/jenkins/workspace/mr-clang-stage1-cmake-RA-expensive/llvm-project/compiler-rt/test/sanitizer_common/ios_commands/iossim_run.py /Users/buildslave/jenkins/workspace/mr-clang-stage1-cmake-RA-expensive/clang-build/tools/clang/runtime/compiler-rt-bins/test/asan/IOSSimX86_64Config/TestCases/Output/strcat-overlap.cc.tmp
: 'RUN: at line 26';   echo "interceptor_name:strcat" > /Users/buildslave/jenkins/workspace/mr-clang-stage1-cmake-RA-expensive/clang-build/tools/clang/runtime/compiler-rt-bins/test/asan/IOSSimX86_64Config/TestCases/Output/strcat-overlap.cc.tmp.supp
: 'RUN: at line 27';   env ASAN_OPTIONS=abort_on_error=0:log_to_syslog=0:detect_leaks=1:suppressions='"/Users/buildslave/jenkins/workspace/mr-clang-stage1-cmake-RA-expensive/clang-build/tools/clang/runtime/compiler-rt-bins/test/asan/IOSSimX86_64Config/TestCases/Output/strcat-overlap.cc.tmp.supp"' /Users/buildslave/jenkins/workspace/mr-clang-stage1-cmake-RA-expensive/llvm-project/compiler-rt/test/sanitizer_common/ios_commands/iossim_run.py /Users/buildslave/jenkins/workspace/mr-clang-stage1-cmake-RA-expensive/clang-build/tools/clang/runtime/compiler-rt-bins/test/asan/IOSSimX86_64Config/TestCases/Output/strcat-overlap.cc.tmp
--
Exit Code: 1

Command Output (stderr):
--
/Users/buildslave/jenkins/workspace/mr-clang-stage1-cmake-RA-expensive/llvm-project/compiler-rt/test/asan/TestCases/strcat-overlap.cc:46:12: error: CHECK: expected string not found in input
 // CHECK: {{#1 0x.* in bad_function.*strcat-overlap.cc:}}[[@LINE+2]]
           ^
<stdin>:12:32: note: scanning from here
 #0 0x105ef83b3 in wrap_strcat (/Users/buildslave/jenkins/workspace/mr-clang-stage1-cmake-RA-expensive/clang-build/lib/clang/10.0.0/lib/darwin/libclang_rt.asan_iossim_dynamic.dylib:x86_64+0x3c3b3)
                               ^
<stdin>:12:32: note: with "@LINE+2" equal to "48"
 #0 0x105ef83b3 in wrap_strcat (/Users/buildslave/jenkins/workspace/mr-clang-stage1-cmake-RA-expensive/clang-build/lib/clang/10.0.0/lib/darwin/libclang_rt.asan_iossim_dynamic.dylib:x86_64+0x3c3b3)
                               ^
<stdin>:13:176: note: possible intended match here
 #1 0x105d86d2e in bad_function() (/Users/buildslave/jenkins/workspace/mr-clang-stage1-cmake-RA-expensive/clang-build/tools/clang/runtime/compiler-rt-bins/test/asan/IOSSimX86_64Config/TestCases/Output/strcat-overlap.cc.tmp:x86_64+0x100000d2e)
                                                                                                                                                                               ^

--

********************
PASS: AddressSanitizer-x86_64-iossim :: TestCases/strchr_strict.c (419 of 479)
PASS: AddressSanitizer-x86_64-iossim :: TestCases/scariness_score_test.cc (420 of 479)
FAIL: AddressSanitizer-x86_64-iossim :: TestCases/strcpy-overlap.cc (421 of 479)
******************** TEST 'AddressSanitizer-x86_64-iossim :: TestCases/strcpy-overlap.cc' FAILED ********************
Script:
--
: 'RUN: at line 1';     /Users/buildslave/jenkins/workspace/mr-clang-stage1-cmake-RA-expensive/llvm-project/compiler-rt/test/sanitizer_common/ios_commands/iossim_compile.py /Users/buildslave/jenkins/workspace/mr-clang-stage1-cmake-RA-expensive/clang-build/./bin/clang  --driver-mode=g++ -fsanitize=address -mno-omit-leaf-frame-pointer -fno-omit-frame-pointer -fno-optimize-sibling-calls -gline-tables-only  -arch x86_64 -isysroot /Applications/Xcode.app/Contents/Developer/Platforms/iPhoneSimulator.platform/Developer/SDKs/iPhoneSimulator12.1.sdk   -shared-libasan -O0 /Users/buildslave/jenkins/workspace/mr-clang-stage1-cmake-RA-expensive/llvm-project/compiler-rt/test/asan/TestCases/strcpy-overlap.cc -o /Users/buildslave/jenkins/workspace/mr-clang-stage1-cmake-RA-expensive/clang-build/tools/clang/runtime/compiler-rt-bins/test/asan/IOSSimX86_64Config/TestCases/Output/strcpy-overlap.cc.tmp
: 'RUN: at line 2';   not /Users/buildslave/jenkins/workspace/mr-clang-stage1-cmake-RA-expensive/llvm-project/compiler-rt/test/sanitizer_common/ios_commands/iossim_run.py /Users/buildslave/jenkins/workspace/mr-clang-stage1-cmake-RA-expensive/clang-build/tools/clang/runtime/compiler-rt-bins/test/asan/IOSSimX86_64Config/TestCases/Output/strcpy-overlap.cc.tmp 2>&1 | FileCheck /Users/buildslave/jenkins/workspace/mr-clang-stage1-cmake-RA-expensive/llvm-project/compiler-rt/test/asan/TestCases/strcpy-overlap.cc
: 'RUN: at line 3';   echo "interceptor_via_fun:bad_function" > /Users/buildslave/jenkins/workspace/mr-clang-stage1-cmake-RA-expensive/clang-build/tools/clang/runtime/compiler-rt-bins/test/asan/IOSSimX86_64Config/TestCases/Output/strcpy-overlap.cc.tmp.supp
: 'RUN: at line 4';   env ASAN_OPTIONS=abort_on_error=0:log_to_syslog=0:detect_leaks=1:suppressions='"/Users/buildslave/jenkins/workspace/mr-clang-stage1-cmake-RA-expensive/clang-build/tools/clang/runtime/compiler-rt-bins/test/asan/IOSSimX86_64Config/TestCases/Output/strcpy-overlap.cc.tmp.supp"' /Users/buildslave/jenkins/workspace/mr-clang-stage1-cmake-RA-expensive/llvm-project/compiler-rt/test/sanitizer_common/ios_commands/iossim_run.py /Users/buildslave/jenkins/workspace/mr-clang-stage1-cmake-RA-expensive/clang-build/tools/clang/runtime/compiler-rt-bins/test/asan/IOSSimX86_64Config/TestCases/Output/strcpy-overlap.cc.tmp
: 'RUN: at line 5';   echo "interceptor_name:strcpy" > /Users/buildslave/jenkins/workspace/mr-clang-stage1-cmake-RA-expensive/clang-build/tools/clang/runtime/compiler-rt-bins/test/asan/IOSSimX86_64Config/TestCases/Output/strcpy-overlap.cc.tmp.supp
: 'RUN: at line 6';   env ASAN_OPTIONS=abort_on_error=0:log_to_syslog=0:detect_leaks=1:suppressions='"/Users/buildslave/jenkins/workspace/mr-clang-stage1-cmake-RA-expensive/clang-build/tools/clang/runtime/compiler-rt-bins/test/asan/IOSSimX86_64Config/TestCases/Output/strcpy-overlap.cc.tmp.supp"' /Users/buildslave/jenkins/workspace/mr-clang-stage1-cmake-RA-expensive/llvm-project/compiler-rt/test/sanitizer_common/ios_commands/iossim_run.py /Users/buildslave/jenkins/workspace/mr-clang-stage1-cmake-RA-expensive/clang-build/tools/clang/runtime/compiler-rt-bins/test/asan/IOSSimX86_64Config/TestCases/Output/strcpy-overlap.cc.tmp
: 'RUN: at line 8';     /Users/buildslave/jenkins/workspace/mr-clang-stage1-cmake-RA-expensive/llvm-project/compiler-rt/test/sanitizer_common/ios_commands/iossim_compile.py /Users/buildslave/jenkins/workspace/mr-clang-stage1-cmake-RA-expensive/clang-build/./bin/clang  --driver-mode=g++ -fsanitize=address -mno-omit-leaf-frame-pointer -fno-omit-frame-pointer -fno-optimize-sibling-calls -gline-tables-only  -arch x86_64 -isysroot /Applications/Xcode.app/Contents/Developer/Platforms/iPhoneSimulator.platform/Developer/SDKs/iPhoneSimulator12.1.sdk   -shared-libasan -O1 /Users/buildslave/jenkins/workspace/mr-clang-stage1-cmake-RA-expensive/llvm-project/compiler-rt/test/asan/TestCases/strcpy-overlap.cc -o /Users/buildslave/jenkins/workspace/mr-clang-stage1-cmake-RA-expensive/clang-build/tools/clang/runtime/compiler-rt-bins/test/asan/IOSSimX86_64Config/TestCases/Output/strcpy-overlap.cc.tmp
: 'RUN: at line 9';   not /Users/buildslave/jenkins/workspace/mr-clang-stage1-cmake-RA-expensive/llvm-project/compiler-rt/test/sanitizer_common/ios_commands/iossim_run.py /Users/buildslave/jenkins/workspace/mr-clang-stage1-cmake-RA-expensive/clang-build/tools/clang/runtime/compiler-rt-bins/test/asan/IOSSimX86_64Config/TestCases/Output/strcpy-overlap.cc.tmp 2>&1 | FileCheck /Users/buildslave/jenkins/workspace/mr-clang-stage1-cmake-RA-expensive/llvm-project/compiler-rt/test/asan/TestCases/strcpy-overlap.cc
: 'RUN: at line 10';   echo "interceptor_via_fun:bad_function" > /Users/buildslave/jenkins/workspace/mr-clang-stage1-cmake-RA-expensive/clang-build/tools/clang/runtime/compiler-rt-bins/test/asan/IOSSimX86_64Config/TestCases/Output/strcpy-overlap.cc.tmp.supp
: 'RUN: at line 11';   env ASAN_OPTIONS=abort_on_error=0:log_to_syslog=0:detect_leaks=1:suppressions='"/Users/buildslave/jenkins/workspace/mr-clang-stage1-cmake-RA-expensive/clang-build/tools/clang/runtime/compiler-rt-bins/test/asan/IOSSimX86_64Config/TestCases/Output/strcpy-overlap.cc.tmp.supp"' /Users/buildslave/jenkins/workspace/mr-clang-stage1-cmake-RA-expensive/llvm-project/compiler-rt/test/sanitizer_common/ios_commands/iossim_run.py /Users/buildslave/jenkins/workspace/mr-clang-stage1-cmake-RA-expensive/clang-build/tools/clang/runtime/compiler-rt-bins/test/asan/IOSSimX86_64Config/TestCases/Output/strcpy-overlap.cc.tmp
: 'RUN: at line 12';   echo "interceptor_name:strcpy" > /Users/buildslave/jenkins/workspace/mr-clang-stage1-cmake-RA-expensive/clang-build/tools/clang/runtime/compiler-rt-bins/test/asan/IOSSimX86_64Config/TestCases/Output/strcpy-overlap.cc.tmp.supp
: 'RUN: at line 13';   env ASAN_OPTIONS=abort_on_error=0:log_to_syslog=0:detect_leaks=1:suppressions='"/Users/buildslave/jenkins/workspace/mr-clang-stage1-cmake-RA-expensive/clang-build/tools/clang/runtime/compiler-rt-bins/test/asan/IOSSimX86_64Config/TestCases/Output/strcpy-overlap.cc.tmp.supp"' /Users/buildslave/jenkins/workspace/mr-clang-stage1-cmake-RA-expensive/llvm-project/compiler-rt/test/sanitizer_common/ios_commands/iossim_run.py /Users/buildslave/jenkins/workspace/mr-clang-stage1-cmake-RA-expensive/clang-build/tools/clang/runtime/compiler-rt-bins/test/asan/IOSSimX86_64Config/TestCases/Output/strcpy-overlap.cc.tmp
: 'RUN: at line 15';     /Users/buildslave/jenkins/workspace/mr-clang-stage1-cmake-RA-expensive/llvm-project/compiler-rt/test/sanitizer_common/ios_commands/iossim_compile.py /Users/buildslave/jenkins/workspace/mr-clang-stage1-cmake-RA-expensive/clang-build/./bin/clang  --driver-mode=g++ -fsanitize=address -mno-omit-leaf-frame-pointer -fno-omit-frame-pointer -fno-optimize-sibling-calls -gline-tables-only  -arch x86_64 -isysroot /Applications/Xcode.app/Contents/Developer/Platforms/iPhoneSimulator.platform/Developer/SDKs/iPhoneSimulator12.1.sdk   -shared-libasan -O2 /Users/buildslave/jenkins/workspace/mr-clang-stage1-cmake-RA-expensive/llvm-project/compiler-rt/test/asan/TestCases/strcpy-overlap.cc -o /Users/buildslave/jenkins/workspace/mr-clang-stage1-cmake-RA-expensive/clang-build/tools/clang/runtime/compiler-rt-bins/test/asan/IOSSimX86_64Config/TestCases/Output/strcpy-overlap.cc.tmp
: 'RUN: at line 16';   not /Users/buildslave/jenkins/workspace/mr-clang-stage1-cmake-RA-expensive/llvm-project/compiler-rt/test/sanitizer_common/ios_commands/iossim_run.py /Users/buildslave/jenkins/workspace/mr-clang-stage1-cmake-RA-expensive/clang-build/tools/clang/runtime/compiler-rt-bins/test/asan/IOSSimX86_64Config/TestCases/Output/strcpy-overlap.cc.tmp 2>&1 | FileCheck /Users/buildslave/jenkins/workspace/mr-clang-stage1-cmake-RA-expensive/llvm-project/compiler-rt/test/asan/TestCases/strcpy-overlap.cc
: 'RUN: at line 17';   echo "interceptor_via_fun:bad_function" > /Users/buildslave/jenkins/workspace/mr-clang-stage1-cmake-RA-expensive/clang-build/tools/clang/runtime/compiler-rt-bins/test/asan/IOSSimX86_64Config/TestCases/Output/strcpy-overlap.cc.tmp.supp
: 'RUN: at line 18';   env ASAN_OPTIONS=abort_on_error=0:log_to_syslog=0:detect_leaks=1:suppressions='"/Users/buildslave/jenkins/workspace/mr-clang-stage1-cmake-RA-expensive/clang-build/tools/clang/runtime/compiler-rt-bins/test/asan/IOSSimX86_64Config/TestCases/Output/strcpy-overlap.cc.tmp.supp"' /Users/buildslave/jenkins/workspace/mr-clang-stage1-cmake-RA-expensive/llvm-project/compiler-rt/test/sanitizer_common/ios_commands/iossim_run.py /Users/buildslave/jenkins/workspace/mr-clang-stage1-cmake-RA-expensive/clang-build/tools/clang/runtime/compiler-rt-bins/test/asan/IOSSimX86_64Config/TestCases/Output/strcpy-overlap.cc.tmp
: 'RUN: at line 19';   echo "interceptor_name:strcpy" > /Users/buildslave/jenkins/workspace/mr-clang-stage1-cmake-RA-expensive/clang-build/tools/clang/runtime/compiler-rt-bins/test/asan/IOSSimX86_64Config/TestCases/Output/strcpy-overlap.cc.tmp.supp
: 'RUN: at line 20';   env ASAN_OPTIONS=abort_on_error=0:log_to_syslog=0:detect_leaks=1:suppressions='"/Users/buildslave/jenkins/workspace/mr-clang-stage1-cmake-RA-expensive/clang-build/tools/clang/runtime/compiler-rt-bins/test/asan/IOSSimX86_64Config/TestCases/Output/strcpy-overlap.cc.tmp.supp"' /Users/buildslave/jenkins/workspace/mr-clang-stage1-cmake-RA-expensive/llvm-project/compiler-rt/test/sanitizer_common/ios_commands/iossim_run.py /Users/buildslave/jenkins/workspace/mr-clang-stage1-cmake-RA-expensive/clang-build/tools/clang/runtime/compiler-rt-bins/test/asan/IOSSimX86_64Config/TestCases/Output/strcpy-overlap.cc.tmp
: 'RUN: at line 22';     /Users/buildslave/jenkins/workspace/mr-clang-stage1-cmake-RA-expensive/llvm-project/compiler-rt/test/sanitizer_common/ios_commands/iossim_compile.py /Users/buildslave/jenkins/workspace/mr-clang-stage1-cmake-RA-expensive/clang-build/./bin/clang  --driver-mode=g++ -fsanitize=address -mno-omit-leaf-frame-pointer -fno-omit-frame-pointer -fno-optimize-sibling-calls -gline-tables-only  -arch x86_64 -isysroot /Applications/Xcode.app/Contents/Developer/Platforms/iPhoneSimulator.platform/Developer/SDKs/iPhoneSimulator12.1.sdk   -shared-libasan -O3 /Users/buildslave/jenkins/workspace/mr-clang-stage1-cmake-RA-expensive/llvm-project/compiler-rt/test/asan/TestCases/strcpy-overlap.cc -o /Users/buildslave/jenkins/workspace/mr-clang-stage1-cmake-RA-expensive/clang-build/tools/clang/runtime/compiler-rt-bins/test/asan/IOSSimX86_64Config/TestCases/Output/strcpy-overlap.cc.tmp
: 'RUN: at line 23';   not /Users/buildslave/jenkins/workspace/mr-clang-stage1-cmake-RA-expensive/llvm-project/compiler-rt/test/sanitizer_common/ios_commands/iossim_run.py /Users/buildslave/jenkins/workspace/mr-clang-stage1-cmake-RA-expensive/clang-build/tools/clang/runtime/compiler-rt-bins/test/asan/IOSSimX86_64Config/TestCases/Output/strcpy-overlap.cc.tmp 2>&1 | FileCheck /Users/buildslave/jenkins/workspace/mr-clang-stage1-cmake-RA-expensive/llvm-project/compiler-rt/test/asan/TestCases/strcpy-overlap.cc
: 'RUN: at line 24';   echo "interceptor_via_fun:bad_function" > /Users/buildslave/jenkins/workspace/mr-clang-stage1-cmake-RA-expensive/clang-build/tools/clang/runtime/compiler-rt-bins/test/asan/IOSSimX86_64Config/TestCases/Output/strcpy-overlap.cc.tmp.supp
: 'RUN: at line 25';   env ASAN_OPTIONS=abort_on_error=0:log_to_syslog=0:detect_leaks=1:suppressions='"/Users/buildslave/jenkins/workspace/mr-clang-stage1-cmake-RA-expensive/clang-build/tools/clang/runtime/compiler-rt-bins/test/asan/IOSSimX86_64Config/TestCases/Output/strcpy-overlap.cc.tmp.supp"' /Users/buildslave/jenkins/workspace/mr-clang-stage1-cmake-RA-expensive/llvm-project/compiler-rt/test/sanitizer_common/ios_commands/iossim_run.py /Users/buildslave/jenkins/workspace/mr-clang-stage1-cmake-RA-expensive/clang-build/tools/clang/runtime/compiler-rt-bins/test/asan/IOSSimX86_64Config/TestCases/Output/strcpy-overlap.cc.tmp
: 'RUN: at line 26';   echo "interceptor_name:strcpy" > /Users/buildslave/jenkins/workspace/mr-clang-stage1-cmake-RA-expensive/clang-build/tools/clang/runtime/compiler-rt-bins/test/asan/IOSSimX86_64Config/TestCases/Output/strcpy-overlap.cc.tmp.supp
: 'RUN: at line 27';   env ASAN_OPTIONS=abort_on_error=0:log_to_syslog=0:detect_leaks=1:suppressions='"/Users/buildslave/jenkins/workspace/mr-clang-stage1-cmake-RA-expensive/clang-build/tools/clang/runtime/compiler-rt-bins/test/asan/IOSSimX86_64Config/TestCases/Output/strcpy-overlap.cc.tmp.supp"' /Users/buildslave/jenkins/workspace/mr-clang-stage1-cmake-RA-expensive/llvm-project/compiler-rt/test/sanitizer_common/ios_commands/iossim_run.py /Users/buildslave/jenkins/workspace/mr-clang-stage1-cmake-RA-expensive/clang-build/tools/clang/runtime/compiler-rt-bins/test/asan/IOSSimX86_64Config/TestCases/Output/strcpy-overlap.cc.tmp
--
Exit Code: 1

Command Output (stderr):
--
/Users/buildslave/jenkins/workspace/mr-clang-stage1-cmake-RA-expensive/llvm-project/compiler-rt/test/asan/TestCases/strcpy-overlap.cc:40:12: error: CHECK: expected string not found in input
 // CHECK: {{#1 0x.* in bad_function.*strcpy-overlap.cc:}}[[@LINE+2]]
           ^
<stdin>:12:32: note: scanning from here
 #0 0x10ede6adc in wrap_strcpy (/Users/buildslave/jenkins/workspace/mr-clang-stage1-cmake-RA-expensive/clang-build/lib/clang/10.0.0/lib/darwin/libclang_rt.asan_iossim_dynamic.dylib:x86_64+0x3cadc)
                               ^
<stdin>:12:32: note: with "@LINE+2" equal to "42"
 #0 0x10ede6adc in wrap_strcpy (/Users/buildslave/jenkins/workspace/mr-clang-stage1-cmake-RA-expensive/clang-build/lib/clang/10.0.0/lib/darwin/libclang_rt.asan_iossim_dynamic.dylib:x86_64+0x3cadc)
                               ^
<stdin>:13:176: note: possible intended match here
 #1 0x10ec74d3c in bad_function() (/Users/buildslave/jenkins/workspace/mr-clang-stage1-cmake-RA-expensive/clang-build/tools/clang/runtime/compiler-rt-bins/test/asan/IOSSimX86_64Config/TestCases/Output/strcpy-overlap.cc.tmp:x86_64+0x100000d3c)
                                                                                                                                                                               ^

--

********************
PASS: AddressSanitizer-x86_64-iossim :: TestCases/strcmp_strict.c (422 of 479)
PASS: AddressSanitizer-x86_64-iossim :: TestCases/strcat_strict.c (423 of 479)
PASS: AddressSanitizer-x86_64-iossim :: TestCases/strcspn-2.c (424 of 479)
UNSUPPORTED: AddressSanitizer-x86_64-iossim :: TestCases/strdup_oob_test.cc (425 of 479)
PASS: AddressSanitizer-x86_64-iossim :: TestCases/strcspn-1.c (426 of 479)
PASS: AddressSanitizer-x86_64-iossim :: TestCases/strcspn_strict.c (427 of 479)
FAIL: AddressSanitizer-x86_64-iossim :: TestCases/strip_path_prefix.c (428 of 479)
******************** TEST 'AddressSanitizer-x86_64-iossim :: TestCases/strip_path_prefix.c' FAILED ********************
Script:
--
: 'RUN: at line 1';     /Users/buildslave/jenkins/workspace/mr-clang-stage1-cmake-RA-expensive/llvm-project/compiler-rt/test/sanitizer_common/ios_commands/iossim_compile.py /Users/buildslave/jenkins/workspace/mr-clang-stage1-cmake-RA-expensive/clang-build/./bin/clang  -fsanitize=address -mno-omit-leaf-frame-pointer -fno-omit-frame-pointer -fno-optimize-sibling-calls -gline-tables-only  -arch x86_64 -isysroot /Applications/Xcode.app/Contents/Developer/Platforms/iPhoneSimulator.platform/Developer/SDKs/iPhoneSimulator12.1.sdk   -shared-libasan -O2 /Users/buildslave/jenkins/workspace/mr-clang-stage1-cmake-RA-expensive/llvm-project/compiler-rt/test/asan/TestCases/strip_path_prefix.c -o /Users/buildslave/jenkins/workspace/mr-clang-stage1-cmake-RA-expensive/clang-build/tools/clang/runtime/compiler-rt-bins/test/asan/IOSSimX86_64Config/TestCases/Output/strip_path_prefix.c.tmp
: 'RUN: at line 2';   env ASAN_OPTIONS=abort_on_error=0:log_to_syslog=0:detect_leaks=1:strip_path_prefix='"/Users/buildslave/jenkins/workspace/mr-clang-stage1-cmake-RA-expensive/llvm-project/compiler-rt/test/asan/TestCases/"' not /Users/buildslave/jenkins/workspace/mr-clang-stage1-cmake-RA-expensive/llvm-project/compiler-rt/test/sanitizer_common/ios_commands/iossim_run.py /Users/buildslave/jenkins/workspace/mr-clang-stage1-cmake-RA-expensive/clang-build/tools/clang/runtime/compiler-rt-bins/test/asan/IOSSimX86_64Config/TestCases/Output/strip_path_prefix.c.tmp 2>&1 | FileCheck /Users/buildslave/jenkins/workspace/mr-clang-stage1-cmake-RA-expensive/llvm-project/compiler-rt/test/asan/TestCases/strip_path_prefix.c
--
Exit Code: 1

Command Output (stderr):
--
/Users/buildslave/jenkins/workspace/mr-clang-stage1-cmake-RA-expensive/llvm-project/compiler-rt/test/asan/TestCases/strip_path_prefix.c:11:12: error: CHECK: expected string not found in input
 // CHECK: #0 0x{{.*}} in main {{.*}}strip_path_prefix.c:[[@LINE-3]]
           ^
<stdin>:2:55: note: scanning from here
==25016==ERROR: AddressSanitizer: heap-use-after-free on address 0x602000000155 at pc 0x00010a4e6f32 bp 0x7ffee5718b50 sp 0x7ffee5718b48
                                                      ^
<stdin>:2:55: note: with "@LINE-3" equal to "8"
==25016==ERROR: AddressSanitizer: heap-use-after-free on address 0x602000000155 at pc 0x00010a4e6f32 bp 0x7ffee5718b50 sp 0x7ffee5718b48
                                                      ^
<stdin>:4:24: note: possible intended match here
atos[25017]: atos cannot examine process 25016 (strip_path_prefix.c.tmp) for unknown reasons, even though it appears to exist; try running with `sudo`.
                       ^

--

********************
FAIL: AddressSanitizer-x86_64-iossim :: TestCases/strncat-overlap.cc (429 of 479)
******************** TEST 'AddressSanitizer-x86_64-iossim :: TestCases/strncat-overlap.cc' FAILED ********************
Script:
--
: 'RUN: at line 1';     /Users/buildslave/jenkins/workspace/mr-clang-stage1-cmake-RA-expensive/llvm-project/compiler-rt/test/sanitizer_common/ios_commands/iossim_compile.py /Users/buildslave/jenkins/workspace/mr-clang-stage1-cmake-RA-expensive/clang-build/./bin/clang  --driver-mode=g++ -fsanitize=address -mno-omit-leaf-frame-pointer -fno-omit-frame-pointer -fno-optimize-sibling-calls -gline-tables-only  -arch x86_64 -isysroot /Applications/Xcode.app/Contents/Developer/Platforms/iPhoneSimulator.platform/Developer/SDKs/iPhoneSimulator12.1.sdk   -shared-libasan -O0 /Users/buildslave/jenkins/workspace/mr-clang-stage1-cmake-RA-expensive/llvm-project/compiler-rt/test/asan/TestCases/strncat-overlap.cc -o /Users/buildslave/jenkins/workspace/mr-clang-stage1-cmake-RA-expensive/clang-build/tools/clang/runtime/compiler-rt-bins/test/asan/IOSSimX86_64Config/TestCases/Output/strncat-overlap.cc.tmp
: 'RUN: at line 2';   not /Users/buildslave/jenkins/workspace/mr-clang-stage1-cmake-RA-expensive/llvm-project/compiler-rt/test/sanitizer_common/ios_commands/iossim_run.py /Users/buildslave/jenkins/workspace/mr-clang-stage1-cmake-RA-expensive/clang-build/tools/clang/runtime/compiler-rt-bins/test/asan/IOSSimX86_64Config/TestCases/Output/strncat-overlap.cc.tmp 2>&1 | FileCheck /Users/buildslave/jenkins/workspace/mr-clang-stage1-cmake-RA-expensive/llvm-project/compiler-rt/test/asan/TestCases/strncat-overlap.cc
: 'RUN: at line 3';   echo "interceptor_via_fun:bad_function" > /Users/buildslave/jenkins/workspace/mr-clang-stage1-cmake-RA-expensive/clang-build/tools/clang/runtime/compiler-rt-bins/test/asan/IOSSimX86_64Config/TestCases/Output/strncat-overlap.cc.tmp.supp
: 'RUN: at line 4';   env ASAN_OPTIONS=abort_on_error=0:log_to_syslog=0:detect_leaks=1:suppressions='"/Users/buildslave/jenkins/workspace/mr-clang-stage1-cmake-RA-expensive/clang-build/tools/clang/runtime/compiler-rt-bins/test/asan/IOSSimX86_64Config/TestCases/Output/strncat-overlap.cc.tmp.supp"' /Users/buildslave/jenkins/workspace/mr-clang-stage1-cmake-RA-expensive/llvm-project/compiler-rt/test/sanitizer_common/ios_commands/iossim_run.py /Users/buildslave/jenkins/workspace/mr-clang-stage1-cmake-RA-expensive/clang-build/tools/clang/runtime/compiler-rt-bins/test/asan/IOSSimX86_64Config/TestCases/Output/strncat-overlap.cc.tmp
: 'RUN: at line 5';   echo "interceptor_name:strncat" > /Users/buildslave/jenkins/workspace/mr-clang-stage1-cmake-RA-expensive/clang-build/tools/clang/runtime/compiler-rt-bins/test/asan/IOSSimX86_64Config/TestCases/Output/strncat-overlap.cc.tmp.supp
: 'RUN: at line 6';   env ASAN_OPTIONS=abort_on_error=0:log_to_syslog=0:detect_leaks=1:suppressions='"/Users/buildslave/jenkins/workspace/mr-clang-stage1-cmake-RA-expensive/clang-build/tools/clang/runtime/compiler-rt-bins/test/asan/IOSSimX86_64Config/TestCases/Output/strncat-overlap.cc.tmp.supp"' /Users/buildslave/jenkins/workspace/mr-clang-stage1-cmake-RA-expensive/llvm-project/compiler-rt/test/sanitizer_common/ios_commands/iossim_run.py /Users/buildslave/jenkins/workspace/mr-clang-stage1-cmake-RA-expensive/clang-build/tools/clang/runtime/compiler-rt-bins/test/asan/IOSSimX86_64Config/TestCases/Output/strncat-overlap.cc.tmp
: 'RUN: at line 8';     /Users/buildslave/jenkins/workspace/mr-clang-stage1-cmake-RA-expensive/llvm-project/compiler-rt/test/sanitizer_common/ios_commands/iossim_compile.py /Users/buildslave/jenkins/workspace/mr-clang-stage1-cmake-RA-expensive/clang-build/./bin/clang  --driver-mode=g++ -fsanitize=address -mno-omit-leaf-frame-pointer -fno-omit-frame-pointer -fno-optimize-sibling-calls -gline-tables-only  -arch x86_64 -isysroot /Applications/Xcode.app/Contents/Developer/Platforms/iPhoneSimulator.platform/Developer/SDKs/iPhoneSimulator12.1.sdk   -shared-libasan -O1 /Users/buildslave/jenkins/workspace/mr-clang-stage1-cmake-RA-expensive/llvm-project/compiler-rt/test/asan/TestCases/strncat-overlap.cc -o /Users/buildslave/jenkins/workspace/mr-clang-stage1-cmake-RA-expensive/clang-build/tools/clang/runtime/compiler-rt-bins/test/asan/IOSSimX86_64Config/TestCases/Output/strncat-overlap.cc.tmp
: 'RUN: at line 9';   not /Users/buildslave/jenkins/workspace/mr-clang-stage1-cmake-RA-expensive/llvm-project/compiler-rt/test/sanitizer_common/ios_commands/iossim_run.py /Users/buildslave/jenkins/workspace/mr-clang-stage1-cmake-RA-expensive/clang-build/tools/clang/runtime/compiler-rt-bins/test/asan/IOSSimX86_64Config/TestCases/Output/strncat-overlap.cc.tmp 2>&1 | FileCheck /Users/buildslave/jenkins/workspace/mr-clang-stage1-cmake-RA-expensive/llvm-project/compiler-rt/test/asan/TestCases/strncat-overlap.cc
: 'RUN: at line 10';   echo "interceptor_via_fun:bad_function" > /Users/buildslave/jenkins/workspace/mr-clang-stage1-cmake-RA-expensive/clang-build/tools/clang/runtime/compiler-rt-bins/test/asan/IOSSimX86_64Config/TestCases/Output/strncat-overlap.cc.tmp.supp
: 'RUN: at line 11';   env ASAN_OPTIONS=abort_on_error=0:log_to_syslog=0:detect_leaks=1:suppressions='"/Users/buildslave/jenkins/workspace/mr-clang-stage1-cmake-RA-expensive/clang-build/tools/clang/runtime/compiler-rt-bins/test/asan/IOSSimX86_64Config/TestCases/Output/strncat-overlap.cc.tmp.supp"' /Users/buildslave/jenkins/workspace/mr-clang-stage1-cmake-RA-expensive/llvm-project/compiler-rt/test/sanitizer_common/ios_commands/iossim_run.py /Users/buildslave/jenkins/workspace/mr-clang-stage1-cmake-RA-expensive/clang-build/tools/clang/runtime/compiler-rt-bins/test/asan/IOSSimX86_64Config/TestCases/Output/strncat-overlap.cc.tmp
: 'RUN: at line 12';   echo "interceptor_name:strncat" > /Users/buildslave/jenkins/workspace/mr-clang-stage1-cmake-RA-expensive/clang-build/tools/clang/runtime/compiler-rt-bins/test/asan/IOSSimX86_64Config/TestCases/Output/strncat-overlap.cc.tmp.supp
: 'RUN: at line 13';   env ASAN_OPTIONS=abort_on_error=0:log_to_syslog=0:detect_leaks=1:suppressions='"/Users/buildslave/jenkins/workspace/mr-clang-stage1-cmake-RA-expensive/clang-build/tools/clang/runtime/compiler-rt-bins/test/asan/IOSSimX86_64Config/TestCases/Output/strncat-overlap.cc.tmp.supp"' /Users/buildslave/jenkins/workspace/mr-clang-stage1-cmake-RA-expensive/llvm-project/compiler-rt/test/sanitizer_common/ios_commands/iossim_run.py /Users/buildslave/jenkins/workspace/mr-clang-stage1-cmake-RA-expensive/clang-build/tools/clang/runtime/compiler-rt-bins/test/asan/IOSSimX86_64Config/TestCases/Output/strncat-overlap.cc.tmp
: 'RUN: at line 15';     /Users/buildslave/jenkins/workspace/mr-clang-stage1-cmake-RA-expensive/llvm-project/compiler-rt/test/sanitizer_common/ios_commands/iossim_compile.py /Users/buildslave/jenkins/workspace/mr-clang-stage1-cmake-RA-expensive/clang-build/./bin/clang  --driver-mode=g++ -fsanitize=address -mno-omit-leaf-frame-pointer -fno-omit-frame-pointer -fno-optimize-sibling-calls -gline-tables-only  -arch x86_64 -isysroot /Applications/Xcode.app/Contents/Developer/Platforms/iPhoneSimulator.platform/Developer/SDKs/iPhoneSimulator12.1.sdk   -shared-libasan -O2 /Users/buildslave/jenkins/workspace/mr-clang-stage1-cmake-RA-expensive/llvm-project/compiler-rt/test/asan/TestCases/strncat-overlap.cc -o /Users/buildslave/jenkins/workspace/mr-clang-stage1-cmake-RA-expensive/clang-build/tools/clang/runtime/compiler-rt-bins/test/asan/IOSSimX86_64Config/TestCases/Output/strncat-overlap.cc.tmp
: 'RUN: at line 16';   not /Users/buildslave/jenkins/workspace/mr-clang-stage1-cmake-RA-expensive/llvm-project/compiler-rt/test/sanitizer_common/ios_commands/iossim_run.py /Users/buildslave/jenkins/workspace/mr-clang-stage1-cmake-RA-expensive/clang-build/tools/clang/runtime/compiler-rt-bins/test/asan/IOSSimX86_64Config/TestCases/Output/strncat-overlap.cc.tmp 2>&1 | FileCheck /Users/buildslave/jenkins/workspace/mr-clang-stage1-cmake-RA-expensive/llvm-project/compiler-rt/test/asan/TestCases/strncat-overlap.cc
: 'RUN: at line 17';   echo "interceptor_via_fun:bad_function" > /Users/buildslave/jenkins/workspace/mr-clang-stage1-cmake-RA-expensive/clang-build/tools/clang/runtime/compiler-rt-bins/test/asan/IOSSimX86_64Config/TestCases/Output/strncat-overlap.cc.tmp.supp
: 'RUN: at line 18';   env ASAN_OPTIONS=abort_on_error=0:log_to_syslog=0:detect_leaks=1:suppressions='"/Users/buildslave/jenkins/workspace/mr-clang-stage1-cmake-RA-expensive/clang-build/tools/clang/runtime/compiler-rt-bins/test/asan/IOSSimX86_64Config/TestCases/Output/strncat-overlap.cc.tmp.supp"' /Users/buildslave/jenkins/workspace/mr-clang-stage1-cmake-RA-expensive/llvm-project/compiler-rt/test/sanitizer_common/ios_commands/iossim_run.py /Users/buildslave/jenkins/workspace/mr-clang-stage1-cmake-RA-expensive/clang-build/tools/clang/runtime/compiler-rt-bins/test/asan/IOSSimX86_64Config/TestCases/Output/strncat-overlap.cc.tmp
: 'RUN: at line 19';   echo "interceptor_name:strncat" > /Users/buildslave/jenkins/workspace/mr-clang-stage1-cmake-RA-expensive/clang-build/tools/clang/runtime/compiler-rt-bins/test/asan/IOSSimX86_64Config/TestCases/Output/strncat-overlap.cc.tmp.supp
: 'RUN: at line 20';   env ASAN_OPTIONS=abort_on_error=0:log_to_syslog=0:detect_leaks=1:suppressions='"/Users/buildslave/jenkins/workspace/mr-clang-stage1-cmake-RA-expensive/clang-build/tools/clang/runtime/compiler-rt-bins/test/asan/IOSSimX86_64Config/TestCases/Output/strncat-overlap.cc.tmp.supp"' /Users/buildslave/jenkins/workspace/mr-clang-stage1-cmake-RA-expensive/llvm-project/compiler-rt/test/sanitizer_common/ios_commands/iossim_run.py /Users/buildslave/jenkins/workspace/mr-clang-stage1-cmake-RA-expensive/clang-build/tools/clang/runtime/compiler-rt-bins/test/asan/IOSSimX86_64Config/TestCases/Output/strncat-overlap.cc.tmp
: 'RUN: at line 22';     /Users/buildslave/jenkins/workspace/mr-clang-stage1-cmake-RA-expensive/llvm-project/compiler-rt/test/sanitizer_common/ios_commands/iossim_compile.py /Users/buildslave/jenkins/workspace/mr-clang-stage1-cmake-RA-expensive/clang-build/./bin/clang  --driver-mode=g++ -fsanitize=address -mno-omit-leaf-frame-pointer -fno-omit-frame-pointer -fno-optimize-sibling-calls -gline-tables-only  -arch x86_64 -isysroot /Applications/Xcode.app/Contents/Developer/Platforms/iPhoneSimulator.platform/Developer/SDKs/iPhoneSimulator12.1.sdk   -shared-libasan -O3 /Users/buildslave/jenkins/workspace/mr-clang-stage1-cmake-RA-expensive/llvm-project/compiler-rt/test/asan/TestCases/strncat-overlap.cc -o /Users/buildslave/jenkins/workspace/mr-clang-stage1-cmake-RA-expensive/clang-build/tools/clang/runtime/compiler-rt-bins/test/asan/IOSSimX86_64Config/TestCases/Output/strncat-overlap.cc.tmp
: 'RUN: at line 23';   not /Users/buildslave/jenkins/workspace/mr-clang-stage1-cmake-RA-expensive/llvm-project/compiler-rt/test/sanitizer_common/ios_commands/iossim_run.py /Users/buildslave/jenkins/workspace/mr-clang-stage1-cmake-RA-expensive/clang-build/tools/clang/runtime/compiler-rt-bins/test/asan/IOSSimX86_64Config/TestCases/Output/strncat-overlap.cc.tmp 2>&1 | FileCheck /Users/buildslave/jenkins/workspace/mr-clang-stage1-cmake-RA-expensive/llvm-project/compiler-rt/test/asan/TestCases/strncat-overlap.cc
: 'RUN: at line 24';   echo "interceptor_via_fun:bad_function" > /Users/buildslave/jenkins/workspace/mr-clang-stage1-cmake-RA-expensive/clang-build/tools/clang/runtime/compiler-rt-bins/test/asan/IOSSimX86_64Config/TestCases/Output/strncat-overlap.cc.tmp.supp
: 'RUN: at line 25';   env ASAN_OPTIONS=abort_on_error=0:log_to_syslog=0:detect_leaks=1:suppressions='"/Users/buildslave/jenkins/workspace/mr-clang-stage1-cmake-RA-expensive/clang-build/tools/clang/runtime/compiler-rt-bins/test/asan/IOSSimX86_64Config/TestCases/Output/strncat-overlap.cc.tmp.supp"' /Users/buildslave/jenkins/workspace/mr-clang-stage1-cmake-RA-expensive/llvm-project/compiler-rt/test/sanitizer_common/ios_commands/iossim_run.py /Users/buildslave/jenkins/workspace/mr-clang-stage1-cmake-RA-expensive/clang-build/tools/clang/runtime/compiler-rt-bins/test/asan/IOSSimX86_64Config/TestCases/Output/strncat-overlap.cc.tmp
: 'RUN: at line 26';   echo "interceptor_name:strncat" > /Users/buildslave/jenkins/workspace/mr-clang-stage1-cmake-RA-expensive/clang-build/tools/clang/runtime/compiler-rt-bins/test/asan/IOSSimX86_64Config/TestCases/Output/strncat-overlap.cc.tmp.supp
: 'RUN: at line 27';   env ASAN_OPTIONS=abort_on_error=0:log_to_syslog=0:detect_leaks=1:suppressions='"/Users/buildslave/jenkins/workspace/mr-clang-stage1-cmake-RA-expensive/clang-build/tools/clang/runtime/compiler-rt-bins/test/asan/IOSSimX86_64Config/TestCases/Output/strncat-overlap.cc.tmp.supp"' /Users/buildslave/jenkins/workspace/mr-clang-stage1-cmake-RA-expensive/llvm-project/compiler-rt/test/sanitizer_common/ios_commands/iossim_run.py /Users/buildslave/jenkins/workspace/mr-clang-stage1-cmake-RA-expensive/clang-build/tools/clang/runtime/compiler-rt-bins/test/asan/IOSSimX86_64Config/TestCases/Output/strncat-overlap.cc.tmp
--
Exit Code: 1

Command Output (stderr):
--
/Users/buildslave/jenkins/workspace/mr-clang-stage1-cmake-RA-expensive/llvm-project/compiler-rt/test/asan/TestCases/strncat-overlap.cc:40:12: error: CHECK: expected string not found in input
 // CHECK: {{#1 0x.* in bad_function.*strncat-overlap.cc:}}[[@LINE+2]]
           ^
<stdin>:12:33: note: scanning from here
 #0 0x10b20b954 in wrap_strncat (/Users/buildslave/jenkins/workspace/mr-clang-stage1-cmake-RA-expensive/clang-build/lib/clang/10.0.0/lib/darwin/libclang_rt.asan_iossim_dynamic.dylib:x86_64+0x3c954)
                                ^
<stdin>:12:33: note: with "@LINE+2" equal to "42"
 #0 0x10b20b954 in wrap_strncat (/Users/buildslave/jenkins/workspace/mr-clang-stage1-cmake-RA-expensive/clang-build/lib/clang/10.0.0/lib/darwin/libclang_rt.asan_iossim_dynamic.dylib:x86_64+0x3c954)
                                ^
<stdin>:13:176: note: possible intended match here
 #1 0x10b099d33 in bad_function() (/Users/buildslave/jenkins/workspace/mr-clang-stage1-cmake-RA-expensive/clang-build/tools/clang/runtime/compiler-rt-bins/test/asan/IOSSimX86_64Config/TestCases/Output/strncat-overlap.cc.tmp:x86_64+0x100000d33)
                                                                                                                                                                               ^

--

********************
PASS: AddressSanitizer-x86_64-iossim :: TestCases/strncat_strict.c (430 of 479)
FAIL: AddressSanitizer-x86_64-iossim :: TestCases/strncpy-overflow.cc (431 of 479)
******************** TEST 'AddressSanitizer-x86_64-iossim :: TestCases/strncpy-overflow.cc' FAILED ********************
Script:
--
: 'RUN: at line 1';     /Users/buildslave/jenkins/workspace/mr-clang-stage1-cmake-RA-expensive/llvm-project/compiler-rt/test/sanitizer_common/ios_commands/iossim_compile.py /Users/buildslave/jenkins/workspace/mr-clang-stage1-cmake-RA-expensive/clang-build/./bin/clang  --driver-mode=g++ -fsanitize=address -mno-omit-leaf-frame-pointer -fno-omit-frame-pointer -fno-optimize-sibling-calls -gline-tables-only  -arch x86_64 -isysroot /Applications/Xcode.app/Contents/Developer/Platforms/iPhoneSimulator.platform/Developer/SDKs/iPhoneSimulator12.1.sdk   -shared-libasan -O0 /Users/buildslave/jenkins/workspace/mr-clang-stage1-cmake-RA-expensive/llvm-project/compiler-rt/test/asan/TestCases/strncpy-overflow.cc -o /Users/buildslave/jenkins/workspace/mr-clang-stage1-cmake-RA-expensive/clang-build/tools/clang/runtime/compiler-rt-bins/test/asan/IOSSimX86_64Config/TestCases/Output/strncpy-overflow.cc.tmp && not /Users/buildslave/jenkins/workspace/mr-clang-stage1-cmake-RA-expensive/llvm-project/compiler-rt/test/sanitizer_common/ios_commands/iossim_run.py /Users/buildslave/jenkins/workspace/mr-clang-stage1-cmake-RA-expensive/clang-build/tools/clang/runtime/compiler-rt-bins/test/asan/IOSSimX86_64Config/TestCases/Output/strncpy-overflow.cc.tmp 2>&1 | FileCheck /Users/buildslave/jenkins/workspace/mr-clang-stage1-cmake-RA-expensive/llvm-project/compiler-rt/test/asan/TestCases/strncpy-overflow.cc --check-prefix=CHECK-Darwin --check-prefix=CHECK
: 'RUN: at line 2';     /Users/buildslave/jenkins/workspace/mr-clang-stage1-cmake-RA-expensive/llvm-project/compiler-rt/test/sanitizer_common/ios_commands/iossim_compile.py /Users/buildslave/jenkins/workspace/mr-clang-stage1-cmake-RA-expensive/clang-build/./bin/clang  --driver-mode=g++ -fsanitize=address -mno-omit-leaf-frame-pointer -fno-omit-frame-pointer -fno-optimize-sibling-calls -gline-tables-only  -arch x86_64 -isysroot /Applications/Xcode.app/Contents/Developer/Platforms/iPhoneSimulator.platform/Developer/SDKs/iPhoneSimulator12.1.sdk   -shared-libasan -O1 /Users/buildslave/jenkins/workspace/mr-clang-stage1-cmake-RA-expensive/llvm-project/compiler-rt/test/asan/TestCases/strncpy-overflow.cc -o /Users/buildslave/jenkins/workspace/mr-clang-stage1-cmake-RA-expensive/clang-build/tools/clang/runtime/compiler-rt-bins/test/asan/IOSSimX86_64Config/TestCases/Output/strncpy-overflow.cc.tmp && not /Users/buildslave/jenkins/workspace/mr-clang-stage1-cmake-RA-expensive/llvm-project/compiler-rt/test/sanitizer_common/ios_commands/iossim_run.py /Users/buildslave/jenkins/workspace/mr-clang-stage1-cmake-RA-expensive/clang-build/tools/clang/runtime/compiler-rt-bins/test/asan/IOSSimX86_64Config/TestCases/Output/strncpy-overflow.cc.tmp 2>&1 | FileCheck /Users/buildslave/jenkins/workspace/mr-clang-stage1-cmake-RA-expensive/llvm-project/compiler-rt/test/asan/TestCases/strncpy-overflow.cc --check-prefix=CHECK-Darwin --check-prefix=CHECK
: 'RUN: at line 3';     /Users/buildslave/jenkins/workspace/mr-clang-stage1-cmake-RA-expensive/llvm-project/compiler-rt/test/sanitizer_common/ios_commands/iossim_compile.py /Users/buildslave/jenkins/workspace/mr-clang-stage1-cmake-RA-expensive/clang-build/./bin/clang  --driver-mode=g++ -fsanitize=address -mno-omit-leaf-frame-pointer -fno-omit-frame-pointer -fno-optimize-sibling-calls -gline-tables-only  -arch x86_64 -isysroot /Applications/Xcode.app/Contents/Developer/Platforms/iPhoneSimulator.platform/Developer/SDKs/iPhoneSimulator12.1.sdk   -shared-libasan -O2 /Users/buildslave/jenkins/workspace/mr-clang-stage1-cmake-RA-expensive/llvm-project/compiler-rt/test/asan/TestCases/strncpy-overflow.cc -o /Users/buildslave/jenkins/workspace/mr-clang-stage1-cmake-RA-expensive/clang-build/tools/clang/runtime/compiler-rt-bins/test/asan/IOSSimX86_64Config/TestCases/Output/strncpy-overflow.cc.tmp && not /Users/buildslave/jenkins/workspace/mr-clang-stage1-cmake-RA-expensive/llvm-project/compiler-rt/test/sanitizer_common/ios_commands/iossim_run.py /Users/buildslave/jenkins/workspace/mr-clang-stage1-cmake-RA-expensive/clang-build/tools/clang/runtime/compiler-rt-bins/test/asan/IOSSimX86_64Config/TestCases/Output/strncpy-overflow.cc.tmp 2>&1 | FileCheck /Users/buildslave/jenkins/workspace/mr-clang-stage1-cmake-RA-expensive/llvm-project/compiler-rt/test/asan/TestCases/strncpy-overflow.cc --check-prefix=CHECK-Darwin --check-prefix=CHECK
: 'RUN: at line 4';     /Users/buildslave/jenkins/workspace/mr-clang-stage1-cmake-RA-expensive/llvm-project/compiler-rt/test/sanitizer_common/ios_commands/iossim_compile.py /Users/buildslave/jenkins/workspace/mr-clang-stage1-cmake-RA-expensive/clang-build/./bin/clang  --driver-mode=g++ -fsanitize=address -mno-omit-leaf-frame-pointer -fno-omit-frame-pointer -fno-optimize-sibling-calls -gline-tables-only  -arch x86_64 -isysroot /Applications/Xcode.app/Contents/Developer/Platforms/iPhoneSimulator.platform/Developer/SDKs/iPhoneSimulator12.1.sdk   -shared-libasan -O3 /Users/buildslave/jenkins/workspace/mr-clang-stage1-cmake-RA-expensive/llvm-project/compiler-rt/test/asan/TestCases/strncpy-overflow.cc -o /Users/buildslave/jenkins/workspace/mr-clang-stage1-cmake-RA-expensive/clang-build/tools/clang/runtime/compiler-rt-bins/test/asan/IOSSimX86_64Config/TestCases/Output/strncpy-overflow.cc.tmp && not /Users/buildslave/jenkins/workspace/mr-clang-stage1-cmake-RA-expensive/llvm-project/compiler-rt/test/sanitizer_common/ios_commands/iossim_run.py /Users/buildslave/jenkins/workspace/mr-clang-stage1-cmake-RA-expensive/clang-build/tools/clang/runtime/compiler-rt-bins/test/asan/IOSSimX86_64Config/TestCases/Output/strncpy-overflow.cc.tmp 2>&1 | FileCheck /Users/buildslave/jenkins/workspace/mr-clang-stage1-cmake-RA-expensive/llvm-project/compiler-rt/test/asan/TestCases/strncpy-overflow.cc --check-prefix=CHECK-Darwin --check-prefix=CHECK
--
Exit Code: 1

Command Output (stderr):
--
/Users/buildslave/jenkins/workspace/mr-clang-stage1-cmake-RA-expensive/llvm-project/compiler-rt/test/asan/TestCases/strncpy-overflow.cc:19:12: error: CHECK: expected string not found in input
 // CHECK: {{ #1 0x.* in main .*strncpy-overflow.cc:}}[[@LINE-4]]
           ^
<stdin>:13:33: note: scanning from here
 #0 0x10458144e in wrap_strncpy (/Users/buildslave/jenkins/workspace/mr-clang-stage1-cmake-RA-expensive/clang-build/lib/clang/10.0.0/lib/darwin/libclang_rt.asan_iossim_dynamic.dylib:x86_64+0x3d44e)
                                ^
<stdin>:13:33: note: with "@LINE-4" equal to "15"
 #0 0x10458144e in wrap_strncpy (/Users/buildslave/jenkins/workspace/mr-clang-stage1-cmake-RA-expensive/clang-build/lib/clang/10.0.0/lib/darwin/libclang_rt.asan_iossim_dynamic.dylib:x86_64+0x3d44e)
                                ^
<stdin>:14:172: note: possible intended match here
 #1 0x10440ed15 in main (/Users/buildslave/jenkins/workspace/mr-clang-stage1-cmake-RA-expensive/clang-build/tools/clang/runtime/compiler-rt-bins/test/asan/IOSSimX86_64Config/TestCases/Output/strncpy-overflow.cc.tmp:x86_64+0x100000d15)
                                                                                                                                                                           ^

--

********************
PASS: AddressSanitizer-x86_64-iossim :: TestCases/strncasecmp_strict.c (432 of 479)
FAIL: AddressSanitizer-x86_64-iossim :: TestCases/strncpy-overlap.cc (433 of 479)
******************** TEST 'AddressSanitizer-x86_64-iossim :: TestCases/strncpy-overlap.cc' FAILED ********************
Script:
--
: 'RUN: at line 1';     /Users/buildslave/jenkins/workspace/mr-clang-stage1-cmake-RA-expensive/llvm-project/compiler-rt/test/sanitizer_common/ios_commands/iossim_compile.py /Users/buildslave/jenkins/workspace/mr-clang-stage1-cmake-RA-expensive/clang-build/./bin/clang  --driver-mode=g++ -fsanitize=address -mno-omit-leaf-frame-pointer -fno-omit-frame-pointer -fno-optimize-sibling-calls -gline-tables-only  -arch x86_64 -isysroot /Applications/Xcode.app/Contents/Developer/Platforms/iPhoneSimulator.platform/Developer/SDKs/iPhoneSimulator12.1.sdk   -shared-libasan -O0 /Users/buildslave/jenkins/workspace/mr-clang-stage1-cmake-RA-expensive/llvm-project/compiler-rt/test/asan/TestCases/strncpy-overlap.cc -o /Users/buildslave/jenkins/workspace/mr-clang-stage1-cmake-RA-expensive/clang-build/tools/clang/runtime/compiler-rt-bins/test/asan/IOSSimX86_64Config/TestCases/Output/strncpy-overlap.cc.tmp
: 'RUN: at line 2';   not /Users/buildslave/jenkins/workspace/mr-clang-stage1-cmake-RA-expensive/llvm-project/compiler-rt/test/sanitizer_common/ios_commands/iossim_run.py /Users/buildslave/jenkins/workspace/mr-clang-stage1-cmake-RA-expensive/clang-build/tools/clang/runtime/compiler-rt-bins/test/asan/IOSSimX86_64Config/TestCases/Output/strncpy-overlap.cc.tmp 2>&1 | FileCheck /Users/buildslave/jenkins/workspace/mr-clang-stage1-cmake-RA-expensive/llvm-project/compiler-rt/test/asan/TestCases/strncpy-overlap.cc
: 'RUN: at line 3';   echo "interceptor_via_fun:bad_function" > /Users/buildslave/jenkins/workspace/mr-clang-stage1-cmake-RA-expensive/clang-build/tools/clang/runtime/compiler-rt-bins/test/asan/IOSSimX86_64Config/TestCases/Output/strncpy-overlap.cc.tmp.supp
: 'RUN: at line 4';   env ASAN_OPTIONS=abort_on_error=0:log_to_syslog=0:detect_leaks=1:suppressions='"/Users/buildslave/jenkins/workspace/mr-clang-stage1-cmake-RA-expensive/clang-build/tools/clang/runtime/compiler-rt-bins/test/asan/IOSSimX86_64Config/TestCases/Output/strncpy-overlap.cc.tmp.supp"' /Users/buildslave/jenkins/workspace/mr-clang-stage1-cmake-RA-expensive/llvm-project/compiler-rt/test/sanitizer_common/ios_commands/iossim_run.py /Users/buildslave/jenkins/workspace/mr-clang-stage1-cmake-RA-expensive/clang-build/tools/clang/runtime/compiler-rt-bins/test/asan/IOSSimX86_64Config/TestCases/Output/strncpy-overlap.cc.tmp
: 'RUN: at line 5';   echo "interceptor_name:strncpy" > /Users/buildslave/jenkins/workspace/mr-clang-stage1-cmake-RA-expensive/clang-build/tools/clang/runtime/compiler-rt-bins/test/asan/IOSSimX86_64Config/TestCases/Output/strncpy-overlap.cc.tmp.supp
: 'RUN: at line 6';   env ASAN_OPTIONS=abort_on_error=0:log_to_syslog=0:detect_leaks=1:suppressions='"/Users/buildslave/jenkins/workspace/mr-clang-stage1-cmake-RA-expensive/clang-build/tools/clang/runtime/compiler-rt-bins/test/asan/IOSSimX86_64Config/TestCases/Output/strncpy-overlap.cc.tmp.supp"' /Users/buildslave/jenkins/workspace/mr-clang-stage1-cmake-RA-expensive/llvm-project/compiler-rt/test/sanitizer_common/ios_commands/iossim_run.py /Users/buildslave/jenkins/workspace/mr-clang-stage1-cmake-RA-expensive/clang-build/tools/clang/runtime/compiler-rt-bins/test/asan/IOSSimX86_64Config/TestCases/Output/strncpy-overlap.cc.tmp
: 'RUN: at line 8';     /Users/buildslave/jenkins/workspace/mr-clang-stage1-cmake-RA-expensive/llvm-project/compiler-rt/test/sanitizer_common/ios_commands/iossim_compile.py /Users/buildslave/jenkins/workspace/mr-clang-stage1-cmake-RA-expensive/clang-build/./bin/clang  --driver-mode=g++ -fsanitize=address -mno-omit-leaf-frame-pointer -fno-omit-frame-pointer -fno-optimize-sibling-calls -gline-tables-only  -arch x86_64 -isysroot /Applications/Xcode.app/Contents/Developer/Platforms/iPhoneSimulator.platform/Developer/SDKs/iPhoneSimulator12.1.sdk   -shared-libasan -O1 /Users/buildslave/jenkins/workspace/mr-clang-stage1-cmake-RA-expensive/llvm-project/compiler-rt/test/asan/TestCases/strncpy-overlap.cc -o /Users/buildslave/jenkins/workspace/mr-clang-stage1-cmake-RA-expensive/clang-build/tools/clang/runtime/compiler-rt-bins/test/asan/IOSSimX86_64Config/TestCases/Output/strncpy-overlap.cc.tmp
: 'RUN: at line 9';   not /Users/buildslave/jenkins/workspace/mr-clang-stage1-cmake-RA-expensive/llvm-project/compiler-rt/test/sanitizer_common/ios_commands/iossim_run.py /Users/buildslave/jenkins/workspace/mr-clang-stage1-cmake-RA-expensive/clang-build/tools/clang/runtime/compiler-rt-bins/test/asan/IOSSimX86_64Config/TestCases/Output/strncpy-overlap.cc.tmp 2>&1 | FileCheck /Users/buildslave/jenkins/workspace/mr-clang-stage1-cmake-RA-expensive/llvm-project/compiler-rt/test/asan/TestCases/strncpy-overlap.cc
: 'RUN: at line 10';   echo "interceptor_via_fun:bad_function" > /Users/buildslave/jenkins/workspace/mr-clang-stage1-cmake-RA-expensive/clang-build/tools/clang/runtime/compiler-rt-bins/test/asan/IOSSimX86_64Config/TestCases/Output/strncpy-overlap.cc.tmp.supp
: 'RUN: at line 11';   env ASAN_OPTIONS=abort_on_error=0:log_to_syslog=0:detect_leaks=1:suppressions='"/Users/buildslave/jenkins/workspace/mr-clang-stage1-cmake-RA-expensive/clang-build/tools/clang/runtime/compiler-rt-bins/test/asan/IOSSimX86_64Config/TestCases/Output/strncpy-overlap.cc.tmp.supp"' /Users/buildslave/jenkins/workspace/mr-clang-stage1-cmake-RA-expensive/llvm-project/compiler-rt/test/sanitizer_common/ios_commands/iossim_run.py /Users/buildslave/jenkins/workspace/mr-clang-stage1-cmake-RA-expensive/clang-build/tools/clang/runtime/compiler-rt-bins/test/asan/IOSSimX86_64Config/TestCases/Output/strncpy-overlap.cc.tmp
: 'RUN: at line 12';   echo "interceptor_name:strncpy" > /Users/buildslave/jenkins/workspace/mr-clang-stage1-cmake-RA-expensive/clang-build/tools/clang/runtime/compiler-rt-bins/test/asan/IOSSimX86_64Config/TestCases/Output/strncpy-overlap.cc.tmp.supp
: 'RUN: at line 13';   env ASAN_OPTIONS=abort_on_error=0:log_to_syslog=0:detect_leaks=1:suppressions='"/Users/buildslave/jenkins/workspace/mr-clang-stage1-cmake-RA-expensive/clang-build/tools/clang/runtime/compiler-rt-bins/test/asan/IOSSimX86_64Config/TestCases/Output/strncpy-overlap.cc.tmp.supp"' /Users/buildslave/jenkins/workspace/mr-clang-stage1-cmake-RA-expensive/llvm-project/compiler-rt/test/sanitizer_common/ios_commands/iossim_run.py /Users/buildslave/jenkins/workspace/mr-clang-stage1-cmake-RA-expensive/clang-build/tools/clang/runtime/compiler-rt-bins/test/asan/IOSSimX86_64Config/TestCases/Output/strncpy-overlap.cc.tmp
: 'RUN: at line 15';     /Users/buildslave/jenkins/workspace/mr-clang-stage1-cmake-RA-expensive/llvm-project/compiler-rt/test/sanitizer_common/ios_commands/iossim_compile.py /Users/buildslave/jenkins/workspace/mr-clang-stage1-cmake-RA-expensive/clang-build/./bin/clang  --driver-mode=g++ -fsanitize=address -mno-omit-leaf-frame-pointer -fno-omit-frame-pointer -fno-optimize-sibling-calls -gline-tables-only  -arch x86_64 -isysroot /Applications/Xcode.app/Contents/Developer/Platforms/iPhoneSimulator.platform/Developer/SDKs/iPhoneSimulator12.1.sdk   -shared-libasan -O2 /Users/buildslave/jenkins/workspace/mr-clang-stage1-cmake-RA-expensive/llvm-project/compiler-rt/test/asan/TestCases/strncpy-overlap.cc -o /Users/buildslave/jenkins/workspace/mr-clang-stage1-cmake-RA-expensive/clang-build/tools/clang/runtime/compiler-rt-bins/test/asan/IOSSimX86_64Config/TestCases/Output/strncpy-overlap.cc.tmp
: 'RUN: at line 16';   not /Users/buildslave/jenkins/workspace/mr-clang-stage1-cmake-RA-expensive/llvm-project/compiler-rt/test/sanitizer_common/ios_commands/iossim_run.py /Users/buildslave/jenkins/workspace/mr-clang-stage1-cmake-RA-expensive/clang-build/tools/clang/runtime/compiler-rt-bins/test/asan/IOSSimX86_64Config/TestCases/Output/strncpy-overlap.cc.tmp 2>&1 | FileCheck /Users/buildslave/jenkins/workspace/mr-clang-stage1-cmake-RA-expensive/llvm-project/compiler-rt/test/asan/TestCases/strncpy-overlap.cc
: 'RUN: at line 17';   echo "interceptor_via_fun:bad_function" > /Users/buildslave/jenkins/workspace/mr-clang-stage1-cmake-RA-expensive/clang-build/tools/clang/runtime/compiler-rt-bins/test/asan/IOSSimX86_64Config/TestCases/Output/strncpy-overlap.cc.tmp.supp
: 'RUN: at line 18';   env ASAN_OPTIONS=abort_on_error=0:log_to_syslog=0:detect_leaks=1:suppressions='"/Users/buildslave/jenkins/workspace/mr-clang-stage1-cmake-RA-expensive/clang-build/tools/clang/runtime/compiler-rt-bins/test/asan/IOSSimX86_64Config/TestCases/Output/strncpy-overlap.cc.tmp.supp"' /Users/buildslave/jenkins/workspace/mr-clang-stage1-cmake-RA-expensive/llvm-project/compiler-rt/test/sanitizer_common/ios_commands/iossim_run.py /Users/buildslave/jenkins/workspace/mr-clang-stage1-cmake-RA-expensive/clang-build/tools/clang/runtime/compiler-rt-bins/test/asan/IOSSimX86_64Config/TestCases/Output/strncpy-overlap.cc.tmp
: 'RUN: at line 19';   echo "interceptor_name:strncpy" > /Users/buildslave/jenkins/workspace/mr-clang-stage1-cmake-RA-expensive/clang-build/tools/clang/runtime/compiler-rt-bins/test/asan/IOSSimX86_64Config/TestCases/Output/strncpy-overlap.cc.tmp.supp
: 'RUN: at line 20';   env ASAN_OPTIONS=abort_on_error=0:log_to_syslog=0:detect_leaks=1:suppressions='"/Users/buildslave/jenkins/workspace/mr-clang-stage1-cmake-RA-expensive/clang-build/tools/clang/runtime/compiler-rt-bins/test/asan/IOSSimX86_64Config/TestCases/Output/strncpy-overlap.cc.tmp.supp"' /Users/buildslave/jenkins/workspace/mr-clang-stage1-cmake-RA-expensive/llvm-project/compiler-rt/test/sanitizer_common/ios_commands/iossim_run.py /Users/buildslave/jenkins/workspace/mr-clang-stage1-cmake-RA-expensive/clang-build/tools/clang/runtime/compiler-rt-bins/test/asan/IOSSimX86_64Config/TestCases/Output/strncpy-overlap.cc.tmp
: 'RUN: at line 22';     /Users/buildslave/jenkins/workspace/mr-clang-stage1-cmake-RA-expensive/llvm-project/compiler-rt/test/sanitizer_common/ios_commands/iossim_compile.py /Users/buildslave/jenkins/workspace/mr-clang-stage1-cmake-RA-expensive/clang-build/./bin/clang  --driver-mode=g++ -fsanitize=address -mno-omit-leaf-frame-pointer -fno-omit-frame-pointer -fno-optimize-sibling-calls -gline-tables-only  -arch x86_64 -isysroot /Applications/Xcode.app/Contents/Developer/Platforms/iPhoneSimulator.platform/Developer/SDKs/iPhoneSimulator12.1.sdk   -shared-libasan -O3 /Users/buildslave/jenkins/workspace/mr-clang-stage1-cmake-RA-expensive/llvm-project/compiler-rt/test/asan/TestCases/strncpy-overlap.cc -o /Users/buildslave/jenkins/workspace/mr-clang-stage1-cmake-RA-expensive/clang-build/tools/clang/runtime/compiler-rt-bins/test/asan/IOSSimX86_64Config/TestCases/Output/strncpy-overlap.cc.tmp
: 'RUN: at line 23';   not /Users/buildslave/jenkins/workspace/mr-clang-stage1-cmake-RA-expensive/llvm-project/compiler-rt/test/sanitizer_common/ios_commands/iossim_run.py /Users/buildslave/jenkins/workspace/mr-clang-stage1-cmake-RA-expensive/clang-build/tools/clang/runtime/compiler-rt-bins/test/asan/IOSSimX86_64Config/TestCases/Output/strncpy-overlap.cc.tmp 2>&1 | FileCheck /Users/buildslave/jenkins/workspace/mr-clang-stage1-cmake-RA-expensive/llvm-project/compiler-rt/test/asan/TestCases/strncpy-overlap.cc
: 'RUN: at line 24';   echo "interceptor_via_fun:bad_function" > /Users/buildslave/jenkins/workspace/mr-clang-stage1-cmake-RA-expensive/clang-build/tools/clang/runtime/compiler-rt-bins/test/asan/IOSSimX86_64Config/TestCases/Output/strncpy-overlap.cc.tmp.supp
: 'RUN: at line 25';   env ASAN_OPTIONS=abort_on_error=0:log_to_syslog=0:detect_leaks=1:suppressions='"/Users/buildslave/jenkins/workspace/mr-clang-stage1-cmake-RA-expensive/clang-build/tools/clang/runtime/compiler-rt-bins/test/asan/IOSSimX86_64Config/TestCases/Output/strncpy-overlap.cc.tmp.supp"' /Users/buildslave/jenkins/workspace/mr-clang-stage1-cmake-RA-expensive/llvm-project/compiler-rt/test/sanitizer_common/ios_commands/iossim_run.py /Users/buildslave/jenkins/workspace/mr-clang-stage1-cmake-RA-expensive/clang-build/tools/clang/runtime/compiler-rt-bins/test/asan/IOSSimX86_64Config/TestCases/Output/strncpy-overlap.cc.tmp
: 'RUN: at line 26';   echo "interceptor_name:strncpy" > /Users/buildslave/jenkins/workspace/mr-clang-stage1-cmake-RA-expensive/clang-build/tools/clang/runtime/compiler-rt-bins/test/asan/IOSSimX86_64Config/TestCases/Output/strncpy-overlap.cc.tmp.supp
: 'RUN: at line 27';   env ASAN_OPTIONS=abort_on_error=0:log_to_syslog=0:detect_leaks=1:suppressions='"/Users/buildslave/jenkins/workspace/mr-clang-stage1-cmake-RA-expensive/clang-build/tools/clang/runtime/compiler-rt-bins/test/asan/IOSSimX86_64Config/TestCases/Output/strncpy-overlap.cc.tmp.supp"' /Users/buildslave/jenkins/workspace/mr-clang-stage1-cmake-RA-expensive/llvm-project/compiler-rt/test/sanitizer_common/ios_commands/iossim_run.py /Users/buildslave/jenkins/workspace/mr-clang-stage1-cmake-RA-expensive/clang-build/tools/clang/runtime/compiler-rt-bins/test/asan/IOSSimX86_64Config/TestCases/Output/strncpy-overlap.cc.tmp
--
Exit Code: 1

Command Output (stderr):
--
/Users/buildslave/jenkins/workspace/mr-clang-stage1-cmake-RA-expensive/llvm-project/compiler-rt/test/asan/TestCases/strncpy-overlap.cc:40:12: error: CHECK: expected string not found in input
 // CHECK: {{#1 0x.* in bad_function.*strncpy-overlap.cc:}}[[@LINE+2]]
           ^
<stdin>:12:33: note: scanning from here
 #0 0x10f1df175 in wrap_strncpy (/Users/buildslave/jenkins/workspace/mr-clang-stage1-cmake-RA-expensive/clang-build/lib/clang/10.0.0/lib/darwin/libclang_rt.asan_iossim_dynamic.dylib:x86_64+0x3d175)
                                ^
<stdin>:12:33: note: with "@LINE+2" equal to "42"
 #0 0x10f1df175 in wrap_strncpy (/Users/buildslave/jenkins/workspace/mr-clang-stage1-cmake-RA-expensive/clang-build/lib/clang/10.0.0/lib/darwin/libclang_rt.asan_iossim_dynamic.dylib:x86_64+0x3d175)
                                ^
<stdin>:13:176: note: possible intended match here
 #1 0x10ecb5d31 in bad_function() (/Users/buildslave/jenkins/workspace/mr-clang-stage1-cmake-RA-expensive/clang-build/tools/clang/runtime/compiler-rt-bins/test/asan/IOSSimX86_64Config/TestCases/Output/strncpy-overlap.cc.tmp:x86_64+0x100000d31)
                                                                                                                                                                               ^

--

********************
PASS: AddressSanitizer-x86_64-iossim :: TestCases/strpbrk-1.c (434 of 479)
PASS: AddressSanitizer-x86_64-iossim :: TestCases/strpbrk-2.c (435 of 479)
PASS: AddressSanitizer-x86_64-iossim :: TestCases/strncmp_strict.c (436 of 479)
PASS: AddressSanitizer-x86_64-iossim :: TestCases/strpbrk_strict.c (437 of 479)
PASS: AddressSanitizer-x86_64-iossim :: TestCases/strspn-1.c (438 of 479)
PASS: AddressSanitizer-x86_64-iossim :: TestCases/strspn-2.c (439 of 479)
PASS: AddressSanitizer-x86_64-iossim :: TestCases/strstr-1.c (440 of 479)
PASS: AddressSanitizer-x86_64-iossim :: TestCases/strspn_strict.c (441 of 479)
PASS: AddressSanitizer-x86_64-iossim :: TestCases/strstr-2.c (442 of 479)
PASS: AddressSanitizer-x86_64-iossim :: TestCases/strstr_strict.c (443 of 479)
PASS: AddressSanitizer-x86_64-iossim :: TestCases/strtok.c (444 of 479)
UNSUPPORTED: AddressSanitizer-x86_64-iossim :: TestCases/suppressions-exec-relative-location.cc (445 of 479)
UNSUPPORTED: AddressSanitizer-x86_64-iossim :: TestCases/suppressions-function.cc (446 of 479)
PASS: AddressSanitizer-x86_64-iossim :: TestCases/suppressions-interceptor.cc (447 of 479)
PASS: AddressSanitizer-x86_64-iossim :: TestCases/suppressions-library.cc (448 of 479)
PASS: AddressSanitizer-x86_64-iossim :: TestCases/throw_call_test.cc (449 of 479)
PASS: AddressSanitizer-x86_64-iossim :: TestCases/strtol_strict.c (450 of 479)
PASS: AddressSanitizer-x86_64-iossim :: TestCases/strtoll_strict.c (451 of 479)
PASS: AddressSanitizer-x86_64-iossim :: TestCases/throw_catch.cc (452 of 479)
PASS: AddressSanitizer-x86_64-iossim :: TestCases/throw_invoke_test.cc (453 of 479)
PASS: AddressSanitizer-x86_64-iossim :: TestCases/uar_and_exceptions.cc (454 of 479)
PASS: AddressSanitizer-x86_64-iossim :: TestCases/time_interceptor.cc (455 of 479)
FAIL: AddressSanitizer-x86_64-iossim :: TestCases/unaligned_loads_and_stores.cc (456 of 479)
******************** TEST 'AddressSanitizer-x86_64-iossim :: TestCases/unaligned_loads_and_stores.cc' FAILED ********************
Script:
--
: 'RUN: at line 1';     /Users/buildslave/jenkins/workspace/mr-clang-stage1-cmake-RA-expensive/llvm-project/compiler-rt/test/sanitizer_common/ios_commands/iossim_compile.py /Users/buildslave/jenkins/workspace/mr-clang-stage1-cmake-RA-expensive/clang-build/./bin/clang  --driver-mode=g++ -fsanitize=address -mno-omit-leaf-frame-pointer -fno-omit-frame-pointer -fno-optimize-sibling-calls -gline-tables-only  -arch x86_64 -isysroot /Applications/Xcode.app/Contents/Developer/Platforms/iPhoneSimulator.platform/Developer/SDKs/iPhoneSimulator12.1.sdk   -shared-libasan -O0 /Users/buildslave/jenkins/workspace/mr-clang-stage1-cmake-RA-expensive/llvm-project/compiler-rt/test/asan/TestCases/unaligned_loads_and_stores.cc -o /Users/buildslave/jenkins/workspace/mr-clang-stage1-cmake-RA-expensive/clang-build/tools/clang/runtime/compiler-rt-bins/test/asan/IOSSimX86_64Config/TestCases/Output/unaligned_loads_and_stores.cc.tmp
: 'RUN: at line 2';   not /Users/buildslave/jenkins/workspace/mr-clang-stage1-cmake-RA-expensive/llvm-project/compiler-rt/test/sanitizer_common/ios_commands/iossim_run.py /Users/buildslave/jenkins/workspace/mr-clang-stage1-cmake-RA-expensive/clang-build/tools/clang/runtime/compiler-rt-bins/test/asan/IOSSimX86_64Config/TestCases/Output/unaligned_loads_and_stores.cc.tmp A 2>&1 | FileCheck --check-prefix=CHECK-A /Users/buildslave/jenkins/workspace/mr-clang-stage1-cmake-RA-expensive/llvm-project/compiler-rt/test/asan/TestCases/unaligned_loads_and_stores.cc
: 'RUN: at line 3';   not /Users/buildslave/jenkins/workspace/mr-clang-stage1-cmake-RA-expensive/llvm-project/compiler-rt/test/sanitizer_common/ios_commands/iossim_run.py /Users/buildslave/jenkins/workspace/mr-clang-stage1-cmake-RA-expensive/clang-build/tools/clang/runtime/compiler-rt-bins/test/asan/IOSSimX86_64Config/TestCases/Output/unaligned_loads_and_stores.cc.tmp B 2>&1 | FileCheck --check-prefix=CHECK-B /Users/buildslave/jenkins/workspace/mr-clang-stage1-cmake-RA-expensive/llvm-project/compiler-rt/test/asan/TestCases/unaligned_loads_and_stores.cc
: 'RUN: at line 4';   not /Users/buildslave/jenkins/workspace/mr-clang-stage1-cmake-RA-expensive/llvm-project/compiler-rt/test/sanitizer_common/ios_commands/iossim_run.py /Users/buildslave/jenkins/workspace/mr-clang-stage1-cmake-RA-expensive/clang-build/tools/clang/runtime/compiler-rt-bins/test/asan/IOSSimX86_64Config/TestCases/Output/unaligned_loads_and_stores.cc.tmp C 2>&1 | FileCheck --check-prefix=CHECK-C /Users/buildslave/jenkins/workspace/mr-clang-stage1-cmake-RA-expensive/llvm-project/compiler-rt/test/asan/TestCases/unaligned_loads_and_stores.cc
: 'RUN: at line 5';   not /Users/buildslave/jenkins/workspace/mr-clang-stage1-cmake-RA-expensive/llvm-project/compiler-rt/test/sanitizer_common/ios_commands/iossim_run.py /Users/buildslave/jenkins/workspace/mr-clang-stage1-cmake-RA-expensive/clang-build/tools/clang/runtime/compiler-rt-bins/test/asan/IOSSimX86_64Config/TestCases/Output/unaligned_loads_and_stores.cc.tmp D 2>&1 | FileCheck --check-prefix=CHECK-D /Users/buildslave/jenkins/workspace/mr-clang-stage1-cmake-RA-expensive/llvm-project/compiler-rt/test/asan/TestCases/unaligned_loads_and_stores.cc
: 'RUN: at line 6';   not /Users/buildslave/jenkins/workspace/mr-clang-stage1-cmake-RA-expensive/llvm-project/compiler-rt/test/sanitizer_common/ios_commands/iossim_run.py /Users/buildslave/jenkins/workspace/mr-clang-stage1-cmake-RA-expensive/clang-build/tools/clang/runtime/compiler-rt-bins/test/asan/IOSSimX86_64Config/TestCases/Output/unaligned_loads_and_stores.cc.tmp E 2>&1 | FileCheck --check-prefix=CHECK-E /Users/buildslave/jenkins/workspace/mr-clang-stage1-cmake-RA-expensive/llvm-project/compiler-rt/test/asan/TestCases/unaligned_loads_and_stores.cc
: 'RUN: at line 8';   not /Users/buildslave/jenkins/workspace/mr-clang-stage1-cmake-RA-expensive/llvm-project/compiler-rt/test/sanitizer_common/ios_commands/iossim_run.py /Users/buildslave/jenkins/workspace/mr-clang-stage1-cmake-RA-expensive/clang-build/tools/clang/runtime/compiler-rt-bins/test/asan/IOSSimX86_64Config/TestCases/Output/unaligned_loads_and_stores.cc.tmp K 2>&1 | FileCheck --check-prefix=CHECK-K /Users/buildslave/jenkins/workspace/mr-clang-stage1-cmake-RA-expensive/llvm-project/compiler-rt/test/asan/TestCases/unaligned_loads_and_stores.cc
: 'RUN: at line 9';   not /Users/buildslave/jenkins/workspace/mr-clang-stage1-cmake-RA-expensive/llvm-project/compiler-rt/test/sanitizer_common/ios_commands/iossim_run.py /Users/buildslave/jenkins/workspace/mr-clang-stage1-cmake-RA-expensive/clang-build/tools/clang/runtime/compiler-rt-bins/test/asan/IOSSimX86_64Config/TestCases/Output/unaligned_loads_and_stores.cc.tmp L 2>&1 | FileCheck --check-prefix=CHECK-L /Users/buildslave/jenkins/workspace/mr-clang-stage1-cmake-RA-expensive/llvm-project/compiler-rt/test/asan/TestCases/unaligned_loads_and_stores.cc
: 'RUN: at line 10';   not /Users/buildslave/jenkins/workspace/mr-clang-stage1-cmake-RA-expensive/llvm-project/compiler-rt/test/sanitizer_common/ios_commands/iossim_run.py /Users/buildslave/jenkins/workspace/mr-clang-stage1-cmake-RA-expensive/clang-build/tools/clang/runtime/compiler-rt-bins/test/asan/IOSSimX86_64Config/TestCases/Output/unaligned_loads_and_stores.cc.tmp M 2>&1 | FileCheck --check-prefix=CHECK-M /Users/buildslave/jenkins/workspace/mr-clang-stage1-cmake-RA-expensive/llvm-project/compiler-rt/test/asan/TestCases/unaligned_loads_and_stores.cc
: 'RUN: at line 11';   not /Users/buildslave/jenkins/workspace/mr-clang-stage1-cmake-RA-expensive/llvm-project/compiler-rt/test/sanitizer_common/ios_commands/iossim_run.py /Users/buildslave/jenkins/workspace/mr-clang-stage1-cmake-RA-expensive/clang-build/tools/clang/runtime/compiler-rt-bins/test/asan/IOSSimX86_64Config/TestCases/Output/unaligned_loads_and_stores.cc.tmp N 2>&1 | FileCheck --check-prefix=CHECK-N /Users/buildslave/jenkins/workspace/mr-clang-stage1-cmake-RA-expensive/llvm-project/compiler-rt/test/asan/TestCases/unaligned_loads_and_stores.cc
: 'RUN: at line 12';   not /Users/buildslave/jenkins/workspace/mr-clang-stage1-cmake-RA-expensive/llvm-project/compiler-rt/test/sanitizer_common/ios_commands/iossim_run.py /Users/buildslave/jenkins/workspace/mr-clang-stage1-cmake-RA-expensive/clang-build/tools/clang/runtime/compiler-rt-bins/test/asan/IOSSimX86_64Config/TestCases/Output/unaligned_loads_and_stores.cc.tmp O 2>&1 | FileCheck --check-prefix=CHECK-O /Users/buildslave/jenkins/workspace/mr-clang-stage1-cmake-RA-expensive/llvm-project/compiler-rt/test/asan/TestCases/unaligned_loads_and_stores.cc
--
Exit Code: 1

Command Output (stderr):
--
/Users/buildslave/jenkins/workspace/mr-clang-stage1-cmake-RA-expensive/llvm-project/compiler-rt/test/asan/TestCases/unaligned_loads_and_stores.cc:50:3: warning: 'delete' applied to a pointer that was allocated with 'new[]'; did you mean 'delete[]'? [-Wmismatched-new-delete]
  delete x;
  ^
        []
/Users/buildslave/jenkins/workspace/mr-clang-stage1-cmake-RA-expensive/llvm-project/compiler-rt/test/asan/TestCases/unaligned_loads_and_stores.cc:20:13: note: allocated with 'new[]' here
  char *x = new char[16];
            ^
1 warning generated.
/Users/buildslave/jenkins/workspace/mr-clang-stage1-cmake-RA-expensive/llvm-project/compiler-rt/test/asan/TestCases/unaligned_loads_and_stores.cc:26:13: error: CHECK-A: expected string not found in input
// CHECK-A: main{{.*}}unaligned_loads_and_stores.cc:[[@LINE-2]]
            ^
<stdin>:1:1: note: scanning from here
=================================================================
^
<stdin>:1:1: note: with "@LINE-2" equal to "24"
=================================================================
^
<stdin>:4:40: note: possible intended match here
atos[26118]: atos cannot examine process 26117 (unaligned_loads_and_stores.cc.tmp) for unknown reasons, even though it appears to exist; try running with `sudo`.
                                       ^

--

********************
FAIL: AddressSanitizer-x86_64-iossim :: TestCases/use-after-delete.cc (457 of 479)
******************** TEST 'AddressSanitizer-x86_64-iossim :: TestCases/use-after-delete.cc' FAILED ********************
Script:
--
: 'RUN: at line 1';     /Users/buildslave/jenkins/workspace/mr-clang-stage1-cmake-RA-expensive/llvm-project/compiler-rt/test/sanitizer_common/ios_commands/iossim_compile.py /Users/buildslave/jenkins/workspace/mr-clang-stage1-cmake-RA-expensive/clang-build/./bin/clang  --driver-mode=g++ -fsanitize=address -mno-omit-leaf-frame-pointer -fno-omit-frame-pointer -fno-optimize-sibling-calls -gline-tables-only  -arch x86_64 -isysroot /Applications/Xcode.app/Contents/Developer/Platforms/iPhoneSimulator.platform/Developer/SDKs/iPhoneSimulator12.1.sdk   -shared-libasan -O0 /Users/buildslave/jenkins/workspace/mr-clang-stage1-cmake-RA-expensive/llvm-project/compiler-rt/test/asan/TestCases/use-after-delete.cc -o /Users/buildslave/jenkins/workspace/mr-clang-stage1-cmake-RA-expensive/clang-build/tools/clang/runtime/compiler-rt-bins/test/asan/IOSSimX86_64Config/TestCases/Output/use-after-delete.cc.tmp && not /Users/buildslave/jenkins/workspace/mr-clang-stage1-cmake-RA-expensive/llvm-project/compiler-rt/test/sanitizer_common/ios_commands/iossim_run.py /Users/buildslave/jenkins/workspace/mr-clang-stage1-cmake-RA-expensive/clang-build/tools/clang/runtime/compiler-rt-bins/test/asan/IOSSimX86_64Config/TestCases/Output/use-after-delete.cc.tmp 2>&1 | FileCheck /Users/buildslave/jenkins/workspace/mr-clang-stage1-cmake-RA-expensive/llvm-project/compiler-rt/test/asan/TestCases/use-after-delete.cc --check-prefix=CHECK-Darwin --check-prefix=CHECK
: 'RUN: at line 2';     /Users/buildslave/jenkins/workspace/mr-clang-stage1-cmake-RA-expensive/llvm-project/compiler-rt/test/sanitizer_common/ios_commands/iossim_compile.py /Users/buildslave/jenkins/workspace/mr-clang-stage1-cmake-RA-expensive/clang-build/./bin/clang  --driver-mode=g++ -fsanitize=address -mno-omit-leaf-frame-pointer -fno-omit-frame-pointer -fno-optimize-sibling-calls -gline-tables-only  -arch x86_64 -isysroot /Applications/Xcode.app/Contents/Developer/Platforms/iPhoneSimulator.platform/Developer/SDKs/iPhoneSimulator12.1.sdk   -shared-libasan -O1 /Users/buildslave/jenkins/workspace/mr-clang-stage1-cmake-RA-expensive/llvm-project/compiler-rt/test/asan/TestCases/use-after-delete.cc -o /Users/buildslave/jenkins/workspace/mr-clang-stage1-cmake-RA-expensive/clang-build/tools/clang/runtime/compiler-rt-bins/test/asan/IOSSimX86_64Config/TestCases/Output/use-after-delete.cc.tmp && not /Users/buildslave/jenkins/workspace/mr-clang-stage1-cmake-RA-expensive/llvm-project/compiler-rt/test/sanitizer_common/ios_commands/iossim_run.py /Users/buildslave/jenkins/workspace/mr-clang-stage1-cmake-RA-expensive/clang-build/tools/clang/runtime/compiler-rt-bins/test/asan/IOSSimX86_64Config/TestCases/Output/use-after-delete.cc.tmp 2>&1 | FileCheck /Users/buildslave/jenkins/workspace/mr-clang-stage1-cmake-RA-expensive/llvm-project/compiler-rt/test/asan/TestCases/use-after-delete.cc --check-prefix=CHECK-Darwin --check-prefix=CHECK
: 'RUN: at line 3';     /Users/buildslave/jenkins/workspace/mr-clang-stage1-cmake-RA-expensive/llvm-project/compiler-rt/test/sanitizer_common/ios_commands/iossim_compile.py /Users/buildslave/jenkins/workspace/mr-clang-stage1-cmake-RA-expensive/clang-build/./bin/clang  --driver-mode=g++ -fsanitize=address -mno-omit-leaf-frame-pointer -fno-omit-frame-pointer -fno-optimize-sibling-calls -gline-tables-only  -arch x86_64 -isysroot /Applications/Xcode.app/Contents/Developer/Platforms/iPhoneSimulator.platform/Developer/SDKs/iPhoneSimulator12.1.sdk   -shared-libasan -O2 /Users/buildslave/jenkins/workspace/mr-clang-stage1-cmake-RA-expensive/llvm-project/compiler-rt/test/asan/TestCases/use-after-delete.cc -o /Users/buildslave/jenkins/workspace/mr-clang-stage1-cmake-RA-expensive/clang-build/tools/clang/runtime/compiler-rt-bins/test/asan/IOSSimX86_64Config/TestCases/Output/use-after-delete.cc.tmp && not /Users/buildslave/jenkins/workspace/mr-clang-stage1-cmake-RA-expensive/llvm-project/compiler-rt/test/sanitizer_common/ios_commands/iossim_run.py /Users/buildslave/jenkins/workspace/mr-clang-stage1-cmake-RA-expensive/clang-build/tools/clang/runtime/compiler-rt-bins/test/asan/IOSSimX86_64Config/TestCases/Output/use-after-delete.cc.tmp 2>&1 | FileCheck /Users/buildslave/jenkins/workspace/mr-clang-stage1-cmake-RA-expensive/llvm-project/compiler-rt/test/asan/TestCases/use-after-delete.cc --check-prefix=CHECK-Darwin --check-prefix=CHECK
: 'RUN: at line 4';     /Users/buildslave/jenkins/workspace/mr-clang-stage1-cmake-RA-expensive/llvm-project/compiler-rt/test/sanitizer_common/ios_commands/iossim_compile.py /Users/buildslave/jenkins/workspace/mr-clang-stage1-cmake-RA-expensive/clang-build/./bin/clang  --driver-mode=g++ -fsanitize=address -mno-omit-leaf-frame-pointer -fno-omit-frame-pointer -fno-optimize-sibling-calls -gline-tables-only  -arch x86_64 -isysroot /Applications/Xcode.app/Contents/Developer/Platforms/iPhoneSimulator.platform/Developer/SDKs/iPhoneSimulator12.1.sdk   -shared-libasan -O3 /Users/buildslave/jenkins/workspace/mr-clang-stage1-cmake-RA-expensive/llvm-project/compiler-rt/test/asan/TestCases/use-after-delete.cc -o /Users/buildslave/jenkins/workspace/mr-clang-stage1-cmake-RA-expensive/clang-build/tools/clang/runtime/compiler-rt-bins/test/asan/IOSSimX86_64Config/TestCases/Output/use-after-delete.cc.tmp && not /Users/buildslave/jenkins/workspace/mr-clang-stage1-cmake-RA-expensive/llvm-project/compiler-rt/test/sanitizer_common/ios_commands/iossim_run.py /Users/buildslave/jenkins/workspace/mr-clang-stage1-cmake-RA-expensive/clang-build/tools/clang/runtime/compiler-rt-bins/test/asan/IOSSimX86_64Config/TestCases/Output/use-after-delete.cc.tmp 2>&1 | FileCheck /Users/buildslave/jenkins/workspace/mr-clang-stage1-cmake-RA-expensive/llvm-project/compiler-rt/test/asan/TestCases/use-after-delete.cc --check-prefix=CHECK-Darwin --check-prefix=CHECK
--
Exit Code: 1

Command Output (stderr):
--
/Users/buildslave/jenkins/workspace/mr-clang-stage1-cmake-RA-expensive/llvm-project/compiler-rt/test/asan/TestCases/use-after-delete.cc:15:12: error: CHECK: expected string not found in input
 // CHECK: {{ #0 0x.* in main .*use-after-delete.cc:}}[[@LINE-4]]
           ^
<stdin>:4:1: note: scanning from here
atos[26137]: atos cannot examine process 26136 (use-after-delete.cc.tmp) for unknown reasons, even though it appears to exist; try running with `sudo`.
^
<stdin>:4:1: note: with "@LINE-4" equal to "11"
atos[26137]: atos cannot examine process 26136 (use-after-delete.cc.tmp) for unknown reasons, even though it appears to exist; try running with `sudo`.
^
<stdin>:4:29: note: possible intended match here
atos[26137]: atos cannot examine process 26136 (use-after-delete.cc.tmp) for unknown reasons, even though it appears to exist; try running with `sudo`.
                            ^

--

********************
FAIL: AddressSanitizer-x86_64-iossim :: TestCases/use-after-free-right.cc (458 of 479)
******************** TEST 'AddressSanitizer-x86_64-iossim :: TestCases/use-after-free-right.cc' FAILED ********************
Script:
--
: 'RUN: at line 1';     /Users/buildslave/jenkins/workspace/mr-clang-stage1-cmake-RA-expensive/llvm-project/compiler-rt/test/sanitizer_common/ios_commands/iossim_compile.py /Users/buildslave/jenkins/workspace/mr-clang-stage1-cmake-RA-expensive/clang-build/./bin/clang  --driver-mode=g++ -fsanitize=address -mno-omit-leaf-frame-pointer -fno-omit-frame-pointer -fno-optimize-sibling-calls -gline-tables-only  -arch x86_64 -isysroot /Applications/Xcode.app/Contents/Developer/Platforms/iPhoneSimulator.platform/Developer/SDKs/iPhoneSimulator12.1.sdk   -shared-libasan -O0 /Users/buildslave/jenkins/workspace/mr-clang-stage1-cmake-RA-expensive/llvm-project/compiler-rt/test/asan/TestCases/use-after-free-right.cc -o /Users/buildslave/jenkins/workspace/mr-clang-stage1-cmake-RA-expensive/clang-build/tools/clang/runtime/compiler-rt-bins/test/asan/IOSSimX86_64Config/TestCases/Output/use-after-free-right.cc.tmp && not /Users/buildslave/jenkins/workspace/mr-clang-stage1-cmake-RA-expensive/llvm-project/compiler-rt/test/sanitizer_common/ios_commands/iossim_run.py /Users/buildslave/jenkins/workspace/mr-clang-stage1-cmake-RA-expensive/clang-build/tools/clang/runtime/compiler-rt-bins/test/asan/IOSSimX86_64Config/TestCases/Output/use-after-free-right.cc.tmp 2>&1 | FileCheck /Users/buildslave/jenkins/workspace/mr-clang-stage1-cmake-RA-expensive/llvm-project/compiler-rt/test/asan/TestCases/use-after-free-right.cc --check-prefix=CHECK-Darwin --check-prefix=CHECK
: 'RUN: at line 2';     /Users/buildslave/jenkins/workspace/mr-clang-stage1-cmake-RA-expensive/llvm-project/compiler-rt/test/sanitizer_common/ios_commands/iossim_compile.py /Users/buildslave/jenkins/workspace/mr-clang-stage1-cmake-RA-expensive/clang-build/./bin/clang  --driver-mode=g++ -fsanitize=address -mno-omit-leaf-frame-pointer -fno-omit-frame-pointer -fno-optimize-sibling-calls -gline-tables-only  -arch x86_64 -isysroot /Applications/Xcode.app/Contents/Developer/Platforms/iPhoneSimulator.platform/Developer/SDKs/iPhoneSimulator12.1.sdk   -shared-libasan -O1 /Users/buildslave/jenkins/workspace/mr-clang-stage1-cmake-RA-expensive/llvm-project/compiler-rt/test/asan/TestCases/use-after-free-right.cc -o /Users/buildslave/jenkins/workspace/mr-clang-stage1-cmake-RA-expensive/clang-build/tools/clang/runtime/compiler-rt-bins/test/asan/IOSSimX86_64Config/TestCases/Output/use-after-free-right.cc.tmp && not /Users/buildslave/jenkins/workspace/mr-clang-stage1-cmake-RA-expensive/llvm-project/compiler-rt/test/sanitizer_common/ios_commands/iossim_run.py /Users/buildslave/jenkins/workspace/mr-clang-stage1-cmake-RA-expensive/clang-build/tools/clang/runtime/compiler-rt-bins/test/asan/IOSSimX86_64Config/TestCases/Output/use-after-free-right.cc.tmp 2>&1 | FileCheck /Users/buildslave/jenkins/workspace/mr-clang-stage1-cmake-RA-expensive/llvm-project/compiler-rt/test/asan/TestCases/use-after-free-right.cc --check-prefix=CHECK-Darwin --check-prefix=CHECK
: 'RUN: at line 3';     /Users/buildslave/jenkins/workspace/mr-clang-stage1-cmake-RA-expensive/llvm-project/compiler-rt/test/sanitizer_common/ios_commands/iossim_compile.py /Users/buildslave/jenkins/workspace/mr-clang-stage1-cmake-RA-expensive/clang-build/./bin/clang  --driver-mode=g++ -fsanitize=address -mno-omit-leaf-frame-pointer -fno-omit-frame-pointer -fno-optimize-sibling-calls -gline-tables-only  -arch x86_64 -isysroot /Applications/Xcode.app/Contents/Developer/Platforms/iPhoneSimulator.platform/Developer/SDKs/iPhoneSimulator12.1.sdk   -shared-libasan -O2 /Users/buildslave/jenkins/workspace/mr-clang-stage1-cmake-RA-expensive/llvm-project/compiler-rt/test/asan/TestCases/use-after-free-right.cc -o /Users/buildslave/jenkins/workspace/mr-clang-stage1-cmake-RA-expensive/clang-build/tools/clang/runtime/compiler-rt-bins/test/asan/IOSSimX86_64Config/TestCases/Output/use-after-free-right.cc.tmp && not /Users/buildslave/jenkins/workspace/mr-clang-stage1-cmake-RA-expensive/llvm-project/compiler-rt/test/sanitizer_common/ios_commands/iossim_run.py /Users/buildslave/jenkins/workspace/mr-clang-stage1-cmake-RA-expensive/clang-build/tools/clang/runtime/compiler-rt-bins/test/asan/IOSSimX86_64Config/TestCases/Output/use-after-free-right.cc.tmp 2>&1 | FileCheck /Users/buildslave/jenkins/workspace/mr-clang-stage1-cmake-RA-expensive/llvm-project/compiler-rt/test/asan/TestCases/use-after-free-right.cc --check-prefix=CHECK-Darwin --check-prefix=CHECK
: 'RUN: at line 4';     /Users/buildslave/jenkins/workspace/mr-clang-stage1-cmake-RA-expensive/llvm-project/compiler-rt/test/sanitizer_common/ios_commands/iossim_compile.py /Users/buildslave/jenkins/workspace/mr-clang-stage1-cmake-RA-expensive/clang-build/./bin/clang  --driver-mode=g++ -fsanitize=address -mno-omit-leaf-frame-pointer -fno-omit-frame-pointer -fno-optimize-sibling-calls -gline-tables-only  -arch x86_64 -isysroot /Applications/Xcode.app/Contents/Developer/Platforms/iPhoneSimulator.platform/Developer/SDKs/iPhoneSimulator12.1.sdk   -shared-libasan -O3 /Users/buildslave/jenkins/workspace/mr-clang-stage1-cmake-RA-expensive/llvm-project/compiler-rt/test/asan/TestCases/use-after-free-right.cc -o /Users/buildslave/jenkins/workspace/mr-clang-stage1-cmake-RA-expensive/clang-build/tools/clang/runtime/compiler-rt-bins/test/asan/IOSSimX86_64Config/TestCases/Output/use-after-free-right.cc.tmp && not /Users/buildslave/jenkins/workspace/mr-clang-stage1-cmake-RA-expensive/llvm-project/compiler-rt/test/sanitizer_common/ios_commands/iossim_run.py /Users/buildslave/jenkins/workspace/mr-clang-stage1-cmake-RA-expensive/clang-build/tools/clang/runtime/compiler-rt-bins/test/asan/IOSSimX86_64Config/TestCases/Output/use-after-free-right.cc.tmp 2>&1 | FileCheck /Users/buildslave/jenkins/workspace/mr-clang-stage1-cmake-RA-expensive/llvm-project/compiler-rt/test/asan/TestCases/use-after-free-right.cc --check-prefix=CHECK-Darwin --check-prefix=CHECK
--
Exit Code: 1

Command Output (stderr):
--
/Users/buildslave/jenkins/workspace/mr-clang-stage1-cmake-RA-expensive/llvm-project/compiler-rt/test/asan/TestCases/use-after-free-right.cc:18:12: error: CHECK: expected string not found in input
 // CHECK: {{ #0 0x.* in main .*use-after-free-right.cc:}}[[@LINE-4]]
           ^
<stdin>:4:1: note: scanning from here
atos[26155]: atos cannot examine process 26154 (use-after-free-right.cc.tmp) for unknown reasons, even though it appears to exist; try running with `sudo`.
^
<stdin>:4:1: note: with "@LINE-4" equal to "14"
atos[26155]: atos cannot examine process 26154 (use-after-free-right.cc.tmp) for unknown reasons, even though it appears to exist; try running with `sudo`.
^
<stdin>:4:29: note: possible intended match here
atos[26155]: atos cannot examine process 26154 (use-after-free-right.cc.tmp) for unknown reasons, even though it appears to exist; try running with `sudo`.
                            ^

--

********************
FAIL: AddressSanitizer-x86_64-iossim :: TestCases/use-after-free.cc (459 of 479)
******************** TEST 'AddressSanitizer-x86_64-iossim :: TestCases/use-after-free.cc' FAILED ********************
Script:
--
: 'RUN: at line 1';     /Users/buildslave/jenkins/workspace/mr-clang-stage1-cmake-RA-expensive/llvm-project/compiler-rt/test/sanitizer_common/ios_commands/iossim_compile.py /Users/buildslave/jenkins/workspace/mr-clang-stage1-cmake-RA-expensive/clang-build/./bin/clang  --driver-mode=g++ -fsanitize=address -mno-omit-leaf-frame-pointer -fno-omit-frame-pointer -fno-optimize-sibling-calls -gline-tables-only  -arch x86_64 -isysroot /Applications/Xcode.app/Contents/Developer/Platforms/iPhoneSimulator.platform/Developer/SDKs/iPhoneSimulator12.1.sdk   -shared-libasan -O0 /Users/buildslave/jenkins/workspace/mr-clang-stage1-cmake-RA-expensive/llvm-project/compiler-rt/test/asan/TestCases/use-after-free.cc -o /Users/buildslave/jenkins/workspace/mr-clang-stage1-cmake-RA-expensive/clang-build/tools/clang/runtime/compiler-rt-bins/test/asan/IOSSimX86_64Config/TestCases/Output/use-after-free.cc.tmp && not /Users/buildslave/jenkins/workspace/mr-clang-stage1-cmake-RA-expensive/llvm-project/compiler-rt/test/sanitizer_common/ios_commands/iossim_run.py /Users/buildslave/jenkins/workspace/mr-clang-stage1-cmake-RA-expensive/clang-build/tools/clang/runtime/compiler-rt-bins/test/asan/IOSSimX86_64Config/TestCases/Output/use-after-free.cc.tmp 2>&1 | FileCheck /Users/buildslave/jenkins/workspace/mr-clang-stage1-cmake-RA-expensive/llvm-project/compiler-rt/test/asan/TestCases/use-after-free.cc --check-prefix=CHECK-Darwin --check-prefix=CHECK
: 'RUN: at line 2';     /Users/buildslave/jenkins/workspace/mr-clang-stage1-cmake-RA-expensive/llvm-project/compiler-rt/test/sanitizer_common/ios_commands/iossim_compile.py /Users/buildslave/jenkins/workspace/mr-clang-stage1-cmake-RA-expensive/clang-build/./bin/clang  --driver-mode=g++ -fsanitize=address -mno-omit-leaf-frame-pointer -fno-omit-frame-pointer -fno-optimize-sibling-calls -gline-tables-only  -arch x86_64 -isysroot /Applications/Xcode.app/Contents/Developer/Platforms/iPhoneSimulator.platform/Developer/SDKs/iPhoneSimulator12.1.sdk   -shared-libasan -O1 /Users/buildslave/jenkins/workspace/mr-clang-stage1-cmake-RA-expensive/llvm-project/compiler-rt/test/asan/TestCases/use-after-free.cc -o /Users/buildslave/jenkins/workspace/mr-clang-stage1-cmake-RA-expensive/clang-build/tools/clang/runtime/compiler-rt-bins/test/asan/IOSSimX86_64Config/TestCases/Output/use-after-free.cc.tmp && not /Users/buildslave/jenkins/workspace/mr-clang-stage1-cmake-RA-expensive/llvm-project/compiler-rt/test/sanitizer_common/ios_commands/iossim_run.py /Users/buildslave/jenkins/workspace/mr-clang-stage1-cmake-RA-expensive/clang-build/tools/clang/runtime/compiler-rt-bins/test/asan/IOSSimX86_64Config/TestCases/Output/use-after-free.cc.tmp 2>&1 | FileCheck /Users/buildslave/jenkins/workspace/mr-clang-stage1-cmake-RA-expensive/llvm-project/compiler-rt/test/asan/TestCases/use-after-free.cc --check-prefix=CHECK-Darwin --check-prefix=CHECK
: 'RUN: at line 3';     /Users/buildslave/jenkins/workspace/mr-clang-stage1-cmake-RA-expensive/llvm-project/compiler-rt/test/sanitizer_common/ios_commands/iossim_compile.py /Users/buildslave/jenkins/workspace/mr-clang-stage1-cmake-RA-expensive/clang-build/./bin/clang  --driver-mode=g++ -fsanitize=address -mno-omit-leaf-frame-pointer -fno-omit-frame-pointer -fno-optimize-sibling-calls -gline-tables-only  -arch x86_64 -isysroot /Applications/Xcode.app/Contents/Developer/Platforms/iPhoneSimulator.platform/Developer/SDKs/iPhoneSimulator12.1.sdk   -shared-libasan -O2 /Users/buildslave/jenkins/workspace/mr-clang-stage1-cmake-RA-expensive/llvm-project/compiler-rt/test/asan/TestCases/use-after-free.cc -o /Users/buildslave/jenkins/workspace/mr-clang-stage1-cmake-RA-expensive/clang-build/tools/clang/runtime/compiler-rt-bins/test/asan/IOSSimX86_64Config/TestCases/Output/use-after-free.cc.tmp && not /Users/buildslave/jenkins/workspace/mr-clang-stage1-cmake-RA-expensive/llvm-project/compiler-rt/test/sanitizer_common/ios_commands/iossim_run.py /Users/buildslave/jenkins/workspace/mr-clang-stage1-cmake-RA-expensive/clang-build/tools/clang/runtime/compiler-rt-bins/test/asan/IOSSimX86_64Config/TestCases/Output/use-after-free.cc.tmp 2>&1 | FileCheck /Users/buildslave/jenkins/workspace/mr-clang-stage1-cmake-RA-expensive/llvm-project/compiler-rt/test/asan/TestCases/use-after-free.cc --check-prefix=CHECK-Darwin --check-prefix=CHECK
: 'RUN: at line 4';     /Users/buildslave/jenkins/workspace/mr-clang-stage1-cmake-RA-expensive/llvm-project/compiler-rt/test/sanitizer_common/ios_commands/iossim_compile.py /Users/buildslave/jenkins/workspace/mr-clang-stage1-cmake-RA-expensive/clang-build/./bin/clang  --driver-mode=g++ -fsanitize=address -mno-omit-leaf-frame-pointer -fno-omit-frame-pointer -fno-optimize-sibling-calls -gline-tables-only  -arch x86_64 -isysroot /Applications/Xcode.app/Contents/Developer/Platforms/iPhoneSimulator.platform/Developer/SDKs/iPhoneSimulator12.1.sdk   -shared-libasan -O3 /Users/buildslave/jenkins/workspace/mr-clang-stage1-cmake-RA-expensive/llvm-project/compiler-rt/test/asan/TestCases/use-after-free.cc -o /Users/buildslave/jenkins/workspace/mr-clang-stage1-cmake-RA-expensive/clang-build/tools/clang/runtime/compiler-rt-bins/test/asan/IOSSimX86_64Config/TestCases/Output/use-after-free.cc.tmp && not /Users/buildslave/jenkins/workspace/mr-clang-stage1-cmake-RA-expensive/llvm-project/compiler-rt/test/sanitizer_common/ios_commands/iossim_run.py /Users/buildslave/jenkins/workspace/mr-clang-stage1-cmake-RA-expensive/clang-build/tools/clang/runtime/compiler-rt-bins/test/asan/IOSSimX86_64Config/TestCases/Output/use-after-free.cc.tmp 2>&1 | FileCheck /Users/buildslave/jenkins/workspace/mr-clang-stage1-cmake-RA-expensive/llvm-project/compiler-rt/test/asan/TestCases/use-after-free.cc --check-prefix=CHECK-Darwin --check-prefix=CHECK
--
Exit Code: 1

Command Output (stderr):
--
/Users/buildslave/jenkins/workspace/mr-clang-stage1-cmake-RA-expensive/llvm-project/compiler-rt/test/asan/TestCases/use-after-free.cc:15:12: error: CHECK: expected string not found in input
 // CHECK: {{ #0 0x.* in main .*use-after-free.cc:}}[[@LINE-4]]
           ^
<stdin>:4:1: note: scanning from here
atos[26175]: atos cannot examine process 26172 (use-after-free.cc.tmp) for unknown reasons, even though it appears to exist; try running with `sudo`.
^
<stdin>:4:1: note: with "@LINE-4" equal to "11"
atos[26175]: atos cannot examine process 26172 (use-after-free.cc.tmp) for unknown reasons, even though it appears to exist; try running with `sudo`.
^
<stdin>:4:29: note: possible intended match here
atos[26175]: atos cannot examine process 26172 (use-after-free.cc.tmp) for unknown reasons, even though it appears to exist; try running with `sudo`.
                            ^

--

********************
XFAIL: AddressSanitizer-x86_64-iossim :: TestCases/use-after-scope-conversion.cc (460 of 479)
FAIL: AddressSanitizer-x86_64-iossim :: TestCases/use-after-poison.cc (461 of 479)
******************** TEST 'AddressSanitizer-x86_64-iossim :: TestCases/use-after-poison.cc' FAILED ********************
Script:
--
: 'RUN: at line 2';     /Users/buildslave/jenkins/workspace/mr-clang-stage1-cmake-RA-expensive/llvm-project/compiler-rt/test/sanitizer_common/ios_commands/iossim_compile.py /Users/buildslave/jenkins/workspace/mr-clang-stage1-cmake-RA-expensive/clang-build/./bin/clang  --driver-mode=g++ -fsanitize=address -mno-omit-leaf-frame-pointer -fno-omit-frame-pointer -fno-optimize-sibling-calls -gline-tables-only  -arch x86_64 -isysroot /Applications/Xcode.app/Contents/Developer/Platforms/iPhoneSimulator.platform/Developer/SDKs/iPhoneSimulator12.1.sdk   -shared-libasan -O0 /Users/buildslave/jenkins/workspace/mr-clang-stage1-cmake-RA-expensive/llvm-project/compiler-rt/test/asan/TestCases/use-after-poison.cc -o /Users/buildslave/jenkins/workspace/mr-clang-stage1-cmake-RA-expensive/clang-build/tools/clang/runtime/compiler-rt-bins/test/asan/IOSSimX86_64Config/TestCases/Output/use-after-poison.cc.tmp && not /Users/buildslave/jenkins/workspace/mr-clang-stage1-cmake-RA-expensive/llvm-project/compiler-rt/test/sanitizer_common/ios_commands/iossim_run.py /Users/buildslave/jenkins/workspace/mr-clang-stage1-cmake-RA-expensive/clang-build/tools/clang/runtime/compiler-rt-bins/test/asan/IOSSimX86_64Config/TestCases/Output/use-after-poison.cc.tmp 2>&1 | FileCheck /Users/buildslave/jenkins/workspace/mr-clang-stage1-cmake-RA-expensive/llvm-project/compiler-rt/test/asan/TestCases/use-after-poison.cc
: 'RUN: at line 5';   env ASAN_OPTIONS=abort_on_error=0:log_to_syslog=0:detect_leaks=1:allow_user_poisoning=0 /Users/buildslave/jenkins/workspace/mr-clang-stage1-cmake-RA-expensive/llvm-project/compiler-rt/test/sanitizer_common/ios_commands/iossim_run.py /Users/buildslave/jenkins/workspace/mr-clang-stage1-cmake-RA-expensive/clang-build/tools/clang/runtime/compiler-rt-bins/test/asan/IOSSimX86_64Config/TestCases/Output/use-after-poison.cc.tmp
--
Exit Code: 1

Command Output (stderr):
--
/Users/buildslave/jenkins/workspace/mr-clang-stage1-cmake-RA-expensive/llvm-project/compiler-rt/test/asan/TestCases/use-after-poison.cc:17:12: error: CHECK: expected string not found in input
 // CHECK: main{{.*}}use-after-poison.cc:[[@LINE-2]]
           ^
<stdin>:2:52: note: scanning from here
==26188==ERROR: AddressSanitizer: use-after-poison on address 0x60200000015a at pc 0x000102b14ef3 bp 0x7ffeed0eaba0 sp 0x7ffeed0eab98
                                                   ^
<stdin>:2:52: note: with "@LINE-2" equal to "15"
==26188==ERROR: AddressSanitizer: use-after-poison on address 0x60200000015a at pc 0x000102b14ef3 bp 0x7ffeed0eaba0 sp 0x7ffeed0eab98
                                                   ^
<stdin>:4:40: note: possible intended match here
atos[26190]: atos cannot examine process 26188 (use-after-poison.cc.tmp) for unknown reasons, even though it appears to exist; try running with `sudo`.
                                       ^

--

********************
FAIL: AddressSanitizer-x86_64-iossim :: TestCases/use-after-scope-dtor-order.cc (462 of 479)
******************** TEST 'AddressSanitizer-x86_64-iossim :: TestCases/use-after-scope-dtor-order.cc' FAILED ********************
Script:
--
: 'RUN: at line 1';     /Users/buildslave/jenkins/workspace/mr-clang-stage1-cmake-RA-expensive/llvm-project/compiler-rt/test/sanitizer_common/ios_commands/iossim_compile.py /Users/buildslave/jenkins/workspace/mr-clang-stage1-cmake-RA-expensive/clang-build/./bin/clang  --driver-mode=g++ -fsanitize=address -mno-omit-leaf-frame-pointer -fno-omit-frame-pointer -fno-optimize-sibling-calls -gline-tables-only  -arch x86_64 -isysroot /Applications/Xcode.app/Contents/Developer/Platforms/iPhoneSimulator.platform/Developer/SDKs/iPhoneSimulator12.1.sdk   -shared-libasan -O1 -fsanitize-address-use-after-scope /Users/buildslave/jenkins/workspace/mr-clang-stage1-cmake-RA-expensive/llvm-project/compiler-rt/test/asan/TestCases/use-after-scope-dtor-order.cc -o /Users/buildslave/jenkins/workspace/mr-clang-stage1-cmake-RA-expensive/clang-build/tools/clang/runtime/compiler-rt-bins/test/asan/IOSSimX86_64Config/TestCases/Output/use-after-scope-dtor-order.cc.tmp &&      not /Users/buildslave/jenkins/workspace/mr-clang-stage1-cmake-RA-expensive/llvm-project/compiler-rt/test/sanitizer_common/ios_commands/iossim_run.py /Users/buildslave/jenkins/workspace/mr-clang-stage1-cmake-RA-expensive/clang-build/tools/clang/runtime/compiler-rt-bins/test/asan/IOSSimX86_64Config/TestCases/Output/use-after-scope-dtor-order.cc.tmp 2>&1 | FileCheck /Users/buildslave/jenkins/workspace/mr-clang-stage1-cmake-RA-expensive/llvm-project/compiler-rt/test/asan/TestCases/use-after-scope-dtor-order.cc
--
Exit Code: 1

Command Output (stderr):
--
/Users/buildslave/jenkins/workspace/mr-clang-stage1-cmake-RA-expensive/llvm-project/compiler-rt/test/asan/TestCases/use-after-scope-dtor-order.cc:11:12: error: CHECK: expected string not found in input
 // CHECK: #0 0x{{.*}} in IntHolder::~IntHolder{{.*}}.cc:[[@LINE-2]]
           ^
<stdin>:2:57: note: scanning from here
==26217==ERROR: AddressSanitizer: stack-use-after-scope on address 0x7ffee4d8ab60 at pc 0x00010ae74cef bp 0x7ffee4d8aaf0 sp 0x7ffee4d8aae8
                                                        ^
<stdin>:2:57: note: with "@LINE-2" equal to "9"
==26217==ERROR: AddressSanitizer: stack-use-after-scope on address 0x7ffee4d8ab60 at pc 0x00010ae74cef bp 0x7ffee4d8aaf0 sp 0x7ffee4d8aae8
                                                        ^
<stdin>:26:261: note: possible intended match here
SUMMARY: AddressSanitizer: stack-use-after-scope (/Users/buildslave/jenkins/workspace/mr-clang-stage1-cmake-RA-expensive/clang-build/tools/clang/runtime/compiler-rt-bins/test/asan/IOSSimX86_64Config/TestCases/Output/use-after-scope-dtor-order.cc.tmp:x86_64+0x100000cee) in IntHolder::~IntHolder()
                                                                                                                                                                                                                                                                    ^

--

********************
PASS: AddressSanitizer-x86_64-iossim :: TestCases/use-after-scope-goto.cc (463 of 479)
FAIL: AddressSanitizer-x86_64-iossim :: TestCases/use-after-scope-if.cc (464 of 479)
******************** TEST 'AddressSanitizer-x86_64-iossim :: TestCases/use-after-scope-if.cc' FAILED ********************
Script:
--
: 'RUN: at line 1';     /Users/buildslave/jenkins/workspace/mr-clang-stage1-cmake-RA-expensive/llvm-project/compiler-rt/test/sanitizer_common/ios_commands/iossim_compile.py /Users/buildslave/jenkins/workspace/mr-clang-stage1-cmake-RA-expensive/clang-build/./bin/clang  --driver-mode=g++ -fsanitize=address -mno-omit-leaf-frame-pointer -fno-omit-frame-pointer -fno-optimize-sibling-calls -gline-tables-only  -arch x86_64 -isysroot /Applications/Xcode.app/Contents/Developer/Platforms/iPhoneSimulator.platform/Developer/SDKs/iPhoneSimulator12.1.sdk   -shared-libasan -O1 -fsanitize-address-use-after-scope /Users/buildslave/jenkins/workspace/mr-clang-stage1-cmake-RA-expensive/llvm-project/compiler-rt/test/asan/TestCases/use-after-scope-if.cc -o /Users/buildslave/jenkins/workspace/mr-clang-stage1-cmake-RA-expensive/clang-build/tools/clang/runtime/compiler-rt-bins/test/asan/IOSSimX86_64Config/TestCases/Output/use-after-scope-if.cc.tmp &&      not /Users/buildslave/jenkins/workspace/mr-clang-stage1-cmake-RA-expensive/llvm-project/compiler-rt/test/sanitizer_common/ios_commands/iossim_run.py /Users/buildslave/jenkins/workspace/mr-clang-stage1-cmake-RA-expensive/clang-build/tools/clang/runtime/compiler-rt-bins/test/asan/IOSSimX86_64Config/TestCases/Output/use-after-scope-if.cc.tmp 2>&1 | FileCheck /Users/buildslave/jenkins/workspace/mr-clang-stage1-cmake-RA-expensive/llvm-project/compiler-rt/test/asan/TestCases/use-after-scope-if.cc
--
Exit Code: 1

Command Output (stderr):
--
/Users/buildslave/jenkins/workspace/mr-clang-stage1-cmake-RA-expensive/llvm-project/compiler-rt/test/asan/TestCases/use-after-scope-if.cc:14:12: error: CHECK: expected string not found in input
 // CHECK: #0 0x{{.*}} in main {{.*}}.cc:[[@LINE-2]]
           ^
<stdin>:2:57: note: scanning from here
==26246==ERROR: AddressSanitizer: stack-use-after-scope on address 0x7ffeeaec4b64 at pc 0x000104d3adbc bp 0x7ffeeaec4b30 sp 0x7ffeeaec4b28
                                                        ^
<stdin>:2:57: note: with "@LINE-2" equal to "12"
==26246==ERROR: AddressSanitizer: stack-use-after-scope on address 0x7ffeeaec4b64 at pc 0x000104d3adbc bp 0x7ffeeaec4b30 sp 0x7ffeeaec4b28
                                                        ^
<stdin>:13:7: note: possible intended match here
 #0 0x104d3adbb in main (/Users/buildslave/jenkins/workspace/mr-clang-stage1-cmake-RA-expensive/clang-build/tools/clang/runtime/compiler-rt-bins/test/asan/IOSSimX86_64Config/TestCases/Output/use-after-scope-if.cc.tmp:x86_64+0x100000dbb)
      ^

--

********************
FAIL: AddressSanitizer-x86_64-iossim :: TestCases/use-after-scope-inlined.cc (465 of 479)
******************** TEST 'AddressSanitizer-x86_64-iossim :: TestCases/use-after-scope-inlined.cc' FAILED ********************
Script:
--
: 'RUN: at line 5';     /Users/buildslave/jenkins/workspace/mr-clang-stage1-cmake-RA-expensive/llvm-project/compiler-rt/test/sanitizer_common/ios_commands/iossim_compile.py /Users/buildslave/jenkins/workspace/mr-clang-stage1-cmake-RA-expensive/clang-build/./bin/clang  --driver-mode=g++ -fsanitize=address -mno-omit-leaf-frame-pointer -fno-omit-frame-pointer -fno-optimize-sibling-calls -gline-tables-only  -arch x86_64 -isysroot /Applications/Xcode.app/Contents/Developer/Platforms/iPhoneSimulator.platform/Developer/SDKs/iPhoneSimulator12.1.sdk   -shared-libasan -O2 -fsanitize-address-use-after-scope /Users/buildslave/jenkins/workspace/mr-clang-stage1-cmake-RA-expensive/llvm-project/compiler-rt/test/asan/TestCases/use-after-scope-inlined.cc -o /Users/buildslave/jenkins/workspace/mr-clang-stage1-cmake-RA-expensive/clang-build/tools/clang/runtime/compiler-rt-bins/test/asan/IOSSimX86_64Config/TestCases/Output/use-after-scope-inlined.cc.tmp &&      not /Users/buildslave/jenkins/workspace/mr-clang-stage1-cmake-RA-expensive/llvm-project/compiler-rt/test/sanitizer_common/ios_commands/iossim_run.py /Users/buildslave/jenkins/workspace/mr-clang-stage1-cmake-RA-expensive/clang-build/tools/clang/runtime/compiler-rt-bins/test/asan/IOSSimX86_64Config/TestCases/Output/use-after-scope-inlined.cc.tmp 2>&1 | FileCheck /Users/buildslave/jenkins/workspace/mr-clang-stage1-cmake-RA-expensive/llvm-project/compiler-rt/test/asan/TestCases/use-after-scope-inlined.cc
--
Exit Code: 1

Command Output (stderr):
--
/Users/buildslave/jenkins/workspace/mr-clang-stage1-cmake-RA-expensive/llvm-project/compiler-rt/test/asan/TestCases/use-after-scope-inlined.cc:23:12: error: CHECK: expected string not found in input
 // CHECK: {{.*}}use-after-scope-inlined.cc:[[@LINE-4]]
           ^
<stdin>:13:25: note: scanning from here
 #0 0x10ad62c7c in main (/Users/buildslave/jenkins/workspace/mr-clang-stage1-cmake-RA-expensive/clang-build/tools/clang/runtime/compiler-rt-bins/test/asan/IOSSimX86_64Config/TestCases/Output/use-after-scope-inlined.cc.tmp:x86_64+0x100001c7c)
                        ^
<stdin>:13:25: note: with "@LINE-4" equal to "19"
 #0 0x10ad62c7c in main (/Users/buildslave/jenkins/workspace/mr-clang-stage1-cmake-RA-expensive/clang-build/tools/clang/runtime/compiler-rt-bins/test/asan/IOSSimX86_64Config/TestCases/Output/use-after-scope-inlined.cc.tmp:x86_64+0x100001c7c)
                        ^
<stdin>:13:187: note: possible intended match here
 #0 0x10ad62c7c in main (/Users/buildslave/jenkins/workspace/mr-clang-stage1-cmake-RA-expensive/clang-build/tools/clang/runtime/compiler-rt-bins/test/asan/IOSSimX86_64Config/TestCases/Output/use-after-scope-inlined.cc.tmp:x86_64+0x100001c7c)
                                                                                                                                                                                          ^

--

********************
FAIL: AddressSanitizer-x86_64-iossim :: TestCases/use-after-scope-loop-bug.cc (466 of 479)
******************** TEST 'AddressSanitizer-x86_64-iossim :: TestCases/use-after-scope-loop-bug.cc' FAILED ********************
Script:
--
: 'RUN: at line 1';     /Users/buildslave/jenkins/workspace/mr-clang-stage1-cmake-RA-expensive/llvm-project/compiler-rt/test/sanitizer_common/ios_commands/iossim_compile.py /Users/buildslave/jenkins/workspace/mr-clang-stage1-cmake-RA-expensive/clang-build/./bin/clang  --driver-mode=g++ -fsanitize=address -mno-omit-leaf-frame-pointer -fno-omit-frame-pointer -fno-optimize-sibling-calls -gline-tables-only  -arch x86_64 -isysroot /Applications/Xcode.app/Contents/Developer/Platforms/iPhoneSimulator.platform/Developer/SDKs/iPhoneSimulator12.1.sdk   -shared-libasan -O1 -fsanitize-address-use-after-scope /Users/buildslave/jenkins/workspace/mr-clang-stage1-cmake-RA-expensive/llvm-project/compiler-rt/test/asan/TestCases/use-after-scope-loop-bug.cc -o /Users/buildslave/jenkins/workspace/mr-clang-stage1-cmake-RA-expensive/clang-build/tools/clang/runtime/compiler-rt-bins/test/asan/IOSSimX86_64Config/TestCases/Output/use-after-scope-loop-bug.cc.tmp &&      not /Users/buildslave/jenkins/workspace/mr-clang-stage1-cmake-RA-expensive/llvm-project/compiler-rt/test/sanitizer_common/ios_commands/iossim_run.py /Users/buildslave/jenkins/workspace/mr-clang-stage1-cmake-RA-expensive/clang-build/tools/clang/runtime/compiler-rt-bins/test/asan/IOSSimX86_64Config/TestCases/Output/use-after-scope-loop-bug.cc.tmp 2>&1 | FileCheck /Users/buildslave/jenkins/workspace/mr-clang-stage1-cmake-RA-expensive/llvm-project/compiler-rt/test/asan/TestCases/use-after-scope-loop-bug.cc
--
Exit Code: 1

Command Output (stderr):
--
/Users/buildslave/jenkins/workspace/mr-clang-stage1-cmake-RA-expensive/llvm-project/compiler-rt/test/asan/TestCases/use-after-scope-loop-bug.cc:14:12: error: CHECK: expected string not found in input
 // CHECK: #0 0x{{.*}} in main {{.*}}use-after-scope-loop-bug.cc:[[@LINE-2]]
           ^
<stdin>:2:57: note: scanning from here
==26278==ERROR: AddressSanitizer: stack-use-after-scope on address 0x7ffeebb36b88 at pc 0x0001040c8db2 bp 0x7ffeebb36b50 sp 0x7ffeebb36b48
                                                        ^
<stdin>:2:57: note: with "@LINE-2" equal to "12"
==26278==ERROR: AddressSanitizer: stack-use-after-scope on address 0x7ffeebb36b88 at pc 0x0001040c8db2 bp 0x7ffeebb36b50 sp 0x7ffeebb36b48
                                                        ^
<stdin>:4:24: note: possible intended match here
atos[26283]: atos cannot examine process 26278 (use-after-scope-loop-bug.cc.tmp) for unknown reasons, even though it appears to exist; try running with `sudo`.
                       ^

--

********************
FAIL: AddressSanitizer-x86_64-iossim :: TestCases/use-after-scope-capture.cc (467 of 479)
******************** TEST 'AddressSanitizer-x86_64-iossim :: TestCases/use-after-scope-capture.cc' FAILED ********************
Script:
--
: 'RUN: at line 1';     /Users/buildslave/jenkins/workspace/mr-clang-stage1-cmake-RA-expensive/llvm-project/compiler-rt/test/sanitizer_common/ios_commands/iossim_compile.py /Users/buildslave/jenkins/workspace/mr-clang-stage1-cmake-RA-expensive/clang-build/./bin/clang  --driver-mode=g++ -fsanitize=address -mno-omit-leaf-frame-pointer -fno-omit-frame-pointer -fno-optimize-sibling-calls -gline-tables-only  -arch x86_64 -isysroot /Applications/Xcode.app/Contents/Developer/Platforms/iPhoneSimulator.platform/Developer/SDKs/iPhoneSimulator12.1.sdk   -shared-libasan -std=c++11 -O1 -fsanitize-address-use-after-scope /Users/buildslave/jenkins/workspace/mr-clang-stage1-cmake-RA-expensive/llvm-project/compiler-rt/test/asan/TestCases/use-after-scope-capture.cc -o /Users/buildslave/jenkins/workspace/mr-clang-stage1-cmake-RA-expensive/clang-build/tools/clang/runtime/compiler-rt-bins/test/asan/IOSSimX86_64Config/TestCases/Output/use-after-scope-capture.cc.tmp &&      not /Users/buildslave/jenkins/workspace/mr-clang-stage1-cmake-RA-expensive/llvm-project/compiler-rt/test/sanitizer_common/ios_commands/iossim_run.py /Users/buildslave/jenkins/workspace/mr-clang-stage1-cmake-RA-expensive/clang-build/tools/clang/runtime/compiler-rt-bins/test/asan/IOSSimX86_64Config/TestCases/Output/use-after-scope-capture.cc.tmp 2>&1 | FileCheck /Users/buildslave/jenkins/workspace/mr-clang-stage1-cmake-RA-expensive/llvm-project/compiler-rt/test/asan/TestCases/use-after-scope-capture.cc
--
Exit Code: 1

Command Output (stderr):
--
/Users/buildslave/jenkins/workspace/mr-clang-stage1-cmake-RA-expensive/llvm-project/compiler-rt/test/asan/TestCases/use-after-scope-capture.cc:13:12: error: CHECK: expected string not found in input
 // CHECK: #0 0x{{.*}} in {{.*}}use-after-scope-capture.cc:[[@LINE-2]]
           ^
<stdin>:2:57: note: scanning from here
==26294==ERROR: AddressSanitizer: stack-use-after-scope on address 0x7ffee6251b50 at pc 0x0001099afd81 bp 0x7ffee6251a60 sp 0x7ffee6251a58
                                                        ^
<stdin>:2:57: note: with "@LINE-2" equal to "11"
==26294==ERROR: AddressSanitizer: stack-use-after-scope on address 0x7ffee6251b50 at pc 0x0001099afd81 bp 0x7ffee6251a60 sp 0x7ffee6251a58
                                                        ^
<stdin>:4:31: note: possible intended match here
atos[26295]: atos cannot examine process 26294 (use-after-scope-capture.cc.tmp) for unknown reasons, even though it appears to exist; try running with `sudo`.
                              ^

--

********************
FAIL: AddressSanitizer-x86_64-iossim :: TestCases/use-after-scope-loop-removed.cc (468 of 479)
******************** TEST 'AddressSanitizer-x86_64-iossim :: TestCases/use-after-scope-loop-removed.cc' FAILED ********************
Script:
--
: 'RUN: at line 1';     /Users/buildslave/jenkins/workspace/mr-clang-stage1-cmake-RA-expensive/llvm-project/compiler-rt/test/sanitizer_common/ios_commands/iossim_compile.py /Users/buildslave/jenkins/workspace/mr-clang-stage1-cmake-RA-expensive/clang-build/./bin/clang  --driver-mode=g++ -fsanitize=address -mno-omit-leaf-frame-pointer -fno-omit-frame-pointer -fno-optimize-sibling-calls -gline-tables-only  -arch x86_64 -isysroot /Applications/Xcode.app/Contents/Developer/Platforms/iPhoneSimulator.platform/Developer/SDKs/iPhoneSimulator12.1.sdk   -shared-libasan -O1 -fsanitize-address-use-after-scope /Users/buildslave/jenkins/workspace/mr-clang-stage1-cmake-RA-expensive/llvm-project/compiler-rt/test/asan/TestCases/use-after-scope-loop-removed.cc -o /Users/buildslave/jenkins/workspace/mr-clang-stage1-cmake-RA-expensive/clang-build/tools/clang/runtime/compiler-rt-bins/test/asan/IOSSimX86_64Config/TestCases/Output/use-after-scope-loop-removed.cc.tmp &&      not /Users/buildslave/jenkins/workspace/mr-clang-stage1-cmake-RA-expensive/llvm-project/compiler-rt/test/sanitizer_common/ios_commands/iossim_run.py /Users/buildslave/jenkins/workspace/mr-clang-stage1-cmake-RA-expensive/clang-build/tools/clang/runtime/compiler-rt-bins/test/asan/IOSSimX86_64Config/TestCases/Output/use-after-scope-loop-removed.cc.tmp 2>&1 | FileCheck /Users/buildslave/jenkins/workspace/mr-clang-stage1-cmake-RA-expensive/llvm-project/compiler-rt/test/asan/TestCases/use-after-scope-loop-removed.cc
--
Exit Code: 1

Command Output (stderr):
--
/Users/buildslave/jenkins/workspace/mr-clang-stage1-cmake-RA-expensive/llvm-project/compiler-rt/test/asan/TestCases/use-after-scope-loop-removed.cc:15:12: error: CHECK: expected string not found in input
 // CHECK: #0 0x{{.*}} in main {{.*}}use-after-scope-loop-removed.cc:[[@LINE-2]]
           ^
<stdin>:2:57: note: scanning from here
==26319==ERROR: AddressSanitizer: stack-use-after-scope on address 0x7ffee293db60 at pc 0x00010d2c1dac bp 0x7ffee293db30 sp 0x7ffee293db28
                                                        ^
<stdin>:2:57: note: with "@LINE-2" equal to "13"
==26319==ERROR: AddressSanitizer: stack-use-after-scope on address 0x7ffee293db60 at pc 0x00010d2c1dac bp 0x7ffee293db30 sp 0x7ffee293db28
                                                        ^
<stdin>:4:24: note: possible intended match here
atos[26322]: atos cannot examine process 26319 (use-after-scope-loop-removed.cc.tmp) for unknown reasons, even though it appears to exist; try running with `sudo`.
                       ^

--

********************
FAIL: AddressSanitizer-x86_64-iossim :: TestCases/use-after-scope-loop.cc (469 of 479)
******************** TEST 'AddressSanitizer-x86_64-iossim :: TestCases/use-after-scope-loop.cc' FAILED ********************
Script:
--
: 'RUN: at line 1';     /Users/buildslave/jenkins/workspace/mr-clang-stage1-cmake-RA-expensive/llvm-project/compiler-rt/test/sanitizer_common/ios_commands/iossim_compile.py /Users/buildslave/jenkins/workspace/mr-clang-stage1-cmake-RA-expensive/clang-build/./bin/clang  --driver-mode=g++ -fsanitize=address -mno-omit-leaf-frame-pointer -fno-omit-frame-pointer -fno-optimize-sibling-calls -gline-tables-only  -arch x86_64 -isysroot /Applications/Xcode.app/Contents/Developer/Platforms/iPhoneSimulator.platform/Developer/SDKs/iPhoneSimulator12.1.sdk   -shared-libasan -O1 -fsanitize-address-use-after-scope /Users/buildslave/jenkins/workspace/mr-clang-stage1-cmake-RA-expensive/llvm-project/compiler-rt/test/asan/TestCases/use-after-scope-loop.cc -o /Users/buildslave/jenkins/workspace/mr-clang-stage1-cmake-RA-expensive/clang-build/tools/clang/runtime/compiler-rt-bins/test/asan/IOSSimX86_64Config/TestCases/Output/use-after-scope-loop.cc.tmp &&      not /Users/buildslave/jenkins/workspace/mr-clang-stage1-cmake-RA-expensive/llvm-project/compiler-rt/test/sanitizer_common/ios_commands/iossim_run.py /Users/buildslave/jenkins/workspace/mr-clang-stage1-cmake-RA-expensive/clang-build/tools/clang/runtime/compiler-rt-bins/test/asan/IOSSimX86_64Config/TestCases/Output/use-after-scope-loop.cc.tmp 2>&1 | FileCheck /Users/buildslave/jenkins/workspace/mr-clang-stage1-cmake-RA-expensive/llvm-project/compiler-rt/test/asan/TestCases/use-after-scope-loop.cc
--
Exit Code: 1

Command Output (stderr):
--
/Users/buildslave/jenkins/workspace/mr-clang-stage1-cmake-RA-expensive/llvm-project/compiler-rt/test/asan/TestCases/use-after-scope-loop.cc:13:12: error: CHECK: expected string not found in input
 // CHECK: #0 0x{{.*}} in main {{.*}}.cc:[[@LINE-2]]
           ^
<stdin>:2:57: note: scanning from here
==26328==ERROR: AddressSanitizer: stack-use-after-scope on address 0x7ffee0d6fb80 at pc 0x00010ee8fdaf bp 0x7ffee0d6fb50 sp 0x7ffee0d6fb48
                                                        ^
<stdin>:2:57: note: with "@LINE-2" equal to "11"
==26328==ERROR: AddressSanitizer: stack-use-after-scope on address 0x7ffee0d6fb80 at pc 0x00010ee8fdaf bp 0x7ffee0d6fb50 sp 0x7ffee0d6fb48
                                                        ^
<stdin>:13:7: note: possible intended match here
 #0 0x10ee8fdae in main (/Users/buildslave/jenkins/workspace/mr-clang-stage1-cmake-RA-expensive/clang-build/tools/clang/runtime/compiler-rt-bins/test/asan/IOSSimX86_64Config/TestCases/Output/use-after-scope-loop.cc.tmp:x86_64+0x100000dae)
      ^

--

********************
PASS: AddressSanitizer-x86_64-iossim :: TestCases/use-after-scope-nobug.cc (470 of 479)
FAIL: AddressSanitizer-x86_64-iossim :: TestCases/use-after-scope-temp.cc (471 of 479)
******************** TEST 'AddressSanitizer-x86_64-iossim :: TestCases/use-after-scope-temp.cc' FAILED ********************
Script:
--
: 'RUN: at line 1';     /Users/buildslave/jenkins/workspace/mr-clang-stage1-cmake-RA-expensive/llvm-project/compiler-rt/test/sanitizer_common/ios_commands/iossim_compile.py /Users/buildslave/jenkins/workspace/mr-clang-stage1-cmake-RA-expensive/clang-build/./bin/clang  --driver-mode=g++ -fsanitize=address -mno-omit-leaf-frame-pointer -fno-omit-frame-pointer -fno-optimize-sibling-calls -gline-tables-only  -arch x86_64 -isysroot /Applications/Xcode.app/Contents/Developer/Platforms/iPhoneSimulator.platform/Developer/SDKs/iPhoneSimulator12.1.sdk   -shared-libasan -std=c++11 -O1 -fsanitize-address-use-after-scope /Users/buildslave/jenkins/workspace/mr-clang-stage1-cmake-RA-expensive/llvm-project/compiler-rt/test/asan/TestCases/use-after-scope-temp.cc -o /Users/buildslave/jenkins/workspace/mr-clang-stage1-cmake-RA-expensive/clang-build/tools/clang/runtime/compiler-rt-bins/test/asan/IOSSimX86_64Config/TestCases/Output/use-after-scope-temp.cc.tmp &&      not /Users/buildslave/jenkins/workspace/mr-clang-stage1-cmake-RA-expensive/llvm-project/compiler-rt/test/sanitizer_common/ios_commands/iossim_run.py /Users/buildslave/jenkins/workspace/mr-clang-stage1-cmake-RA-expensive/clang-build/tools/clang/runtime/compiler-rt-bins/test/asan/IOSSimX86_64Config/TestCases/Output/use-after-scope-temp.cc.tmp 2>&1 | FileCheck /Users/buildslave/jenkins/workspace/mr-clang-stage1-cmake-RA-expensive/llvm-project/compiler-rt/test/asan/TestCases/use-after-scope-temp.cc
--
Exit Code: 1

Command Output (stderr):
--
/Users/buildslave/jenkins/workspace/mr-clang-stage1-cmake-RA-expensive/llvm-project/compiler-rt/test/asan/TestCases/use-after-scope-temp.cc:19:12: error: CHECK: expected string not found in input
 // CHECK: #0 0x{{.*}} in main {{.*}}use-after-scope-temp.cc:[[@LINE-2]]
           ^
<stdin>:2:57: note: scanning from here
==26369==ERROR: AddressSanitizer: stack-use-after-scope on address 0x7ffedfd91b60 at pc 0x00010fe6dda8 bp 0x7ffedfd91b30 sp 0x7ffedfd91b28
                                                        ^
<stdin>:2:57: note: with "@LINE-2" equal to "17"
==26369==ERROR: AddressSanitizer: stack-use-after-scope on address 0x7ffedfd91b60 at pc 0x00010fe6dda8 bp 0x7ffedfd91b30 sp 0x7ffedfd91b28
                                                        ^
<stdin>:4:24: note: possible intended match here
atos[26372]: atos cannot examine process 26369 (use-after-scope-temp.cc.tmp) for unknown reasons, even though it appears to exist; try running with `sudo`.
                       ^

--

********************
FAIL: AddressSanitizer-x86_64-iossim :: TestCases/use-after-scope-temp2.cc (472 of 479)
******************** TEST 'AddressSanitizer-x86_64-iossim :: TestCases/use-after-scope-temp2.cc' FAILED ********************
Script:
--
: 'RUN: at line 1';     /Users/buildslave/jenkins/workspace/mr-clang-stage1-cmake-RA-expensive/llvm-project/compiler-rt/test/sanitizer_common/ios_commands/iossim_compile.py /Users/buildslave/jenkins/workspace/mr-clang-stage1-cmake-RA-expensive/clang-build/./bin/clang  --driver-mode=g++ -fsanitize=address -mno-omit-leaf-frame-pointer -fno-omit-frame-pointer -fno-optimize-sibling-calls -gline-tables-only  -arch x86_64 -isysroot /Applications/Xcode.app/Contents/Developer/Platforms/iPhoneSimulator.platform/Developer/SDKs/iPhoneSimulator12.1.sdk   -shared-libasan -std=c++11 -O1 -fsanitize-address-use-after-scope /Users/buildslave/jenkins/workspace/mr-clang-stage1-cmake-RA-expensive/llvm-project/compiler-rt/test/asan/TestCases/use-after-scope-temp2.cc -o /Users/buildslave/jenkins/workspace/mr-clang-stage1-cmake-RA-expensive/clang-build/tools/clang/runtime/compiler-rt-bins/test/asan/IOSSimX86_64Config/TestCases/Output/use-after-scope-temp2.cc.tmp &&      not /Users/buildslave/jenkins/workspace/mr-clang-stage1-cmake-RA-expensive/llvm-project/compiler-rt/test/sanitizer_common/ios_commands/iossim_run.py /Users/buildslave/jenkins/workspace/mr-clang-stage1-cmake-RA-expensive/clang-build/tools/clang/runtime/compiler-rt-bins/test/asan/IOSSimX86_64Config/TestCases/Output/use-after-scope-temp2.cc.tmp 2>&1 | FileCheck /Users/buildslave/jenkins/workspace/mr-clang-stage1-cmake-RA-expensive/llvm-project/compiler-rt/test/asan/TestCases/use-after-scope-temp2.cc
--
Exit Code: 1

Command Output (stderr):
--
/Users/buildslave/jenkins/workspace/mr-clang-stage1-cmake-RA-expensive/llvm-project/compiler-rt/test/asan/TestCases/use-after-scope-temp2.cc:18:12: error: CHECK: expected string not found in input
 // CHECK: #0 0x{{.*}} in main {{.*}}use-after-scope-temp2.cc:[[@LINE-2]]
           ^
<stdin>:2:57: note: scanning from here
==26374==ERROR: AddressSanitizer: stack-use-after-scope on address 0x7ffee2875b60 at pc 0x00010d389d45 bp 0x7ffee2875b30 sp 0x7ffee2875b28
                                                        ^
<stdin>:2:57: note: with "@LINE-2" equal to "16"
==26374==ERROR: AddressSanitizer: stack-use-after-scope on address 0x7ffee2875b60 at pc 0x00010d389d45 bp 0x7ffee2875b30 sp 0x7ffee2875b28
                                                        ^
<stdin>:4:24: note: possible intended match here
atos[26376]: atos cannot examine process 26374 (use-after-scope-temp2.cc.tmp) for unknown reasons, even though it appears to exist; try running with `sudo`.
                       ^

--

********************
UNSUPPORTED: AddressSanitizer-x86_64-iossim :: TestCases/verbose-log-path_test.cc (473 of 479)
FAIL: AddressSanitizer-x86_64-iossim :: TestCases/use-after-scope.cc (474 of 479)
******************** TEST 'AddressSanitizer-x86_64-iossim :: TestCases/use-after-scope.cc' FAILED ********************
Script:
--
: 'RUN: at line 1';     /Users/buildslave/jenkins/workspace/mr-clang-stage1-cmake-RA-expensive/llvm-project/compiler-rt/test/sanitizer_common/ios_commands/iossim_compile.py /Users/buildslave/jenkins/workspace/mr-clang-stage1-cmake-RA-expensive/clang-build/./bin/clang  --driver-mode=g++ -fsanitize=address -mno-omit-leaf-frame-pointer -fno-omit-frame-pointer -fno-optimize-sibling-calls -gline-tables-only  -arch x86_64 -isysroot /Applications/Xcode.app/Contents/Developer/Platforms/iPhoneSimulator.platform/Developer/SDKs/iPhoneSimulator12.1.sdk   -shared-libasan -O1 -fsanitize-address-use-after-scope /Users/buildslave/jenkins/workspace/mr-clang-stage1-cmake-RA-expensive/llvm-project/compiler-rt/test/asan/TestCases/use-after-scope.cc -o /Users/buildslave/jenkins/workspace/mr-clang-stage1-cmake-RA-expensive/clang-build/tools/clang/runtime/compiler-rt-bins/test/asan/IOSSimX86_64Config/TestCases/Output/use-after-scope.cc.tmp &&      not /Users/buildslave/jenkins/workspace/mr-clang-stage1-cmake-RA-expensive/llvm-project/compiler-rt/test/sanitizer_common/ios_commands/iossim_run.py /Users/buildslave/jenkins/workspace/mr-clang-stage1-cmake-RA-expensive/clang-build/tools/clang/runtime/compiler-rt-bins/test/asan/IOSSimX86_64Config/TestCases/Output/use-after-scope.cc.tmp 2>&1 | FileCheck /Users/buildslave/jenkins/workspace/mr-clang-stage1-cmake-RA-expensive/llvm-project/compiler-rt/test/asan/TestCases/use-after-scope.cc
: 'RUN: at line 5';     /Users/buildslave/jenkins/workspace/mr-clang-stage1-cmake-RA-expensive/llvm-project/compiler-rt/test/sanitizer_common/ios_commands/iossim_compile.py /Users/buildslave/jenkins/workspace/mr-clang-stage1-cmake-RA-expensive/clang-build/./bin/clang  --driver-mode=g++ -fsanitize=address -mno-omit-leaf-frame-pointer -fno-omit-frame-pointer -fno-optimize-sibling-calls -gline-tables-only  -arch x86_64 -isysroot /Applications/Xcode.app/Contents/Developer/Platforms/iPhoneSimulator.platform/Developer/SDKs/iPhoneSimulator12.1.sdk   -shared-libasan -O1 /Users/buildslave/jenkins/workspace/mr-clang-stage1-cmake-RA-expensive/llvm-project/compiler-rt/test/asan/TestCases/use-after-scope.cc -o /Users/buildslave/jenkins/workspace/mr-clang-stage1-cmake-RA-expensive/clang-build/tools/clang/runtime/compiler-rt-bins/test/asan/IOSSimX86_64Config/TestCases/Output/use-after-scope.cc.tmp &&      not /Users/buildslave/jenkins/workspace/mr-clang-stage1-cmake-RA-expensive/llvm-project/compiler-rt/test/sanitizer_common/ios_commands/iossim_run.py /Users/buildslave/jenkins/workspace/mr-clang-stage1-cmake-RA-expensive/clang-build/tools/clang/runtime/compiler-rt-bins/test/asan/IOSSimX86_64Config/TestCases/Output/use-after-scope.cc.tmp 2>&1 | FileCheck /Users/buildslave/jenkins/workspace/mr-clang-stage1-cmake-RA-expensive/llvm-project/compiler-rt/test/asan/TestCases/use-after-scope.cc
--
Exit Code: 1

Command Output (stderr):
--
/Users/buildslave/jenkins/workspace/mr-clang-stage1-cmake-RA-expensive/llvm-project/compiler-rt/test/asan/TestCases/use-after-scope.cc:17:12: error: CHECK: expected string not found in input
 // CHECK: #0 0x{{.*}} in main {{.*}}use-after-scope.cc:[[@LINE-2]]
           ^
<stdin>:2:57: note: scanning from here
==26400==ERROR: AddressSanitizer: stack-use-after-scope on address 0x7ffee035fb80 at pc 0x00010f89fdd0 bp 0x7ffee035fb50 sp 0x7ffee035fb48
                                                        ^
<stdin>:2:57: note: with "@LINE-2" equal to "15"
==26400==ERROR: AddressSanitizer: stack-use-after-scope on address 0x7ffee035fb80 at pc 0x00010f89fdd0 bp 0x7ffee035fb50 sp 0x7ffee035fb48
                                                        ^
<stdin>:4:24: note: possible intended match here
atos[26401]: atos cannot examine process 26400 (use-after-scope.cc.tmp) for unknown reasons, even though it appears to exist; try running with `sudo`.
                       ^

--

********************
PASS: AddressSanitizer-x86_64-iossim :: TestCases/vla_chrome_testcase.cc (475 of 479)
PASS: AddressSanitizer-x86_64-iossim :: TestCases/vla_condition_overflow.cc (476 of 479)
PASS: AddressSanitizer-x86_64-iossim :: TestCases/vla_loop_overfow.cc (477 of 479)
PASS: AddressSanitizer-x86_64-iossim :: TestCases/zero_page_pc.cc (478 of 479)
PASS: AddressSanitizer-x86_64-iossim :: TestCases/use-after-scope-types.cc (479 of 479)

1 warning(s) in tests.
Testing Time: 531.63s
********************
Failing Tests (42):
    AddressSanitizer-x86_64-iossim :: TestCases/Posix/interception-in-shared-lib-test.cc
    AddressSanitizer-x86_64-iossim :: TestCases/Posix/ioctl.cc
    AddressSanitizer-x86_64-iossim :: TestCases/Posix/shared-lib-test.cc
    AddressSanitizer-x86_64-iossim :: TestCases/Posix/stack-use-after-return.cc
    AddressSanitizer-x86_64-iossim :: TestCases/Posix/strndup_oob_test.cc
    AddressSanitizer-x86_64-iossim :: TestCases/Posix/strndup_oob_test2.cc
    AddressSanitizer-x86_64-iossim :: TestCases/calloc-overflow.cc
    AddressSanitizer-x86_64-iossim :: TestCases/double-free.cc
    AddressSanitizer-x86_64-iossim :: TestCases/global-overflow.cc
    AddressSanitizer-x86_64-iossim :: TestCases/global-underflow.cc
    AddressSanitizer-x86_64-iossim :: TestCases/heap-overflow.cc
    AddressSanitizer-x86_64-iossim :: TestCases/intra-object-overflow.cc
    AddressSanitizer-x86_64-iossim :: TestCases/invalid-free.cc
    AddressSanitizer-x86_64-iossim :: TestCases/invalid-pointer-pairs-compare-errors.cc
    AddressSanitizer-x86_64-iossim :: TestCases/invalid-pointer-pairs-subtract-errors.cc
    AddressSanitizer-x86_64-iossim :: TestCases/invalid-pointer-pairs.cc
    AddressSanitizer-x86_64-iossim :: TestCases/large_func_test.cc
    AddressSanitizer-x86_64-iossim :: TestCases/malloc-size-too-big.cc
    AddressSanitizer-x86_64-iossim :: TestCases/print_summary.cc
    AddressSanitizer-x86_64-iossim :: TestCases/sanity_check_pure_c.c
    AddressSanitizer-x86_64-iossim :: TestCases/stack-buffer-overflow.cc
    AddressSanitizer-x86_64-iossim :: TestCases/strcat-overlap.cc
    AddressSanitizer-x86_64-iossim :: TestCases/strcpy-overlap.cc
    AddressSanitizer-x86_64-iossim :: TestCases/strip_path_prefix.c
    AddressSanitizer-x86_64-iossim :: TestCases/strncat-overlap.cc
    AddressSanitizer-x86_64-iossim :: TestCases/strncpy-overflow.cc
    AddressSanitizer-x86_64-iossim :: TestCases/strncpy-overlap.cc
    AddressSanitizer-x86_64-iossim :: TestCases/unaligned_loads_and_stores.cc
    AddressSanitizer-x86_64-iossim :: TestCases/use-after-delete.cc
    AddressSanitizer-x86_64-iossim :: TestCases/use-after-free-right.cc
    AddressSanitizer-x86_64-iossim :: TestCases/use-after-free.cc
    AddressSanitizer-x86_64-iossim :: TestCases/use-after-poison.cc
    AddressSanitizer-x86_64-iossim :: TestCases/use-after-scope-capture.cc
    AddressSanitizer-x86_64-iossim :: TestCases/use-after-scope-dtor-order.cc
    AddressSanitizer-x86_64-iossim :: TestCases/use-after-scope-if.cc
    AddressSanitizer-x86_64-iossim :: TestCases/use-after-scope-inlined.cc
    AddressSanitizer-x86_64-iossim :: TestCases/use-after-scope-loop-bug.cc
    AddressSanitizer-x86_64-iossim :: TestCases/use-after-scope-loop-removed.cc
    AddressSanitizer-x86_64-iossim :: TestCases/use-after-scope-loop.cc
    AddressSanitizer-x86_64-iossim :: TestCases/use-after-scope-temp.cc
    AddressSanitizer-x86_64-iossim :: TestCases/use-after-scope-temp2.cc
    AddressSanitizer-x86_64-iossim :: TestCases/use-after-scope.cc

  Expected Passes    : 179
  Expected Failures  : 1
  Unsupported Tests  : 257
  Unexpected Failures: 42