Started 2 hr 9 min ago
Took 1 hr 11 min

Failed Build clang-d332484-g5aaca2355ec-t3986-b3986.tar.gz (Nov 22, 2019 5:09:00 AM)

Issues

Found 10 issues:
Ninja target: aarch64_neon_intrinsics.c.o
[8578/8583] /Users/buildslave/jenkins/workspace/test-suite-verify-machineinstrs-aarch64-O0-g/test-suite-build/tools/timeit --summary SingleSource/Regression/C++/EH/CMakeFiles/Regression-C++-class_hierarchy.dir/class_hierarchy.cpp.o.time /Users/buildslave/jenkins/workspace/test-suite-verify-machineinstrs-aarch64-O0-g/compiler/bin/clang++  -DNDEBUG  -B /Applications/Xcode.app/Contents/Developer/Toolchains/XcodeDefault.xctoolchain/usr/bin    -Wno-unused-command-line-argument -mllvm -verify-machineinstrs -O0 -g -arch arm64 -isysroot /Applications/Xcode.app/Contents/Developer/Platforms/iPhoneOS.platform/Developer/SDKs/iPhoneOS12.1.sdk   -w -Werror=date-time -MD -MT SingleSource/Regression/C++/EH/CMakeFiles/Regression-C++-class_hierarchy.dir/class_hierarchy.cpp.o -MF SingleSource/Regression/C++/EH/CMakeFiles/Regression-C++-class_hierarchy.dir/class_hierarchy.cpp.o.d -o SingleSource/Regression/C++/EH/CMakeFiles/Regression-C++-class_hierarchy.dir/class_hierarchy.cpp.o -c /Users/buildslave/jenkins/workspace/test-suite-verify-machineinstrs-aarch64-O0-g/test-suite/SingleSource/Regression/C++/EH/class_hierarchy.cpp
[8579/8583] : && /Users/buildslave/jenkins/workspace/test-suite-verify-machineinstrs-aarch64-O0-g/test-suite-build/tools/timeit --summary SingleSource/Regression/C++/EH/Regression-C++-exception_spec_test.link.time /Users/buildslave/jenkins/workspace/test-suite-verify-machineinstrs-aarch64-O0-g/compiler/bin/clang++  -B /Applications/Xcode.app/Contents/Developer/Toolchains/XcodeDefault.xctoolchain/usr/bin    -Wno-unused-command-line-argument -mllvm -verify-machineinstrs -O0 -g -arch arm64 -isysroot /Applications/Xcode.app/Contents/Developer/Platforms/iPhoneOS.platform/Developer/SDKs/iPhoneOS12.1.sdk -Wl,-search_paths_first -Wl,-headerpad_max_install_names -B /Applications/Xcode.app/Contents/Developer/Toolchains/XcodeDefault.xctoolchain/usr/bin SingleSource/Regression/C++/EH/CMakeFiles/Regression-C++-exception_spec_test.dir/exception_spec_test.cpp.o  -o SingleSource/Regression/C++/EH/Regression-C++-exception_spec_test  -lstdc++ && cd /Users/buildslave/jenkins/workspace/test-suite-verify-machineinstrs-aarch64-O0-g/test-suite-build/SingleSource/Regression/C++/EH && /usr/local/Cellar/cmake/3.13.1/bin/cmake -E create_symlink /Users/buildslave/jenkins/workspace/test-suite-verify-machineinstrs-aarch64-O0-g/test-suite/SingleSource/Regression/C++/EH/exception_spec_test.reference_output /Users/buildslave/jenkins/workspace/test-suite-verify-machineinstrs-aarch64-O0-g/test-suite-build/SingleSource/Regression/C++/EH/exception_spec_test.reference_output
[8580/8583] : && /Users/buildslave/jenkins/workspace/test-suite-verify-machineinstrs-aarch64-O0-g/test-suite-build/tools/timeit --summary SingleSource/Regression/C++/EH/Regression-C++-function_try_block.link.time /Users/buildslave/jenkins/workspace/test-suite-verify-machineinstrs-aarch64-O0-g/compiler/bin/clang++  -B /Applications/Xcode.app/Contents/Developer/Toolchains/XcodeDefault.xctoolchain/usr/bin    -Wno-unused-command-line-argument -mllvm -verify-machineinstrs -O0 -g -arch arm64 -isysroot /Applications/Xcode.app/Contents/Developer/Platforms/iPhoneOS.platform/Developer/SDKs/iPhoneOS12.1.sdk -Wl,-search_paths_first -Wl,-headerpad_max_install_names -B /Applications/Xcode.app/Contents/Developer/Toolchains/XcodeDefault.xctoolchain/usr/bin SingleSource/Regression/C++/EH/CMakeFiles/Regression-C++-function_try_block.dir/function_try_block.cpp.o  -o SingleSource/Regression/C++/EH/Regression-C++-function_try_block  -lstdc++ && cd /Users/buildslave/jenkins/workspace/test-suite-verify-machineinstrs-aarch64-O0-g/test-suite-build/SingleSource/Regression/C++/EH && /usr/local/Cellar/cmake/3.13.1/bin/cmake -E create_symlink /Users/buildslave/jenkins/workspace/test-suite-verify-machineinstrs-aarch64-O0-g/test-suite/SingleSource/Regression/C++/EH/function_try_block.reference_output /Users/buildslave/jenkins/workspace/test-suite-verify-machineinstrs-aarch64-O0-g/test-suite-build/SingleSource/Regression/C++/EH/function_try_block.reference_output
[8581/8583] : && /Users/buildslave/jenkins/workspace/test-suite-verify-machineinstrs-aarch64-O0-g/test-suite-build/tools/timeit --summary SingleSource/Regression/C++/EH/Regression-C++-class_hierarchy.link.time /Users/buildslave/jenkins/workspace/test-suite-verify-machineinstrs-aarch64-O0-g/compiler/bin/clang++  -B /Applications/Xcode.app/Contents/Developer/Toolchains/XcodeDefault.xctoolchain/usr/bin    -Wno-unused-command-line-argument -mllvm -verify-machineinstrs -O0 -g -arch arm64 -isysroot /Applications/Xcode.app/Contents/Developer/Platforms/iPhoneOS.platform/Developer/SDKs/iPhoneOS12.1.sdk -Wl,-search_paths_first -Wl,-headerpad_max_install_names -B /Applications/Xcode.app/Contents/Developer/Toolchains/XcodeDefault.xctoolchain/usr/bin SingleSource/Regression/C++/EH/CMakeFiles/Regression-C++-class_hierarchy.dir/class_hierarchy.cpp.o  -o SingleSource/Regression/C++/EH/Regression-C++-class_hierarchy  -lstdc++ && cd /Users/buildslave/jenkins/workspace/test-suite-verify-machineinstrs-aarch64-O0-g/test-suite-build/SingleSource/Regression/C++/EH && /usr/local/Cellar/cmake/3.13.1/bin/cmake -E create_symlink /Users/buildslave/jenkins/workspace/test-suite-verify-machineinstrs-aarch64-O0-g/test-suite/SingleSource/Regression/C++/EH/class_hierarchy.reference_output /Users/buildslave/jenkins/workspace/test-suite-verify-machineinstrs-aarch64-O0-g/test-suite-build/SingleSource/Regression/C++/EH/class_hierarchy.reference_output
[8582/8583] /Users/buildslave/jenkins/workspace/test-suite-verify-machineinstrs-aarch64-O0-g/test-suite-build/tools/timeit --summary SingleSource/UnitTests/Vector/AArch64/CMakeFiles/aarch64_neon_intrinsics.dir/aarch64_neon_intrinsics.c.o.time /Users/buildslave/jenkins/workspace/test-suite-verify-machineinstrs-aarch64-O0-g/compiler/bin/clang -DNDEBUG  -B /Applications/Xcode.app/Contents/Developer/Toolchains/XcodeDefault.xctoolchain/usr/bin    -Wno-unused-command-line-argument -mllvm -verify-machineinstrs -O0 -g -arch arm64 -isysroot /Applications/Xcode.app/Contents/Developer/Platforms/iPhoneOS.platform/Developer/SDKs/iPhoneOS12.1.sdk   -w -Werror=date-time -std=c99 -MD -MT SingleSource/UnitTests/Vector/AArch64/CMakeFiles/aarch64_neon_intrinsics.dir/aarch64_neon_intrinsics.c.o -MF SingleSource/UnitTests/Vector/AArch64/CMakeFiles/aarch64_neon_intrinsics.dir/aarch64_neon_intrinsics.c.o.d -o SingleSource/UnitTests/Vector/AArch64/CMakeFiles/aarch64_neon_intrinsics.dir/aarch64_neon_intrinsics.c.o   -c /Users/buildslave/jenkins/workspace/test-suite-verify-machineinstrs-aarch64-O0-g/test-suite/SingleSource/UnitTests/Vector/AArch64/aarch64_neon_intrinsics.c
FAILED: SingleSource/UnitTests/Vector/AArch64/CMakeFiles/aarch64_neon_intrinsics.dir/aarch64_neon_intrinsics.c.o 
/Users/buildslave/jenkins/workspace/test-suite-verify-machineinstrs-aarch64-O0-g/test-suite-build/tools/timeit --summary SingleSource/UnitTests/Vector/AArch64/CMakeFiles/aarch64_neon_intrinsics.dir/aarch64_neon_intrinsics.c.o.time /Users/buildslave/jenkins/workspace/test-suite-verify-machineinstrs-aarch64-O0-g/compiler/bin/clang -DNDEBUG  -B /Applications/Xcode.app/Contents/Developer/Toolchains/XcodeDefault.xctoolchain/usr/bin    -Wno-unused-command-line-argument -mllvm -verify-machineinstrs -O0 -g -arch arm64 -isysroot /Applications/Xcode.app/Contents/Developer/Platforms/iPhoneOS.platform/Developer/SDKs/iPhoneOS12.1.sdk   -w -Werror=date-time -std=c99 -MD -MT SingleSource/UnitTests/Vector/AArch64/CMakeFiles/aarch64_neon_intrinsics.dir/aarch64_neon_intrinsics.c.o -MF SingleSource/UnitTests/Vector/AArch64/CMakeFiles/aarch64_neon_intrinsics.dir/aarch64_neon_intrinsics.c.o.d -o SingleSource/UnitTests/Vector/AArch64/CMakeFiles/aarch64_neon_intrinsics.dir/aarch64_neon_intrinsics.c.o   -c /Users/buildslave/jenkins/workspace/test-suite-verify-machineinstrs-aarch64-O0-g/test-suite/SingleSource/UnitTests/Vector/AArch64/aarch64_neon_intrinsics.c
/Users/buildslave/jenkins/workspace/test-suite-verify-machineinstrs-aarch64-O0-g/test-suite/SingleSource/UnitTests/Vector/AArch64/aarch64_neon_intrinsics.c:37433:27: error: invalid conversion between vector type 'int32x2_t' (vector of 2 'int32_t' values) and integer type 'int' of different size
aarch64_neon_intrinsics.c error: invalid conversion between vector type 'int32x2_t' (vector of 2 'int32_t' values) and integer type 'int' of different size
[8580/8583] : && /Users/buildslave/jenkins/workspace/test-suite-verify-machineinstrs-aarch64-O0-g/test-suite-build/tools/timeit --summary SingleSource/Regression/C++/EH/Regression-C++-function_try_block.link.time /Users/buildslave/jenkins/workspace/test-suite-verify-machineinstrs-aarch64-O0-g/compiler/bin/clang++  -B /Applications/Xcode.app/Contents/Developer/Toolchains/XcodeDefault.xctoolchain/usr/bin    -Wno-unused-command-line-argument -mllvm -verify-machineinstrs -O0 -g -arch arm64 -isysroot /Applications/Xcode.app/Contents/Developer/Platforms/iPhoneOS.platform/Developer/SDKs/iPhoneOS12.1.sdk -Wl,-search_paths_first -Wl,-headerpad_max_install_names -B /Applications/Xcode.app/Contents/Developer/Toolchains/XcodeDefault.xctoolchain/usr/bin SingleSource/Regression/C++/EH/CMakeFiles/Regression-C++-function_try_block.dir/function_try_block.cpp.o  -o SingleSource/Regression/C++/EH/Regression-C++-function_try_block  -lstdc++ && cd /Users/buildslave/jenkins/workspace/test-suite-verify-machineinstrs-aarch64-O0-g/test-suite-build/SingleSource/Regression/C++/EH && /usr/local/Cellar/cmake/3.13.1/bin/cmake -E create_symlink /Users/buildslave/jenkins/workspace/test-suite-verify-machineinstrs-aarch64-O0-g/test-suite/SingleSource/Regression/C++/EH/function_try_block.reference_output /Users/buildslave/jenkins/workspace/test-suite-verify-machineinstrs-aarch64-O0-g/test-suite-build/SingleSource/Regression/C++/EH/function_try_block.reference_output
[8581/8583] : && /Users/buildslave/jenkins/workspace/test-suite-verify-machineinstrs-aarch64-O0-g/test-suite-build/tools/timeit --summary SingleSource/Regression/C++/EH/Regression-C++-class_hierarchy.link.time /Users/buildslave/jenkins/workspace/test-suite-verify-machineinstrs-aarch64-O0-g/compiler/bin/clang++  -B /Applications/Xcode.app/Contents/Developer/Toolchains/XcodeDefault.xctoolchain/usr/bin    -Wno-unused-command-line-argument -mllvm -verify-machineinstrs -O0 -g -arch arm64 -isysroot /Applications/Xcode.app/Contents/Developer/Platforms/iPhoneOS.platform/Developer/SDKs/iPhoneOS12.1.sdk -Wl,-search_paths_first -Wl,-headerpad_max_install_names -B /Applications/Xcode.app/Contents/Developer/Toolchains/XcodeDefault.xctoolchain/usr/bin SingleSource/Regression/C++/EH/CMakeFiles/Regression-C++-class_hierarchy.dir/class_hierarchy.cpp.o  -o SingleSource/Regression/C++/EH/Regression-C++-class_hierarchy  -lstdc++ && cd /Users/buildslave/jenkins/workspace/test-suite-verify-machineinstrs-aarch64-O0-g/test-suite-build/SingleSource/Regression/C++/EH && /usr/local/Cellar/cmake/3.13.1/bin/cmake -E create_symlink /Users/buildslave/jenkins/workspace/test-suite-verify-machineinstrs-aarch64-O0-g/test-suite/SingleSource/Regression/C++/EH/class_hierarchy.reference_output /Users/buildslave/jenkins/workspace/test-suite-verify-machineinstrs-aarch64-O0-g/test-suite-build/SingleSource/Regression/C++/EH/class_hierarchy.reference_output
[8582/8583] /Users/buildslave/jenkins/workspace/test-suite-verify-machineinstrs-aarch64-O0-g/test-suite-build/tools/timeit --summary SingleSource/UnitTests/Vector/AArch64/CMakeFiles/aarch64_neon_intrinsics.dir/aarch64_neon_intrinsics.c.o.time /Users/buildslave/jenkins/workspace/test-suite-verify-machineinstrs-aarch64-O0-g/compiler/bin/clang -DNDEBUG  -B /Applications/Xcode.app/Contents/Developer/Toolchains/XcodeDefault.xctoolchain/usr/bin    -Wno-unused-command-line-argument -mllvm -verify-machineinstrs -O0 -g -arch arm64 -isysroot /Applications/Xcode.app/Contents/Developer/Platforms/iPhoneOS.platform/Developer/SDKs/iPhoneOS12.1.sdk   -w -Werror=date-time -std=c99 -MD -MT SingleSource/UnitTests/Vector/AArch64/CMakeFiles/aarch64_neon_intrinsics.dir/aarch64_neon_intrinsics.c.o -MF SingleSource/UnitTests/Vector/AArch64/CMakeFiles/aarch64_neon_intrinsics.dir/aarch64_neon_intrinsics.c.o.d -o SingleSource/UnitTests/Vector/AArch64/CMakeFiles/aarch64_neon_intrinsics.dir/aarch64_neon_intrinsics.c.o   -c /Users/buildslave/jenkins/workspace/test-suite-verify-machineinstrs-aarch64-O0-g/test-suite/SingleSource/UnitTests/Vector/AArch64/aarch64_neon_intrinsics.c
FAILED: SingleSource/UnitTests/Vector/AArch64/CMakeFiles/aarch64_neon_intrinsics.dir/aarch64_neon_intrinsics.c.o 
/Users/buildslave/jenkins/workspace/test-suite-verify-machineinstrs-aarch64-O0-g/test-suite-build/tools/timeit --summary SingleSource/UnitTests/Vector/AArch64/CMakeFiles/aarch64_neon_intrinsics.dir/aarch64_neon_intrinsics.c.o.time /Users/buildslave/jenkins/workspace/test-suite-verify-machineinstrs-aarch64-O0-g/compiler/bin/clang -DNDEBUG  -B /Applications/Xcode.app/Contents/Developer/Toolchains/XcodeDefault.xctoolchain/usr/bin    -Wno-unused-command-line-argument -mllvm -verify-machineinstrs -O0 -g -arch arm64 -isysroot /Applications/Xcode.app/Contents/Developer/Platforms/iPhoneOS.platform/Developer/SDKs/iPhoneOS12.1.sdk   -w -Werror=date-time -std=c99 -MD -MT SingleSource/UnitTests/Vector/AArch64/CMakeFiles/aarch64_neon_intrinsics.dir/aarch64_neon_intrinsics.c.o -MF SingleSource/UnitTests/Vector/AArch64/CMakeFiles/aarch64_neon_intrinsics.dir/aarch64_neon_intrinsics.c.o.d -o SingleSource/UnitTests/Vector/AArch64/CMakeFiles/aarch64_neon_intrinsics.dir/aarch64_neon_intrinsics.c.o   -c /Users/buildslave/jenkins/workspace/test-suite-verify-machineinstrs-aarch64-O0-g/test-suite/SingleSource/UnitTests/Vector/AArch64/aarch64_neon_intrinsics.c
/Users/buildslave/jenkins/workspace/test-suite-verify-machineinstrs-aarch64-O0-g/test-suite/SingleSource/UnitTests/Vector/AArch64/aarch64_neon_intrinsics.c:37433:27: error: invalid conversion between vector type 'int32x2_t' (vector of 2 'int32_t' values) and integer type 'int' of different size
      arg2 = vcombine_s32(vcreate_s32(0),
                          ^~~~~~~~~~~~~~
aarch64_neon_intrinsics.c error: invalid conversion between vector type 'int32x2_t' (vector of 2 'int32_t' values) and integer type 'int' of different size
      arg2 = vcombine_s32(vcreate_s32(0),
                          ^~~~~~~~~~~~~~
/Users/buildslave/jenkins/workspace/test-suite-verify-machineinstrs-aarch64-O0-g/compiler/lib/clang/10.0.0/include/arm_neon.h:4169:11: note: expanded from macro 'vcreate_s32'
  __ret = (int32x2_t)(__p0); \
          ^~~~~~~~~~~~~~~~~
/Users/buildslave/jenkins/workspace/test-suite-verify-machineinstrs-aarch64-O0-g/test-suite/SingleSource/UnitTests/Vector/AArch64/aarch64_neon_intrinsics.c:43129:27: error: invalid conversion between vector type 'int32x2_t' (vector of 2 'int32_t' values) and integer type 'int' of different size
                          vcreate_s32(0));
                          ^~~~~~~~~~~~~~
aarch64_neon_intrinsics.c error: invalid conversion between vector type 'uint16x4_t' (vector of 4 'uint16_t' values) and integer type 'int' of different size
                          vcreate_s32(0));
                          ^~~~~~~~~~~~~~
/Users/buildslave/jenkins/workspace/test-suite-verify-machineinstrs-aarch64-O0-g/compiler/lib/clang/10.0.0/include/arm_neon.h:4169:11: note: expanded from macro 'vcreate_s32'
  __ret = (int32x2_t)(__p0); \
          ^~~~~~~~~~~~~~~~~
/Users/buildslave/jenkins/workspace/test-suite-verify-machineinstrs-aarch64-O0-g/test-suite/SingleSource/UnitTests/Vector/AArch64/aarch64_neon_intrinsics.c:44230:14: error: invalid conversion between vector type 'uint16x4_t' (vector of 4 'uint16_t' values) and integer type 'int' of different size
      arg2 = vcreate_u16(0);
             ^~~~~~~~~~~~~~
aarch64_neon_intrinsics.c error: invalid conversion between vector type 'int16x4_t' (vector of 4 'int16_t' values) and integer type 'int' of different size
      arg2 = vcreate_u16(0);
             ^~~~~~~~~~~~~~
/Users/buildslave/jenkins/workspace/test-suite-verify-machineinstrs-aarch64-O0-g/compiler/lib/clang/10.0.0/include/arm_neon.h:4149:11: note: expanded from macro 'vcreate_u16'
  __ret = (uint16x4_t)(__p0); \
          ^~~~~~~~~~~~~~~~~~
/Users/buildslave/jenkins/workspace/test-suite-verify-machineinstrs-aarch64-O0-g/test-suite/SingleSource/UnitTests/Vector/AArch64/aarch64_neon_intrinsics.c:62891:27: error: invalid conversion between vector type 'int16x4_t' (vector of 4 'int16_t' values) and integer type 'int' of different size
                          vcreate_s16(0));
                          ^~~~~~~~~~~~~~
aarch64_neon_intrinsics.c error: invalid conversion between vector type 'int32x2_t' (vector of 2 'int32_t' values) and integer type 'int' of different size
                          vcreate_s16(0));
                          ^~~~~~~~~~~~~~
/Users/buildslave/jenkins/workspace/test-suite-verify-machineinstrs-aarch64-O0-g/compiler/lib/clang/10.0.0/include/arm_neon.h:4179:11: note: expanded from macro 'vcreate_s16'
  __ret = (int16x4_t)(__p0); \
          ^~~~~~~~~~~~~~~~~
/Users/buildslave/jenkins/workspace/test-suite-verify-machineinstrs-aarch64-O0-g/test-suite/SingleSource/UnitTests/Vector/AArch64/aarch64_neon_intrinsics.c:107308:34: error: invalid conversion between vector type 'int32x2_t' (vector of 2 'int32_t' values) and integer type 'int' of different size
      arg2.val[0] = vcombine_s32(vcreate_s32(0),
                                 ^~~~~~~~~~~~~~
aarch64_neon_intrinsics.c error: invalid conversion between vector type 'uint32x2_t' (vector of 2 'uint32_t' values) and integer type 'int' of different size
      arg2.val[0] = vcombine_s32(vcreate_s32(0),
                                 ^~~~~~~~~~~~~~
/Users/buildslave/jenkins/workspace/test-suite-verify-machineinstrs-aarch64-O0-g/compiler/lib/clang/10.0.0/include/arm_neon.h:4169:11: note: expanded from macro 'vcreate_s32'
  __ret = (int32x2_t)(__p0); \
          ^~~~~~~~~~~~~~~~~
/Users/buildslave/jenkins/workspace/test-suite-verify-machineinstrs-aarch64-O0-g/test-suite/SingleSource/UnitTests/Vector/AArch64/aarch64_neon_intrinsics.c:174263:27: error: invalid conversion between vector type 'uint32x2_t' (vector of 2 'uint32_t' values) and integer type 'int' of different size
                          vcreate_u32(0));
                          ^~~~~~~~~~~~~~
aarch64_neon_intrinsics.c error: invalid conversion between vector type 'int32x2_t' (vector of 2 'int32_t' values) and integer type 'int' of different size
                          vcreate_u32(0));
                          ^~~~~~~~~~~~~~
/Users/buildslave/jenkins/workspace/test-suite-verify-machineinstrs-aarch64-O0-g/compiler/lib/clang/10.0.0/include/arm_neon.h:4139:11: note: expanded from macro 'vcreate_u32'
  __ret = (uint32x2_t)(__p0); \
          ^~~~~~~~~~~~~~~~~~
/Users/buildslave/jenkins/workspace/test-suite-verify-machineinstrs-aarch64-O0-g/test-suite/SingleSource/UnitTests/Vector/AArch64/aarch64_neon_intrinsics.c:175191:27: error: invalid conversion between vector type 'int32x2_t' (vector of 2 'int32_t' values) and integer type 'int' of different size
      arg1 = vcombine_s32(vcreate_s32(0),
                          ^~~~~~~~~~~~~~
aarch64_neon_intrinsics.c error: invalid conversion between vector type 'int32x2_t' (vector of 2 'int32_t' values) and integer type 'int' of different size
      arg1 = vcombine_s32(vcreate_s32(0),
                          ^~~~~~~~~~~~~~
/Users/buildslave/jenkins/workspace/test-suite-verify-machineinstrs-aarch64-O0-g/compiler/lib/clang/10.0.0/include/arm_neon.h:4169:11: note: expanded from macro 'vcreate_s32'
  __ret = (int32x2_t)(__p0); \
          ^~~~~~~~~~~~~~~~~
/Users/buildslave/jenkins/workspace/test-suite-verify-machineinstrs-aarch64-O0-g/test-suite/SingleSource/UnitTests/Vector/AArch64/aarch64_neon_intrinsics.c:176993:27: error: invalid conversion between vector type 'int32x2_t' (vector of 2 'int32_t' values) and integer type 'int' of different size
                          vcreate_s32(0));
                          ^~~~~~~~~~~~~~
aarch64_neon_intrinsics.c error: invalid conversion between vector type 'uint16x4_t' (vector of 4 'uint16_t' values) and integer type 'int' of different size
                          vcreate_s32(0));
                          ^~~~~~~~~~~~~~
/Users/buildslave/jenkins/workspace/test-suite-verify-machineinstrs-aarch64-O0-g/compiler/lib/clang/10.0.0/include/arm_neon.h:4169:11: note: expanded from macro 'vcreate_s32'
  __ret = (int32x2_t)(__p0); \
          ^~~~~~~~~~~~~~~~~
/Users/buildslave/jenkins/workspace/test-suite-verify-machineinstrs-aarch64-O0-g/test-suite/SingleSource/UnitTests/Vector/AArch64/aarch64_neon_intrinsics.c:210780:27: error: invalid conversion between vector type 'uint16x4_t' (vector of 4 'uint16_t' values) and integer type 'int' of different size
      arg1 = vcombine_u16(vcreate_u16(0),
                          ^~~~~~~~~~~~~~

Build Log

Changes
  1. [clangd] Show lambda signature for lambda autocompletions (detail)
  2. [X86] Updated strict fp scalar tests and add fp80 tests for D68857 (detail)

Started by upstream project relay-test-suite-verify-machineinstrs build number 6751
originally caused by:

This run spent:

  • 52 min waiting;
  • 1 hr 11 min build duration;
  • 1 hr 11 min total from scheduled to completion.
Revision: 5aaca2355ec2ba043c9b1ba2be9674b128dfa718
  • detached

Identified problems

Compile Error

This build failed because of a compile error. Below is a list of all errors in the build log:
Indication 1

Ninja target failed

Below is a link to the first failed ninja target.
Indication 2