FailedConsole Output

Skipping 10,634 KB.. Full Log
info2.s (17152 of 34304)
PASS: LLVM :: MC/SystemZ/regs-good.s (17153 of 34304)
PASS: LLVM-Unit :: FuzzMutate/./FuzzMutateTests/RandomIRBuilderTest.InsertValueArray (17154 of 34304)
PASS: LLVM-Unit :: ADT/./ADTTests/APIntTest.i33_Count (17155 of 34304)
PASS: LLVM :: CodeGen/Hexagon/swp-prolog-phi4.ll (17156 of 34304)
PASS: LLVM :: CodeGen/AArch64/GlobalISel/select-intrinsic-trunc.mir (17157 of 34304)
PASS: LLVM :: DebugInfo/COFF/inlining-header.ll (17158 of 34304)
PASS: LLVM :: CodeGen/Mips/inlineasm-output-template.ll (17159 of 34304)
PASS: LLVM :: tools/llvm-objdump/X86/macho-data-in-code.ll (17160 of 34304)
PASS: LLVM :: CodeGen/X86/memset-zero.ll (17161 of 34304)
PASS: LLVM-Unit :: CodeGen/GlobalISel/./GlobalISelTests/LegalizerInfoTest.SizeChangeStrategy (17162 of 34304)
PASS: LLVM :: tools/llvm-objdump/coff-many-relocs.test (17163 of 34304)
PASS: LLVM :: CodeGen/AMDGPU/llvm.amdgcn.cubetc.ll (17164 of 34304)
PASS: LLVM :: tools/llvm-mca/X86/Haswell/resources-x86_32.s (17165 of 34304)
PASS: LLVM-Unit :: ADT/./ADTTests/DenseMapTest/1.CopyConstructorNotSmallTest (17166 of 34304)
PASS: LLVM :: DebugInfo/X86/ghost-sdnode-dbgvalues.ll (17167 of 34304)
PASS: LLVM :: Analysis/ScalarEvolution/exhaustive-trip-counts.ll (17168 of 34304)
PASS: LLVM-Unit :: XRay/./XRayTests/GraphTest/1.TestGraphEdge (17169 of 34304)
PASS: LLVM :: Transforms/LoopStrengthReduce/missing-phi-operand-update.ll (17170 of 34304)
PASS: LLVM :: ExecutionEngine/RuntimeDyld/Mips/ELF_O32R6_relocations.s (17171 of 34304)
PASS: LLVM :: CodeGen/Thumb2/thumb2-asr2.ll (17172 of 34304)
PASS: LLVM :: CodeGen/X86/avx2-phaddsub.ll (17173 of 34304)
UNSUPPORTED: LLVM :: MC/AVR/inst-sts.s (17174 of 34304)
PASS: LLVM :: MC/WebAssembly/reloc-code.ll (17175 of 34304)
PASS: LLVM :: CodeGen/Mips/GlobalISel/irtranslator/var_arg.ll (17176 of 34304)
PASS: LLVM :: Integer/2007-01-19-TruncSext.ll (17177 of 34304)
PASS: LLVM :: CodeGen/AArch64/machine-copy-remove.ll (17178 of 34304)
PASS: LLVM-Unit :: ADT/./ADTTests/SmallVectorTest/3.AssignNonIterTest (17179 of 34304)
PASS: LLVM :: CodeGen/PowerPC/2006-10-17-brcc-miscompile.ll (17180 of 34304)
PASS: LLVM-Unit :: IR/./IRTests/ConstantRangeTest.Trunc (17181 of 34304)
XFAIL: LLVM :: CodeGen/AMDGPU/xfail.r600.bitcast.ll (17182 of 34304)
PASS: LLVM :: MC/Disassembler/Hexagon/too_many_instructions.txt (17183 of 34304)
PASS: LLVM :: CodeGen/AArch64/emutls_generic.ll (17184 of 34304)
PASS: LLVM :: CodeGen/RISCV/interrupt-attr-ret-error.ll (17185 of 34304)
PASS: LLVM :: MC/MachO/PowerPC/coal-sections-powerpc.s (17186 of 34304)
PASS: LLVM :: CodeGen/Hexagon/vect/vect-apint-truncate.ll (17187 of 34304)
PASS: LLVM :: ExecutionEngine/MCJIT/pr13727.ll (17188 of 34304)
PASS: LLVM :: CodeGen/ARM/a15-partial-update.ll (17189 of 34304)
PASS: LLVM-Unit :: ADT/./ADTTests/MapVectorMappedTypeTest/5.DifferentDenseMap (17190 of 34304)
PASS: LLVM :: tools/llvm-lipo/replace-universal-binary.test (17191 of 34304)
PASS: LLVM :: LTO/X86/symver-asm2.ll (17192 of 34304)
PASS: LLVM :: MC/Disassembler/AMDGPU/smem_vi.txt (17193 of 34304)
PASS: LLVM :: CodeGen/AMDGPU/call-argument-types.ll (17194 of 34304)
PASS: LLVM :: CodeGen/NVPTX/calling-conv.ll (17195 of 34304)
PASS: LLVM :: tools/llvm-lto/thinlto.ll (17196 of 34304)
PASS: LLVM :: MC/Mips/expansion-j-sym-pic.s (17197 of 34304)
PASS: LLVM :: CodeGen/ARM/fast-isel-crash.ll (17198 of 34304)
PASS: LLVM :: Assembler/2003-05-12-MinIntProblem.ll (17199 of 34304)
PASS: LLVM :: Transforms/RewriteStatepointsForGC/call-gc-result.ll (17200 of 34304)
PASS: LLVM :: Transforms/ArgumentPromotion/control-flow.ll (17201 of 34304)
PASS: LLVM :: CodeGen/PowerPC/atomics.ll (17202 of 34304)
PASS: LLVM :: CodeGen/WebAssembly/offset.ll (17203 of 34304)
PASS: LLVM :: tools/llvm-mca/X86/SkylakeClient/resources-sse1.s (17204 of 34304)
PASS: LLVM :: CodeGen/Mips/inlineasm-constraint-bad-l1.ll (17205 of 34304)
PASS: LLVM :: Transforms/Inline/frameescape.ll (17206 of 34304)
PASS: LLVM :: tools/llvm-mca/X86/SandyBridge/resources-x86_64.s (17207 of 34304)
PASS: LLVM :: tools/llvm-dwarfdump/X86/apple_names_verify_data.s (17208 of 34304)
PASS: LLVM :: Transforms/DeadStoreElimination/lifetime.ll (17209 of 34304)
PASS: LLVM :: CodeGen/AMDGPU/load-select-ptr.ll (17210 of 34304)
PASS: LLVM :: Transforms/RewriteStatepointsForGC/codegen-cond.ll (17211 of 34304)
UNSUPPORTED: LLVM :: MC/AVR/inst-ori.s (17212 of 34304)
UNSUPPORTED: LLVM :: CodeGen/AVR/cttz.ll (17213 of 34304)
PASS: LLVM :: CodeGen/AArch64/arm64-tls-dynamic-together.ll (17214 of 34304)
PASS: LLVM :: MC/ELF/addrsig-error.s (17215 of 34304)
PASS: LLVM :: Analysis/BasicAA/full-store-partial-alias.ll (17216 of 34304)
PASS: LLVM :: CodeGen/PowerPC/e500-1.ll (17217 of 34304)
UNSUPPORTED: LLVM :: tools/sancov/merge.test (17218 of 34304)
PASS: LLVM :: tools/dsymutil/X86/swift-interface.test (17219 of 34304)
PASS: LLVM :: CodeGen/Mips/mul.ll (17220 of 34304)
PASS: LLVM-Unit :: ADT/./ADTTests/TwineTest.Characters (17221 of 34304)
PASS: LLVM :: Transforms/Inline/no-inline-line-tables.ll (17222 of 34304)
PASS: LLVM :: tools/llvm-mca/X86/BtVer2/dependency-breaking-pcmpeq.s (17223 of 34304)
PASS: LLVM :: CodeGen/SystemZ/int-cmp-42.ll (17224 of 34304)
PASS: LLVM :: CodeGen/AMDGPU/are-loads-from-same-base-ptr.ll (17225 of 34304)
PASS: LLVM :: CodeGen/AArch64/unfold-masked-merge-scalar-constmask-interleavedbytehalves.ll (17226 of 34304)
PASS: LLVM :: Bitcode/tailcall.ll (17227 of 34304)
PASS: LLVM :: MC/AArch64/neon-across.s (17228 of 34304)
PASS: LLVM :: CodeGen/Mips/2008-07-15-SmallSection.ll (17229 of 34304)
PASS: LLVM :: Transforms/SLPVectorizer/X86/PR35865.ll (17230 of 34304)
PASS: LLVM :: Assembler/invalid-uselistorder-function-between-blocks.ll (17231 of 34304)
PASS: LLVM :: CodeGen/Mips/GlobalISel/legalizer/fabs_vec.mir (17232 of 34304)
PASS: LLVM :: CodeGen/Hexagon/store-widen-aliased-load.ll (17233 of 34304)
PASS: LLVM :: CodeGen/Hexagon/vaddh.ll (17234 of 34304)
PASS: LLVM :: tools/llvm-readobj/elf-no-action.test (17235 of 34304)
PASS: LLVM :: Transforms/LoopUnswitch/2015-09-18-Addrspace.ll (17236 of 34304)
PASS: LLVM :: tools/llvm-objdump/X86/macho-universal-x86_64.i386.test (17237 of 34304)
PASS: LLVM :: CodeGen/X86/zext-extract_subreg.ll (17238 of 34304)
PASS: LLVM :: MC/PowerPC/qpx.s (17239 of 34304)
PASS: LLVM :: CodeGen/AMDGPU/schedule-global-loads.ll (17240 of 34304)
PASS: LLVM :: MC/AArch64/SVE/sdiv-diagnostics.s (17241 of 34304)
PASS: LLVM :: MC/Mips/mips64r5/abiflags.s (17242 of 34304)
PASS: LLVM :: Transforms/LoopVectorize/loop-form.ll (17243 of 34304)
PASS: LLVM :: MC/X86/AVX-64.s (17244 of 34304)
PASS: LLVM :: CodeGen/X86/extend-set-cc-uses-dbg.ll (17245 of 34304)
PASS: LLVM :: Transforms/IndVarSimplify/ult-sub-to-eq.ll (17246 of 34304)
PASS: LLVM :: CodeGen/Mips/mips64shift.ll (17247 of 34304)
PASS: LLVM :: CodeGen/Hexagon/bit-rie.ll (17248 of 34304)
PASS: LLVM :: Transforms/InstCombine/memcpy.ll (17249 of 34304)
PASS: LLVM :: Transforms/SimpleLoopUnswitch/crash.ll (17250 of 34304)
PASS: LLVM :: DebugInfo/X86/debug-info-access.ll (17251 of 34304)
PASS: LLVM :: Transforms/Inline/crash-lifetime-marker.ll (17252 of 34304)
PASS: LLVM :: MC/AArch64/SVE/rbit-diagnostics.s (17253 of 34304)
PASS: LLVM :: Transforms/ADCE/basictest.ll (17254 of 34304)
PASS: LLVM :: CodeGen/AMDGPU/noop-shader-O0.ll (17255 of 34304)
PASS: LLVM :: TableGen/Paste.td (17256 of 34304)
UNSUPPORTED: LLVM :: tools/gold/X86/thinlto_afdo.ll (17257 of 34304)
PASS: LLVM :: Feature/weak_constant.ll (17258 of 34304)
PASS: LLVM :: CodeGen/Hexagon/v6vect-dh1.ll (17259 of 34304)
PASS: LLVM :: CodeGen/Mips/msa/llvm-stress-s2090927243-simplified.ll (17260 of 34304)
PASS: LLVM-Unit :: IR/./IRTests/Attributes.StringRepresentation (17261 of 34304)
PASS: LLVM :: CodeGen/AArch64/arm64-ldp-aa.ll (17262 of 34304)
PASS: LLVM :: Transforms/MergeFunc/constant-entire-value.ll (17263 of 34304)
PASS: LLVM :: CodeGen/X86/2006-03-01-InstrSchedBug.ll (17264 of 34304)
PASS: LLVM :: CodeGen/X86/tailcallfp2.ll (17265 of 34304)
PASS: LLVM :: tools/llvm-readobj/macho-file-headers.test (17266 of 34304)
PASS: LLVM :: CodeGen/X86/xop-mask-comments.ll (17267 of 34304)
PASS: LLVM :: CodeGen/Thumb/2011-05-11-DAGLegalizer.ll (17268 of 34304)
PASS: LLVM :: CodeGen/X86/2008-08-17-UComiCodeGenBug.ll (17269 of 34304)
PASS: LLVM :: Analysis/Delinearization/iv_times_constant_in_subscript.ll (17270 of 34304)
PASS: LLVM :: CodeGen/AMDGPU/uaddo.ll (17271 of 34304)
PASS: LLVM :: CodeGen/AMDGPU/llvm.amdgcn.sin.ll (17272 of 34304)
PASS: LLVM :: CodeGen/AMDGPU/build-vector-insert-elt-infloop.ll (17273 of 34304)
PASS: LLVM-Unit :: DebugInfo/PDB/./DebugInfoPDBTests/HashTableTest.Serialization (17274 of 34304)
PASS: LLVM :: Object/archive-extract-dir.test (17275 of 34304)
PASS: LLVM :: CodeGen/ARM/global-merge-dllexport.ll (17276 of 34304)
PASS: LLVM :: tools/llvm-mca/X86/Haswell/resources-lea.s (17277 of 34304)
PASS: LLVM :: CodeGen/Thumb2/thumb2-tbb.ll (17278 of 34304)
PASS: LLVM :: CodeGen/PowerPC/zext-bitperm.ll (17279 of 34304)
PASS: LLVM :: tools/llvm-nm/X86/nm-no-symbols.test (17280 of 34304)
UNSUPPORTED: LLVM :: ExecutionEngine/fma3-jit.ll (17281 of 34304)
PASS: LLVM :: MC/AsmParser/altmacro_string_escape.s (17282 of 34304)
PASS: LLVM :: CodeGen/X86/switch-zextload.ll (17283 of 34304)
PASS: LLVM :: Linker/comdat4.ll (17284 of 34304)
PASS: LLVM :: CodeGen/Hexagon/isel-exti1.ll (17285 of 34304)
PASS: LLVM-Unit :: IR/./IRTests/IRBuilderTest.LandingPadName (17286 of 34304)
PASS: LLVM :: CodeGen/XCore/switch.ll (17287 of 34304)
PASS: LLVM :: Transforms/InstCombine/unsigned_saturated_sub.ll (17288 of 34304)
PASS: LLVM-Unit :: Support/./SupportTests/TarWriterTest.LongFilename (17289 of 34304)
PASS: LLVM :: tools/llvm-readobj/amdgpu-elf-definitions.test (17290 of 34304)
PASS: LLVM :: MC/ARM/thumb-invalid-crypto.txt (17291 of 34304)
PASS: LLVM :: CodeGen/ARM/mvn.ll (17292 of 34304)
PASS: LLVM :: Linker/available_externally_b.ll (17293 of 34304)
PASS: LLVM :: Transforms/SpeculateAroundPHIs/basic-x86.ll (17294 of 34304)
PASS: LLVM :: DebugInfo/symbolize-demangling.s (17295 of 34304)
PASS: LLVM :: Transforms/NewGVN/lifetime-simple.ll (17296 of 34304)
PASS: LLVM-Unit :: BinaryFormat/./BinaryFormatTests/MsgPackReader.TestReadBin8Zero (17297 of 34304)
PASS: LLVM :: CodeGen/X86/extractelement-from-arg.ll (17298 of 34304)
PASS: LLVM :: Transforms/LoopVectorize/X86/uniform-phi.ll (17299 of 34304)
PASS: LLVM :: Bitcode/drop-debug-info.3.5.ll (17300 of 34304)
PASS: LLVM :: CodeGen/ARM/llround-conv.ll (17301 of 34304)
PASS: LLVM :: Transforms/TailCallElim/opt-remarks-recursion.ll (17302 of 34304)
PASS: LLVM :: CodeGen/SystemZ/call-04.ll (17303 of 34304)
PASS: LLVM :: CodeGen/AMDGPU/GlobalISel/inst-select-amdgcn.sin.mir (17304 of 34304)
PASS: LLVM :: CodeGen/Hexagon/cmpb_gtu.ll (17305 of 34304)
PASS: LLVM-Unit :: ProfileData/./ProfileDataTests/SampleProfTest.default_suffix_elision_compact_binary (17306 of 34304)
PASS: LLVM :: Transforms/Inline/inline_prune.ll (17307 of 34304)
PASS: LLVM-Unit :: IR/./IRTests/IRBuilderTest.ConstrainedFP (17308 of 34304)
PASS: LLVM :: CodeGen/X86/frame-lowering-debug-intrinsic.ll (17309 of 34304)
PASS: LLVM-Unit :: ADT/./ADTTests/BitmaskEnumTest.BitwiseOrEquals (17310 of 34304)
PASS: LLVM :: tools/llvm-dwarfdump/X86/apple-names-die-offset-data.s (17311 of 34304)
PASS: LLVM :: Verifier/mdcompositetype-templateparams.ll (17312 of 34304)
PASS: LLVM :: CodeGen/X86/AppendingLinkage.ll (17313 of 34304)
PASS: LLVM :: ExecutionEngine/JITLink/X86/MachO_x86-64_ehframe.test (17314 of 34304)
PASS: LLVM-Unit :: Analysis/./AnalysisTests/SparsePropagationTest.ExceptionalTerminatorInsts (17315 of 34304)
PASS: LLVM :: Linker/debug-info-version-a.ll (17316 of 34304)
PASS: LLVM :: CodeGen/ARM/fast-isel-deadcode.ll (17317 of 34304)
PASS: LLVM :: CodeGen/X86/x86-64-pic-3.ll (17318 of 34304)
PASS: LLVM :: ThinLTO/X86/weak_resolution_single.ll (17319 of 34304)
PASS: LLVM :: CodeGen/PowerPC/lower-globaladdr64-aix.ll (17320 of 34304)
PASS: LLVM :: CodeGen/PowerPC/vsx-div.ll (17321 of 34304)
PASS: LLVM :: Assembler/invalid-datalayout5.ll (17322 of 34304)
PASS: LLVM :: CodeGen/Hexagon/reg-eq-cmp.ll (17323 of 34304)
PASS: LLVM :: CodeGen/SystemZ/fp-strict-round-02.ll (17324 of 34304)
PASS: LLVM :: Transforms/LoopDistribute/outside-use.ll (17325 of 34304)
PASS: LLVM :: CodeGen/NVPTX/surf-write.ll (17326 of 34304)
PASS: LLVM :: CodeGen/AArch64/GlobalISel/select-bitcast.mir (17327 of 34304)
PASS: LLVM :: Transforms/SimplifyCFG/UnreachableEliminate.ll (17328 of 34304)
PASS: LLVM :: CodeGen/ARM/2008-04-11-PHIofImpDef.ll (17329 of 34304)
PASS: LLVM-Unit :: Support/./SupportTests/ScaledNumberHelpersTest.getLgCeiling (17330 of 34304)
PASS: LLVM :: CodeGen/X86/2010-06-01-DeadArg-DbgInfo.ll (17331 of 34304)
PASS: LLVM :: CodeGen/Generic/fwdtwice.ll (17332 of 34304)
PASS: LLVM :: CodeGen/X86/lsr-reuse-trunc.ll (17333 of 34304)
PASS: LLVM :: Transforms/HotColdSplit/split-cold-2.ll (17334 of 34304)
PASS: LLVM :: CodeGen/Thumb2/mve-ldst-preinc.ll (17335 of 34304)
PASS: LLVM :: MC/Mips/msa/test_dlsa.s (17336 of 34304)
PASS: LLVM :: Assembler/invalid-uselistorder-function-missing-numbered.ll (17337 of 34304)
PASS: LLVM :: CodeGen/X86/2011-03-30-CreateFixedObjCrash.ll (17338 of 34304)
PASS: LLVM :: MC/Mips/micromips32r6-eva.s (17339 of 34304)
PASS: LLVM :: Transforms/LoopVectorize/consec_no_gep.ll (17340 of 34304)
PASS: LLVM-Unit :: DebugInfo/CodeView/./DebugInfoCodeViewTests/RandomAccessVisitorTest.StopPrematurelyInChunk (17341 of 34304)
PASS: LLVM-Unit :: ADT/./ADTTests/DenseMapTest/4.CopyConstructorFromDefaultTest (17342 of 34304)
PASS: LLVM :: CodeGen/X86/vector-shift-ashr-128.ll (17343 of 34304)
PASS: LLVM :: CodeGen/Hexagon/cmp-to-genreg.ll (17344 of 34304)
PASS: LLVM :: CodeGen/SystemZ/fp-conv-04.ll (17345 of 34304)
PASS: LLVM :: Transforms/FunctionAttrs/internal-noalias.ll (17346 of 34304)
PASS: LLVM :: Verifier/swiftself.ll (17347 of 34304)
PASS: LLVM :: tools/llvm-mca/X86/BdVer2/load-store-alias.s (17348 of 34304)
PASS: LLVM :: Transforms/InstCombine/element-atomic-memintrins.ll (17349 of 34304)
PASS: LLVM :: CodeGen/PowerPC/testComparesigtsll.ll (17350 of 34304)
PASS: LLVM :: CodeGen/AArch64/misched-fusion-addr.ll (17351 of 34304)
PASS: LLVM :: ExecutionEngine/OrcMCJIT/test-ptr-reloc.ll (17352 of 34304)
PASS: LLVM :: Transforms/GlobalOpt/SROA-section.ll (17353 of 34304)
PASS: LLVM :: ThinLTO/X86/llvm.used.ll (17354 of 34304)
PASS: LLVM :: CodeGen/X86/2008-02-06-LoadFoldingBug.ll (17355 of 34304)
PASS: LLVM :: Linker/module-flags-6-a.ll (17356 of 34304)
PASS: LLVM :: MC/ELF/multiple-different-symver.s (17357 of 34304)
PASS: LLVM :: MC/AArch64/SVE/uzp1-diagnostics.s (17358 of 34304)
PASS: LLVM :: CodeGen/MIR/Generic/multiRunPass.mir (17359 of 34304)
PASS: LLVM :: Transforms/LoopStrengthReduce/lsr-overflow.ll (17360 of 34304)
PASS: LLVM-Unit :: CodeGen/./CodeGenTests/MachineOperandTest.PrintRegisterLiveOut (17361 of 34304)
PASS: LLVM-Unit :: BinaryFormat/./BinaryFormatTests/MsgPackWriter.TestWriteArray32Max (17362 of 34304)
PASS: LLVM :: MC/AArch64/SVE/ldnt1b-diagnostics.s (17363 of 34304)
PASS: LLVM :: DebugInfo/X86/tu-to-non-named-type.ll (17364 of 34304)
PASS: LLVM :: CodeGen/ARM/arm-modifier.ll (17365 of 34304)
PASS: LLVM :: Transforms/CodeExtractor/PartialInlineInvokeProducesOutVal.ll (17366 of 34304)
PASS: LLVM-Unit :: ExecutionEngine/Orc/./OrcJITTests/LegacyObjectTransformLayerTest.Main (17367 of 34304)
PASS: LLVM :: CodeGen/X86/2007-05-15-maskmovq.ll (17368 of 34304)
PASS: LLVM :: MC/AArch64/SVE/ldnt1h-diagnostics.s (17369 of 34304)
PASS: LLVM :: Object/objdump-section-content.test (17370 of 34304)
PASS: LLVM :: tools/llvm-profdata/hash-mismatch.proftext (17371 of 34304)
PASS: LLVM :: MC/AArch64/SVE2/stnt1h-diagnostics.s (17372 of 34304)
PASS: LLVM :: TableGen/DAGDefaultOps.td (17373 of 34304)
PASS: LLVM :: CodeGen/Thumb2/mve-shufflemov.ll (17374 of 34304)
PASS: LLVM :: MC/AArch64/SVE/ldnf1w.s (17375 of 34304)
PASS: LLVM :: Transforms/DeadStoreElimination/2016-07-17-UseAfterFree.ll (17376 of 34304)
PASS: LLVM :: MC/AArch64/SVE2/sbclb.s (17377 of 34304)
PASS: LLVM :: Transforms/SimplifyCFG/inline-asm-sink.ll (17378 of 34304)
PASS: LLVM :: CodeGen/Hexagon/bit-has.ll (17379 of 34304)
PASS: LLVM :: CodeGen/X86/peephole.mir (17380 of 34304)
PASS: LLVM :: CodeGen/ARM/2009-10-27-double-align.ll (17381 of 34304)
PASS: LLVM :: MC/Disassembler/Mips/crc/valid-64r6.txt (17382 of 34304)
PASS: LLVM-Unit :: ADT/./ADTTests/DenseMapTest/5.CopyConstructorFromEmptyTest (17383 of 34304)
PASS: LLVM :: CodeGen/X86/pr11334.ll (17384 of 34304)
PASS: LLVM :: Transforms/LoopStrengthReduce/pr3571.ll (17385 of 34304)
PASS: LLVM :: CodeGen/AArch64/arm64-cse.ll (17386 of 34304)
PASS: LLVM :: MC/COFF/cv-inline-linetable-unreachable.s (17387 of 34304)
PASS: LLVM :: Transforms/Coroutines/smoketest.ll (17388 of 34304)
PASS: LLVM :: MC/Disassembler/Mips/ginv/valid-el.txt (17389 of 34304)
PASS: LLVM :: CodeGen/Thumb2/mve-vpt-block7.mir (17390 of 34304)
PASS: LLVM :: Assembler/2002-04-29-NameBinding.ll (17391 of 34304)
PASS: LLVM :: MC/AArch64/armv8.4a-tlb.s (17392 of 34304)
PASS: LLVM :: CodeGen/Hexagon/propagate-vcombine.ll (17393 of 34304)
PASS: LLVM-Unit :: ProfileData/./ProfileDataTests/ParameterizedCovMapTest/CoverageMappingTest.correct_deserialize_for_more_than_two_files/0 (17394 of 34304)
PASS: LLVM :: MC/AArch64/SVE/orr-diagnostics.s (17395 of 34304)
PASS: LLVM :: Transforms/EntryExitInstrumenter/debug-info.ll (17396 of 34304)
PASS: LLVM :: CodeGen/AArch64/arm64-swizzle-tbl-i16-layout.ll (17397 of 34304)
PASS: LLVM-Unit :: Transforms/Utils/./UtilsTests/CloneInstruction.DuplicateInstructionsToSplit (17398 of 34304)
PASS: LLVM :: MC/AArch64/SVE/ld1rqd.s (17399 of 34304)
PASS: LLVM :: CodeGen/BPF/ex1.ll (17400 of 34304)
PASS: LLVM :: Instrumentation/DataFlowSanitizer/load.ll (17401 of 34304)
PASS: LLVM :: tools/llvm-mca/X86/Znver1/resources-sse1.s (17402 of 34304)
PASS: LLVM :: Other/can-execute.txt (17403 of 34304)
PASS: LLVM :: MC/AArch64/SVE/ldnt1w-diagnostics.s (17404 of 34304)
PASS: LLVM :: tools/llvm-readobj/coff-const-import.test (17405 of 34304)
PASS: LLVM :: Transforms/Inline/AArch64/logical-and-or.ll (17406 of 34304)
PASS: LLVM :: tools/llvm-mca/X86/BtVer2/register-files-3.s (17407 of 34304)
PASS: LLVM :: CodeGen/X86/pr38865-2.ll (17408 of 34304)
PASS: LLVM :: Transforms/PlaceSafepoints/no-statepoints.ll (17409 of 34304)
PASS: LLVM :: CodeGen/Mips/GlobalISel/llvm-ir/fabs.ll (17410 of 34304)
PASS: LLVM-Unit :: DebugInfo/MSF/./DebugInfoMSFTests/MSFBuilderTest.TestRejectReusedStreamBlock (17411 of 34304)
PASS: LLVM-Unit :: ADT/./ADTTests/APFloatTest.mod (17412 of 34304)
PASS: LLVM :: MC/AArch64/SVE/sdivr.s (17413 of 34304)
PASS: LLVM :: CodeGen/AMDGPU/GlobalISel/legalize-unmerge-values.mir (17414 of 34304)
PASS: LLVM :: ExecutionEngine/OrcMCJIT/remote/test-ptr-reloc-sm-pic.ll (17415 of 34304)
PASS: LLVM :: YAMLParser/spec-09-07.test (17416 of 34304)
PASS: LLVM-Unit :: IR/./IRTests/MDNodeTest.Print (17417 of 34304)
PASS: LLVM :: CodeGen/Hexagon/select-instr-align.ll (17418 of 34304)
PASS: LLVM :: CodeGen/MIR/AMDGPU/mfi-parse-error-scratch-rsrc-reg.mir (17419 of 34304)
PASS: LLVM :: MC/ARM/ldr-pseudo-parse-errors.s (17420 of 34304)
PASS: LLVM :: tools/llvm-mca/X86/Atom/resources-lea.s (17421 of 34304)
PASS: LLVM :: CodeGen/ARM/arm-shrink-wrapping.ll (17422 of 34304)
PASS: LLVM :: MC/AArch64/SVE/uqincw.s (17423 of 34304)
PASS: LLVM :: ObjectYAML/MachO/BigEndian.yaml (17424 of 34304)
PASS: LLVM :: tools/yaml2obj/elf-emachine.yaml (17425 of 34304)
PASS: LLVM :: CodeGen/ARM/2012-02-01-CoalescerBug.ll (17426 of 34304)
PASS: LLVM :: MC/X86/reloc-directive.s (17427 of 34304)
PASS: LLVM :: tools/llvm-ar/mri-addmod.test (17428 of 34304)
PASS: LLVM-Unit :: Analysis/./AnalysisTests/MatchSelectPatternTest.FMinMismatchConstantZero6 (17429 of 34304)
PASS: LLVM-Unit :: ADT/./ADTTests/APFloatTest.PPCDoubleDoubleFactories (17430 of 34304)
PASS: LLVM :: CodeGen/X86/vector-reduce-fmul-fast.ll (17431 of 34304)
PASS: LLVM :: Analysis/MemorySSA/loop-rotate-simplified-clone.ll (17432 of 34304)
PASS: LLVM :: CodeGen/PowerPC/fp-to-int-ext.ll (17433 of 34304)
PASS: LLVM :: Transforms/Reassociate/2002-05-15-MissedTree.ll (17434 of 34304)
PASS: LLVM :: Transforms/JumpThreading/conservative-lvi.ll (17435 of 34304)
PASS: LLVM :: CodeGen/X86/phielim-split.ll (17436 of 34304)
PASS: LLVM :: tools/llvm-cov/showLineExecutionCounts.cpp (17437 of 34304)
PASS: LLVM :: tools/llvm-mca/X86/BdVer2/read-advance-3.s (17438 of 34304)
PASS: LLVM :: CodeGen/ARM/cmn.ll (17439 of 34304)
PASS: LLVM-Unit :: Analysis/./AnalysisTests/LoopInfoTest.UnguardedLoop (17440 of 34304)
PASS: LLVM :: Transforms/InstCombine/prefetch-load.ll (17441 of 34304)
PASS: LLVM :: DebugInfo/Generic/cu-ranges.ll (17442 of 34304)
PASS: LLVM-Unit :: IR/./IRTests/ConstantRangeTest.SubWithNoWrap (17443 of 34304)
PASS: LLVM :: TableGen/foreach.td (17444 of 34304)
PASS: LLVM-Unit :: Support/./SupportTests/CheckedArithmetic.CheckedAdd (17445 of 34304)
PASS: LLVM :: CodeGen/Mips/seleq.ll (17446 of 34304)
PASS: LLVM :: MC/AArch64/SVE2/sshllt-diagnostics.s (17447 of 34304)
PASS: LLVM :: CodeGen/AArch64/arm64-AdvSIMD-Scalar.ll (17448 of 34304)
PASS: LLVM :: Linker/DbgDeclare2.ll (17449 of 34304)
PASS: LLVM :: CodeGen/ARM/ldaex-stlex.ll (17450 of 34304)
PASS: LLVM :: MC/RISCV/rv64d-aliases-valid.s (17451 of 34304)
PASS: LLVM :: CodeGen/X86/avx512-extract-subvector-load-store.ll (17452 of 34304)
PASS: LLVM :: CodeGen/AMDGPU/GlobalISel/legalize-zextload-local.mir (17453 of 34304)
PASS: LLVM :: CodeGen/Hexagon/calling-conv-2.ll (17454 of 34304)
PASS: LLVM :: MC/Mips/micromips-tailr.s (17455 of 34304)
PASS: LLVM :: CodeGen/Thumb2/mve-vdup.ll (17456 of 34304)
PASS: LLVM :: CodeGen/Hexagon/predicate-logical.ll (17457 of 34304)
PASS: LLVM :: Transforms/JumpThreading/ddt-crash.ll (17458 of 34304)
PASS: LLVM :: CodeGen/X86/system-intrinsics.ll (17459 of 34304)
PASS: LLVM :: Transforms/GVN/2007-07-25-Loop.ll (17460 of 34304)
PASS: LLVM-Unit :: Analysis/./AnalysisTests/IsPotentiallyReachableTest.UnreachableFromEntryTest (17461 of 34304)
PASS: LLVM :: tools/llvm-rc/not-expr.test (17462 of 34304)
PASS: LLVM :: Transforms/Reassociate/fast-basictest.ll (17463 of 34304)
PASS: LLVM :: CodeGen/SystemZ/vec-round-02.ll (17464 of 34304)
PASS: LLVM :: CodeGen/X86/nontemporal-loads-2.ll (17465 of 34304)
PASS: LLVM :: tools/llvm-dwarfdump/X86/debug-names-find.s (17466 of 34304)
PASS: LLVM :: CodeGen/X86/2008-09-11-CoalescerBug.ll (17467 of 34304)
PASS: LLVM :: Analysis/CFLAliasAnalysis/Steensgaard/pr27213.ll (17468 of 34304)
PASS: LLVM :: CodeGen/X86/2007-04-24-VectorCrash.ll (17469 of 34304)
PASS: LLVM :: Transforms/GlobalOpt/basictest.ll (17470 of 34304)
PASS: LLVM-Unit :: Analysis/./AnalysisTests/CGSCCPassManagerTest.TestModulePassCanPreserveFunctionAnalysisNestedInCGSCC (17471 of 34304)
PASS: LLVM :: Bitcode/invalid.test (17472 of 34304)
PASS: LLVM :: MC/X86/XOP-64.s (17473 of 34304)
PASS: LLVM :: CodeGen/Hexagon/dwarf-discriminator.ll (17474 of 34304)
PASS: LLVM :: MC/AArch64/neon-aba-abd.s (17475 of 34304)
PASS: LLVM :: Transforms/LoopUnroll/disable_nonforced_count.ll (17476 of 34304)
PASS: LLVM :: CodeGen/ARM/vicmp.ll (17477 of 34304)
PASS: LLVM-Unit :: Support/./SupportTests/AlignmentDeathTest.Division (17478 of 34304)
PASS: LLVM :: MC/AArch64/elf_osabi_flags.s (17479 of 34304)
PASS: LLVM :: CodeGen/PowerPC/compare-duplicate.ll (17480 of 34304)
PASS: LLVM :: MC/ARM/relocated-mapping.s (17481 of 34304)
PASS: LLVM-Unit :: DebugInfo/GSYM/./DebugInfoGSYMTests/GSYMTest.TestInlineInfoEncodeErrors (17482 of 34304)
PASS: LLVM :: CodeGen/X86/2009-03-03-BitcastLongDouble.ll (17483 of 34304)
PASS: LLVM :: CodeGen/PowerPC/atomic-minmax.ll (17484 of 34304)
PASS: LLVM :: CodeGen/SystemZ/memcpy-01.ll (17485 of 34304)
PASS: LLVM :: CodeGen/AMDGPU/GlobalISel/lds-global-non-entry-func.ll (17486 of 34304)
PASS: LLVM :: DebugInfo/dwarfdump-invalid.test (17487 of 34304)
PASS: LLVM :: tools/llvm-ifs/conflict-header-version.ifs (17488 of 34304)
PASS: LLVM :: CodeGen/X86/i686-win-shrink-wrapping.ll (17489 of 34304)
PASS: LLVM :: CodeGen/RISCV/readcyclecounter.ll (17490 of 34304)
PASS: LLVM :: ExecutionEngine/RuntimeDyld/ARM/MachO_ARM_PIC_relocations.s (17491 of 34304)
PASS: LLVM :: CodeGen/Hexagon/rdf-def-mask.ll (17492 of 34304)
PASS: LLVM :: CodeGen/X86/illegal-insert.ll (17493 of 34304)
PASS: LLVM :: MC/ELF/section-relro.ll (17494 of 34304)
PASS: LLVM :: CodeGen/Mips/GlobalISel/irtranslator/bitwise.ll (17495 of 34304)
PASS: LLVM-Unit :: ADT/./ADTTests/APFloatTest.PPCDoubleDoubleHashValue (17496 of 34304)
PASS: LLVM :: MC/Disassembler/AMDGPU/mubuf_vi.txt (17497 of 34304)
PASS: LLVM :: CodeGen/Hexagon/bit-addr-align.mir (17498 of 34304)
PASS: LLVM :: Transforms/ObjCARC/intrinsic-use-isolated.ll (17499 of 34304)
PASS: LLVM :: DebugInfo/AMDGPU/dbg-value-sched-crash.ll (17500 of 34304)
PASS: LLVM :: CodeGen/Hexagon/memops_global.ll (17501 of 34304)
PASS: LLVM :: Assembler/vector-shift.ll (17502 of 34304)
PASS: LLVM :: Instrumentation/HWAddressSanitizer/atomic.ll (17503 of 34304)
PASS: LLVM :: CodeGen/AArch64/arm64-extract.ll (17504 of 34304)
PASS: LLVM :: Transforms/LoadStoreVectorizer/AMDGPU/gep-bitcast.ll (17505 of 34304)
PASS: LLVM-Unit :: ADT/./ADTTests/DenseMapTest/0.SwapTest (17506 of 34304)
PASS: LLVM :: CodeGen/Mips/GlobalISel/llvm-ir/implicit_def.ll (17507 of 34304)
PASS: LLVM-Unit :: Support/./SupportTests/CheckedArithmetic.CheckedMulAdd (17508 of 34304)
PASS: LLVM :: MC/AArch64/SVE/sxtw-diagnostics.s (17509 of 34304)
PASS: LLVM :: CodeGen/X86/pr32451.ll (17510 of 34304)
PASS: LLVM :: CodeGen/AMDGPU/nsa-reassign.ll (17511 of 34304)
PASS: LLVM :: DebugInfo/X86/dwarfdump-ranges-baseaddr.s (17512 of 34304)
PASS: LLVM :: CodeGen/SystemZ/int-usub-11.ll (17513 of 34304)
PASS: LLVM :: Transforms/LoadStoreVectorizer/AMDGPU/multiple_tails.ll (17514 of 34304)
PASS: LLVM-Unit :: XRay/./XRayTests/GraphTest/0.TestGraphEdge (17515 of 34304)
PASS: LLVM :: tools/llvm-cov/prevent_false_instantiations.h (17516 of 34304)
PASS: LLVM :: CodeGen/X86/sdiv-pow2.ll (17517 of 34304)
PASS: LLVM-Unit :: LineEditor/./LineEditorTests/LineEditorTest.ListCompleters (17518 of 34304)
PASS: LLVM :: Transforms/IndVarSimplify/2011-10-27-lftrnull.ll (17519 of 34304)
PASS: LLVM :: CodeGen/Thumb2/2010-02-11-phi-cycle.ll (17520 of 34304)
PASS: LLVM :: Transforms/InstCombine/signed-comparison.ll (17521 of 34304)
PASS: LLVM :: tools/llvm-objcopy/ELF/binary-output-empty.test (17522 of 34304)
PASS: LLVM :: CodeGen/ARM/weak.ll (17523 of 34304)
PASS: LLVM-Unit :: Support/./SupportTests/AllocationTests/MappedMemoryTest.SuccessiveNear/3 (17524 of 34304)
PASS: LLVM :: Transforms/Inline/inlined-loop-metadata.ll (17525 of 34304)
PASS: LLVM-Unit :: tools/llvm-cfi-verify/./CFIVerifyTests/BasicX86FileAnalysisTest.CFIProtectionComplexExample (17526 of 34304)
PASS: LLVM :: CodeGen/Hexagon/swp-epilog-reuse2.ll (17527 of 34304)
PASS: LLVM :: MC/AArch64/SVE/udiv.s (17528 of 34304)
PASS: LLVM :: CodeGen/X86/basic-promote-integers.ll (17529 of 34304)
PASS: LLVM :: MC/AsmParser/hash-directive.s (17530 of 34304)
PASS: LLVM :: CodeGen/Hexagon/cext-ice.ll (17531 of 34304)
PASS: LLVM :: CodeGen/AArch64/GlobalISel/legalizer-combiner.mir (17532 of 34304)
PASS: LLVM :: Transforms/ConstProp/2009-06-20-constexpr-zero-lhs.ll (17533 of 34304)
PASS: LLVM :: Transforms/JumpThreading/thread-cmp.ll (17534 of 34304)
PASS: LLVM :: CodeGen/X86/vector-width-store-merge.ll (17535 of 34304)
PASS: LLVM :: tools/llvm-mca/X86/Generic/resources-clzero.s (17536 of 34304)
PASS: LLVM-Unit :: Support/./SupportTests/VirtualFileSystemTest.BrokenSymlinkRealFSIteration (17537 of 34304)
PASS: LLVM :: Transforms/InstCombine/masked_intrinsics.ll (17538 of 34304)
PASS: LLVM-Unit :: ExecutionEngine/Orc/./OrcJITTests/CoreAPIsStandardTest.GeneratorTest (17539 of 34304)
PASS: LLVM :: Assembler/invalid-difile-missing-directory.ll (17540 of 34304)
PASS: LLVM-Unit :: DebugInfo/PDB/./DebugInfoPDBTests/NativeSymbolReuseTest.CompilandSymbolReuseBackwards (17541 of 34304)
PASS: LLVM :: CodeGen/X86/cmpxchg-i1.ll (17542 of 34304)
PASS: LLVM-Unit :: ExecutionEngine/MCJIT/./MCJITTests/MCJITMultipleModuleTest.two_module_consecutive_call_case (17543 of 34304)
PASS: LLVM :: CodeGen/X86/shift-pcmp.ll (17544 of 34304)
PASS: LLVM :: Transforms/InstCombine/apint-shl-trunc.ll (17545 of 34304)
PASS: LLVM :: CodeGen/AArch64/unfold-masked-merge-scalar-variablemask.ll (17546 of 34304)
PASS: LLVM :: Transforms/LoopVectorize/AArch64/smallest-and-widest-types.ll (17547 of 34304)
PASS: LLVM :: CodeGen/ARM/debug-info-d16-reg.ll (17548 of 34304)
PASS: LLVM :: Transforms/InstCombine/apint-rem2.ll (17549 of 34304)
PASS: LLVM :: CodeGen/PowerPC/load-v4i8-improved.ll (17550 of 34304)
PASS: LLVM :: CodeGen/Hexagon/check-dot-new.ll (17551 of 34304)
PASS: LLVM-Unit :: Support/./SupportTests/OverflowTest/2.SubOverflowToNegative (17552 of 34304)
PASS: LLVM :: Transforms/LowerTypeTests/export-dead.ll (17553 of 34304)
PASS: LLVM :: CodeGen/Mips/2008-08-03-ReturnDouble.ll (17554 of 34304)
PASS: LLVM-Unit :: IR/./IRTests/MDNodeTest.isTemporary (17555 of 34304)
UNSUPPORTED: LLVM :: CodeGen/ARC/call.ll (17556 of 34304)
PASS: LLVM :: CodeGen/RISCV/verify-instr.mir (17557 of 34304)
PASS: LLVM :: MC/X86/x86-evenDirective.s (17558 of 34304)
PASS: LLVM :: CodeGen/X86/shl-crash-on-legalize.ll (17559 of 34304)
PASS: LLVM :: Transforms/InstCombine/vector-xor.ll (17560 of 34304)
PASS: LLVM :: ObjectYAML/wasm/import_memory_shared.yaml (17561 of 34304)
PASS: LLVM-Unit :: tools/llvm-exegesis/./LLVMExegesisTests/PerfHelperTest.FunctionalTest (17562 of 34304)
PASS: LLVM :: Transforms/LoopUnroll/AArch64/runtime-loop.ll (17563 of 34304)
PASS: LLVM :: CodeGen/Hexagon/vect/vect-insert-extract-elt.ll (17564 of 34304)
PASS: LLVM :: CodeGen/AMDGPU/ipra-regmask.ll (17565 of 34304)
PASS: LLVM :: CodeGen/PowerPC/machine-pre.ll (17566 of 34304)
PASS: LLVM :: Instrumentation/MemorySanitizer/msan_llvm_strip_invariant.ll (17567 of 34304)
PASS: LLVM :: CodeGen/PowerPC/ppc32-i1-stack-arguments-abi-bug.ll (17568 of 34304)
PASS: LLVM :: Transforms/SimplifyCFG/X86/merge-cond-stores-cost.ll (17569 of 34304)
PASS: LLVM :: CodeGen/ARM/2009-09-24-spill-align.ll (17570 of 34304)
PASS: LLVM :: Linker/type-unique-odr-b.ll (17571 of 34304)
PASS: LLVM :: Transforms/InstSimplify/log-exp-intrinsic.ll (17572 of 34304)
PASS: LLVM :: tools/llvm-dwarfdump/X86/debug-names-verify-short3.s (17573 of 34304)
PASS: LLVM :: CodeGen/X86/fast-isel-extract.ll (17574 of 34304)
PASS: LLVM :: tools/llvm-objcopy/ELF/error-format.test (17575 of 34304)
PASS: LLVM :: CodeGen/X86/lsr-redundant-addressing.ll (17576 of 34304)
PASS: LLVM :: Analysis/DivergenceAnalysis/AMDGPU/llvm.amdgcn.image.atomic.ll (17577 of 34304)
PASS: LLVM :: Transforms/SafeStack/X86/memintrinsic-oob-read.ll (17578 of 34304)
PASS: LLVM :: Verifier/comdat-decl2.ll (17579 of 34304)
PASS: LLVM :: Analysis/BasicAA/2003-12-11-ConstExprGEP.ll (17580 of 34304)
PASS: LLVM :: CodeGen/SystemZ/int-usub-01.ll (17581 of 34304)
PASS: LLVM :: CodeGen/X86/empty-function.ll (17582 of 34304)
PASS: LLVM :: CodeGen/Generic/asm-large-immediate.ll (17583 of 34304)
UNSUPPORTED: LLVM :: CodeGen/AVR/store.ll (17584 of 34304)
PASS: LLVM :: CodeGen/AMDGPU/vmem-vcc-hazard.mir (17585 of 34304)
PASS: LLVM :: Transforms/LoopUnroll/unroll-opt-attribute.ll (17586 of 34304)
PASS: LLVM :: CodeGen/PowerPC/bdzlr.ll (17587 of 34304)
PASS: LLVM :: Analysis/ScalarEvolution/nsw.ll (17588 of 34304)
PASS: LLVM-Unit :: Support/./SupportTests/ErrorOr.Covariant (17589 of 34304)
PASS: LLVM :: Bitcode/thinlto-summary-globalvar.ll (17590 of 34304)
PASS: LLVM :: MC/AMDGPU/gfx10-vop2be-literal.s (17591 of 34304)
PASS: LLVM :: CodeGen/MIR/AArch64/cfi.mir (17592 of 34304)
PASS: LLVM-Unit :: TextAPI/./TextAPITests/TBDv1.UnknownPlatform (17593 of 34304)
PASS: LLVM :: CodeGen/X86/codegen-prepare-crash.ll (17594 of 34304)
PASS: LLVM :: CodeGen/WinEH/wineh-statenumbering-cleanups.ll (17595 of 34304)
PASS: LLVM :: CodeGen/PowerPC/f128-arith.ll (17596 of 34304)
PASS: LLVM :: CodeGen/AArch64/macro-fusion-last.mir (17597 of 34304)
PASS: LLVM :: CodeGen/AMDGPU/extract_subvector_vec4_vec3.ll (17598 of 34304)
PASS: LLVM :: Transforms/InstCombine/2009-01-19-fmod-constant-float.ll (17599 of 34304)
PASS: LLVM-Unit :: ADT/./ADTTests/SmallVectorTest/0.EraseTest (17600 of 34304)
PASS: LLVM :: tools/llvm-mca/X86/Haswell/resources-fma.s (17601 of 34304)
PASS: LLVM :: CodeGen/AMDGPU/select-vectors.ll (17602 of 34304)
PASS: LLVM :: Transforms/CodeGenPrepare/X86/pr27536.ll (17603 of 34304)
PASS: LLVM-Unit :: ADT/./ADTTests/SmallVectorTest/4.SwapTest (17604 of 34304)
PASS: LLVM :: CodeGen/X86/insert-positions.ll (17605 of 34304)
PASS: LLVM :: Verifier/recursive-struct-param.ll (17606 of 34304)
PASS: LLVM :: DebugInfo/X86/union-template.ll (17607 of 34304)
PASS: LLVM :: CodeGen/X86/mulfix_combine.ll (17608 of 34304)
UNSUPPORTED: LLVM :: tools/llvm-pdbutil/enum-layout.test (17609 of 34304)
PASS: LLVM :: Transforms/GVN/calls-nonlocal.ll (17610 of 34304)
PASS: LLVM :: CodeGen/AArch64/arm64-regress-opt-cmp.mir (17611 of 34304)
PASS: LLVM :: DebugInfo/Generic/2010-03-12-llc-crash.ll (17612 of 34304)
PASS: LLVM :: Transforms/LoopSimplify/indirectbr-backedge.ll (17613 of 34304)
PASS: LLVM :: MC/AArch64/SVE/sabd.s (17614 of 34304)
PASS: LLVM :: CodeGen/X86/compiler_used.ll (17615 of 34304)
PASS: LLVM :: Transforms/SimplifyCFG/trap-debugloc.ll (17616 of 34304)
PASS: LLVM-Unit :: ADT/./ADTTests/StringRefTest.ConsumeFront (17617 of 34304)
PASS: LLVM :: DebugInfo/debugify.ll (17618 of 34304)
PASS: LLVM :: CodeGen/ARM/intrinsics-memory-barrier.ll (17619 of 34304)
PASS: LLVM :: Transforms/IPConstantProp/musttail-call.ll (17620 of 34304)
PASS: LLVM :: MC/Hexagon/duplex-addi-global-imm.s (17621 of 34304)
PASS: LLVM :: CodeGen/PowerPC/2007-05-03-InlineAsm-S-Constraint.ll (17622 of 34304)
PASS: LLVM :: MC/ARM/modified-immediate-fixup-error.s (17623 of 34304)
PASS: LLVM-Unit :: ADT/./ADTTests/StringSetTest.InsertAndCountStringMapEntry (17624 of 34304)
PASS: LLVM :: CodeGen/X86/GlobalISel/legalize-or-scalar.mir (17625 of 34304)
PASS: LLVM :: MC/AArch64/SVE/udivr.s (17626 of 34304)
PASS: LLVM-Unit :: IR/./IRTests/MDNodeTest.replaceWithUniqued (17627 of 34304)
PASS: LLVM :: Transforms/InstCombine/abs-1.ll (17628 of 34304)
PASS: LLVM :: Transforms/StripSymbols/2007-01-15-llvm.used.ll (17629 of 34304)
PASS: LLVM-Unit :: ExecutionEngine/MCJIT/./MCJITTests/MCJITCAPITest.addGlobalMapping (17630 of 34304)
PASS: LLVM :: Transforms/GVN/rle-must-alias.ll (17631 of 34304)
PASS: LLVM :: CodeGen/Hexagon/bug9049.ll (17632 of 34304)
PASS: LLVM-Unit :: Support/./SupportTests/SymbolRemappingReaderTest.DemanglingErrors (17633 of 34304)
PASS: LLVM :: tools/llvm-mca/X86/read-after-ld-1.s (17634 of 34304)
PASS: LLVM :: CodeGen/ARM/hidden-vis.ll (17635 of 34304)
PASS: LLVM :: Transforms/ArgumentPromotion/2008-09-07-CGUpdate.ll (17636 of 34304)
PASS: LLVM-Unit :: ADT/./ADTTests/SmallPtrSetTest.ConstTest (17637 of 34304)
PASS: LLVM :: tools/llvm-mca/X86/Haswell/cmpxchg16b.s (17638 of 34304)
PASS: LLVM-Unit :: IR/./IRTests/ConstantRangeTest.SignWrapped (17639 of 34304)
PASS: LLVM :: Transforms/PGOProfile/statics_counter_naming.ll (17640 of 34304)
PASS: LLVM :: CodeGen/X86/no-stack-arg-probe.ll (17641 of 34304)
PASS: LLVM :: MC/AArch64/SVE2/uhsub.s (17642 of 34304)
PASS: LLVM :: CodeGen/X86/fast-isel-fneg-kill.ll (17643 of 34304)
PASS: LLVM :: CodeGen/PowerPC/aix-lr.ll (17644 of 34304)
PASS: LLVM :: CodeGen/ARM/thumb1-div.ll (17645 of 34304)
PASS: LLVM :: Transforms/SimplifyCFG/PhiEliminate2.ll (17646 of 34304)
PASS: LLVM-Unit :: ADT/./ADTTests/APIntTest.i256 (17647 of 34304)
PASS: LLVM-Unit :: IR/./IRTests/InstructionsTest.SkipDebug (17648 of 34304)
PASS: LLVM :: CodeGen/X86/and-su.ll (17649 of 34304)
PASS: LLVM-Unit :: IR/./IRTests/PreservedAnalysisTest.Abandon (17650 of 34304)
PASS: LLVM :: CodeGen/X86/twoaddr-sink-terminator.ll (17651 of 34304)
PASS: LLVM :: CodeGen/X86/2012-10-03-DAGCycle.ll (17652 of 34304)
PASS: LLVM :: CodeGen/AArch64/fast-isel-cbz.ll (17653 of 34304)
PASS: LLVM :: MC/Mips/mips32r6/invalid-mips1.s (17654 of 34304)
PASS: LLVM :: CodeGen/Hexagon/swp-loop-carried.ll (17655 of 34304)
PASS: LLVM-Unit :: Support/./SupportTests/AnnotationsTest.Nested (17656 of 34304)
PASS: LLVM :: Transforms/LoopVectorize/ptr-induction.ll (17657 of 34304)
PASS: LLVM :: CodeGen/X86/vortex-bug.ll (17658 of 34304)
PASS: LLVM :: tools/obj2yaml/elf-gnu-hash-section.yaml (17659 of 34304)
PASS: LLVM :: Linker/transitive-lazy-link.ll (17660 of 34304)
PASS: LLVM :: CodeGen/MSP430/2009-12-21-FrameAddr.ll (17661 of 34304)
PASS: LLVM-Unit :: tools/llvm-exegesis/PowerPC/./LLVMExegesisPowerPCTests/AnalysisTest.ComputeIdealizedProcResPressure_1ALUE (17662 of 34304)
PASS: LLVM :: CodeGen/XCore/ashr.ll (17663 of 34304)
UNSUPPORTED: LLVM :: CodeGen/AVR/pseudo/STDWPtrQRr.mir (17664 of 34304)
PASS: LLVM :: CodeGen/X86/avx512vlcd-intrinsics-fast-isel.ll (17665 of 34304)
PASS: LLVM :: Transforms/PartiallyInlineLibCalls/X86/good-prototype.ll (17666 of 34304)
PASS: LLVM-Unit :: Support/./SupportTests/PCS_GOTBuildAttr.testBuildAttr (17667 of 34304)
PASS: LLVM :: CodeGen/Mips/longbranch/long-branch-expansion-2.ll (17668 of 34304)
PASS: LLVM :: ThinLTO/X86/personality-local.ll (17669 of 34304)
PASS: LLVM-Unit :: Transforms/Utils/./UtilsTests/CodeExtractor.ExtractAndInvalidateAssumptionCache (17670 of 34304)
PASS: LLVM :: MC/Disassembler/Mips/mips32r5/valid-mips32r5-el.txt (17671 of 34304)
PASS: LLVM :: CodeGen/ARM/emutls_generic.ll (17672 of 34304)
PASS: LLVM-Unit :: IR/./IRTests/ModuleWithFunctionTest.InvokeInst (17673 of 34304)
PASS: LLVM :: CodeGen/RISCV/interrupt-attr.ll (17674 of 34304)
PASS: LLVM :: CodeGen/ARM/ifcvt_diamond_unanalyzable.mir (17675 of 34304)
PASS: LLVM :: tools/llvm-cov/report.cpp (17676 of 34304)
PASS: LLVM-Unit :: ADT/./ADTTests/SmallPtrSetTest.GrowthTest (17677 of 34304)
PASS: LLVM :: DebugInfo/X86/dbg-value-frame-index.ll (17678 of 34304)
PASS: LLVM :: CodeGen/Hexagon/isel-zext-vNi1.ll (17679 of 34304)
PASS: LLVM :: MC/MachO/loc.s (17680 of 34304)
PASS: LLVM :: CodeGen/AMDGPU/unify-metadata.ll (17681 of 34304)
PASS: LLVM :: CodeGen/Hexagon/struct_copy_sched_r16.ll (17682 of 34304)
PASS: LLVM :: tools/llvm-size/version.test (17683 of 34304)
PASS: LLVM :: CodeGen/AArch64/arm64-storebytesmerge.ll (17684 of 34304)
PASS: LLVM-Unit :: IR/./IRTests/AsmWriterTest.DumpDIExpression (17685 of 34304)
PASS: LLVM-Unit :: Support/./SupportTests/swapByteOrder.int8_t (17686 of 34304)
PASS: LLVM :: CodeGen/AMDGPU/omod.ll (17687 of 34304)
PASS: LLVM :: CodeGen/Hexagon/swp-const-tc3.ll (17688 of 34304)
PASS: LLVM-Unit :: ProfileData/./ProfileDataTests/ParameterizedCovMapTest/CoverageMappingTest.dont_emit_closing_segment_at_new_region_start/2 (17689 of 34304)
PASS: LLVM :: DebugInfo/X86/inline-asm-locs.ll (17690 of 34304)
PASS: LLVM :: CodeGen/Mips/mirparser/target-flags-pic-mxgot-tls.mir (17691 of 34304)
PASS: LLVM :: CodeGen/X86/wide-fma-contraction.ll (17692 of 34304)
PASS: LLVM :: CodeGen/AArch64/build-pair-isel.ll (17693 of 34304)
PASS: LLVM :: CodeGen/PowerPC/fold-li.ll (17694 of 34304)
PASS: LLVM :: Analysis/ScalarEvolution/limit-depth.ll (17695 of 34304)
UNSUPPORTED: LLVM :: CodeGen/AVR/sext.ll (17696 of 34304)
PASS: LLVM :: CodeGen/Hexagon/regalloc-bad-undef.mir (17697 of 34304)
PASS: LLVM :: Transforms/SCCP/constant-struct.ll (17698 of 34304)
PASS: LLVM :: Transforms/AggressiveInstCombine/popcount.ll (17699 of 34304)
PASS: LLVM :: DebugInfo/MIR/X86/no-cfi-loc.mir (17700 of 34304)
PASS: LLVM :: Transforms/LoopVectorize/phi-cost.ll (17701 of 34304)
PASS: LLVM-Unit :: ADT/./ADTTests/APFloatTest.Maximum (17702 of 34304)
PASS: LLVM :: CodeGen/Mips/setcc-se.ll (17703 of 34304)
PASS: LLVM :: LTO/X86/strip-debug-info-no-call-loc.ll (17704 of 34304)
PASS: LLVM :: CodeGen/PowerPC/fp-int-conversions-direct-moves.ll (17705 of 34304)
PASS: LLVM :: Transforms/ArgumentPromotion/tail.ll (17706 of 34304)
PASS: LLVM :: tools/llvm-objdump/macho-compact-unwind-x86_64.test (17707 of 34304)
PASS: LLVM :: CodeGen/MSP430/stacksave_restore.ll (17708 of 34304)
PASS: LLVM-Unit :: CodeGen/./CodeGenTests/MachineOperandTest.PrintCPI (17709 of 34304)
PASS: LLVM :: CodeGen/AMDGPU/llvm.amdgcn.raw.tbuffer.store.d16.ll (17710 of 34304)
PASS: LLVM :: Transforms/LoopVectorize/pr31098.ll (17711 of 34304)
PASS: LLVM-Unit :: Support/./SupportTests/FileCollectorTest.addFile (17712 of 34304)
PASS: LLVM-Unit :: IR/./IRTests/ValueMapTest/0.CallsConfig (17713 of 34304)
PASS: LLVM :: CodeGen/Hexagon/swp-more-phi.ll (17714 of 34304)
PASS: LLVM :: Verifier/guard-intrinsic.ll (17715 of 34304)
PASS: LLVM :: tools/llvm-mca/X86/Haswell/resources-x87.s (17716 of 34304)
PASS: LLVM :: DebugInfo/COFF/local-variable-gap.ll (17717 of 34304)
PASS: LLVM :: Transforms/PlaceSafepoints/statepoint-frameescape.ll (17718 of 34304)
PASS: LLVM :: Verifier/swifterror3.ll (17719 of 34304)
PASS: LLVM :: MC/Mips/mips32r6/invalid-mips32.s (17720 of 34304)
PASS: LLVM :: CodeGen/X86/MachineBranchProb.ll (17721 of 34304)
PASS: LLVM :: Transforms/InstCombine/strpbrk-1.ll (17722 of 34304)
PASS: LLVM :: tools/llvm-readobj/reloc-types-elf-lanai.test (17723 of 34304)
PASS: LLVM :: Transforms/SimplifyCFG/AArch64/prefer-fma.ll (17724 of 34304)
PASS: LLVM :: CodeGen/ARM/gep-optimization.ll (17725 of 34304)
PASS: LLVM-Unit :: ADT/./ADTTests/StringRefTest.Trim (17726 of 34304)
PASS: LLVM :: CodeGen/ARM/vceq.ll (17727 of 34304)
PASS: LLVM :: MC/COFF/secrel-variant.s (17728 of 34304)
PASS: LLVM :: CodeGen/X86/neg-shl-add.ll (17729 of 34304)
PASS: LLVM :: MC/AArch64/SVE2/shadd-diagnostics.s (17730 of 34304)
PASS: LLVM-Unit :: ProfileData/./ProfileDataTests/ParameterizedCovMapTest/CoverageMappingTest.strip_unknown_filename_prefix/1 (17731 of 34304)
PASS: LLVM :: Transforms/LICM/hoist-fast-fdiv.ll (17732 of 34304)
PASS: LLVM :: CodeGen/SystemZ/vec-move-07.ll (17733 of 34304)
PASS: LLVM :: Transforms/SimplifyCFG/branch-fold.ll (17734 of 34304)
PASS: LLVM :: CodeGen/Thumb/consthoist-imm8-costs-1.ll (17735 of 34304)
PASS: LLVM :: CodeGen/X86/x86-64-static-relo-movl.ll (17736 of 34304)
PASS: LLVM :: Transforms/LoopDistribute/followup.ll (17737 of 34304)
PASS: LLVM :: MC/Disassembler/X86/x86-16.txt (17738 of 34304)
PASS: LLVM :: CodeGen/X86/dllimport-x86_64.ll (17739 of 34304)
PASS: LLVM :: Bitcode/metadata.ll (17740 of 34304)
PASS: LLVM :: MC/ARM/elf-thumbfunc-reloc2.s (17741 of 34304)
PASS: LLVM :: CodeGen/BPF/many_args2.ll (17742 of 34304)
PASS: LLVM :: CodeGen/AArch64/inline-asm-constraints-badK.ll (17743 of 34304)
PASS: LLVM :: Transforms/SimplifyCFG/ForwardSwitchConditionToPHI.ll (17744 of 34304)
PASS: LLVM :: CodeGen/AArch64/aarch64-mov-debug-locs.mir (17745 of 34304)
PASS: LLVM :: Transforms/LoopVectorize/X86/unroll-pm.ll (17746 of 34304)
PASS: LLVM :: MC/AArch64/SVE/smaxv-diagnostics.s (17747 of 34304)
PASS: LLVM-Unit :: ADT/./ADTTests/DenseMapTest/2.CopyConstructorFromDefaultTest (17748 of 34304)
PASS: LLVM :: Transforms/SimplifyCFG/wc-widen-block.ll (17749 of 34304)
PASS: LLVM :: CodeGen/AMDGPU/dead-lane.mir (17750 of 34304)
PASS: LLVM :: MC/ARM/eh-directive-unwind_raw.s (17751 of 34304)
PASS: LLVM :: DebugInfo/X86/no-public-sections-metadata.ll (17752 of 34304)
PASS: LLVM :: Transforms/FunctionAttrs/readnone.ll (17753 of 34304)
PASS: LLVM :: Transforms/Scalarizer/basic.ll (17754 of 34304)
PASS: LLVM :: Instrumentation/ThreadSanitizer/do-not-instrument-memory-access.ll (17755 of 34304)
PASS: LLVM :: CodeGen/Thumb2/thumb2-asr.ll (17756 of 34304)
PASS: LLVM :: Transforms/InstCombine/2010-05-30-memcpy-Struct.ll (17757 of 34304)
PASS: LLVM :: tools/llvm-objdump/non-archive-object.test (17758 of 34304)
PASS: LLVM :: Transforms/InstCombine/disable-simplify-libcalls.ll (17759 of 34304)
PASS: LLVM :: CodeGen/SystemZ/vec-move-14.ll (17760 of 34304)
PASS: LLVM :: Transforms/LoopVectorize/lifetime.ll (17761 of 34304)
PASS: LLVM :: CodeGen/Mips/inlineasm-constraint-ZC-1.ll (17762 of 34304)
PASS: LLVM :: Analysis/BasicAA/sequential-gep.ll (17763 of 34304)
PASS: LLVM :: Analysis/DivergenceAnalysis/AMDGPU/hidden_loopdiverge.ll (17764 of 34304)
PASS: LLVM :: CodeGen/X86/2007-04-27-InlineAsm-IntMemInput.ll (17765 of 34304)
PASS: LLVM :: MC/AArch64/neon-scalar-by-elem-saturating-mul.s (17766 of 34304)
PASS: LLVM :: Assembler/invalid-datalayout8.ll (17767 of 34304)
PASS: LLVM :: CodeGen/ARM/ret_arg5.ll (17768 of 34304)
PASS: LLVM :: Transforms/InstCombine/objsize.ll (17769 of 34304)
PASS: LLVM-Unit :: ADT/./ADTTests/IListTest.SpliceOne (17770 of 34304)
PASS: LLVM :: TableGen/ConstraintChecking5.td (17771 of 34304)
PASS: LLVM :: CodeGen/X86/no-plt-libcalls.ll (17772 of 34304)
PASS: LLVM :: CodeGen/ARM/2010-09-21-OptCmpBug.ll (17773 of 34304)
PASS: LLVM :: DebugInfo/X86/coff_relative_names.ll (17774 of 34304)
PASS: LLVM :: CodeGen/AArch64/GlobalISel/constant-dbg-loc.ll (17775 of 34304)
PASS: LLVM :: Transforms/CrossDSOCFI/basic.ll (17776 of 34304)
PASS: LLVM :: Transforms/IRCE/wide_indvar.ll (17777 of 34304)
PASS: LLVM :: Bindings/llvm-c/function_attributes.ll (17778 of 34304)
PASS: LLVM :: CodeGen/ARM/ret_f32_arg5.ll (17779 of 34304)
PASS: LLVM :: tools/llvm-ar/mri-comments.test (17780 of 34304)
PASS: LLVM :: CodeGen/ARM/2013-05-13-DAGCombiner-undef-mask.ll (17781 of 34304)
PASS: LLVM :: Other/bcanalyzer-block-info.txt (17782 of 34304)
PASS: LLVM-Unit :: tools/llvm-cfi-verify/./CFIVerifyTests/BasicX86FileAnalysisTest.CFIProtectionDualPathUd2 (17783 of 34304)
PASS: LLVM :: Transforms/Reassociate/absorption.ll (17784 of 34304)
PASS: LLVM :: CodeGen/X86/i486-fence-loop.ll (17785 of 34304)
PASS: LLVM-Unit :: tools/llvm-cfi-verify/./CFIVerifyTests/BasicGraphBuilderTest.BuildFlowGraphConditionalInfiniteLoop (17786 of 34304)
PASS: LLVM :: CodeGen/PowerPC/fastisel-gep-promote-before-add.ll (17787 of 34304)
PASS: LLVM :: MC/Disassembler/ARM/mve-vmov-pair.txt (17788 of 34304)
PASS: LLVM-Unit :: BinaryFormat/./BinaryFormatTests/MsgPackReader.TestReadMap32Max (17789 of 34304)
PASS: LLVM :: Transforms/MergeFunc/phi-speculation2.ll (17790 of 34304)
PASS: LLVM :: CodeGen/SystemZ/vec-or-01.ll (17791 of 34304)
PASS: LLVM :: CodeGen/MIR/X86/undefined-global-value.mir (17792 of 34304)
PASS: LLVM :: CodeGen/AMDGPU/r600.extract-lowbits.ll (17793 of 34304)
PASS: LLVM :: DebugInfo/X86/asm-macro-line-number.s (17794 of 34304)
PASS: LLVM :: CodeGen/X86/fmf-propagation.ll (17795 of 34304)
PASS: LLVM :: Transforms/Inline/devirtualize-3.ll (17796 of 34304)
PASS: LLVM :: DebugInfo/X86/align_cpp11.ll (17797 of 34304)
PASS: LLVM :: CodeGen/Lanai/codemodel.ll (17798 of 34304)
PASS: LLVM :: MC/AArch64/SVE/mov-diagnostics.s (17799 of 34304)
PASS: LLVM :: CodeGen/BPF/CORE/intrinsic-fieldinfo-signedness-2.ll (17800 of 34304)
PASS: LLVM :: MC/AArch64/SVE2/ldnt1sb-diagnostics.s (17801 of 34304)
PASS: LLVM :: CodeGen/RISCV/float-bit-preserving-dagcombines.ll (17802 of 34304)
PASS: LLVM-Unit :: DebugInfo/CodeView/./DebugInfoCodeViewTests/TypeHashingTest.ContentHash (17803 of 34304)
PASS: LLVM :: CodeGen/ARM/Windows/tls.ll (17804 of 34304)
PASS: LLVM :: CodeGen/X86/sse42-intrinsics-fast-isel-x86_64.ll (17805 of 34304)
PASS: LLVM :: ThinLTO/X86/empty_module_with_cache.ll (17806 of 34304)
PASS: LLVM :: CodeGen/ARM/inlineasm-imm-thumb2.ll (17807 of 34304)
PASS: LLVM :: MC/Disassembler/ARM/coprocessors-arm.txt (17808 of 34304)
PASS: LLVM :: ExecutionEngine/OrcLazy/weak-function.ll (17809 of 34304)
PASS: LLVM :: Verifier/dbg-orphaned-compileunit.ll (17810 of 34304)
PASS: LLVM :: CodeGen/PowerPC/testComparesigtsc.ll (17811 of 34304)
PASS: LLVM-Unit :: ProfileData/./ProfileDataTests/SampleProfTest.default_suffix_elision_text (17812 of 34304)
PASS: LLVM :: ExecutionEngine/OrcMCJIT/2003-08-21-EnvironmentTest.ll (17813 of 34304)
PASS: LLVM :: CodeGen/AArch64/arm64-vcvtxd_f32_f64.ll (17814 of 34304)
PASS: LLVM :: CodeGen/WebAssembly/conv-trap.ll (17815 of 34304)
PASS: LLVM-Unit :: IR/./IRTests/CFGBuilder.Deletions (17816 of 34304)
PASS: LLVM-Unit :: Support/./SupportTests/YAMLIO.TestReadWriteMyFlowSequence (17817 of 34304)
PASS: LLVM :: MC/AArch64/SVE2/pmullt.s (17818 of 34304)
PASS: LLVM-Unit :: Support/./SupportTests/InMemoryFileSystemTest.AddFileInPlaceOfAHardLinkWithDifferentContent (17819 of 34304)
PASS: LLVM-Unit :: Analysis/./AnalysisTests/LoopInfoTest.LoopWithLatchCmpNE (17820 of 34304)
PASS: LLVM :: CodeGen/SystemZ/vec-conv-02.ll (17821 of 34304)
PASS: LLVM :: Transforms/MergeICmps/X86/pr36557.ll (17822 of 34304)
PASS: LLVM :: CodeGen/BPF/32-bit-subreg-load-store.ll (17823 of 34304)
PASS: LLVM :: YAMLParser/null.test (17824 of 34304)
PASS: LLVM-Unit :: Support/./SupportTests/AllocationTests/MappedMemoryTest.ZeroNear/5 (17825 of 34304)
PASS: LLVM :: TableGen/arithmetic.td (17826 of 34304)
PASS: LLVM :: Analysis/DivergenceAnalysis/NVPTX/daorder.ll (17827 of 34304)
PASS: LLVM :: CodeGen/SystemZ/int-div-03.ll (17828 of 34304)
PASS: LLVM :: CodeGen/Mips/GlobalISel/llvm-ir/global_address_pic.ll (17829 of 34304)
PASS: LLVM :: Transforms/TailCallElim/ackermann.ll (17830 of 34304)
PASS: LLVM :: LTO/Resolution/X86/alias-alias.ll (17831 of 34304)
PASS: LLVM :: CodeGen/AArch64/sve-masked-ldst-sext.ll (17832 of 34304)
PASS: LLVM :: Transforms/NewGVN/pr35125.ll (17833 of 34304)
PASS: LLVM :: CodeGen/ARM/load_i1_select.ll (17834 of 34304)
PASS: LLVM :: CodeGen/ARM/GlobalISel/arm-legalize-consts.mir (17835 of 34304)
PASS: LLVM :: CodeGen/X86/vector-lzcnt-128.ll (17836 of 34304)
PASS: LLVM :: Analysis/ConstantFolding/timeout.ll (17837 of 34304)
PASS: LLVM :: Object/no-section-table.test (17838 of 34304)
PASS: LLVM-Unit :: ADT/./ADTTests/APIntTest.divrem_big5 (17839 of 34304)
PASS: LLVM :: CodeGen/AMDGPU/schedule-regpressure-limit3.ll (17840 of 34304)
PASS: LLVM :: CodeGen/AArch64/dbg-declare-tag-offset.ll (17841 of 34304)
PASS: LLVM :: MC/AArch64/SVE2/sqrdmlsh.s (17842 of 34304)
PASS: LLVM-Unit :: ADT/./ADTTests/StringMapTest.ClearTest (17843 of 34304)
PASS: LLVM :: CodeGen/X86/2012-03-15-build_vector_wl.ll (17844 of 34304)
PASS: LLVM :: CodeGen/AMDGPU/GlobalISel/legalize-fmad.mir (17845 of 34304)
PASS: LLVM-Unit :: Transforms/Utils/./UtilsTests/ValueMapperTest.mapMDNodeSeededWithNull (17846 of 34304)
PASS: LLVM :: CodeGen/AArch64/uadd_sat_vec.ll (17847 of 34304)
PASS: LLVM :: CodeGen/X86/avx512ifmavl-intrinsics-fast-isel.ll (17848 of 34304)
PASS: LLVM :: Transforms/JumpThreading/branch-debug-info.ll (17849 of 34304)
PASS: LLVM-Unit :: ADT/./ADTTests/BitVectorTest/1.SimpleFindOpsMultiWord (17850 of 34304)
PASS: LLVM :: tools/llvm-mca/X86/Broadwell/resources-cmpxchg.s (17851 of 34304)
PASS: LLVM-Unit :: ADT/./ADTTests/APIntTest.clearLowBits (17852 of 34304)
PASS: LLVM :: MC/Disassembler/AArch64/arm64-non-apple-fmov.txt (17853 of 34304)
PASS: LLVM-Unit :: TextAPI/./TextAPITests/TBDv4.InvalidArchitecture (17854 of 34304)
PASS: LLVM :: CodeGen/SystemZ/args-03.ll (17855 of 34304)
PASS: LLVM :: CodeGen/AMDGPU/llvm.amdgcn.raw.tbuffer.load.d16.ll (17856 of 34304)
PASS: LLVM :: CodeGen/ARM/macho-trap.ll (17857 of 34304)
PASS: LLVM :: Instrumentation/AddressSanitizer/do-not-instrument-profiling-globals.ll (17858 of 34304)
PASS: LLVM :: MC/Mips/mips5/invalid-mips32r2.s (17859 of 34304)
PASS: LLVM :: tools/llvm-rc/tag-stringtable.test (17860 of 34304)
PASS: LLVM :: CodeGen/X86/pr28560.ll (17861 of 34304)
PASS: LLVM :: CodeGen/AArch64/arm64-fml-combines.ll (17862 of 34304)
PASS: LLVM-Unit :: BinaryFormat/./BinaryFormatTests/MsgPackWriter.TestWriteArray16Min (17863 of 34304)
PASS: LLVM :: Transforms/GVN/2009-07-13-MemDepSortFail.ll (17864 of 34304)
PASS: LLVM-Unit :: ADT/./ADTTests/OptionalTest.Emplace (17865 of 34304)
PASS: LLVM-Unit :: ADT/./ADTTests/SmallVectorTest/3.InsertCopy (17866 of 34304)
PASS: LLVM :: CodeGen/X86/tailcall-pseudo-64.mir (17867 of 34304)
PASS: LLVM :: LTO/Resolution/X86/diagnostic-handler-remarks.ll (17868 of 34304)
PASS: LLVM :: DebugInfo/high-pc-constant.test (17869 of 34304)
PASS: LLVM :: MC/AArch64/SVE2/shsub.s (17870 of 34304)
PASS: LLVM :: MC/Mips/msa/test_mi10.s (17871 of 34304)
PASS: LLVM :: CodeGen/SystemZ/vec-strict-round-02.ll (17872 of 34304)
PASS: LLVM :: tools/llvm-mca/X86/BtVer2/dependency-breaking-sbb-2.s (17873 of 34304)
PASS: LLVM :: CodeGen/Generic/2006-02-12-InsertLibcall.ll (17874 of 34304)
PASS: LLVM :: Assembler/2003-01-30-UnsignedString.ll (17875 of 34304)
PASS: LLVM :: Transforms/GVN/2012-05-22-PreCrash.ll (17876 of 34304)
PASS: LLVM :: CodeGen/Thumb2/thumb2-ldrd.ll (17877 of 34304)
PASS: LLVM-Unit :: Support/./SupportTests/BranchProbabilityTest.scaleByInverse (17878 of 34304)
PASS: LLVM :: CodeGen/NVPTX/MachineSink-convergent.ll (17879 of 34304)
PASS: LLVM :: tools/llvm-xray/X86/extract-instrmap.ll (17880 of 34304)
PASS: LLVM :: CodeGen/AArch64/tailcall-ccmismatch.ll (17881 of 34304)
PASS: LLVM :: Verifier/musttail-valid.ll (17882 of 34304)
PASS: LLVM :: CodeGen/X86/broadcastm-lowering.ll (17883 of 34304)
PASS: LLVM :: CodeGen/PowerPC/ppcf128sf.ll (17884 of 34304)
PASS: LLVM :: CodeGen/AArch64/i128-fast-isel-fallback.ll (17885 of 34304)
PASS: LLVM :: MC/AMDGPU/ds.s (17886 of 34304)
PASS: LLVM :: CodeGen/AArch64/fast-isel-vret.ll (17887 of 34304)
PASS: LLVM :: CodeGen/AMDGPU/hsa-metadata-invalid-ocl-version-2-v3.ll (17888 of 34304)
PASS: LLVM :: tools/llvm-profdata/weight-sample.test (17889 of 34304)
PASS: LLVM :: CodeGen/AMDGPU/insert-skips-flat-vmem.mir (17890 of 34304)
PASS: LLVM :: CodeGen/PowerPC/testComparesineuc.ll (17891 of 34304)
PASS: LLVM :: CodeGen/X86/pr32108.ll (17892 of 34304)
PASS: LLVM :: MC/PowerPC/ppc-machine.s (17893 of 34304)
PASS: LLVM :: CodeGen/X86/GC/badwriteproto.ll (17894 of 34304)
PASS: LLVM-Unit :: BinaryFormat/./BinaryFormatTests/MsgPackWriter.TestWriteArray32Min (17895 of 34304)
PASS: LLVM :: Transforms/SimplifyCFG/merge-cond-stores.ll (17896 of 34304)
PASS: LLVM-Unit :: Analysis/./AnalysisTests/IsBytewiseValueParamTests/IsBytewiseValueTest.IsBytewiseValue/36 (17897 of 34304)
PASS: LLVM :: CodeGen/AMDGPU/private-memory-atomics.ll (17898 of 34304)
PASS: LLVM :: CodeGen/PowerPC/inc-of-add.ll (17899 of 34304)
PASS: LLVM :: CodeGen/X86/x86-64-pic-12.ll (17900 of 34304)
PASS: LLVM :: CodeGen/X86/tailccfp.ll (17901 of 34304)
PASS: LLVM-Unit :: XRay/./XRayTests/Records/RoundTripTest/1.RoundTripsSingleValue (17902 of 34304)
PASS: LLVM :: CodeGen/ARM/GlobalISel/arm-call-lowering.ll (17903 of 34304)
PASS: LLVM :: CodeGen/X86/catchpad-lifetime.ll (17904 of 34304)
PASS: LLVM :: CodeGen/Hexagon/hexagon-cond-jumpr31.ll (17905 of 34304)
PASS: LLVM :: MC/MachO/symbols-1.s (17906 of 34304)
PASS: LLVM :: MC/AArch64/SVE/ld1rh-diagnostics.s (17907 of 34304)
PASS: LLVM-Unit :: Analysis/./AnalysisTests/ScalarEvolutionsTest.SCEVAddRecFromPHIwithLargeConstantAccum (17908 of 34304)
PASS: LLVM :: MC/AArch64/SVE2/whilewr-diagnostics.s (17909 of 34304)
PASS: LLVM :: CodeGen/Hexagon/split-muxii.ll (17910 of 34304)
PASS: LLVM :: CodeGen/SystemZ/vec-sub-01.ll (17911 of 34304)
PASS: LLVM :: tools/llvm-objdump/AMDGPU/source-lines.ll (17912 of 34304)
PASS: LLVM :: CodeGen/AMDGPU/no-shrink-extloads.ll (17913 of 34304)
PASS: LLVM :: CodeGen/SystemZ/vec-sub-02.ll (17914 of 34304)
PASS: LLVM :: MC/X86/CLFSH-32.s (17915 of 34304)
PASS: LLVM :: CodeGen/SystemZ/int-cmp-41.ll (17916 of 34304)
PASS: LLVM :: Transforms/SCCP/apint-basictest3.ll (17917 of 34304)
PASS: LLVM-Unit :: DebugInfo/DWARF/./DebugInfoDWARFTests/LineTableTestParams/DebugLineParameterisedFixture.ErrorForTooLargePrologueLength/3 (17918 of 34304)
PASS: LLVM :: CodeGen/AMDGPU/bug-vopc-commute.ll (17919 of 34304)
PASS: LLVM :: Transforms/Internalize/comdat.ll (17920 of 34304)
PASS: LLVM :: MC/Disassembler/AMDGPU/gfx10_mimg.txt (17921 of 34304)
PASS: LLVM :: CodeGen/X86/shift-logic.ll (17922 of 34304)
PASS: LLVM :: MC/MachO/tls.s (17923 of 34304)
PASS: LLVM :: Verifier/metadata-function-dbg.ll (17924 of 34304)
PASS: LLVM-Unit :: ADT/./ADTTests/FallibleIteratorTest.BasicSuccess (17925 of 34304)
PASS: LLVM-Unit :: ADT/./ADTTests/SmallVectorTest/4.AppendRepeatedNonForwardIterator (17926 of 34304)
PASS: LLVM :: CodeGen/X86/vector-fshr-128.ll (17927 of 34304)
PASS: LLVM :: CodeGen/AMDGPU/concat_vectors.ll (17928 of 34304)
PASS: LLVM :: CodeGen/X86/float-asmprint.ll (17929 of 34304)
PASS: LLVM :: Transforms/RewriteStatepointsForGC/base-pointers-13.ll (17930 of 34304)
PASS: LLVM :: CodeGen/X86/implicit-null-check.ll (17931 of 34304)
PASS: LLVM :: Analysis/CostModel/SystemZ/divrem-reg.ll (17932 of 34304)
PASS: LLVM :: MC/SystemZ/tokens.s (17933 of 34304)
PASS: LLVM-Unit :: BinaryFormat/./BinaryFormatTests/MsgPackDocument.TestReadMap (17934 of 34304)
PASS: LLVM :: CodeGen/ARM/cmp1-peephole-thumb.mir (17935 of 34304)
PASS: LLVM :: MC/AArch64/SVE2/stnt1w.s (17936 of 34304)
PASS: LLVM :: CodeGen/AArch64/arm64-build-vector.ll (17937 of 34304)
PASS: LLVM :: CodeGen/X86/store-empty-member.ll (17938 of 34304)
PASS: LLVM :: CodeGen/X86/pr34080.ll (17939 of 34304)
PASS: LLVM :: CodeGen/RISCV/imm.ll (17940 of 34304)
PASS: LLVM :: CodeGen/AArch64/GlobalISel/opt-shuffle-splat.mir (17941 of 34304)
PASS: LLVM :: CodeGen/AArch64/macho-global-symbols.ll (17942 of 34304)
PASS: LLVM :: Transforms/InstCombine/shift-by-signext.ll (17943 of 34304)
PASS: LLVM :: CodeGen/AArch64/fcvt_combine.ll (17944 of 34304)
PASS: LLVM :: Transforms/LoopVectorize/PowerPC/small-loop-rdx.ll (17945 of 34304)
PASS: LLVM :: DebugInfo/X86/fission-hash.ll (17946 of 34304)
PASS: LLVM :: ThinLTO/X86/index-const-prop-dead.ll (17947 of 34304)
PASS: LLVM :: Analysis/ValueTracking/known-nonnull-at.ll (17948 of 34304)
PASS: LLVM :: CodeGen/SystemZ/int-cmp-46.ll (17949 of 34304)
PASS: LLVM :: Analysis/CostModel/X86/strided-load-i32.ll (17950 of 34304)
PASS: LLVM :: CodeGen/X86/avx2-intrinsics-fast-isel.ll (17951 of 34304)
PASS: LLVM-Unit :: Support/./SupportTests/YAMLIO.TestReadBuiltInTypes (17952 of 34304)
PASS: LLVM :: DebugInfo/COFF/purge-typedef-udts.ll (17953 of 34304)
PASS: LLVM :: MC/AArch64/SVE2/sshllb-diagnostics.s (17954 of 34304)
PASS: LLVM :: CodeGen/Thumb2/LowOverheadLoops/basic-tail-pred.ll (17955 of 34304)
PASS: LLVM :: Transforms/LoopVectorize/simple-unroll.ll (17956 of 34304)
PASS: LLVM :: CodeGen/MIR/ARM/bundled-instructions.mir (17957 of 34304)
PASS: LLVM :: CodeGen/AMDGPU/GlobalISel/regbankselect-fma.mir (17958 of 34304)
PASS: LLVM :: Assembler/invalid-byval-type2.ll (17959 of 34304)
PASS: LLVM :: CodeGen/AMDGPU/llvm.amdgcn.raw.buffer.store.ll (17960 of 34304)
PASS: LLVM :: MC/PowerPC/ppc64-regs.s (17961 of 34304)
PASS: LLVM :: CodeGen/AArch64/GlobalISel/select-binop.mir (17962 of 34304)
PASS: LLVM :: CodeGen/AArch64/seh_funclet_x1.ll (17963 of 34304)
PASS: LLVM :: Object/ARM/nm-mapping-symbol.s (17964 of 34304)
PASS: LLVM :: MC/AArch64/SVE/incp-diagnostics.s (17965 of 34304)
PASS: LLVM :: CodeGen/X86/slow-incdec.ll (17966 of 34304)
PASS: LLVM :: MC/ARM/thumb-add-sub-width.s (17967 of 34304)
PASS: LLVM :: Object/archive-extract.test (17968 of 34304)
PASS: LLVM :: CodeGen/X86/GlobalISel/fadd-scalar.ll (17969 of 34304)
PASS: LLVM :: CodeGen/X86/packss.ll (17970 of 34304)
PASS: LLVM :: CodeGen/BPF/CORE/offset-reloc-pointer-1.ll (17971 of 34304)
PASS: LLVM :: CodeGen/Thumb2/LowOverheadLoops/revert-after-read.mir (17972 of 34304)
PASS: LLVM :: Transforms/SLPVectorizer/X86/cse.ll (17973 of 34304)
PASS: LLVM :: CodeGen/X86/ssp-guard-spill.ll (17974 of 34304)
PASS: LLVM :: MC/AArch64/SVE2/sqdmlalb.s (17975 of 34304)
PASS: LLVM :: CodeGen/AArch64/GlobalISel/legalize-fp-arith.mir (17976 of 34304)
PASS: LLVM :: Instrumentation/BoundsChecking/many-trap.ll (17977 of 34304)
PASS: LLVM :: Transforms/InstCombine/2008-01-27-FloatSelect.ll (17978 of 34304)
PASS: LLVM :: CodeGen/X86/vec_set-A.ll (17979 of 34304)
PASS: LLVM :: Transforms/ArgumentPromotion/profile.ll (17980 of 34304)
PASS: LLVM :: CodeGen/AMDGPU/GlobalISel/legalize-amdgcn.wavefrontsize.mir (17981 of 34304)
PASS: LLVM :: MC/ARM/vmov-vmvn-illegal-cases.s (17982 of 34304)
PASS: LLVM :: CodeGen/X86/attribute-sections.ll (17983 of 34304)
PASS: LLVM :: CodeGen/AMDGPU/GlobalISel/regbankselect-extract.mir (17984 of 34304)
PASS: LLVM :: Transforms/InstCombine/2006-12-23-Select-Cmp-Cmp.ll (17985 of 34304)
PASS: LLVM :: CodeGen/Hexagon/misched-top-rptracker-sync.ll (17986 of 34304)
PASS: LLVM :: CodeGen/X86/personality_size.ll (17987 of 34304)
PASS: LLVM-Unit :: ADT/./ADTTests/SmallVectorTest/4.EraseTest (17988 of 34304)
PASS: LLVM :: CodeGen/SystemZ/subregliveness-07.mir (17989 of 34304)
PASS: LLVM :: Other/X86/debugcounter-partiallyinlinelibcalls.ll (17990 of 34304)
PASS: LLVM :: CodeGen/ARM/machine-copyprop.mir (17991 of 34304)
PASS: LLVM :: Instrumentation/MemorySanitizer/atomics.ll (17992 of 34304)
PASS: LLVM :: MC/PowerPC/pr24686.s (17993 of 34304)
PASS: LLVM :: MC/AArch64/SVE2/uqrshrnt-diagnostics.s (17994 of 34304)
PASS: LLVM :: Analysis/BranchProbabilityInfo/pr22718.ll (17995 of 34304)
PASS: LLVM :: CodeGen/ARM/2011-04-11-MachineLICMBug.ll (17996 of 34304)
UNSUPPORTED: LLVM :: MC/AVR/inst-xch.s (17997 of 34304)
PASS: LLVM :: Analysis/DDG/basic-a.ll (17998 of 34304)
PASS: LLVM :: CodeGen/Mips/mips16_32_10.ll (17999 of 34304)
PASS: LLVM :: CodeGen/Hexagon/rdf-copy-undef.ll (18000 of 34304)
PASS: LLVM :: MC/ELF/cfi-remember.s (18001 of 34304)
PASS: LLVM :: CodeGen/Thumb/triple.ll (18002 of 34304)
PASS: LLVM :: YAMLParser/spec-07-04.test (18003 of 34304)
PASS: LLVM :: MC/Mips/mips-jump-pc-region.s (18004 of 34304)
PASS: LLVM :: Transforms/IndVarSimplify/const_phi.ll (18005 of 34304)
PASS: LLVM-Unit :: BinaryFormat/./BinaryFormatTests/MsgPackWriter.TestWriteUInt32Max (18006 of 34304)
PASS: LLVM :: CodeGen/PowerPC/mcm-4.ll (18007 of 34304)
PASS: LLVM :: CodeGen/AMDGPU/llvm.dbg.value.ll (18008 of 34304)
PASS: LLVM :: CodeGen/Hexagon/v6vect-dbl-spill.ll (18009 of 34304)
PASS: LLVM-Unit :: BinaryFormat/./BinaryFormatTests/MsgPackReader.TestReadStr8Max (18010 of 34304)
PASS: LLVM :: CodeGen/Thumb/select.ll (18011 of 34304)
PASS: LLVM :: tools/llvm-objdump/macho-bad-dysymtab.test (18012 of 34304)
PASS: LLVM :: CodeGen/PowerPC/bswap64.ll (18013 of 34304)
PASS: LLVM :: CodeGen/Hexagon/i8_VarArg.ll (18014 of 34304)
PASS: LLVM :: CodeGen/Thumb/fpconv.ll (18015 of 34304)
PASS: LLVM :: Other/2004-08-16-PackedSelect.ll (18016 of 34304)
PASS: LLVM :: CodeGen/AMDGPU/operand-spacing.ll (18017 of 34304)
PASS: LLVM :: CodeGen/SPARC/mult-alt-generic-sparc.ll (18018 of 34304)
PASS: LLVM :: Analysis/CostModel/ARM/cast.ll (18019 of 34304)
PASS: LLVM :: CodeGen/AArch64/arm64-named-reg-notareg.ll (18020 of 34304)
PASS: LLVM :: CodeGen/X86/GlobalISel/x86-legalize-sdiv.mir (18021 of 34304)
PASS: LLVM :: DebugInfo/MIR/Hexagon/live-debug-values-bundled-entry-values.mir (18022 of 34304)
PASS: LLVM :: Transforms/LoopVectorize/AArch64/pr36032.ll (18023 of 34304)
PASS: LLVM :: CodeGen/PowerPC/testComparesilesi.ll (18024 of 34304)
PASS: LLVM :: CodeGen/Hexagon/autohvx/minmax-64b.ll (18025 of 34304)
PASS: LLVM :: CodeGen/Hexagon/hwloop-ne.ll (18026 of 34304)
PASS: LLVM :: MC/AArch64/SVE/ld2d-diagnostics.s (18027 of 34304)
PASS: LLVM :: CodeGen/Thumb/stm-deprecated.ll (18028 of 34304)
PASS: LLVM :: CodeGen/PowerPC/func-addr-consts.ll (18029 of 34304)
PASS: LLVM :: CodeGen/X86/avoid-sfb-offset.mir (18030 of 34304)
PASS: LLVM :: CodeGen/Mips/micromips-sizereduction/micromips-xor16.ll (18031 of 34304)
PASS: LLVM :: MC/Hexagon/inst_xor.ll (18032 of 34304)
PASS: LLVM :: CodeGen/AArch64/bswap-known-bits.ll (18033 of 34304)
PASS: LLVM :: Transforms/SimplifyCFG/switch-on-const-select.ll (18034 of 34304)
PASS: LLVM :: CodeGen/AMDGPU/GlobalISel/legalize-and.mir (18035 of 34304)
PASS: LLVM :: CodeGen/WinEH/wineh-noret-cleanup.ll (18036 of 34304)
PASS: LLVM :: CodeGen/ARM/setcc-logic.ll (18037 of 34304)
PASS: LLVM :: MC/Disassembler/X86/invalid-VEX-vvvv.txt (18038 of 34304)
PASS: LLVM-Unit :: TextAPI/./TextAPITests/TBDv1.Platform_macOS (18039 of 34304)
PASS: LLVM :: Transforms/Mem2Reg/pr37632-unreachable-list-of-stores.ll (18040 of 34304)
PASS: LLVM :: MC/ELF/cfi-window-save.s (18041 of 34304)
PASS: LLVM :: CodeGen/PowerPC/vec_absd.ll (18042 of 34304)
PASS: LLVM :: CodeGen/SPARC/2011-01-11-Call.ll (18043 of 34304)
PASS: LLVM :: CodeGen/AArch64/cfguard-checks.ll (18044 of 34304)
PASS: LLVM :: MC/AArch64/SVE/brkpbs-diagnostics.s (18045 of 34304)
PASS: LLVM :: Bitcode/thinlto-alias2.ll (18046 of 34304)
PASS: LLVM :: CodeGen/PowerPC/2006-09-28-shift_64.ll (18047 of 34304)
PASS: LLVM :: CodeGen/X86/combine-sext-in-reg.ll (18048 of 34304)
PASS: LLVM :: Transforms/InstCombine/partally-redundant-left-shift-input-masking-after-truncation-variant-a.ll (18049 of 34304)
PASS: LLVM-Unit :: Support/./SupportTests/YAMLParser.ParsesEmptyArrayWithWhitespace (18050 of 34304)
PASS: LLVM :: CodeGen/Mips/o32_cc_byval.ll (18051 of 34304)
PASS: LLVM :: Linker/LinkOnce.ll (18052 of 34304)
PASS: LLVM-Unit :: ADT/./ADTTests/APFloatTest.neg (18053 of 34304)
PASS: LLVM :: CodeGen/X86/2006-10-12-CycleInDAG.ll (18054 of 34304)
PASS: LLVM :: Object/X86/irsymtab-asm.ll (18055 of 34304)
PASS: LLVM :: CodeGen/SystemZ/tls-04.ll (18056 of 34304)
PASS: LLVM :: Analysis/Delinearization/multidim_ivs_and_integer_offsets_nts_3d.ll (18057 of 34304)
PASS: LLVM :: Transforms/SimplifyCFG/preserve-load-metadata-2.ll (18058 of 34304)
PASS: LLVM :: CodeGen/AArch64/vec_cttz.ll (18059 of 34304)
PASS: LLVM :: CodeGen/Hexagon/addr-calc-opt.ll (18060 of 34304)
PASS: LLVM :: CodeGen/PowerPC/addi-reassoc.ll (18061 of 34304)
PASS: LLVM :: CodeGen/Thumb2/mve-vmaxv.ll (18062 of 34304)
PASS: LLVM :: CodeGen/X86/funnel-shift.ll (18063 of 34304)
PASS: LLVM-Unit :: Support/./SupportTests/CheckedArithmetic.CheckedMulAddSmall (18064 of 34304)
PASS: LLVM :: CodeGen/Hexagon/fpelim-basic.ll (18065 of 34304)
PASS: LLVM :: Transforms/SLPVectorizer/PowerPC/pr27897.ll (18066 of 34304)
PASS: LLVM :: CodeGen/ARM/fpcmp.ll (18067 of 34304)
PASS: LLVM :: CodeGen/Mips/GlobalISel/instruction-select/jump_table_and_brjt.mir (18068 of 34304)
PASS: LLVM :: CodeGen/ARM/ifcvt-callback.ll (18069 of 34304)
PASS: LLVM :: CodeGen/PowerPC/int-fp-conv-0.ll (18070 of 34304)
PASS: LLVM :: CodeGen/AArch64/postra-mi-sched.ll (18071 of 34304)
PASS: LLVM :: MC/AArch64/SVE/sunpklo.s (18072 of 34304)
PASS: LLVM :: CodeGen/X86/2012-07-15-vshl.ll (18073 of 34304)
PASS: LLVM :: CodeGen/Mips/mcount.ll (18074 of 34304)
UNSUPPORTED: LLVM :: tools/llvm-ar/case-detection.test (18075 of 34304)
PASS: LLVM :: MC/AArch64/SVE2/sqrshrnt.s (18076 of 34304)
PASS: LLVM :: CodeGen/Hexagon/v62-CJAllSlots.ll (18077 of 34304)
PASS: LLVM :: tools/llvm-objcopy/ELF/add-section.test (18078 of 34304)
PASS: LLVM :: Transforms/CorrelatedValuePropagation/shl.ll (18079 of 34304)
PASS: LLVM :: ExecutionEngine/MCJIT/2013-04-04-RelocAddend.ll (18080 of 34304)
PASS: LLVM :: Transforms/NaryReassociate/pr35710.ll (18081 of 34304)
PASS: LLVM-Unit :: ADT/./ADTTests/APIntTest.StringBitsNeeded2 (18082 of 34304)
PASS: LLVM :: CodeGen/AArch64/aarch64-insert-subvector-undef.ll (18083 of 34304)
PASS: LLVM-Unit :: ADT/./ADTTests/APFloatTest.PPCDoubleDoubleMultiply (18084 of 34304)
PASS: LLVM :: CodeGen/PowerPC/reloc-align.ll (18085 of 34304)
PASS: LLVM :: Transforms/LICM/strlen.ll (18086 of 34304)
PASS: LLVM :: MC/WebAssembly/event-section.ll (18087 of 34304)
PASS: LLVM :: MC/AArch64/SVE2/uqadd.s (18088 of 34304)
PASS: LLVM :: MC/AArch64/SVE2/saddwt-diagnostics.s (18089 of 34304)
PASS: LLVM :: CodeGen/X86/vfcmp.ll (18090 of 34304)
PASS: LLVM :: Transforms/LoopVectorize/non-const-n.ll (18091 of 34304)
PASS: LLVM :: Transforms/InstCombine/fmul.ll (18092 of 34304)
PASS: LLVM :: MC/MachO/ARM/compact-unwind-armv7k.s (18093 of 34304)
PASS: LLVM-Unit :: MC/./MCTests/TargetRegistry.TargetHasArchType (18094 of 34304)
PASS: LLVM :: CodeGen/RISCV/vararg.ll (18095 of 34304)
PASS: LLVM :: CodeGen/X86/x86-interleaved-access.ll (18096 of 34304)
PASS: LLVM :: ExecutionEngine/MCJIT/2003-08-23-RegisterAllocatePhysReg.ll (18097 of 34304)
PASS: LLVM :: CodeGen/AArch64/min-jump-table.ll (18098 of 34304)
PASS: LLVM :: CodeGen/X86/avx-win64.ll (18099 of 34304)
PASS: LLVM :: MC/AArch64/SVE2/uqshl-diagnostics.s (18100 of 34304)
PASS: LLVM :: CodeGen/ARM/GlobalISel/arm-isel-divmod.ll (18101 of 34304)
PASS: LLVM :: Transforms/InstCombine/select_arithmetic.ll (18102 of 34304)
PASS: LLVM :: MC/ELF/comdat.s (18103 of 34304)
PASS: LLVM-Unit :: ADT/./ADTTests/DenseSetTest.DoubleEntrySetTest (18104 of 34304)
PASS: LLVM-Unit :: ProfileData/./ProfileDataTests/ParameterizedCovMapTest/CoverageMappingTest.handle_consecutive_regions_with_zero_length/1 (18105 of 34304)
PASS: LLVM :: CodeGen/PowerPC/crypto_bifs.ll (18106 of 34304)
PASS: LLVM-Unit :: BinaryFormat/./BinaryFormatTests/MsgPackReader.TestReadBin16Max (18107 of 34304)
PASS: LLVM :: Other/loop-deletion-printer.ll (18108 of 34304)
PASS: LLVM-Unit :: IR/./IRTests/WaymarkTest.NativeArray (18109 of 34304)
PASS: LLVM-Unit :: IR/./IRTests/IRBuilderTest.UnaryOperators (18110 of 34304)
PASS: LLVM :: tools/llvm-objdump/malformed-unwind-x86_64.test (18111 of 34304)
PASS: LLVM :: CodeGen/AArch64/fast-isel-trunc.ll (18112 of 34304)
PASS: LLVM-Unit :: IR/./IRTests/ConstantRangeTest.UnionWith (18113 of 34304)
UNSUPPORTED: LLVM :: MC/ELF/nocompression.s (18114 of 34304)
PASS: LLVM :: tools/llvm-nm/wasm/imports.yaml (18115 of 34304)
PASS: LLVM :: CodeGen/SystemZ/memset-01.ll (18116 of 34304)
PASS: LLVM :: CodeGen/ARM/Windows/chkstk-no-stack-arg-probe.ll (18117 of 34304)
PASS: LLVM :: MC/ARM/neont2-reciprocal-encoding.s (18118 of 34304)
PASS: LLVM :: CodeGen/ARM/sched-it-debug-nodes.mir (18119 of 34304)
PASS: LLVM-Unit :: BinaryFormat/./BinaryFormatTests/MsgPackWriter.TestWriteFixMapMax (18120 of 34304)
PASS: LLVM :: MC/ARM/ldr-pseudo-cond-darwin.s (18121 of 34304)
PASS: LLVM :: MC/WebAssembly/func-address.ll (18122 of 34304)
PASS: LLVM :: CodeGen/Hexagon/hwloop-missed.ll (18123 of 34304)
PASS: LLVM :: CodeGen/Mips/mips64-libcall.ll (18124 of 34304)
PASS: LLVM :: MC/ARM/lsl-zero-errors.s (18125 of 34304)
PASS: LLVM :: tools/obj2yaml/verneed-section.yaml (18126 of 34304)
PASS: LLVM :: CodeGen/X86/rrlist-livereg-corrutpion.ll (18127 of 34304)
PASS: LLVM :: CodeGen/AArch64/sve-fp.ll (18128 of 34304)
PASS: LLVM :: Transforms/IndVarSimplify/loop_evaluate_3.ll (18129 of 34304)
PASS: LLVM :: MC/ELF/zero.s (18130 of 34304)
PASS: LLVM :: CodeGen/X86/dagcombine-cse.ll (18131 of 34304)
PASS: LLVM-Unit :: tools/llvm-exegesis/X86/./LLVMExegesisX86Tests/LatencySnippetGeneratorTest.ImplicitSelfDependencyThroughExplicitRegsForbidAll (18132 of 34304)
PASS: LLVM :: CodeGen/Mips/GlobalISel/llvm-ir/zextLoad_and_sextLoad.ll (18133 of 34304)
PASS: LLVM :: MC/ARM/it-nv.s (18134 of 34304)
PASS: LLVM :: CodeGen/ARM/GlobalISel/arm-instruction-select-cmp.mir (18135 of 34304)
PASS: LLVM :: Analysis/CostModel/X86/interleaved-load-float.ll (18136 of 34304)
PASS: LLVM-Unit :: ADT/./ADTTests/RangeAdapterRValueTest/3.TrivialOperation (18137 of 34304)
PASS: LLVM :: Transforms/SimplifyCFG/switch-to-select-two-case.ll (18138 of 34304)
PASS: LLVM-Unit :: ExecutionEngine/Orc/./OrcJITTests/DummyRPC.ReturnErrorSuccess (18139 of 34304)
PASS: LLVM-Unit :: DebugInfo/GSYM/./DebugInfoGSYMTests/GSYMTest.TestInlineInfoDecodeErrors (18140 of 34304)
PASS: LLVM :: CodeGen/ARM/constantpool-promote-ldrh.ll (18141 of 34304)
PASS: LLVM :: Transforms/GVNHoist/int_sideeffect.ll (18142 of 34304)
PASS: LLVM :: CodeGen/X86/debug-loclists.ll (18143 of 34304)
PASS: LLVM :: DebugInfo/cross-cu-scope.ll (18144 of 34304)
PASS: LLVM-Unit :: Support/./SupportTests/Support.PathIterator (18145 of 34304)
PASS: LLVM :: CodeGen/PowerPC/testComparesieqsll.ll (18146 of 34304)
PASS: LLVM :: Transforms/InstCombine/enforce-known-alignment.ll (18147 of 34304)
PASS: LLVM :: MC/Disassembler/ARM/armv8.2a-dotprod-a32.s (18148 of 34304)
PASS: LLVM :: Transforms/PGOProfile/switch.ll (18149 of 34304)
PASS: LLVM :: MC/AArch64/SVE2/smlalb-diagnostics.s (18150 of 34304)
PASS: LLVM :: Assembler/metadata-null-operands.ll (18151 of 34304)
PASS: LLVM :: MC/X86/x86-32-avx512vp2intersect-att.s (18152 of 34304)
PASS: LLVM-Unit :: IR/./IRTests/ConstantsTest.AsInstructionsTest (18153 of 34304)
PASS: LLVM :: CodeGen/AMDGPU/indirect-addressing-si-pregfx9.ll (18154 of 34304)
PASS: LLVM :: CodeGen/ARM/sincos.ll (18155 of 34304)
PASS: LLVM :: Transforms/GCOVProfiling/function-numbering.ll (18156 of 34304)
PASS: LLVM-Unit :: ExecutionEngine/Orc/./OrcJITTests/CoreAPIsStandardTest.AddDependencyOnFailedSymbol (18157 of 34304)
PASS: LLVM :: MC/Disassembler/Mips/msa/test_i5.txt (18158 of 34304)
PASS: LLVM :: DebugInfo/X86/this-stack_value.ll (18159 of 34304)
PASS: LLVM :: Transforms/SpeculativeExecution/spec.ll (18160 of 34304)
PASS: LLVM :: tools/llvm-readobj/arm64-many-epilogs.s (18161 of 34304)
PASS: LLVM :: tools/llvm-cov/ifdef.c (18162 of 34304)
PASS: LLVM :: Instrumentation/AddressSanitizer/ps4.ll (18163 of 34304)
PASS: LLVM :: CodeGen/Mips/GlobalISel/llvm-ir/phi.ll (18164 of 34304)
PASS: LLVM :: tools/llvm-mca/X86/BdVer2/partial-reg-update-3.s (18165 of 34304)
PASS: LLVM :: LTO/X86/list-symbols.ll (18166 of 34304)
PASS: LLVM :: CodeGen/AArch64/sve-masked-ldst-zext.ll (18167 of 34304)
PASS: LLVM :: Transforms/MemCpyOpt/aggregate-type-crash.ll (18168 of 34304)
PASS: LLVM :: CodeGen/X86/win64_alloca_dynalloca.ll (18169 of 34304)
PASS: LLVM :: CodeGen/X86/avx512vl_vnni-intrinsics.ll (18170 of 34304)
PASS: LLVM-Unit :: BinaryFormat/./BinaryFormatTests/MsgPackReader.TestReadFixPositiveInt (18171 of 34304)
PASS: LLVM :: Transforms/Float2Int/toolarge.ll (18172 of 34304)
PASS: LLVM :: Transforms/Inline/last-call-no-bonus.ll (18173 of 34304)
PASS: LLVM-Unit :: DebugInfo/DWARF/./DebugInfoDWARFTests/DebugLineBasicFixture.ParserIgnoresNonPrologueErrorsWhenSkipping (18174 of 34304)
PASS: LLVM :: CodeGen/Hexagon/vect/bit4x8.ll (18175 of 34304)
PASS: LLVM :: DebugInfo/MIR/X86/dbginfo-entryvals.mir (18176 of 34304)
PASS: LLVM :: Transforms/InstCombine/zext-bool-add-sub.ll (18177 of 34304)
PASS: LLVM-Unit :: ProfileData/./ProfileDataTests/MaybeSparse/MaybeSparseInstrProfTest.instr_prof_symtab_module_test/0 (18178 of 34304)
PASS: LLVM :: Analysis/MemorySSA/basicaa-memcpy.ll (18179 of 34304)
PASS: LLVM :: Transforms/SeparateConstOffsetFromGEP/NVPTX/split-gep.ll (18180 of 34304)
PASS: LLVM :: CodeGen/AArch64/GlobalISel/gisel-commandline-option.ll (18181 of 34304)
PASS: LLVM :: Transforms/InstCombine/default-alignment.ll (18182 of 34304)
PASS: LLVM-Unit :: Support/./SupportTests/AllocationTests/MappedMemoryTest.BasicWrite/4 (18183 of 34304)
PASS: LLVM :: CodeGen/Hexagon/hwloop-with-return-call.ll (18184 of 34304)
PASS: LLVM-Unit :: Transforms/Utils/./UtilsTests/ValueMapperTest.mapMetadataConstantAsMetadata (18185 of 34304)
PASS: LLVM :: CodeGen/BPF/CORE/offset-reloc-pointer-2.ll (18186 of 34304)
PASS: LLVM :: Transforms/NewGVN/pr32852.ll (18187 of 34304)
PASS: LLVM :: CodeGen/X86/allrem-moddi3.ll (18188 of 34304)
PASS: LLVM :: CodeGen/AMDGPU/wwm-reserved.ll (18189 of 34304)
PASS: LLVM :: CodeGen/X86/x86-64-pic-10.ll (18190 of 34304)
PASS: LLVM :: Verifier/memcpy.ll (18191 of 34304)
PASS: LLVM :: Transforms/LoopRotate/pr37205.ll (18192 of 34304)
PASS: LLVM-Unit :: ADT/./ADTTests/MapVectorTest.erase (18193 of 34304)
PASS: LLVM-Unit :: BinaryFormat/./BinaryFormatTests/MsgPackReader.TestReadExt16Max (18194 of 34304)
PASS: LLVM :: CodeGen/ARM/ifcvt-regmask-noreturn.ll (18195 of 34304)
PASS: LLVM :: CodeGen/AMDGPU/GlobalISel/inst-select-ashr.mir (18196 of 34304)
PASS: LLVM-Unit :: CodeGen/GlobalISel/./GlobalISelTests/GISelMITest.LowerSEXTINREG (18197 of 34304)
PASS: LLVM-Unit :: ADT/./ADTTests/StringRefTest.Find (18198 of 34304)
PASS: LLVM :: CodeGen/NVPTX/bug26185.ll (18199 of 34304)
PASS: LLVM :: MC/AArch64/SVE/eor.s (18200 of 34304)
PASS: LLVM-Unit :: tools/llvm-exegesis/X86/./LLVMExegesisX86Tests/Core2TargetTest.SetRegToGR8Value (18201 of 34304)
PASS: LLVM :: tools/llvm-strings/help.test (18202 of 34304)
PASS: LLVM :: Analysis/CostModel/X86/vector_gep.ll (18203 of 34304)
PASS: LLVM-Unit :: XRay/./XRayTests/Records/RoundTripTestV5/7.RoundTripsSingleValue (18204 of 34304)
PASS: LLVM :: Transforms/LCSSA/mixed-catch.ll (18205 of 34304)
PASS: LLVM :: CodeGen/Mips/instverify/dextm-size.mir (18206 of 34304)
PASS: LLVM :: CodeGen/BPF/basictest.ll (18207 of 34304)
PASS: LLVM :: CodeGen/X86/lea-opt-cse2.ll (18208 of 34304)
PASS: LLVM-Unit :: ADT/./ADTTests/DenseMapTest/5.SingleEntryMapTest (18209 of 34304)
PASS: LLVM :: CodeGen/X86/variadic-node-pic.ll (18210 of 34304)
PASS: LLVM :: Transforms/LowerConstantIntrinsics/objectsize_basic.ll (18211 of 34304)
PASS: LLVM :: tools/llvm-mca/X86/Atom/resources-x86_32.s (18212 of 34304)
PASS: LLVM :: Linker/only-needed-dtors1.ll (18213 of 34304)
PASS: LLVM :: CodeGen/NVPTX/bug22246.ll (18214 of 34304)
PASS: LLVM-Unit :: Analysis/./AnalysisTests/LazyCallGraphTest.BasicGraphMutation (18215 of 34304)
PASS: LLVM :: Transforms/LoopUnroll/ARM/mve-nounroll.ll (18216 of 34304)
PASS: LLVM :: MC/AArch64/SVE2/shrnb.s (18217 of 34304)
PASS: LLVM :: CodeGen/ARM/Windows/mov32t-bundling.ll (18218 of 34304)
PASS: LLVM :: Linker/2008-07-06-AliasWeakDest2.ll (18219 of 34304)
PASS: LLVM :: Assembler/thinlto-bad-summary2.ll (18220 of 34304)
PASS: LLVM :: DebugInfo/PowerPC/tls-fission.ll (18221 of 34304)
PASS: LLVM :: CodeGen/PowerPC/tailcall-string-rvo.ll (18222 of 34304)
PASS: LLVM :: MC/AMDGPU/gfx9-vop2be-literal.s (18223 of 34304)
PASS: LLVM :: CodeGen/Mips/2008-07-15-InternalConstant.ll (18224 of 34304)
PASS: LLVM :: Transforms/InstCombine/strcspn-2.ll (18225 of 34304)
PASS: LLVM :: MC/X86/SSE42-32.s (18226 of 34304)
PASS: LLVM :: MC/AMDGPU/s_endpgm.s (18227 of 34304)
PASS: LLVM :: Transforms/LoopLoadElim/type-mismatch.ll (18228 of 34304)
PASS: LLVM :: tools/llvm-mca/X86/SkylakeClient/resources-pclmul.s (18229 of 34304)
PASS: LLVM-Unit :: Support/./SupportTests/PCS_ConfigBuildAttr.testBuildAttr (18230 of 34304)
PASS: LLVM :: CodeGen/X86/GlobalISel/x86_64-legalize-urem.mir (18231 of 34304)
PASS: LLVM :: MC/Disassembler/AArch64/armv8.4a-vncr.txt (18232 of 34304)
PASS: LLVM :: Transforms/InstCombine/pr33689_same_bitwidth.ll (18233 of 34304)
PASS: LLVM :: CodeGen/AMDGPU/GlobalISel/regbankselect-amdgcn-s-buffer-load.mir (18234 of 34304)
PASS: LLVM-Unit :: ADT/./ADTTests/SimpleIListTest.eraseAndDispose (18235 of 34304)
PASS: LLVM :: MC/Mips/branch-pseudos.s (18236 of 34304)
PASS: LLVM-Unit :: ObjectYAML/./ObjectYAMLTests/yaml2ObjectFile.Errors (18237 of 34304)
PASS: LLVM :: CodeGen/Mips/msa/i5-c.ll (18238 of 34304)
PASS: LLVM :: MC/Disassembler/AArch64/armv8.4a-tlb.txt (18239 of 34304)
PASS: LLVM :: MC/AArch64/SVE2/saba-diagnostics.s (18240 of 34304)
PASS: LLVM :: CodeGen/X86/sjlj-shadow-stack-liveness.mir (18241 of 34304)
PASS: LLVM-Unit :: BinaryFormat/./BinaryFormatTests/MsgPackReader.TestReadBin8Max (18242 of 34304)
PASS: LLVM :: CodeGen/AArch64/GlobalISel/legalize-inttoptr-xfail-2.mir (18243 of 34304)
PASS: LLVM :: MC/Disassembler/ARM/neont-VST-reencoding.txt (18244 of 34304)
PASS: LLVM :: Analysis/MemorySSA/volatile-clobber.ll (18245 of 34304)
PASS: LLVM :: Transforms/Inline/externally_available.ll (18246 of 34304)
PASS: LLVM :: CodeGen/SystemZ/fp-strict-sub-01.ll (18247 of 34304)
PASS: LLVM :: CodeGen/Mips/GlobalISel/llvm-ir/zext_and_sext.ll (18248 of 34304)
PASS: LLVM :: CodeGen/MIR/Mips/memory-operands.mir (18249 of 34304)
PASS: LLVM :: CodeGen/AMDGPU/GlobalISel/regbankselect-phi.mir (18250 of 34304)
PASS: LLVM :: CodeGen/AArch64/GlobalISel/arm64-fallback.ll (18251 of 34304)
PASS: LLVM-Unit :: ADT/./ADTTests/DenseMapTest/4.AssignmentTest (18252 of 34304)
PASS: LLVM :: MC/AMDGPU/smem-err.s (18253 of 34304)
PASS: LLVM :: CodeGen/Mips/mulll.ll (18254 of 34304)
PASS: LLVM :: MC/ARM/fullfp16-neon-neg.s (18255 of 34304)
PASS: LLVM :: CodeGen/X86/2008-10-13-CoalescerBug.ll (18256 of 34304)
PASS: LLVM-Unit :: Support/./SupportTests/FormatVariadicTest.FormatError (18257 of 34304)
PASS: LLVM :: CodeGen/X86/tail-call-parameter-attrs-mismatch.ll (18258 of 34304)
PASS: LLVM :: Transforms/LoopUnroll/invalidate_right_loop.ll (18259 of 34304)
PASS: LLVM :: tools/llvm-objdump/X86/section-index.s (18260 of 34304)
PASS: LLVM :: CodeGen/Hexagon/store-imm-amode.ll (18261 of 34304)
PASS: LLVM :: CodeGen/NVPTX/i128-param.ll (18262 of 34304)
PASS: LLVM :: CodeGen/X86/loop-strength-reduce8.ll (18263 of 34304)
PASS: LLVM-Unit :: Linker/./LinkerTests/LinkModuleTest.NewCAPISuccess (18264 of 34304)
PASS: LLVM :: SafepointIRVerifier/unreachable-block-tolerant.ll (18265 of 34304)
PASS: LLVM :: CodeGen/PowerPC/vec_extract_p9_2.ll (18266 of 34304)
PASS: LLVM :: CodeGen/Thumb/scheduler-clone-cpsr-def.ll (18267 of 34304)
PASS: LLVM :: Transforms/CorrelatedValuePropagation/basic.ll (18268 of 34304)
PASS: LLVM :: CodeGen/X86/2008-04-16-ReMatBug.ll (18269 of 34304)
PASS: LLVM :: CodeGen/PowerPC/vec_conv_i8_to_fp32_elts.ll (18270 of 34304)
PASS: LLVM :: Transforms/FunctionAttrs/nounwind.ll (18271 of 34304)
PASS: LLVM :: CodeGen/X86/vector-shuffle-256-v16.ll (18272 of 34304)
PASS: LLVM-Unit :: XRay/./XRayTests/Records/RoundTripTest/6.RoundTripsSingleValue (18273 of 34304)
PASS: LLVM :: Transforms/FunctionAttrs/comdat-ipo.ll (18274 of 34304)
PASS: LLVM :: tools/llvm-size/unknown-format.test (18275 of 34304)
PASS: LLVM :: CodeGen/X86/vselect-avx.ll (18276 of 34304)
PASS: LLVM :: Transforms/SimpleLoopUnswitch/nontrivial-unswitch.ll (18277 of 34304)
PASS: LLVM :: Transforms/DeadArgElim/linkage.ll (18278 of 34304)
PASS: LLVM :: CodeGen/Mips/dsp-vec-load-store.ll (18279 of 34304)
PASS: LLVM :: CodeGen/X86/GlobalISel/legalize-sub-v256.mir (18280 of 34304)
PASS: LLVM :: Analysis/BasicAA/2003-09-19-LocalArgument.ll (18281 of 34304)
PASS: LLVM :: CodeGen/X86/merge_store_duplicated_loads.ll (18282 of 34304)
PASS: LLVM-Unit :: Target/AArch64/./AArch64Tests/StackOffset.Sub (18283 of 34304)
PASS: LLVM-Unit :: BinaryFormat/./BinaryFormatTests/MsgPackDocument.TestWriteInt (18284 of 34304)
PASS: LLVM-Unit :: Support/./SupportTests/ProgramEnvTest.TestExecuteNoWait (18285 of 34304)
PASS: LLVM :: Assembler/immarg-param-attribute.ll (18286 of 34304)
PASS: LLVM :: CodeGen/X86/x86-framelowering-trap.ll (18287 of 34304)
PASS: LLVM-Unit :: Analysis/./AnalysisTests/ScalarEvolutionsTest.SCEVZeroExtendExpr (18288 of 34304)
PASS: LLVM :: CodeGen/AArch64/arm64-stacksave.ll (18289 of 34304)
PASS: LLVM-Unit :: Support/./SupportTests/TrigramIndexTest.TooComplicatedRegex (18290 of 34304)
PASS: LLVM :: MC/RISCV/option-relax.s (18291 of 34304)
PASS: LLVM :: Transforms/LoopVectorize/2012-10-22-isconsec.ll (18292 of 34304)
PASS: LLVM :: CodeGen/ARM/sdiv-pow2-arm-size.ll (18293 of 34304)
PASS: LLVM :: MC/RISCV/rv64c-invalid.s (18294 of 34304)
PASS: LLVM :: Transforms/Inline/inline-assume.ll (18295 of 34304)
PASS: LLVM :: Linker/partial-type-refinement.ll (18296 of 34304)
PASS: LLVM-Unit :: ExecutionEngine/Orc/./OrcJITTests/DummyRPC.TestCallAsyncVoidString (18297 of 34304)
PASS: LLVM :: CodeGen/ARM/GlobalISel/arm-isel-globals-pic.ll (18298 of 34304)
PASS: LLVM :: Transforms/LoopDeletion/crashbc.ll (18299 of 34304)
PASS: LLVM :: DebugInfo/X86/gmlt.test (18300 of 34304)
PASS: LLVM :: DebugInfo/PDB/pdbdump-mergeids.test (18301 of 34304)
PASS: LLVM :: Analysis/BasicAA/phi-speculation.ll (18302 of 34304)
PASS: LLVM-Unit :: ADT/./ADTTests/ImmutableListTest.MultiElemIntListTest (18303 of 34304)
PASS: LLVM :: Transforms/PGOProfile/icp_invoke_nouse.ll (18304 of 34304)
PASS: LLVM :: CodeGen/X86/2010-01-08-Atomic64Bug.ll (18305 of 34304)
PASS: LLVM-Unit :: ADT/./ADTTests/OptionalTest.DeletingCopyAssignmentTest (18306 of 34304)
PASS: LLVM :: CodeGen/RISCV/mul.ll (18307 of 34304)
PASS: LLVM :: MC/AArch64/armv8.4a-actmon.s (18308 of 34304)
PASS: LLVM :: CodeGen/Thumb2/inlineasm.ll (18309 of 34304)
PASS: LLVM :: tools/obj2yaml/aix_xcoff_truncated_file_header.test (18310 of 34304)
PASS: LLVM :: CodeGen/Generic/pr2625.ll (18311 of 34304)
PASS: LLVM :: CodeGen/X86/fast-isel-bc.ll (18312 of 34304)
UNSUPPORTED: LLVM :: tools/sancov/not_covered_functions.test (18313 of 34304)
PASS: LLVM :: CodeGen/ARM/unaligned_load_store.ll (18314 of 34304)
PASS: LLVM :: Assembler/2008-01-11-VarargAttrs.ll (18315 of 34304)
PASS: LLVM :: CodeGen/ARM/vaba.ll (18316 of 34304)
PASS: LLVM :: CodeGen/X86/fast-isel-trunc-kill-subreg.ll (18317 of 34304)
PASS: LLVM-Unit :: DebugInfo/DWARF/./DebugInfoDWARFTests/DebugLineBasicFixture.ParserReportsPrologueErrorsInEachTableWhenSkipping (18318 of 34304)
PASS: LLVM :: Instrumentation/AddressSanitizer/global_metadata_windows.ll (18319 of 34304)
PASS: LLVM :: CodeGen/Hexagon/expand-vstorerw-undef.ll (18320 of 34304)
PASS: LLVM :: DebugInfo/X86/enum-fwd-decl.ll (18321 of 34304)
PASS: LLVM :: CodeGen/X86/GlobalISel/fconstant.ll (18322 of 34304)
PASS: LLVM :: MC/ARM/armv8.5a-sb-error-thumb.s (18323 of 34304)
PASS: LLVM :: CodeGen/Thumb2/2009-08-04-SubregLoweringBug3.ll (18324 of 34304)
PASS: LLVM :: ExecutionEngine/OrcLazy/basic-object-file-loading.ll (18325 of 34304)
PASS: LLVM-Unit :: ADT/./ADTTests/IntervalMapTest.Branched (18326 of 34304)
PASS: LLVM :: Transforms/CorrelatedValuePropagation/deopt.ll (18327 of 34304)
PASS: LLVM :: CodeGen/Hexagon/vect/vect-vaddb-1.ll (18328 of 34304)
PASS: LLVM :: CodeGen/X86/sse2-intrinsics-x86_64.ll (18329 of 34304)
PASS: LLVM :: CodeGen/AArch64/GlobalISel/legalize-extracts.mir (18330 of 34304)
PASS: LLVM-Unit :: ADT/./ADTTests/SmallMapVectorLargeTest.insert_pop (18331 of 34304)
PASS: LLVM :: Transforms/LoopUnroll/runtime-multiexit-heuristic.ll (18332 of 34304)
PASS: LLVM :: CodeGen/X86/fold-pcmpeqd-2.ll (18333 of 34304)
PASS: LLVM :: MC/AArch64/basic-pic.s (18334 of 34304)
PASS: LLVM-Unit :: ExecutionEngine/Orc/./OrcJITTests/ThreadSafeModuleTest.ContextOwnershipSharedWithClient (18335 of 34304)
PASS: LLVM :: Analysis/CostModel/X86/shuffle-broadcast.ll (18336 of 34304)
PASS: LLVM :: MC/PowerPC/ppc64-encoding-4xx.s (18337 of 34304)
PASS: LLVM :: CodeGen/Hexagon/intrinsics/xtype_alu.ll (18338 of 34304)
PASS: LLVM :: Instrumentation/BoundsChecking/simple-32.ll (18339 of 34304)
PASS: LLVM :: CodeGen/PowerPC/fp128-bitcast-after-operation.ll (18340 of 34304)
PASS: LLVM :: Transforms/LICM/2007-07-30-AliasSet.ll (18341 of 34304)
PASS: LLVM-Unit :: DebugInfo/DWARF/./DebugInfoDWARFTests/DWARFDebugInfo.TestDWARF32Version3Addr8Children (18342 of 34304)
PASS: LLVM :: FileCheck/numeric-expression.txt (18343 of 34304)
PASS: LLVM :: Transforms/LoopUnswitch/2011-06-02-CritSwitch.ll (18344 of 34304)
PASS: LLVM :: CodeGen/X86/visibility.ll (18345 of 34304)
PASS: LLVM :: CodeGen/Hexagon/M4_mpyri_addi_global.ll (18346 of 34304)
PASS: LLVM :: Transforms/LoopUnroll/AMDGPU/unroll-barrier.ll (18347 of 34304)
PASS: LLVM :: CodeGen/Hexagon/opt-glob-addrs-000.ll (18348 of 34304)
PASS: LLVM :: Transforms/InstCombine/invariant.group.ll (18349 of 34304)
PASS: LLVM :: CodeGen/X86/smul_fix_sat_constants.ll (18350 of 34304)
PASS: LLVM :: CodeGen/AMDGPU/GlobalISel/regbankselect-smax.mir (18351 of 34304)
PASS: LLVM :: Transforms/InstCombine/load_combine_aa.ll (18352 of 34304)
PASS: LLVM :: CodeGen/X86/hoist-spill.ll (18353 of 34304)
PASS: LLVM :: ThinLTO/X86/index-const-prop.ll (18354 of 34304)
PASS: LLVM :: CodeGen/Thumb2/thumb2-ror.ll (18355 of 34304)
PASS: LLVM :: Analysis/MemorySSA/pr40749_2.ll (18356 of 34304)
PASS: LLVM :: CodeGen/X86/pic_jumptable.ll (18357 of 34304)
PASS: LLVM :: tools/llvm-mca/X86/SkylakeClient/resources-movbe.s (18358 of 34304)
PASS: LLVM :: CodeGen/SystemZ/int-move-01.ll (18359 of 34304)
PASS: LLVM :: CodeGen/AMDGPU/offset-split-flat.ll (18360 of 34304)
PASS: LLVM-Unit :: DebugInfo/DWARF/./DebugInfoDWARFTests/DebugLineBasicFixture.ParserReportsFirstErrorInEachTableWhenParsing (18361 of 34304)
PASS: LLVM-Unit :: TextAPI/./TextAPITests/TBDv3.Swift_5 (18362 of 34304)
PASS: LLVM :: Transforms/InstCombine/align-external.ll (18363 of 34304)
PASS: LLVM :: CodeGen/AMDGPU/preserve-hi16.ll (18364 of 34304)
PASS: LLVM-Unit :: Remarks/./RemarksTests/BitstreamRemarkSerializer.SeparateRemarkFileAll (18365 of 34304)
PASS: LLVM :: CodeGen/BPF/sdiv_error.ll (18366 of 34304)
PASS: LLVM :: DebugInfo/ARM/salvage-debug-info.ll (18367 of 34304)
PASS: LLVM :: Analysis/GlobalsModRef/inaccessiblememonly.ll (18368 of 34304)
PASS: LLVM :: CodeGen/X86/fast-isel-bail.ll (18369 of 34304)
PASS: LLVM-Unit :: IR/./IRTests/ValueHandle.WeakTrackingVH_BasicOperation (18370 of 34304)
PASS: LLVM :: Analysis/RegionInfo/condition_simple.ll (18371 of 34304)
PASS: LLVM :: CodeGen/AMDGPU/llvm.amdgcn.cos.ll (18372 of 34304)
PASS: LLVM :: CodeGen/ARM/Windows/dllexport.ll (18373 of 34304)
PASS: LLVM :: CodeGen/SystemZ/int-cmp-44.ll (18374 of 34304)
PASS: LLVM-Unit :: Transforms/Utils/./UtilsTests/CloneModule.CompileUnit (18375 of 34304)
PASS: LLVM :: CodeGen/X86/coalesce-dead-lanes.mir (18376 of 34304)
PASS: LLVM :: CodeGen/AMDGPU/rcp_iflag.ll (18377 of 34304)
PASS: LLVM-Unit :: CodeGen/./CodeGenTests/DIEHashTest.RefUnnamedType (18378 of 34304)
PASS: LLVM :: CodeGen/AMDGPU/llvm.amdgcn.softwqm.ll (18379 of 34304)
PASS: LLVM-Unit :: Support/./SupportTests/YAMLIO.MultilineStrings (18380 of 34304)
PASS: LLVM :: CodeGen/X86/avoid-loop-align-2.ll (18381 of 34304)
PASS: LLVM :: MC/Disassembler/ARM/thumb2-v8m.txt (18382 of 34304)
PASS: LLVM :: DebugInfo/Generic/discriminator.ll (18383 of 34304)
PASS: LLVM :: CodeGen/RISCV/inline-asm-i-constraint-i1.ll (18384 of 34304)
PASS: LLVM :: CodeGen/AMDGPU/mad24-get-global-id.ll (18385 of 34304)
PASS: LLVM :: CodeGen/BPF/objdump_atomics.ll (18386 of 34304)
PASS: LLVM :: CodeGen/X86/extractelement-load.ll (18387 of 34304)
PASS: LLVM :: DebugInfo/dwarfdump-zlib.test (18388 of 34304)
PASS: LLVM :: CodeGen/X86/extractelement-legalization-cycle.ll (18389 of 34304)
PASS: LLVM :: CodeGen/Hexagon/autohvx/isel-setcc-pair.ll (18390 of 34304)
PASS: LLVM :: Transforms/ScalarizeMaskedMemIntrin/X86/expand-masked-store.ll (18391 of 34304)
PASS: LLVM :: CodeGen/Hexagon/addh-shifted.ll (18392 of 34304)
PASS: LLVM :: CodeGen/AArch64/ldradr.ll (18393 of 34304)
PASS: LLVM :: CodeGen/AMDGPU/llvm.amdgcn.ds.append.ll (18394 of 34304)
PASS: LLVM :: Transforms/LoopStrengthReduce/AMDGPU/lsr-void.ll (18395 of 34304)
PASS: LLVM :: CodeGen/ARM/readonly-aliases.ll (18396 of 34304)
PASS: LLVM :: Verifier/statepoint.ll (18397 of 34304)
PASS: LLVM :: CodeGen/X86/fast-isel-select-sse.ll (18398 of 34304)
XFAIL: LLVM :: MC/Mips/relocation-xfail.s (18399 of 34304)
PASS: LLVM :: CodeGen/PowerPC/pr13641.ll (18400 of 34304)
XFAIL: LLVM :: MC/Disassembler/Mips/mips32r3/valid-xfail-mips32r3.txt (18401 of 34304)
PASS: LLVM :: CodeGen/X86/optimize-max-0.ll (18402 of 34304)
PASS: LLVM :: Transforms/IndVarSimplify/bec-cmp.ll (18403 of 34304)
PASS: LLVM-Unit :: Support/./SupportTests/OverflowTest/4.SubNoOverflow (18404 of 34304)
PASS: LLVM :: MC/ARM/mve-misc.s (18405 of 34304)
PASS: LLVM-Unit :: ADT/./ADTTests/TinyPtrVectorTest/2.CopyAndMoveTest (18406 of 34304)
PASS: LLVM :: MC/WebAssembly/compile-twice.ll (18407 of 34304)
PASS: LLVM-Unit :: ADT/./ADTTests/APFloatTest.PPCDoubleDoubleCompare (18408 of 34304)
PASS: LLVM :: CodeGen/AArch64/hoist-and-by-const-from-shl-in-eqcmp-zero.ll (18409 of 34304)
PASS: LLVM :: Transforms/PGOProfile/misexpect-branch-correct.ll (18410 of 34304)
PASS: LLVM :: CodeGen/Hexagon/loop-rotate-liveins.ll (18411 of 34304)
PASS: LLVM-Unit :: Support/./SupportTests/OverflowTest/4.SubOverflowToMax (18412 of 34304)
PASS: LLVM :: Transforms/LoopVectorize/demanded-bits-of-pointer-instruction.ll (18413 of 34304)
PASS: LLVM :: ThinLTO/X86/devirt_promote_legacy.ll (18414 of 34304)
PASS: LLVM-Unit :: Support/./SupportTests/getLinuxHostCPUName.AArch64 (18415 of 34304)
PASS: LLVM-Unit :: DebugInfo/DWARF/./DebugInfoDWARFTests/DWARFDebugInfo.TestErrorReportingPolicy (18416 of 34304)
PASS: LLVM :: CodeGen/X86/remarks-section.ll (18417 of 34304)
PASS: LLVM :: tools/llvm-xray/X86/convert-basic-log-arg1-version3-to-yaml.txt (18418 of 34304)
PASS: LLVM :: CodeGen/SystemZ/atomicrmw-minmax-04.ll (18419 of 34304)
PASS: LLVM :: tools/llvm-readobj/peplus.test (18420 of 34304)
PASS: LLVM :: CodeGen/PowerPC/zext-and-cmp.ll (18421 of 34304)
PASS: LLVM :: CodeGen/Mips/pbqp-reserved-physreg.ll (18422 of 34304)
UNSUPPORTED: LLVM :: tools/gold/X86/slp-vectorize.ll (18423 of 34304)
PASS: LLVM-Unit :: CodeGen/GlobalISel/./GlobalISelTests/LegalizerInfoTest.VectorRISC (18424 of 34304)
PASS: LLVM :: Object/archive-thin-create.test (18425 of 34304)
PASS: LLVM :: MC/X86/intel-syntax-x86-64-avx512f_vl.s (18426 of 34304)
PASS: LLVM :: CodeGen/X86/sse-align-4.ll (18427 of 34304)
PASS: LLVM :: MC/AArch64/SVE/facle-diagnostics.s (18428 of 34304)
PASS: LLVM-Unit :: Support/./SupportTests/BinaryStreamTest.StreamWriterBounds (18429 of 34304)
PASS: LLVM :: CodeGen/PowerPC/popcnt.ll (18430 of 34304)
PASS: LLVM :: Instrumentation/InstrProfiling/always_inline.ll (18431 of 34304)
PASS: LLVM :: CodeGen/SystemZ/fp-move-10.ll (18432 of 34304)
PASS: LLVM :: CodeGen/PowerPC/vec_conv_fp64_to_i8_elts.ll (18433 of 34304)
PASS: LLVM :: Transforms/SampleProfile/gcc-simple.ll (18434 of 34304)
PASS: LLVM :: Transforms/InstCombine/apint-cast-and-cast.ll (18435 of 34304)
PASS: LLVM :: CodeGen/Hexagon/rdf-multiple-phis-up.ll (18436 of 34304)
PASS: LLVM :: CodeGen/ARM/2009-09-13-InvalidSubreg.ll (18437 of 34304)
PASS: LLVM :: ExecutionEngine/RuntimeDyld/PowerPC/ppc32_elf_rel_addr16.s (18438 of 34304)
PASS: LLVM :: Transforms/LoadStoreVectorizer/AMDGPU/merge-stores.ll (18439 of 34304)
PASS: LLVM :: Assembler/extractvalue-invalid-idx.ll (18440 of 34304)
PASS: LLVM :: Transforms/LoopSimplifyCFG/lcssa.ll (18441 of 34304)
PASS: LLVM-Unit :: Linker/./LinkerTests/LinkModuleTest.EmptyModule (18442 of 34304)
PASS: LLVM :: CodeGen/Mips/GlobalISel/instruction-select/truncStore_and_aExtLoad.mir (18443 of 34304)
PASS: LLVM :: Transforms/LICM/explicit_guards.ll (18444 of 34304)
PASS: LLVM :: DebugInfo/SystemZ/eh_frame_personality.ll (18445 of 34304)
PASS: LLVM :: Transforms/InstCombine/trunc-load.ll (18446 of 34304)
PASS: LLVM :: Transforms/MergeFunc/gep-base-type.ll (18447 of 34304)
PASS: LLVM-Unit :: DebugInfo/MSF/./DebugInfoMSFTests/MappedBlockStreamTest.ReadOntoNonEmptyBuffer (18448 of 34304)
PASS: LLVM-Unit :: Support/./SupportTests/FileSystemTest.readNativeFileSlice (18449 of 34304)
PASS: LLVM :: MC/AArch64/SVE2/sqdmlalbt-diagnostics.s (18450 of 34304)
PASS: LLVM :: Transforms/InstCombine/xor-icmps.ll (18451 of 34304)
PASS: LLVM :: Transforms/SLPVectorizer/X86/schedule_budget.ll (18452 of 34304)
PASS: LLVM :: MC/AArch64/SVE2/ext.s (18453 of 34304)
PASS: LLVM :: CodeGen/PowerPC/stacksize.ll (18454 of 34304)
PASS: LLVM :: Transforms/LoopVectorize/X86/tail_folding_and_assume_safety.ll (18455 of 34304)
PASS: LLVM :: CodeGen/BPF/objdump_cond_op.ll (18456 of 34304)
PASS: LLVM :: tools/yaml2obj/local-symbols.yaml (18457 of 34304)
PASS: LLVM :: CodeGen/PowerPC/vec_mul_even_odd.ll (18458 of 34304)
PASS: LLVM :: CodeGen/Generic/hello.ll (18459 of 34304)
PASS: LLVM :: CodeGen/Thumb2/LowOverheadLoops/massive.mir (18460 of 34304)
PASS: LLVM :: CodeGen/X86/mul-constant-i8.ll (18461 of 34304)
PASS: LLVM :: CodeGen/SystemZ/args-09.ll (18462 of 34304)
UNSUPPORTED: LLVM :: CodeGen/SystemZ/Large/branch-range-09.py (18463 of 34304)
PASS: LLVM :: CodeGen/Thumb2/mve-pred-bitcast.ll (18464 of 34304)
PASS: LLVM :: tools/llvm-mca/X86/Generic/resources-xop.s (18465 of 34304)
PASS: LLVM :: MC/ELF/alias.s (18466 of 34304)
PASS: LLVM :: Analysis/ScalarEvolution/sext-to-zext.ll (18467 of 34304)
PASS: LLVM :: CodeGen/X86/mem-promote-integers.ll (18468 of 34304)
PASS: LLVM :: Demangle/ms-back-references.test (18469 of 34304)
PASS: LLVM :: CodeGen/PowerPC/store-load-fwd.ll (18470 of 34304)
PASS: LLVM :: CodeGen/X86/vector-fshl-512.ll (18471 of 34304)
PASS: LLVM-Unit :: Object/./ObjectTests/MinidumpFile.getSystemInfo (18472 of 34304)
PASS: LLVM :: MC/AArch64/SVE/cnth.s (18473 of 34304)
PASS: LLVM-Unit :: Support/./SupportTests/AllocatorTest.TestOverflow (18474 of 34304)
PASS: LLVM :: MC/ARM/thumbv8m.s (18475 of 34304)
PASS: LLVM :: MC/ARM/not-armv4.s (18476 of 34304)
PASS: LLVM :: Transforms/InstCombine/gep-sext.ll (18477 of 34304)
PASS: LLVM :: MC/AArch64/SVE2/ursra-diagnostics.s (18478 of 34304)
PASS: LLVM :: CodeGen/MIR/AMDGPU/mfi-parse-error-scratch-wave-offset-reg.mir (18479 of 34304)
PASS: LLVM :: MC/Hexagon/v62_jumps.s (18480 of 34304)
PASS: LLVM :: CodeGen/Hexagon/peephole-move-phi.ll (18481 of 34304)
PASS: LLVM :: CodeGen/AArch64/wrong_debug_loc_after_regalloc.ll (18482 of 34304)
PASS: LLVM :: tools/llvm-objcopy/ELF/remove-multiple-sections.test (18483 of 34304)
PASS: LLVM :: CodeGen/RISCV/fp128.ll (18484 of 34304)
PASS: LLVM :: MC/AArch64/SVE/not.s (18485 of 34304)
PASS: LLVM :: Transforms/InstCombine/icmp-sub.ll (18486 of 34304)
PASS: LLVM :: MC/AArch64/SVE/st3d-diagnostics.s (18487 of 34304)
PASS: LLVM-Unit :: tools/llvm-cfi-verify/./CFIVerifyTests/BasicGraphBuilderTest.BuildFlowGraphTestSinglePathFallthroughUd2 (18488 of 34304)
PASS: LLVM :: CodeGen/BPF/BTF/uint.ll (18489 of 34304)
PASS: LLVM :: Transforms/InstCombine/memmove_chk-2.ll (18490 of 34304)
PASS: LLVM-Unit :: ProfileData/./ProfileDataTests/ParameterizedCovMapTest/CoverageMappingTest.skip_duplicate_function_record/3 (18491 of 34304)
PASS: LLVM :: CodeGen/X86/use-add-flags.ll (18492 of 34304)
PASS: LLVM :: Transforms/InstCombine/2007-06-06-AshrSignBit.ll (18493 of 34304)
PASS: LLVM :: CodeGen/SystemZ/fp-const-02.ll (18494 of 34304)
PASS: LLVM-Unit :: Support/./SupportTests/raw_pwrite_ostreamTest.TestSVector (18495 of 34304)
PASS: LLVM :: CodeGen/ARM/arm-frameaddr.ll (18496 of 34304)
PASS: LLVM-Unit :: Support/./SupportTests/DataExtractorTest.SignedNumbers (18497 of 34304)
PASS: LLVM :: Analysis/RegionInfo/infinite_loop_2.ll (18498 of 34304)
PASS: LLVM :: CodeGen/PowerPC/vec_conv_fp_to_i_8byte_elts.ll (18499 of 34304)
PASS: LLVM :: Transforms/ObjCARC/expand.ll (18500 of 34304)
PASS: LLVM :: tools/llvm-cxxmap/incomplete.test (18501 of 34304)
PASS: LLVM :: CodeGen/RISCV/inline-asm-d-constraint-f.ll (18502 of 34304)
PASS: LLVM :: CodeGen/ARM/clang-section.ll (18503 of 34304)
PASS: LLVM-Unit :: DebugInfo/MSF/./DebugInfoMSFTests/MSFBuilderTest.TestShrinkStreamWithBlockDecrease (18504 of 34304)
PASS: LLVM :: CodeGen/AMDGPU/fabs.f64.ll (18505 of 34304)
PASS: LLVM :: CodeGen/X86/lea-2.ll (18506 of 34304)
PASS: LLVM-Unit :: ExecutionEngine/Orc/./OrcJITTests/LegacyRTDyldObjectLinkingLayerExecutionTest.TestNotifyLoadedSignature (18507 of 34304)
PASS: LLVM :: CodeGen/X86/2007-08-10-SignExtSubreg.ll (18508 of 34304)
PASS: LLVM :: CodeGen/X86/shuffle-extract-subvector.ll (18509 of 34304)
PASS: LLVM :: CodeGen/X86/fma.ll (18510 of 34304)
PASS: LLVM :: CodeGen/X86/avx512dqvl-intrinsics.ll (18511 of 34304)
PASS: LLVM :: CodeGen/SPARC/disable-fsmuld-fmuls.ll (18512 of 34304)
PASS: LLVM :: CodeGen/AMDGPU/GlobalISel/regbankselect-atomicrmw-and.mir (18513 of 34304)
PASS: LLVM :: CodeGen/AMDGPU/GlobalISel/inst-select-amdgpu-atomic-cmpxchg-flat.mir (18514 of 34304)
PASS: LLVM :: Instrumentation/AddressSanitizer/experiment-call.ll (18515 of 34304)
PASS: LLVM :: Transforms/SCCP/apint-array.ll (18516 of 34304)
PASS: LLVM :: CodeGen/X86/avx2-vperm.ll (18517 of 34304)
PASS: LLVM :: tools/llvm-readobj/ARM/attribute-0.s (18518 of 34304)
PASS: LLVM :: CodeGen/AArch64/GlobalISel/legalize-sext.mir (18519 of 34304)
PASS: LLVM-Unit :: ExecutionEngine/Orc/./OrcJITTests/DummyRPC.TestWithAltCustomType (18520 of 34304)
PASS: LLVM-Unit :: IR/./IRTests/DITemplateTypeParameterTest.get (18521 of 34304)
PASS: LLVM :: CodeGen/Hexagon/hx_V6_lo_hi.ll (18522 of 34304)
PASS: LLVM :: CodeGen/AMDGPU/shrink-vop3-carry-out.mir (18523 of 34304)
PASS: LLVM :: Transforms/InstCombine/srem-canonicalize.ll (18524 of 34304)
PASS: LLVM :: CodeGen/Mips/thread-pointer.ll (18525 of 34304)
PASS: LLVM-Unit :: ADT/./ADTTests/DenseSetTest/1.EmptyInitializerList (18526 of 34304)
PASS: LLVM :: CodeGen/AMDGPU/llvm.amdgcn.udot8.ll (18527 of 34304)
PASS: LLVM :: MC/Mips/elf-gprel-32-64.s (18528 of 34304)
PASS: LLVM :: CodeGen/X86/shift-avx2-crash.ll (18529 of 34304)
PASS: LLVM :: CodeGen/Mips/msa/3r_4r_widen.ll (18530 of 34304)
PASS: LLVM :: CodeGen/X86/tailcall-multiret.ll (18531 of 34304)
PASS: LLVM :: CodeGen/Mips/mbrsize4a.ll (18532 of 34304)
PASS: LLVM :: CodeGen/Hexagon/SUnit-boundary-prob.ll (18533 of 34304)
PASS: LLVM :: CodeGen/Mips/GlobalISel/llvm-ir/fsqrt_vec_builtin.ll (18534 of 34304)
PASS: LLVM :: tools/yaml2obj/dynsymtab-shlink.yaml (18535 of 34304)
PASS: LLVM :: MC/ARM/arm_instructions.s (18536 of 34304)
PASS: LLVM :: MC/AArch64/SVE2/addhnt.s (18537 of 34304)
PASS: LLVM :: CodeGen/MIR/AArch64/parse-shufflemask-invalid0.mir (18538 of 34304)
PASS: LLVM :: CodeGen/ARM/undef-sext.ll (18539 of 34304)
PASS: LLVM :: CodeGen/X86/inline-asm-flag-clobber.ll (18540 of 34304)
PASS: LLVM :: Transforms/Inline/monster_scc.ll (18541 of 34304)
PASS: LLVM :: FileCheck/validate-check-prefix.txt (18542 of 34304)
PASS: LLVM :: CodeGen/PowerPC/dbg.ll (18543 of 34304)
PASS: LLVM :: CodeGen/Generic/2006-06-28-SimplifySetCCCrash.ll (18544 of 34304)
PASS: LLVM :: CodeGen/SystemZ/vec-move-12.ll (18545 of 34304)
PASS: LLVM :: CodeGen/AArch64/arm64-movi.ll (18546 of 34304)
PASS: LLVM :: Transforms/LoopStrengthReduce/X86/2008-08-14-ShadowIV.ll (18547 of 34304)
PASS: LLVM :: CodeGen/AMDGPU/store-private.ll (18548 of 34304)
PASS: LLVM :: CodeGen/X86/GlobalISel/select-br.mir (18549 of 34304)
PASS: LLVM :: CodeGen/RISCV/rv64f-float-convert.ll (18550 of 34304)
PASS: LLVM :: CodeGen/X86/2008-10-17-Asm64bitRConstraint.ll (18551 of 34304)
PASS: LLVM :: CodeGen/Thumb2/LowOverheadLoops/mov-after-dls.mir (18552 of 34304)
UNSUPPORTED: LLVM :: CodeGen/AVR/pseudo/SEXT.mir (18553 of 34304)
PASS: LLVM :: CodeGen/X86/undef-globals-bss.ll (18554 of 34304)
PASS: LLVM :: CodeGen/X86/fixup-bw-inst.ll (18555 of 34304)
PASS: LLVM :: CodeGen/AArch64/arm64-vsub.ll (18556 of 34304)
PASS: LLVM :: CodeGen/SystemZ/branch-09.ll (18557 of 34304)
PASS: LLVM :: CodeGen/X86/branchfolding-catchpads.ll (18558 of 34304)
PASS: LLVM :: Transforms/LoopUnroll/full-unroll-keep-first-exit.ll (18559 of 34304)
PASS: LLVM :: CodeGen/AMDGPU/dpp_combine.mir (18560 of 34304)
PASS: LLVM :: MC/Disassembler/ARM/neon.txt (18561 of 34304)
PASS: LLVM :: CodeGen/Generic/2008-02-25-NegateZero.ll (18562 of 34304)
PASS: LLVM :: MC/Disassembler/AMDGPU/vop3_vi.txt (18563 of 34304)
PASS: LLVM-Unit :: DebugInfo/DWARF/./DebugInfoDWARFTests/DWARFDebugInfo.TestDWARF32Version2Addr8Children (18564 of 34304)
PASS: LLVM :: CodeGen/AArch64/arm64-2012-01-11-ComparisonDAGCrash.ll (18565 of 34304)
PASS: LLVM :: MC/ARM/directive-arch-armv6k.s (18566 of 34304)
PASS: LLVM :: CodeGen/AMDGPU/fdiv.f64.ll (18567 of 34304)
PASS: LLVM :: Transforms/InstCombine/2004-09-20-BadLoadCombine2.ll (18568 of 34304)
PASS: LLVM :: MC/Hexagon/relocations.s (18569 of 34304)
PASS: LLVM :: Transforms/IndVarSimplify/2007-01-06-TripCount.ll (18570 of 34304)
PASS: LLVM :: MC/PowerPC/ppc64-encoding-6xx.s (18571 of 34304)
PASS: LLVM :: Analysis/Delinearization/type_mismatch.ll (18572 of 34304)
PASS: LLVM-Unit :: ADT/./ADTTests/DenseMapTest/1.EraseTest (18573 of 34304)
PASS: LLVM :: CodeGen/Hexagon/packetize-load-store-aliasing.mir (18574 of 34304)
PASS: LLVM-Unit :: ExecutionEngine/Orc/./OrcJITTests/CoreAPIsStandardTest.TestBasicAliases (18575 of 34304)
PASS: LLVM :: CodeGen/X86/2006-05-17-VectorArg.ll (18576 of 34304)
PASS: LLVM :: CodeGen/Mips/GlobalISel/llvm-ir/fabs_vec_builtin.ll (18577 of 34304)
PASS: LLVM :: CodeGen/AArch64/fcvt-fixed.ll (18578 of 34304)
PASS: LLVM :: CodeGen/Hexagon/swp-matmul-bitext.ll (18579 of 34304)
PASS: LLVM :: CodeGen/AMDGPU/GlobalISel/regbankselect-amdgcn.image.sample.1d.ll (18580 of 34304)
PASS: LLVM :: tools/llvm-mca/X86/invalid-empty-file.s (18581 of 34304)
PASS: LLVM :: CodeGen/Mips/inlineasm-opcode-bad-y.ll (18582 of 34304)
PASS: LLVM :: MC/ARM/directive-fpu.s (18583 of 34304)
PASS: LLVM :: Transforms/InstCombine/cos-2.ll (18584 of 34304)
PASS: LLVM :: CodeGen/X86/fp-cvt.ll (18585 of 34304)
PASS: LLVM :: Bitcode/upgrade-debug-info-for-profiling.ll (18586 of 34304)
PASS: LLVM :: CodeGen/AMDGPU/GlobalISel/inst-select-anyext.mir (18587 of 34304)
PASS: LLVM-Unit :: Analysis/./AnalysisTests/VectorUtilsTest.getSplatValueElt0 (18588 of 34304)
PASS: LLVM :: CodeGen/AArch64/dp-3source.ll (18589 of 34304)
PASS: LLVM :: Transforms/EarlyCSE/const-speculation.ll (18590 of 34304)
PASS: LLVM-Unit :: ProfileData/./ProfileDataTests/ParameterizedCovMapTest/CoverageMappingTest.strip_filename_prefix/2 (18591 of 34304)
Cannot contact green-dragon-23: hudson.remoting.RequestAbortedException: java.io.IOException: Unexpected termination of the channel
PASS: LLVM :: CodeGen/PowerPC/debuginfo-split-int.ll (18592 of 34304)
PASS: LLVM :: CodeGen/PowerPC/testComparesllgeui.ll (18593 of 34304)
PASS: LLVM :: CodeGen/X86/shift-amount-mod.ll (18594 of 34304)
PASS: LLVM :: Transforms/ConstProp/loads.ll (18595 of 34304)
PASS: LLVM-Unit :: Support/./SupportTests/YAMLIO.TestSequenceDocListWriteAndRead (18596 of 34304)
PASS: LLVM-Unit :: ADT/./ADTTests/MapVectorTest.NonCopyable (18597 of 34304)
PASS: LLVM :: CodeGen/AMDGPU/GlobalISel/legalize-fabs.mir (18598 of 34304)
PASS: LLVM :: DebugInfo/X86/dw_op_minus_direct.ll (18599 of 34304)
PASS: LLVM :: CodeGen/X86/xray-empty-firstmbb.mir (18600 of 34304)
PASS: LLVM :: Transforms/EarlyCSE/read-reg.ll (18601 of 34304)
PASS: LLVM :: CodeGen/ARM/2009-06-02-ISelCrash.ll (18602 of 34304)
PASS: LLVM :: MC/AArch64/armv8.4a-vncr.s (18603 of 34304)
PASS: LLVM-Unit :: ADT/./ADTTests/SmallVectorTest/4.AppendTest (18604 of 34304)
PASS: LLVM :: tools/llvm-mca/X86/BdVer2/partial-reg-update.s (18605 of 34304)
PASS: LLVM :: CodeGen/X86/cpus-intel.ll (18606 of 34304)
PASS: LLVM :: CodeGen/AMDGPU/uniform-cfg.ll (18607 of 34304)
PASS: LLVM :: CodeGen/X86/movfs.ll (18608 of 34304)
PASS: LLVM :: Transforms/LowerExpectIntrinsic/PR33346.ll (18609 of 34304)
PASS: LLVM :: tools/llvm-dwarfdump/X86/verify_no_linkage_name.s (18610 of 34304)
PASS: LLVM :: CodeGen/PowerPC/2007-10-21-LocalRegAllocAssert.ll (18611 of 34304)
PASS: LLVM :: CodeGen/ARM/arm-shrink-wrapping-linux.ll (18612 of 34304)
PASS: LLVM :: DebugInfo/PDB/pdbdump-write.test (18613 of 34304)
PASS: LLVM-Unit :: Support/./SupportTests/MathExtras.MinAlign (18614 of 34304)
PASS: LLVM :: MC/Disassembler/Mips/msa/test_elm_msa64.txt (18615 of 34304)
PASS: LLVM :: Transforms/ConstProp/div-zero.ll (18616 of 34304)
PASS: LLVM :: CodeGen/AMDGPU/lds-size.ll (18617 of 34304)
PASS: LLVM :: CodeGen/ARM/vst2.ll (18618 of 34304)
PASS: LLVM :: Transforms/InstCombine/fma.ll (18619 of 34304)
PASS: LLVM :: Transforms/Coroutines/coro-split-00.ll (18620 of 34304)
PASS: LLVM :: CodeGen/AMDGPU/llvm.amdgcn.struct.buffer.store.format.ll (18621 of 34304)
PASS: LLVM :: Transforms/InstCombine/AMDGPU/amdgcn-demanded-vector-elts.ll (18622 of 34304)
PASS: LLVM :: CodeGen/Mips/sll2.ll (18623 of 34304)
PASS: LLVM :: MC/AArch64/SVE/sxtb.s (18624 of 34304)
PASS: LLVM :: Analysis/CallGraph/do-nothing-intrinsic.ll (18625 of 34304)
PASS: LLVM :: CodeGen/X86/horizontal-reduce-smax.ll (18626 of 34304)
PASS: LLVM-Unit :: Transforms/Utils/./UtilsTests/CloneModule.GlobalDebugInfo (18627 of 34304)
PASS: LLVM :: Linker/opaque.ll (18628 of 34304)
PASS: LLVM :: MC/RISCV/rvf-user-csr-names.s (18629 of 34304)
PASS: LLVM :: CodeGen/X86/inline-asm-avx-v-constraint.ll (18630 of 34304)
PASS: LLVM :: MC/AArch64/SVE/asrr-diagnostics.s (18631 of 34304)
PASS: LLVM :: CodeGen/RISCV/inline-asm.ll (18632 of 34304)
PASS: LLVM :: CodeGen/NVPTX/nvvm-reflect.ll (18633 of 34304)
PASS: LLVM :: LTO/Resolution/X86/not-prevailing-weak-aliasee.ll (18634 of 34304)
PASS: LLVM :: CodeGen/BPF/callx.ll (18635 of 34304)
PASS: LLVM :: Transforms/InstCombine/pr28725.ll (18636 of 34304)
PASS: LLVM :: MC/AArch64/SVE/saddv.s (18637 of 34304)
PASS: LLVM :: DebugInfo/ARM/single-constant-use-preserves-dbgloc.ll (18638 of 34304)
PASS: LLVM :: CodeGen/NVPTX/global-dtor.ll (18639 of 34304)
PASS: LLVM :: Transforms/ConstantHoisting/ARM/const-addr-no-neg-offset.ll (18640 of 34304)
PASS: LLVM :: CodeGen/AArch64/arm64-neon-3vdiff.ll (18641 of 34304)
PASS: LLVM :: CodeGen/AArch64/GlobalISel/regbank-fp-use-def.mir (18642 of 34304)
PASS: LLVM :: Transforms/InstCombine/vec_shuffle.ll (18643 of 34304)
PASS: LLVM :: Transforms/LoopVectorize/X86/vectorization-remarks-missed.ll (18644 of 34304)
PASS: LLVM :: MC/Disassembler/Mips/msa/test_elm.txt (18645 of 34304)
PASS: LLVM :: CodeGen/ARM/2010-06-29-PartialRedefFastAlloc.ll (18646 of 34304)
PASS: LLVM-Unit :: Support/./SupportTests/ErrorOr.ImplicitConversionNoAmbiguity (18647 of 34304)
PASS: LLVM :: CodeGen/PowerPC/merge-st-chain-op.ll (18648 of 34304)
PASS: LLVM-Unit :: Support/./SupportTests/TrigramIndexTest.Basic (18649 of 34304)
PASS: LLVM :: Transforms/IndVarSimplify/lftr-pr20680.ll (18650 of 34304)
PASS: LLVM :: MC/AArch64/SVE/uxtw.s (18651 of 34304)
PASS: LLVM-Unit :: AsmParser/./AsmParserTests/AsmParserTest.TypeAndConstantValueWithSlotMappingParsing (18652 of 34304)
PASS: LLVM :: Analysis/RegionInfo/exit_in_condition.ll (18653 of 34304)
PASS: LLVM :: CodeGen/ARM/prefetch.ll (18654 of 34304)
PASS: LLVM :: MC/AArch64/SVE/st1b-diagnostics.s (18655 of 34304)
PASS: LLVM :: CodeGen/Generic/inline-asm-special-strings.ll (18656 of 34304)
PASS: LLVM :: MC/AArch64/SVE/dup.s (18657 of 34304)
PASS: LLVM :: Transforms/NewGVN/pair_jumpthread.ll (18658 of 34304)
PASS: LLVM :: CodeGen/WebAssembly/atomic-fence.ll (18659 of 34304)
PASS: LLVM :: CodeGen/X86/stackpointer.ll (18660 of 34304)
PASS: LLVM :: tools/llvm-mca/X86/llvm-mca-markers-11.s (18661 of 34304)
PASS: LLVM :: MC/ELF/relocation.s (18662 of 34304)
PASS: LLVM :: Assembler/call-nonzero-program-addrspace.ll (18663 of 34304)
FAIL: LLVM :: CodeGen/AMDGPU/llvm.amdgcn.ldexp.ll (18664 of 34304)
******************** TEST 'LLVM :: CodeGen/AMDGPU/llvm.amdgcn.ldexp.ll' FAILED ********************
Script:
--
: 'RUN: at line 1';   /Users/buildslave/jenkins/workspace/coverage/lldb-build/bin/llc -march=amdgcn -verify-machineinstrs < /Users/buildslave/jenkins/workspace/coverage/llvm-project/llvm/test/CodeGen/AMDGPU/llvm.amdgcn.ldexp.ll | /Users/buildslave/jenkins/workspace/coverage/lldb-build/bin/FileCheck -check-prefix=SI /Users/buildslave/jenkins/workspace/coverage/llvm-project/llvm/test/CodeGen/AMDGPU/llvm.amdgcn.ldexp.ll
: 'RUN: at line 2';   /Users/buildslave/jenkins/workspace/coverage/lldb-build/bin/llc -march=amdgcn -mcpu=tonga -verify-machineinstrs < /Users/buildslave/jenkins/workspace/coverage/llvm-project/llvm/test/CodeGen/AMDGPU/llvm.amdgcn.ldexp.ll | /Users/buildslave/jenkins/workspace/coverage/lldb-build/bin/FileCheck -check-prefix=SI /Users/buildslave/jenkins/workspace/coverage/llvm-project/llvm/test/CodeGen/AMDGPU/llvm.amdgcn.ldexp.ll
--
Exit Code: 143

Hide Details

Command Output (stderr): -- /Users/buildslave/jenkins/workspace/coverage/lldb-build/test/CodeGen/AMDGPU/Output/llvm.amdgcn.ldexp.ll.script: line 2: 90994 Terminated: 15 /Users/buildslave/jenkins/workspace/coverage/lldb-build/bin/llc -march=amdgcn -mcpu=tonga -verify-machineinstrs < /Users/buildslave/jenkins/workspace/coverage/llvm-project/llvm/test/CodeGen/AMDGPU/llvm.amdgcn.ldexp.ll 90995 | /Users/buildslave/jenkins/workspace/coverage/lldb-build/bin/FileCheck -check-prefix=SI /Users/buildslave/jenkins/workspace/coverage/llvm-project/llvm/test/CodeGen/AMDGPU/llvm.amdgcn.ldexp.ll

Hide Details

--

Hide Details

******************** FAIL: LLVM :: CodeGen/AMDGPU/uniform-loop-inside-nonuniform.ll (18665 of 34304) ******************** TEST 'LLVM :: CodeGen/AMDGPU/uniform-loop-inside-nonuniform.ll' FAILED ******************** Script: -- : 'RUN: at line 1'; /Users/buildslave/jenkins/workspace/coverage/lldb-build/bin/llc -march=amdgcn -mcpu=verde < /Users/buildslave/jenkins/workspace/coverage/llvm-project/llvm/test/CodeGen/AMDGPU/uniform-loop-inside-nonuniform.ll | /Users/buildslave/jenkins/workspace/coverage/lldb-build/bin/FileCheck /Users/buildslave/jenkins/workspace/coverage/llvm-project/llvm/test/CodeGen/AMDGPU/uniform-loop-inside-nonuniform.ll -- Exit Code: 143

Hide Details

Command Output (stderr): -- /Users/buildslave/jenkins/workspace/coverage/lldb-build/test/CodeGen/AMDGPU/Output/uniform-loop-inside-nonuniform.ll.script: line 1: 90996 Terminated: 15 /Users/buildslave/jenkins/workspace/coverage/lldb-build/bin/llc -march=amdgcn -mcpu=verde < /Users/buildslave/jenkins/workspace/coverage/llvm-project/llvm/test/CodeGen/AMDGPU/uniform-loop-inside-nonuniform.ll 90997 | /Users/buildslave/jenkins/workspace/coverage/lldb-build/bin/FileCheck /Users/buildslave/jenkins/workspace/coverage/llvm-project/llvm/test/CodeGen/AMDGPU/uniform-loop-inside-nonuniform.ll

Hide Details

--

Hide Details

******************** FAIL: LLVM :: CodeGen/Mips/msa/vec.ll (18666 of 34304) ******************** TEST 'LLVM :: CodeGen/Mips/msa/vec.ll' FAILED ******************** Script: -- : 'RUN: at line 3'; /Users/buildslave/jenkins/workspace/coverage/lldb-build/bin/llc -march=mips -mattr=+msa,+fp64,+mips32r2 -relocation-model=pic < /Users/buildslave/jenkins/workspace/coverage/llvm-project/llvm/test/CodeGen/Mips/msa/vec.ll | /Users/buildslave/jenkins/workspace/coverage/lldb-build/bin/FileCheck -check-prefix=ANYENDIAN /Users/buildslave/jenkins/workspace/coverage/llvm-project/llvm/test/CodeGen/Mips/msa/vec.ll : 'RUN: at line 5'; /Users/buildslave/jenkins/workspace/coverage/lldb-build/bin/llc -march=mipsel -mattr=+msa,+fp64,+mips32r2 -relocation-model=pic < /Users/buildslave/jenkins/workspace/coverage/llvm-project/llvm/test/CodeGen/Mips/msa/vec.ll | /Users/buildslave/jenkins/workspace/coverage/lldb-build/bin/FileCheck -check-prefix=ANYENDIAN /Users/buildslave/jenkins/workspace/coverage/llvm-project/llvm/test/CodeGen/Mips/msa/vec.ll -- Exit Code: 143

Hide Details

Command Output (stderr): -- warning: the 'msa' ASE requires MIPS32 revision 5 or greater /Users/buildslave/jenkins/workspace/coverage/lldb-build/test/CodeGen/Mips/msa/Output/vec.ll.script: line 2: 90942 Terminated: 15 /Users/buildslave/jenkins/workspace/coverage/lldb-build/bin/llc -march=mips -mattr=+msa,+fp64,+mips32r2 -relocation-model=pic < /Users/buildslave/jenkins/workspace/coverage/llvm-project/llvm/test/CodeGen/Mips/msa/vec.ll 90943 | /Users/buildslave/jenkins/workspace/coverage/lldb-build/bin/FileCheck -check-prefix=ANYENDIAN /Users/buildslave/jenkins/workspace/coverage/llvm-project/llvm/test/CodeGen/Mips/msa/vec.ll

Hide Details

--

Hide Details

******************** FAIL: LLVM :: CodeGen/X86/umul_fix_sat.ll (18667 of 34304) ******************** TEST 'LLVM :: CodeGen/X86/umul_fix_sat.ll' FAILED ******************** Script: -- : 'RUN: at line 2'; /Users/buildslave/jenkins/workspace/coverage/lldb-build/bin/llc < /Users/buildslave/jenkins/workspace/coverage/llvm-project/llvm/test/CodeGen/X86/umul_fix_sat.ll -mtriple=x86_64-linux | /Users/buildslave/jenkins/workspace/coverage/lldb-build/bin/FileCheck /Users/buildslave/jenkins/workspace/coverage/llvm-project/llvm/test/CodeGen/X86/umul_fix_sat.ll --check-prefix=X64 : 'RUN: at line 3'; /Users/buildslave/jenkins/workspace/coverage/lldb-build/bin/llc < /Users/buildslave/jenkins/workspace/coverage/llvm-project/llvm/test/CodeGen/X86/umul_fix_sat.ll -mtriple=i686 -mattr=cmov | /Users/buildslave/jenkins/workspace/coverage/lldb-build/bin/FileCheck /Users/buildslave/jenkins/workspace/coverage/llvm-project/llvm/test/CodeGen/X86/umul_fix_sat.ll --check-prefix=X86 -- Exit Code: 143

Hide Details

Command Output (stderr): -- /Users/buildslave/jenkins/workspace/coverage/lldb-build/test/CodeGen/X86/Output/umul_fix_sat.ll.script: line 2: 90933 Terminated: 15 /Users/buildslave/jenkins/workspace/coverage/lldb-build/bin/llc -mtriple=i686 -mattr=cmov < /Users/buildslave/jenkins/workspace/coverage/llvm-project/llvm/test/CodeGen/X86/umul_fix_sat.ll 90934 | /Users/buildslave/jenkins/workspace/coverage/lldb-build/bin/FileCheck /Users/buildslave/jenkins/workspace/coverage/llvm-project/llvm/test/CodeGen/X86/umul_fix_sat.ll --check-prefix=X86

Hide Details

--

Hide Details

******************** FAIL: LLVM :: CodeGen/X86/retpoline-regparm.ll (18668 of 34304) ******************** TEST 'LLVM :: CodeGen/X86/retpoline-regparm.ll' FAILED ******************** Script: -- : 'RUN: at line 1'; /Users/buildslave/jenkins/workspace/coverage/lldb-build/bin/llc -verify-machineinstrs -mtriple=i686-linux < /Users/buildslave/jenkins/workspace/coverage/llvm-project/llvm/test/CodeGen/X86/retpoline-regparm.ll | /Users/buildslave/jenkins/workspace/coverage/lldb-build/bin/FileCheck --implicit-check-not="jmp.*\*" --implicit-check-not="call.*\*" /Users/buildslave/jenkins/workspace/coverage/llvm-project/llvm/test/CodeGen/X86/retpoline-regparm.ll -- Exit Code: 143

Hide Details

Command Output (stderr): -- /Users/buildslave/jenkins/workspace/coverage/lldb-build/test/CodeGen/X86/Output/retpoline-regparm.ll.script: line 1: 90975 Terminated: 15 /Users/buildslave/jenkins/workspace/coverage/lldb-build/bin/llc -verify-machineinstrs -mtriple=i686-linux < /Users/buildslave/jenkins/workspace/coverage/llvm-project/llvm/test/CodeGen/X86/retpoline-regparm.ll 90976 | /Users/buildslave/jenkins/workspace/coverage/lldb-build/bin/FileCheck --implicit-check-not="jmp.*\*" --implicit-check-not="call.*\*" /Users/buildslave/jenkins/workspace/coverage/llvm-project/llvm/test/CodeGen/X86/retpoline-regparm.ll

Hide Details

--

Hide Details

******************** FAIL: LLVM :: CodeGen/AArch64/arm64-cast-opt.ll (18669 of 34304) ******************** TEST 'LLVM :: CodeGen/AArch64/arm64-cast-opt.ll' FAILED ******************** Script: -- : 'RUN: at line 1'; /Users/buildslave/jenkins/workspace/coverage/lldb-build/bin/llc -O3 -mtriple arm64-apple-ios5.0.0 < /Users/buildslave/jenkins/workspace/coverage/llvm-project/llvm/test/CodeGen/AArch64/arm64-cast-opt.ll | /Users/buildslave/jenkins/workspace/coverage/lldb-build/bin/FileCheck /Users/buildslave/jenkins/workspace/coverage/llvm-project/llvm/test/CodeGen/AArch64/arm64-cast-opt.ll -- Exit Code: 143

Hide Details

Command Output (stderr): -- /Users/buildslave/jenkins/workspace/coverage/lldb-build/test/CodeGen/AArch64/Output/arm64-cast-opt.ll.script: line 1: 90806 Terminated: 15 /Users/buildslave/jenkins/workspace/coverage/lldb-build/bin/llc -O3 -mtriple arm64-apple-ios5.0.0 < /Users/buildslave/jenkins/workspace/coverage/llvm-project/llvm/test/CodeGen/AArch64/arm64-cast-opt.ll 90807 | /Users/buildslave/jenkins/workspace/coverage/lldb-build/bin/FileCheck /Users/buildslave/jenkins/workspace/coverage/llvm-project/llvm/test/CodeGen/AArch64/arm64-cast-opt.ll

Hide Details

--

Hide Details

******************** FAIL: LLVM :: CodeGen/AMDGPU/GlobalISel/legalize-atomic-cmpxchg.mir (18670 of 34304) ******************** TEST 'LLVM :: CodeGen/AMDGPU/GlobalISel/legalize-atomic-cmpxchg.mir' FAILED ******************** Script: -- : 'RUN: at line 2'; /Users/buildslave/jenkins/workspace/coverage/lldb-build/bin/llc -mtriple=amdgcn-mesa-mesa3d -mcpu=tahiti -O0 -run-pass=legalizer /Users/buildslave/jenkins/workspace/coverage/llvm-project/llvm/test/CodeGen/AMDGPU/GlobalISel/legalize-atomic-cmpxchg.mir -o - | /Users/buildslave/jenkins/workspace/coverage/lldb-build/bin/FileCheck /Users/buildslave/jenkins/workspace/coverage/llvm-project/llvm/test/CodeGen/AMDGPU/GlobalISel/legalize-atomic-cmpxchg.mir : 'RUN: at line 3'; /Users/buildslave/jenkins/workspace/coverage/lldb-build/bin/llc -mtriple=amdgcn-mesa-mesa3d -mcpu=fiji -O0 -run-pass=legalizer /Users/buildslave/jenkins/workspace/coverage/llvm-project/llvm/test/CodeGen/AMDGPU/GlobalISel/legalize-atomic-cmpxchg.mir -o - | /Users/buildslave/jenkins/workspace/coverage/lldb-build/bin/FileCheck /Users/buildslave/jenkins/workspace/coverage/llvm-project/llvm/test/CodeGen/AMDGPU/GlobalISel/legalize-atomic-cmpxchg.mir -- Exit Code: 143

Hide Details

Command Output (stderr): -- /Users/buildslave/jenkins/workspace/coverage/lldb-build/test/CodeGen/AMDGPU/GlobalISel/Output/legalize-atomic-cmpxchg.mir.script: line 2: 90876 Terminated: 15 /Users/buildslave/jenkins/workspace/coverage/lldb-build/bin/llc -mtriple=amdgcn-mesa-mesa3d -mcpu=fiji -O0 -run-pass=legalizer /Users/buildslave/jenkins/workspace/coverage/llvm-project/llvm/test/CodeGen/AMDGPU/GlobalISel/legalize-atomic-cmpxchg.mir -o - 90877 | /Users/buildslave/jenkins/workspace/coverage/lldb-build/bin/FileCheck /Users/buildslave/jenkins/workspace/coverage/llvm-project/llvm/test/CodeGen/AMDGPU/GlobalISel/legalize-atomic-cmpxchg.mir

Hide Details

--

Hide Details

******************** FAIL: LLVM :: CodeGen/AArch64/gep-nullptr.ll (18671 of 34304) ******************** TEST 'LLVM :: CodeGen/AArch64/gep-nullptr.ll' FAILED ******************** Script: -- : 'RUN: at line 1'; /Users/buildslave/jenkins/workspace/coverage/lldb-build/bin/llc -O3 -aarch64-enable-gep-opt=true < /Users/buildslave/jenkins/workspace/coverage/llvm-project/llvm/test/CodeGen/AArch64/gep-nullptr.ll |/Users/buildslave/jenkins/workspace/coverage/lldb-build/bin/FileCheck /Users/buildslave/jenkins/workspace/coverage/llvm-project/llvm/test/CodeGen/AArch64/gep-nullptr.ll -- Exit Code: 143

Hide Details

Command Output (stderr): -- /Users/buildslave/jenkins/workspace/coverage/lldb-build/test/CodeGen/AArch64/Output/gep-nullptr.ll.script: line 1: 90885 Terminated: 15 /Users/buildslave/jenkins/workspace/coverage/lldb-build/bin/llc -O3 -aarch64-enable-gep-opt=true < /Users/buildslave/jenkins/workspace/coverage/llvm-project/llvm/test/CodeGen/AArch64/gep-nullptr.ll 90886 | /Users/buildslave/jenkins/workspace/coverage/lldb-build/bin/FileCheck /Users/buildslave/jenkins/workspace/coverage/llvm-project/llvm/test/CodeGen/AArch64/gep-nullptr.ll

Hide Details

--

Hide Details

******************** FAIL: LLVM :: CodeGen/Mips/Fast-ISel/br1.ll (18672 of 34304) ******************** TEST 'LLVM :: CodeGen/Mips/Fast-ISel/br1.ll' FAILED ******************** Script: -- : 'RUN: at line 1'; /Users/buildslave/jenkins/workspace/coverage/lldb-build/bin/llc -march=mipsel -relocation-model=pic -O0 -fast-isel-abort=3 -mcpu=mips32r2 < /Users/buildslave/jenkins/workspace/coverage/llvm-project/llvm/test/CodeGen/Mips/Fast-ISel/br1.ll | /Users/buildslave/jenkins/workspace/coverage/lldb-build/bin/FileCheck /Users/buildslave/jenkins/workspace/coverage/llvm-project/llvm/test/CodeGen/Mips/Fast-ISel/br1.ll : 'RUN: at line 3'; /Users/buildslave/jenkins/workspace/coverage/lldb-build/bin/llc -march=mipsel -relocation-model=pic -O0 -fast-isel-abort=3 -mcpu=mips32 < /Users/buildslave/jenkins/workspace/coverage/llvm-project/llvm/test/CodeGen/Mips/Fast-ISel/br1.ll | /Users/buildslave/jenkins/workspace/coverage/lldb-build/bin/FileCheck /Users/buildslave/jenkins/workspace/coverage/llvm-project/llvm/test/CodeGen/Mips/Fast-ISel/br1.ll -- Exit Code: 143

Hide Details

Command Output (stderr): -- /Users/buildslave/jenkins/workspace/coverage/lldb-build/test/CodeGen/Mips/Fast-ISel/Output/br1.ll.script: line 2: 90811 Terminated: 15 /Users/buildslave/jenkins/workspace/coverage/lldb-build/bin/llc -march=mipsel -relocation-model=pic -O0 -fast-isel-abort=3 -mcpu=mips32r2 < /Users/buildslave/jenkins/workspace/coverage/llvm-project/llvm/test/CodeGen/Mips/Fast-ISel/br1.ll 90812 | /Users/buildslave/jenkins/workspace/coverage/lldb-build/bin/FileCheck /Users/buildslave/jenkins/workspace/coverage/llvm-project/llvm/test/CodeGen/Mips/Fast-ISel/br1.ll

Hide Details

--

Hide Details

******************** XFAIL: LLVM :: CodeGen/Hexagon/noreturn-noepilog.ll (18673 of 34304) FAIL: LLVM :: DebugInfo/X86/noreturn_objc.ll (18674 of 34304) ******************** TEST 'LLVM :: DebugInfo/X86/noreturn_objc.ll' FAILED ******************** Script: -- : 'RUN: at line 1'; /Users/buildslave/jenkins/workspace/coverage/lldb-build/bin/llc -filetype=obj < /Users/buildslave/jenkins/workspace/coverage/llvm-project/llvm/test/DebugInfo/X86/noreturn_objc.ll | /Users/buildslave/jenkins/workspace/coverage/lldb-build/bin/llvm-dwarfdump -debug-info - | /Users/buildslave/jenkins/workspace/coverage/lldb-build/bin/FileCheck /Users/buildslave/jenkins/workspace/coverage/llvm-project/llvm/test/DebugInfo/X86/noreturn_objc.ll -- Exit Code: 143

Hide Details

Command Output (stderr): -- /Users/buildslave/jenkins/workspace/coverage/lldb-build/test/DebugInfo/X86/Output/noreturn_objc.ll.script: line 1: 90915 Terminated: 15 /Users/buildslave/jenkins/workspace/coverage/lldb-build/bin/llc -filetype=obj < /Users/buildslave/jenkins/workspace/coverage/llvm-project/llvm/test/DebugInfo/X86/noreturn_objc.ll 90916 | /Users/buildslave/jenkins/workspace/coverage/lldb-build/bin/llvm-dwarfdump -debug-info - 90917 | /Users/buildslave/jenkins/workspace/coverage/lldb-build/bin/FileCheck /Users/buildslave/jenkins/workspace/coverage/llvm-project/llvm/test/DebugInfo/X86/noreturn_objc.ll

Hide Details

--

Hide Details

******************** FAIL: LLVM :: CodeGen/X86/cpus-other.ll (18675 of 34304) ******************** TEST 'LLVM :: CodeGen/X86/cpus-other.ll' FAILED ******************** Script: -- : 'RUN: at line 6'; /Users/buildslave/jenkins/workspace/coverage/lldb-build/bin/llc < /Users/buildslave/jenkins/workspace/coverage/llvm-project/llvm/test/CodeGen/X86/cpus-other.ll -o /dev/null -mtriple=i686-unknown-unknown -mcpu=foobar 2>&1 | /Users/buildslave/jenkins/workspace/coverage/lldb-build/bin/FileCheck /Users/buildslave/jenkins/workspace/coverage/llvm-project/llvm/test/CodeGen/X86/cpus-other.ll --check-prefix=CHECK-ERROR : 'RUN: at line 11'; /Users/buildslave/jenkins/workspace/coverage/lldb-build/bin/llc < /Users/buildslave/jenkins/workspace/coverage/llvm-project/llvm/test/CodeGen/X86/cpus-other.ll -o /dev/null -mtriple=i686-unknown-unknown -mcpu=generic 2>&1 | /Users/buildslave/jenkins/workspace/coverage/lldb-build/bin/FileCheck /Users/buildslave/jenkins/workspace/coverage/llvm-project/llvm/test/CodeGen/X86/cpus-other.ll --check-prefix=CHECK-NO-ERROR --allow-empty : 'RUN: at line 13'; /Users/buildslave/jenkins/workspace/coverage/lldb-build/bin/llc < /Users/buildslave/jenkins/workspace/coverage/llvm-project/llvm/test/CodeGen/X86/cpus-other.ll -o /dev/null -mtriple=i686-unknown-unknown -mcpu=geode 2>&1 | /Users/buildslave/jenkins/workspace/coverage/lldb-build/bin/FileCheck /Users/buildslave/jenkins/workspace/coverage/llvm-project/llvm/test/CodeGen/X86/cpus-other.ll --check-prefix=CHECK-NO-ERROR --allow-empty : 'RUN: at line 14'; /Users/buildslave/jenkins/workspace/coverage/lldb-build/bin/llc < /Users/buildslave/jenkins/workspace/coverage/llvm-project/llvm/test/CodeGen/X86/cpus-other.ll -o /dev/null -mtriple=i686-unknown-unknown -mcpu=winchip-c6 2>&1 | /Users/buildslave/jenkins/workspace/coverage/lldb-build/bin/FileCheck /Users/buildslave/jenkins/workspace/coverage/llvm-project/llvm/test/CodeGen/X86/cpus-other.ll --check-prefix=CHECK-NO-ERROR --allow-empty : 'RUN: at line 15'; /Users/buildslave/jenkins/workspace/coverage/lldb-build/bin/llc < /Users/buildslave/jenkins/workspace/coverage/llvm-project/llvm/test/CodeGen/X86/cpus-other.ll -o /dev/null -mtriple=i686-unknown-unknown -mcpu=winchip2 2>&1 | /Users/buildslave/jenkins/workspace/coverage/lldb-build/bin/FileCheck /Users/buildslave/jenkins/workspace/coverage/llvm-project/llvm/test/CodeGen/X86/cpus-other.ll --check-prefix=CHECK-NO-ERROR --allow-empty : 'RUN: at line 16'; /Users/buildslave/jenkins/workspace/coverage/lldb-build/bin/llc < /Users/buildslave/jenkins/workspace/coverage/llvm-project/llvm/test/CodeGen/X86/cpus-other.ll -o /dev/null -mtriple=i686-unknown-unknown -mcpu=c3 2>&1 | /Users/buildslave/jenkins/workspace/coverage/lldb-build/bin/FileCheck /Users/buildslave/jenkins/workspace/coverage/llvm-project/llvm/test/CodeGen/X86/cpus-other.ll --check-prefix=CHECK-NO-ERROR --allow-empty : 'RUN: at line 17'; /Users/buildslave/jenkins/workspace/coverage/lldb-build/bin/llc < /Users/buildslave/jenkins/workspace/coverage/llvm-project/llvm/test/CodeGen/X86/cpus-other.ll -o /dev/null -mtriple=i686-unknown-unknown -mcpu=c3-2 2>&1 | /Users/buildslave/jenkins/workspace/coverage/lldb-build/bin/FileCheck /Users/buildslave/jenkins/workspace/coverage/llvm-project/llvm/test/CodeGen/X86/cpus-other.ll --check-prefix=CHECK-NO-ERROR --allow-empty -- Exit Code: 143

Hide Details

Command Output (stderr): -- /Users/buildslave/jenkins/workspace/coverage/lldb-build/test/CodeGen/X86/Output/cpus-other.ll.script: line 7: 90984 Terminated: 15 /Users/buildslave/jenkins/workspace/coverage/lldb-build/bin/llc -o /dev/null -mtriple=i686-unknown-unknown -mcpu=geode < /Users/buildslave/jenkins/workspace/coverage/llvm-project/llvm/test/CodeGen/X86/cpus-other.ll 2>&1 90985 | /Users/buildslave/jenkins/workspace/coverage/lldb-build/bin/FileCheck /Users/buildslave/jenkins/workspace/coverage/llvm-project/llvm/test/CodeGen/X86/cpus-other.ll --check-prefix=CHECK-NO-ERROR --allow-empty

Hide Details

--

Hide Details

******************** FAIL: LLVM :: CodeGen/X86/atom-fixup-lea3.ll (18676 of 34304) ******************** TEST 'LLVM :: CodeGen/X86/atom-fixup-lea3.ll' FAILED ******************** Script: -- : 'RUN: at line 1'; /Users/buildslave/jenkins/workspace/coverage/lldb-build/bin/llc < /Users/buildslave/jenkins/workspace/coverage/llvm-project/llvm/test/CodeGen/X86/atom-fixup-lea3.ll -mcpu=atom -mtriple=i686-linux | /Users/buildslave/jenkins/workspace/coverage/lldb-build/bin/FileCheck /Users/buildslave/jenkins/workspace/coverage/llvm-project/llvm/test/CodeGen/X86/atom-fixup-lea3.ll -- Exit Code: 143

Hide Details

Command Output (stderr): -- /Users/buildslave/jenkins/workspace/coverage/lldb-build/test/CodeGen/X86/Output/atom-fixup-lea3.ll.script: line 1: 90629 Terminated: 15 /Users/buildslave/jenkins/workspace/coverage/lldb-build/bin/llc -mcpu=atom -mtriple=i686-linux < /Users/buildslave/jenkins/workspace/coverage/llvm-project/llvm/test/CodeGen/X86/atom-fixup-lea3.ll 90630 | /Users/buildslave/jenkins/workspace/coverage/lldb-build/bin/FileCheck /Users/buildslave/jenkins/workspace/coverage/llvm-project/llvm/test/CodeGen/X86/atom-fixup-lea3.ll

Hide Details

--

Hide Details

******************** FAIL: LLVM :: CodeGen/RISCV/target-abi-valid.ll (18677 of 34304) ******************** TEST 'LLVM :: CodeGen/RISCV/target-abi-valid.ll' FAILED ******************** Script: -- : 'RUN: at line 1'; /Users/buildslave/jenkins/workspace/coverage/lldb-build/bin/llc -mtriple=riscv32 < /Users/buildslave/jenkins/workspace/coverage/llvm-project/llvm/test/CodeGen/RISCV/target-abi-valid.ll | /Users/buildslave/jenkins/workspace/coverage/lldb-build/bin/FileCheck -check-prefix=CHECK-IMP /Users/buildslave/jenkins/workspace/coverage/llvm-project/llvm/test/CodeGen/RISCV/target-abi-valid.ll : 'RUN: at line 3'; /Users/buildslave/jenkins/workspace/coverage/lldb-build/bin/llc -mtriple=riscv32 -target-abi ilp32 < /Users/buildslave/jenkins/workspace/coverage/llvm-project/llvm/test/CodeGen/RISCV/target-abi-valid.ll | /Users/buildslave/jenkins/workspace/coverage/lldb-build/bin/FileCheck -check-prefix=CHECK-IMP /Users/buildslave/jenkins/workspace/coverage/llvm-project/llvm/test/CodeGen/RISCV/target-abi-valid.ll : 'RUN: at line 5'; /Users/buildslave/jenkins/workspace/coverage/lldb-build/bin/llc -mtriple=riscv32 -mattr=+f -target-abi ilp32 < /Users/buildslave/jenkins/workspace/coverage/llvm-project/llvm/test/CodeGen/RISCV/target-abi-valid.ll | /Users/buildslave/jenkins/workspace/coverage/lldb-build/bin/FileCheck -check-prefix=CHECK-IMP /Users/buildslave/jenkins/workspace/coverage/llvm-project/llvm/test/CodeGen/RISCV/target-abi-valid.ll : 'RUN: at line 7'; /Users/buildslave/jenkins/workspace/coverage/lldb-build/bin/llc -mtriple=riscv32 -mattr=+d -target-abi ilp32 < /Users/buildslave/jenkins/workspace/coverage/llvm-project/llvm/test/CodeGen/RISCV/target-abi-valid.ll | /Users/buildslave/jenkins/workspace/coverage/lldb-build/bin/FileCheck -check-prefix=CHECK-IMP /Users/buildslave/jenkins/workspace/coverage/llvm-project/llvm/test/CodeGen/RISCV/target-abi-valid.ll : 'RUN: at line 9'; /Users/buildslave/jenkins/workspace/coverage/lldb-build/bin/llc -mtriple=riscv64 < /Users/buildslave/jenkins/workspace/coverage/llvm-project/llvm/test/CodeGen/RISCV/target-abi-valid.ll | /Users/buildslave/jenkins/workspace/coverage/lldb-build/bin/FileCheck -check-prefix=CHECK-IMP /Users/buildslave/jenkins/workspace/coverage/llvm-project/llvm/test/CodeGen/RISCV/target-abi-valid.ll : 'RUN: at line 11'; /Users/buildslave/jenkins/workspace/coverage/lldb-build/bin/llc -mtriple=riscv64 -target-abi lp64 < /Users/buildslave/jenkins/workspace/coverage/llvm-project/llvm/test/CodeGen/RISCV/target-abi-valid.ll | /Users/buildslave/jenkins/workspace/coverage/lldb-build/bin/FileCheck -check-prefix=CHECK-IMP /Users/buildslave/jenkins/workspace/coverage/llvm-project/llvm/test/CodeGen/RISCV/target-abi-valid.ll : 'RUN: at line 13'; /Users/buildslave/jenkins/workspace/coverage/lldb-build/bin/llc -mtriple=riscv64 -mattr=+f -target-abi lp64 < /Users/buildslave/jenkins/workspace/coverage/llvm-project/llvm/test/CodeGen/RISCV/target-abi-valid.ll | /Users/buildslave/jenkins/workspace/coverage/lldb-build/bin/FileCheck -check-prefix=CHECK-IMP /Users/buildslave/jenkins/workspace/coverage/llvm-project/llvm/test/CodeGen/RISCV/target-abi-valid.ll : 'RUN: at line 15'; /Users/buildslave/jenkins/workspace/coverage/lldb-build/bin/llc -mtriple=riscv64 -mattr=+d -target-abi lp64 < /Users/buildslave/jenkins/workspace/coverage/llvm-project/llvm/test/CodeGen/RISCV/target-abi-valid.ll | /Users/buildslave/jenkins/workspace/coverage/lldb-build/bin/FileCheck -check-prefix=CHECK-IMP /Users/buildslave/jenkins/workspace/coverage/llvm-project/llvm/test/CodeGen/RISCV/target-abi-valid.ll : 'RUN: at line 17'; /Users/buildslave/jenkins/workspace/coverage/lldb-build/bin/llc -mtriple=riscv32 -mattr=+f -target-abi ilp32f < /Users/buildslave/jenkins/workspace/coverage/llvm-project/llvm/test/CodeGen/RISCV/target-abi-valid.ll 2>&1 | /Users/buildslave/jenkins/workspace/coverage/lldb-build/bin/FileCheck -check-prefix=CHECK-IMP /Users/buildslave/jenkins/workspace/coverage/llvm-project/llvm/test/CodeGen/RISCV/target-abi-valid.ll : 'RUN: at line 19'; /Users/buildslave/jenkins/workspace/coverage/lldb-build/bin/llc -mtriple=riscv32 -mattr=+d -target-abi ilp32f < /Users/buildslave/jenkins/workspace/coverage/llvm-project/llvm/test/CodeGen/RISCV/target-abi-valid.ll 2>&1 | /Users/buildslave/jenkins/workspace/coverage/lldb-build/bin/FileCheck -check-prefix=CHECK-IMP /Users/buildslave/jenkins/workspace/coverage/llvm-project/llvm/test/CodeGen/RISCV/target-abi-valid.ll : 'RUN: at line 21'; /Users/buildslave/jenkins/workspace/coverage/lldb-build/bin/llc -mtriple=riscv32 -mattr=+d -target-abi ilp32d < /Users/buildslave/jenkins/workspace/coverage/llvm-project/llvm/test/CodeGen/RISCV/target-abi-valid.ll 2>&1 | /Users/buildslave/jenkins/workspace/coverage/lldb-build/bin/FileCheck -check-prefix=CHECK-IMP /Users/buildslave/jenkins/workspace/coverage/llvm-project/llvm/test/CodeGen/RISCV/target-abi-valid.ll : 'RUN: at line 23'; /Users/buildslave/jenkins/workspace/coverage/lldb-build/bin/llc -mtriple=riscv64 -mattr=+f -target-abi lp64f < /Users/buildslave/jenkins/workspace/coverage/llvm-project/llvm/test/CodeGen/RISCV/target-abi-valid.ll 2>&1 | /Users/buildslave/jenkins/workspace/coverage/lldb-build/bin/FileCheck -check-prefix=CHECK-IMP /Users/buildslave/jenkins/workspace/coverage/llvm-project/llvm/test/CodeGen/RISCV/target-abi-valid.ll : 'RUN: at line 25'; /Users/buildslave/jenkins/workspace/coverage/lldb-build/bin/llc -mtriple=riscv64 -mattr=+d -target-abi lp64f < /Users/buildslave/jenkins/workspace/coverage/llvm-project/llvm/test/CodeGen/RISCV/target-abi-valid.ll 2>&1 | /Users/buildslave/jenkins/workspace/coverage/lldb-build/bin/FileCheck -check-prefix=CHECK-IMP /Users/buildslave/jenkins/workspace/coverage/llvm-project/llvm/test/CodeGen/RISCV/target-abi-valid.ll : 'RUN: at line 27'; /Users/buildslave/jenkins/workspace/coverage/lldb-build/bin/llc -mtriple=riscv64 -mattr=+d -target-abi lp64d < /Users/buildslave/jenkins/workspace/coverage/llvm-project/llvm/test/CodeGen/RISCV/target-abi-valid.ll 2>&1 | /Users/buildslave/jenkins/workspace/coverage/lldb-build/bin/FileCheck -check-prefix=CHECK-IMP /Users/buildslave/jenkins/workspace/coverage/llvm-project/llvm/test/CodeGen/RISCV/target-abi-valid.ll : 'RUN: at line 37'; not /Users/buildslave/jenkins/workspace/coverage/lldb-build/bin/llc -mtriple=riscv32 -target-abi ilp32e < /Users/buildslave/jenkins/workspace/coverage/llvm-project/llvm/test/CodeGen/RISCV/target-abi-valid.ll 2>&1 | /Users/buildslave/jenkins/workspace/coverage/lldb-build/bin/FileCheck -check-prefix=CHECK-UNIMP /Users/buildslave/jenkins/workspace/coverage/llvm-project/llvm/test/CodeGen/RISCV/target-abi-valid.ll -- Exit Code: 143

Hide Details

Command Output (stderr): -- /Users/buildslave/jenkins/workspace/coverage/lldb-build/test/CodeGen/RISCV/Output/target-abi-valid.ll.script: line 15: 90947 Terminated: 15 /Users/buildslave/jenkins/workspace/coverage/lldb-build/bin/llc -mtriple=riscv32 -mattr=+f -target-abi ilp32f < /Users/buildslave/jenkins/workspace/coverage/llvm-project/llvm/test/CodeGen/RISCV/target-abi-valid.ll 2>&1 90948 | /Users/buildslave/jenkins/workspace/coverage/lldb-build/bin/FileCheck -check-prefix=CHECK-IMP /Users/buildslave/jenkins/workspace/coverage/llvm-project/llvm/test/CodeGen/RISCV/target-abi-valid.ll

Hide Details

--

Hide Details

******************** FAIL: LLVM :: CodeGen/ARM/shift-combine.ll (18678 of 34304) ******************** TEST 'LLVM :: CodeGen/ARM/shift-combine.ll' FAILED ******************** Script: -- : 'RUN: at line 1'; /Users/buildslave/jenkins/workspace/coverage/lldb-build/bin/llc -mtriple=armv7-linux-gnueabihf /Users/buildslave/jenkins/workspace/coverage/llvm-project/llvm/test/CodeGen/ARM/shift-combine.ll -o - | /Users/buildslave/jenkins/workspace/coverage/lldb-build/bin/FileCheck /Users/buildslave/jenkins/workspace/coverage/llvm-project/llvm/test/CodeGen/ARM/shift-combine.ll --check-prefix=CHECK-ARM --check-prefix=CHECK-COMMON : 'RUN: at line 2'; /Users/buildslave/jenkins/workspace/coverage/lldb-build/bin/llc -mtriple=armv7eb-linux-gnueabihf /Users/buildslave/jenkins/workspace/coverage/llvm-project/llvm/test/CodeGen/ARM/shift-combine.ll -o - | /Users/buildslave/jenkins/workspace/coverage/lldb-build/bin/FileCheck /Users/buildslave/jenkins/workspace/coverage/llvm-project/llvm/test/CodeGen/ARM/shift-combine.ll --check-prefix=CHECK-BE : 'RUN: at line 3'; /Users/buildslave/jenkins/workspace/coverage/lldb-build/bin/llc -mtriple=thumbv7-linux-gnueabihf /Users/buildslave/jenkins/workspace/coverage/llvm-project/llvm/test/CodeGen/ARM/shift-combine.ll -o - | /Users/buildslave/jenkins/workspace/coverage/lldb-build/bin/FileCheck /Users/buildslave/jenkins/workspace/coverage/llvm-project/llvm/test/CodeGen/ARM/shift-combine.ll --check-prefix=CHECK-THUMB --check-prefix=CHECK-COMMON : 'RUN: at line 4'; /Users/buildslave/jenkins/workspace/coverage/lldb-build/bin/llc -mtriple=thumbv7m /Users/buildslave/jenkins/workspace/coverage/llvm-project/llvm/test/CodeGen/ARM/shift-combine.ll -o - | /Users/buildslave/jenkins/workspace/coverage/lldb-build/bin/FileCheck /Users/buildslave/jenkins/workspace/coverage/llvm-project/llvm/test/CodeGen/ARM/shift-combine.ll --check-prefix=CHECK-THUMB --check-prefix=CHECK-COMMON : 'RUN: at line 5'; /Users/buildslave/jenkins/workspace/coverage/lldb-build/bin/llc -mtriple=thumbv7m -mattr=+strict-align /Users/buildslave/jenkins/workspace/coverage/llvm-project/llvm/test/CodeGen/ARM/shift-combine.ll -o - | /Users/buildslave/jenkins/workspace/coverage/lldb-build/bin/FileCheck /Users/buildslave/jenkins/workspace/coverage/llvm-project/llvm/test/CodeGen/ARM/shift-combine.ll --check-prefix=CHECK-ALIGN --check-prefix=CHECK-COMMON : 'RUN: at line 6'; /Users/buildslave/jenkins/workspace/coverage/lldb-build/bin/llc -mtriple=thumbv6m /Users/buildslave/jenkins/workspace/coverage/llvm-project/llvm/test/CodeGen/ARM/shift-combine.ll -o - | /Users/buildslave/jenkins/workspace/coverage/lldb-build/bin/FileCheck /Users/buildslave/jenkins/workspace/coverage/llvm-project/llvm/test/CodeGen/ARM/shift-combine.ll --check-prefix=CHECK-V6M -- Exit Code: 143

Hide Details

Command Output (stderr): -- /Users/buildslave/jenkins/workspace/coverage/lldb-build/test/CodeGen/ARM/Output/shift-combine.ll.script: line 6: 90971 Terminated: 15 /Users/buildslave/jenkins/workspace/coverage/lldb-build/bin/llc -mtriple=armv7-linux-gnueabihf /Users/buildslave/jenkins/workspace/coverage/llvm-project/llvm/test/CodeGen/ARM/shift-combine.ll -o - 90972 | /Users/buildslave/jenkins/workspace/coverage/lldb-build/bin/FileCheck /Users/buildslave/jenkins/workspace/coverage/llvm-project/llvm/test/CodeGen/ARM/shift-combine.ll --check-prefix=CHECK-ARM --check-prefix=CHECK-COMMON

Hide Details

--

Hide Details

******************** FAIL: LLVM :: CodeGen/X86/pr3522.ll (18679 of 34304) ******************** TEST 'LLVM :: CodeGen/X86/pr3522.ll' FAILED ******************** Script: -- : 'RUN: at line 2'; /Users/buildslave/jenkins/workspace/coverage/lldb-build/bin/llc < /Users/buildslave/jenkins/workspace/coverage/llvm-project/llvm/test/CodeGen/X86/pr3522.ll -stats 2>&1 | /Users/buildslave/jenkins/workspace/coverage/lldb-build/bin/not grep "instructions sunk" -- Exit Code: 143

Hide Details

Command Output (stderr): -- /Users/buildslave/jenkins/workspace/coverage/lldb-build/test/CodeGen/X86/Output/pr3522.ll.script: line 1: 90925 Terminated: 15 /Users/buildslave/jenkins/workspace/coverage/lldb-build/bin/llc -stats < /Users/buildslave/jenkins/workspace/coverage/llvm-project/llvm/test/CodeGen/X86/pr3522.ll 2>&1 90927 Done | /Users/buildslave/jenkins/workspace/coverage/lldb-build/bin/not grep "instructions sunk"

Hide Details

--

Hide Details

******************** UNSUPPORTED: LLVM :: CodeGen/AVR/atomics/load32.ll (18680 of 34304) PASS: LLVM-Unit :: ADT/./ADTTests/PointerIterator.Basic (18681 of 34304) PASS: LLVM-Unit :: Support/./SupportTests/FormatVariadicTest.Range (18682 of 34304) PASS: LLVM-Unit :: ADT/./ADTTests/DenseSetTest/5.FindAsTest (18683 of 34304) PASS: LLVM :: tools/llvm-mca/X86/BdVer2/vec-logic-read-after-ld-1.s (18684 of 34304) PASS: LLVM :: MC/ARM/arm-branches.s (18685 of 34304) UNSUPPORTED: LLVM :: tools/llvm-exegesis/X86/analysis-uops.test (18686 of 34304) PASS: LLVM :: tools/llvm-mca/X86/Znver1/resources-sse41.s (18687 of 34304) PASS: LLVM :: Feature/escaped_label.ll (18688 of 34304) PASS: LLVM :: MC/MachO/AArch64/reloc-crash2.s (18689 of 34304) PASS: LLVM-Unit :: Support/./SupportTests/MemoryBufferTest.copy (18690 of 34304) PASS: LLVM :: MC/AArch64/SVE/whilels-diagnostics.s (18691 of 34304) PASS: LLVM :: CodeGen/AArch64/GlobalISel/select-load-store-vector-of-ptr.mir (18692 of 34304) PASS: LLVM :: Transforms/SCCP/ub-shift.ll (18693 of 34304) PASS: LLVM :: tools/llvm-readobj/elf-machine-specific-section-types.test (18694 of 34304) PASS: LLVM :: Assembler/invalid-uselistorder_bb-missing-bb.ll (18695 of 34304) PASS: LLVM :: CodeGen/X86/pr16360.ll (18696 of 34304) PASS: LLVM :: Transforms/LoopUnroll/disable-loop-unrolling_forced.ll (18697 of 34304) PASS: LLVM :: tools/llvm-readobj/reloc_overflow.test (18698 of 34304) PASS: LLVM :: tools/llvm-mca/X86/SkylakeClient/resources-cmpxchg.s (18699 of 34304) PASS: LLVM :: CodeGen/X86/ctpop-combine.ll (18700 of 34304) PASS: LLVM :: Transforms/InstCombine/pr38897.ll (18701 of 34304) PASS: LLVM :: CodeGen/X86/GlobalISel/x86-select-trap.mir (18702 of 34304) PASS: LLVM :: Transforms/IndVarSimplify/loop_evaluate_1.ll (18703 of 34304) PASS: LLVM :: CodeGen/ARM/atomicrmw_minmax.ll (18704 of 34304) PASS: LLVM :: FileCheck/check-substring-multi-prefix.txt (18705 of 34304) PASS: LLVM :: MC/AArch64/arm64-tls-modifiers-darwin.s (18706 of 34304) PASS: LLVM :: tools/llvm-mca/X86/Barcelona/resources-prefetchw.s (18707 of 34304) PASS: LLVM :: CodeGen/Hexagon/swp-order-copies.ll (18708 of 34304) XFAIL: LLVM :: Transforms/NewGVN/nonescaping-malloc.ll (18709 of 34304) PASS: LLVM :: MC/Mips/mips32r2/abiflags.s (18710 of 34304) PASS: LLVM :: CodeGen/ARM/cortex-a57-misched-stm-wrback.ll (18711 of 34304) PASS: LLVM :: Transforms/Reassociate/fast-fp-commute.ll (18712 of 34304) PASS: LLVM :: ThinLTO/X86/export.ll (18713 of 34304) PASS: LLVM :: Analysis/ScalarEvolution/2008-02-12-SMAXTripCount.ll (18714 of 34304) PASS: LLVM :: CodeGen/X86/fast-isel-select-cmp.ll (18715 of 34304) PASS: LLVM :: tools/llvm-readobj/archive.test (18716 of 34304) PASS: LLVM-Unit :: Support/./SupportTests/InMemoryFileSystemTest.OverlayFile (18717 of 34304) PASS: LLVM :: DebugInfo/X86/single-fi.ll (18718 of 34304) PASS: LLVM :: Other/opt-twice.ll (18719 of 34304) PASS: LLVM :: tools/llvm-mca/X86/BdVer2/xop-super-registers-1.s (18720 of 34304) PASS: LLVM :: CodeGen/X86/bit-piece-comment.ll (18721 of 34304) PASS: LLVM :: Transforms/InstCombine/insert-const-shuf.ll (18722 of 34304) PASS: LLVM :: MC/AArch64/neon-scalar-abs.s (18723 of 34304) UNSUPPORTED: LLVM :: tools/gold/X86/pr19901.ll (18724 of 34304) PASS: LLVM :: tools/llvm-mca/X86/BdVer2/resources-avx1.s (18725 of 34304) PASS: LLVM :: CodeGen/X86/2008-09-11-CoalescerBug2.ll (18726 of 34304) PASS: LLVM :: Transforms/SLPVectorizer/AArch64/nontemporal.ll (18727 of 34304) PASS: LLVM :: CodeGen/X86/avx512vbmi2-intrinsics-upgrade.ll (18728 of 34304) PASS: LLVM :: CodeGen/PowerPC/vec_mergeow.ll (18729 of 34304) PASS: LLVM :: MC/AArch64/SVE/fnmsb-diagnostics.s (18730 of 34304) PASS: LLVM :: Instrumentation/DataFlowSanitizer/prefix-rename.ll (18731 of 34304) PASS: LLVM :: CodeGen/AMDGPU/collapse-endcf-broken.mir (18732 of 34304) PASS: LLVM-Unit :: IR/./IRTests/MDBuilderTest.createRangeMetadata (18733 of 34304) PASS: LLVM :: Transforms/InstCombine/assume-replacing-call.ll (18734 of 34304) PASS: LLVM :: CodeGen/SystemZ/int-const-06.ll (18735 of 34304) PASS: LLVM :: CodeGen/Mips/buildpairf64-extractelementf64-implicit-sp.ll (18736 of 34304) PASS: LLVM :: Transforms/NewGVN/pr34430.ll (18737 of 34304) PASS: LLVM :: Analysis/CostModel/ARM/gep.ll (18738 of 34304) wrapper script does not seem to be touching the log file in /Users/buildslave/jenkins/workspace/coverage@tmp/durable-eba77171 (JENKINS-48300: if on an extremely laggy filesystem, consider -Dorg.jenkinsci.plugins.durabletask.BourneShellScript.HEARTBEAT_CHECK_INTERVAL=86400) [Pipeline] } [Pipeline] // timeout [Pipeline] } [Pipeline] // stage [Pipeline] stage [Pipeline] { (Declarative: Post Actions) [Pipeline] scanForIssues No credentials specified [Clang (LLVM based)] Sleeping for 5 seconds due to JENKINS-32191... [Clang (LLVM based)] Parsing console log (workspace: '/Users/buildslave/jenkins/workspace/coverage') > git rev-parse HEAD^{commit} # timeout=10 [Clang (LLVM based)] [-ERROR-] Can't determine head commit using 'git rev-parse'. Skipping blame. [Clang (LLVM based)] [-ERROR-] hudson.plugins.git.GitException: Command "git rev-parse HEAD^{commit}" returned status code 128: stdout: stderr: fatal: not a git repository (or any of the parent directories): .git

Hide Details

[Clang (LLVM based)] [-ERROR-] at org.jenkinsci.plugins.gitclient.CliGitAPIImpl.launchCommandIn(CliGitAPIImpl.java:2172) [Clang (LLVM based)] [-ERROR-] at org.jenkinsci.plugins.gitclient.CliGitAPIImpl.launchCommandIn(CliGitAPIImpl.java:2140) [Clang (LLVM based)] [-ERROR-] at org.jenkinsci.plugins.gitclient.CliGitAPIImpl.launchCommandIn(CliGitAPIImpl.java:2136) [Clang (LLVM based)] [-ERROR-] at org.jenkinsci.plugins.gitclient.CliGitAPIImpl.launchCommand(CliGitAPIImpl.java:1741) [Clang (LLVM based)] [-ERROR-] at org.jenkinsci.plugins.gitclient.CliGitAPIImpl.launchCommand(CliGitAPIImpl.java:1753) [Clang (LLVM based)] [-ERROR-] at org.jenkinsci.plugins.gitclient.CliGitAPIImpl.revParse(CliGitAPIImpl.java:938) [Clang (LLVM based)] [-ERROR-] at hudson.plugins.git.GitAPI.revParse(GitAPI.java:316) [Clang (LLVM based)] [-ERROR-] at io.jenkins.plugins.analysis.core.scm.GitBlamer.blame(GitBlamer.java:65) [Clang (LLVM based)] [-ERROR-] at io.jenkins.plugins.analysis.core.steps.IssuesScanner$ReportPostProcessor.invoke(IssuesScanner.java:180) [Clang (LLVM based)] [-ERROR-] at io.jenkins.plugins.analysis.core.steps.IssuesScanner$ReportPostProcessor.invoke(IssuesScanner.java:148) [Clang (LLVM based)] [-ERROR-] at hudson.FilePath$FileCallableWrapper.call(FilePath.java:3050) [Clang (LLVM based)] [-ERROR-] at hudson.remoting.UserRequest.perform(UserRequest.java:212) [Clang (LLVM based)] [-ERROR-] at hudson.remoting.UserRequest.perform(UserRequest.java:54) [Clang (LLVM based)] [-ERROR-] at hudson.remoting.Request$2.run(Request.java:369) [Clang (LLVM based)] [-ERROR-] at hudson.remoting.InterceptingExecutorService$1.call(InterceptingExecutorService.java:72) [Clang (LLVM based)] [-ERROR-] at java.util.concurrent.FutureTask.run(FutureTask.java:266) [Clang (LLVM based)] [-ERROR-] at java.util.concurrent.ThreadPoolExecutor.runWorker(ThreadPoolExecutor.java:1149) [Clang (LLVM based)] [-ERROR-] at java.util.concurrent.ThreadPoolExecutor$Worker.run(ThreadPoolExecutor.java:624) [Clang (LLVM based)] [-ERROR-] at java.lang.Thread.run(Thread.java:748) [Clang (LLVM based)] Post processing issues on 'green-dragon-23' with source code encoding 'UTF-8' [Clang (LLVM based)] Resolving absolute file names for all issues in workspace '/Users/buildslave/jenkins/workspace/coverage' [Clang (LLVM based)] -> 0 resolved, 0 unresolved, 2 already resolved [Clang (LLVM based)] Copying affected files to Jenkins' build folder '/Users/Shared/Jenkins/Home/jobs/coverage/builds/84/files-with-issues' [Clang (LLVM based)] -> 2 copied, 0 not in workspace, 0 not-found, 0 with I/O error [Clang (LLVM based)] Resolving module names from module definitions (build.xml, pom.xml, or Manifest.mf files) [Clang (LLVM based)] -> resolved module names for 2 issues [Clang (LLVM based)] Resolving package names (or namespaces) by parsing the affected files [Clang (LLVM based)] -> resolved package names of 2 affected files [Clang (LLVM based)] No filter has been set, publishing all 2 issues [Clang (LLVM based)] Creating fingerprints for all affected code blocks to track issues over different builds [Clang (LLVM based)] -> created fingerprints for 2 issues [Clang (LLVM based)] Invoking Git blamer to create author and commit information for all affected files [Clang (LLVM based)] GIT_COMMIT env = 'HEAD' [Clang (LLVM based)] Git working tree = '/Users/buildslave/jenkins/workspace/coverage'
[Pipeline] junit Recording test results [Pipeline] } [Pipeline] // stage [Pipeline] } [Pipeline] // node [Pipeline] End of Pipeline [BFA] Scanning build for known causes... [BFA] Found failure cause(s): [BFA] Ninja target failed from category Compile [BFA] Regression test failed from category Test [BFA] Link error [BFA] Compile Error from category Compile [BFA] Done. 2s ERROR: script returned exit code -1 Finished: FAILURE