FailedConsole Output

Skipping 9,612 KB.. Full Log
-IndBr.ll (2103 of 34395)
PASS: LLVM :: CodeGen/X86/store-global-address.ll (2104 of 34395)
PASS: LLVM-Unit :: tools/llvm-exegesis/./LLVMExegesisTests/PerfHelperTest.FunctionalTest (2105 of 34395)
PASS: LLVM :: Transforms/GVN/callbr-scalarpre-critedge.ll (2106 of 34395)
PASS: LLVM :: Transforms/LoopUnroll/AMDGPU/unroll-for-private.ll (2107 of 34395)
PASS: LLVM :: CodeGen/Generic/ret0.ll (2108 of 34395)
PASS: LLVM :: Transforms/InstCombine/demorgan-sink-not-into-xor.ll (2109 of 34395)
PASS: LLVM :: CodeGen/PowerPC/calls.ll (2110 of 34395)
PASS: LLVM :: Transforms/CodeExtractor/PartialInlineDebug.ll (2111 of 34395)
PASS: LLVM-Unit :: TextAPI/./TextAPITests/TBDv3.Platform_watchOS (2112 of 34395)
PASS: LLVM :: CodeGen/X86/sjlj.ll (2113 of 34395)
PASS: LLVM :: Transforms/InferFunctionAttrs/no-proto.ll (2114 of 34395)
PASS: LLVM :: CodeGen/ARM/thumb-stub.ll (2115 of 34395)
PASS: LLVM-Unit :: IR/./IRTests/ConstantsTest.IntSigns (2116 of 34395)
PASS: LLVM :: CodeGen/X86/2009-02-21-ExtWeakInitializer.ll (2117 of 34395)
PASS: LLVM :: CodeGen/Hexagon/simplify64bitops_7223.ll (2118 of 34395)
PASS: LLVM :: Transforms/IPConstantProp/PR43857.ll (2119 of 34395)
PASS: LLVM :: CodeGen/Mips/tls.ll (2120 of 34395)
UNSUPPORTED: LLVM :: MC/AVR/inst-sbrc.s (2121 of 34395)
PASS: LLVM :: MC/Disassembler/Hexagon/xtype_alu.txt (2122 of 34395)
PASS: LLVM :: Transforms/SimplifyCFG/PhiNoEliminate.ll (2123 of 34395)
PASS: LLVM :: tools/llvm-cfi-verify/X86/blacklist-expected-unprotected.s (2124 of 34395)
PASS: LLVM :: Transforms/GlobalOpt/constantfold-initializers.ll (2125 of 34395)
PASS: LLVM :: CodeGen/X86/i16lshr8pat.ll (2126 of 34395)
PASS: LLVM-Unit :: Support/./SupportTests/VirtualFileSystemTest.ThreeLevelIteration (2127 of 34395)
PASS: LLVM :: Analysis/DivergenceAnalysis/AMDGPU/llvm.amdgcn.image.atomic.ll (2128 of 34395)
PASS: LLVM :: CodeGen/ARM/GlobalISel/arm-isel-globals-pic.ll (2129 of 34395)
PASS: LLVM :: MC/Mips/elf_eflags_micromips2.s (2130 of 34395)
PASS: LLVM-Unit :: Support/./SupportTests/ReverseIterationTest.DenseMapTest2 (2131 of 34395)
PASS: LLVM :: Transforms/GlobalOpt/memset.ll (2132 of 34395)
PASS: LLVM :: DebugInfo/X86/single-dbg_value.ll (2133 of 34395)
PASS: LLVM :: Transforms/InstCombine/freeze.ll (2134 of 34395)
PASS: LLVM :: DebugInfo/X86/vla-dependencies.ll (2135 of 34395)
PASS: LLVM :: tools/llvm-rc/helpmsg.test (2136 of 34395)
PASS: LLVM :: MC/Mips/dsp/valid.s (2137 of 34395)
PASS: LLVM :: Transforms/LoopVectorize/X86/cost-model.ll (2138 of 34395)
PASS: LLVM :: CodeGen/SystemZ/ctpop-01.ll (2139 of 34395)
PASS: LLVM :: CodeGen/SystemZ/vec-cmp-01.ll (2140 of 34395)
PASS: LLVM :: Instrumentation/cgprofile.ll (2141 of 34395)
PASS: LLVM :: CodeGen/PowerPC/remove-redundant-load-imm.ll (2142 of 34395)
PASS: LLVM :: tools/llvm-objcopy/ELF/overlap-chain.test (2143 of 34395)
PASS: LLVM :: Transforms/LoopLoadElim/memcheck.ll (2144 of 34395)
PASS: LLVM :: CodeGen/X86/avx512vbmi2vl-intrinsics.ll (2145 of 34395)
PASS: LLVM :: CodeGen/AMDGPU/llvm.amdgcn.atomic.inc.ll (2146 of 34395)
PASS: LLVM :: YAMLParser/spec-07-06.test (2147 of 34395)
PASS: LLVM :: Transforms/LoopUnroll/2007-05-09-UnknownTripCount.ll (2148 of 34395)
PASS: LLVM-Unit :: Support/./SupportTests/FileSystemTest.permissions (2149 of 34395)
PASS: LLVM :: CodeGen/X86/pr18846.ll (2150 of 34395)
PASS: LLVM :: Transforms/LICM/pragma-licm-disable.ll (2151 of 34395)
PASS: LLVM :: CodeGen/AArch64/multi-vector-store-size.ll (2152 of 34395)
UNSUPPORTED: LLVM :: tools/llvm-exegesis/X86/analysis-cluster-stabilization-config.test (2153 of 34395)
PASS: LLVM :: MC/MachO/tlv-reloc.s (2154 of 34395)
PASS: LLVM :: Transforms/SimplifyCFG/select-gep.ll (2155 of 34395)
PASS: LLVM :: CodeGen/X86/fast-isel-deadcode.ll (2156 of 34395)
PASS: LLVM :: CodeGen/X86/2004-02-22-Casts.ll (2157 of 34395)
PASS: LLVM :: MC/ARM/invalid-crc32.s (2158 of 34395)
PASS: LLVM :: DebugInfo/X86/sroasplit-4.ll (2159 of 34395)
PASS: LLVM :: MC/X86/avx512vp2intersectvl-intel.s (2160 of 34395)
PASS: LLVM-Unit :: Support/./SupportTests/FileCheckTest.FileCheckContext (2161 of 34395)
PASS: LLVM :: CodeGen/PowerPC/2007-03-30-SpillerCrash.ll (2162 of 34395)
PASS: LLVM :: MC/ARM/directive-arch-armv4.s (2163 of 34395)
PASS: LLVM :: CodeGen/ARM/GlobalISel/select-dbg.mir (2164 of 34395)
PASS: LLVM :: MC/X86/XSAVEC-64.s (2165 of 34395)
PASS: LLVM :: ExecutionEngine/MCJIT/2003-01-04-PhiTest.ll (2166 of 34395)
PASS: LLVM :: CodeGen/WebAssembly/conv-trap.ll (2167 of 34395)
PASS: LLVM :: MC/AArch64/SVE/decb-diagnostics.s (2168 of 34395)
PASS: LLVM :: CodeGen/AArch64/GlobalISel/legalize-xor.mir (2169 of 34395)
PASS: LLVM :: MC/AArch64/SVE/not-diagnostics.s (2170 of 34395)
PASS: LLVM :: Transforms/Util/lowerinvoke-funclet.ll (2171 of 34395)
PASS: LLVM :: CodeGen/AArch64/fast-isel-cmp-branch.ll (2172 of 34395)
PASS: LLVM :: tools/llvm-profdata/compact-sample.proftext (2173 of 34395)
PASS: LLVM-Unit :: Support/./SupportTests/PCS_R9BuildAttr.testBuildAttr (2174 of 34395)
PASS: LLVM :: CodeGen/AArch64/fast-regalloc-empty-bb-with-liveins.mir (2175 of 34395)
PASS: LLVM-Unit :: ADT/./ADTTests/FilterIteratorTest.Lambda (2176 of 34395)
XFAIL: LLVM :: ExecutionEngine/MCJIT/remote/stubs-sm-pic.ll (2177 of 34395)
PASS: LLVM :: CodeGen/X86/undef-label.ll (2178 of 34395)
PASS: LLVM :: MC/AArch64/SVE/cmpeq.s (2179 of 34395)
PASS: LLVM :: TableGen/prep-diag14.td (2180 of 34395)
PASS: LLVM-Unit :: ADT/./ADTTests/APFloatTest.fromZeroDecimalSingleExponentString (2181 of 34395)
PASS: LLVM :: CodeGen/Hexagon/machine-cp-clobbers.mir (2182 of 34395)
PASS: LLVM :: MC/AArch64/SVE/fabs.s (2183 of 34395)
PASS: LLVM :: CodeGen/X86/avx512ifmavl-intrinsics-fast-isel.ll (2184 of 34395)
PASS: LLVM :: MC/AsmParser/directive_incbin.s (2185 of 34395)
PASS: LLVM :: MC/AArch64/SVE2/sqdmulh-diagnostics.s (2186 of 34395)
PASS: LLVM :: CodeGen/Hexagon/opt-spill-volatile.ll (2187 of 34395)
PASS: LLVM :: Transforms/SLPVectorizer/X86/arith-sub.ll (2188 of 34395)
PASS: LLVM-Unit :: Support/./SupportTests/SourceMgrTest.LocationBeforeEndOf255ByteBuffer (2189 of 34395)
PASS: LLVM :: CodeGen/AArch64/regress-w29-reserved-with-fp.ll (2190 of 34395)
PASS: LLVM :: CodeGen/AArch64/fast-isel-cmp-vec.ll (2191 of 34395)
PASS: LLVM :: CodeGen/X86/2009-06-15-not-a-tail-call.ll (2192 of 34395)
PASS: LLVM :: CodeGen/ARM/inlineasm-global.ll (2193 of 34395)
PASS: LLVM :: CodeGen/AMDGPU/commute-compares.ll (2194 of 34395)
PASS: LLVM :: MC/Disassembler/ARM/neont2.txt (2195 of 34395)
PASS: LLVM :: CodeGen/Mips/return-vector.ll (2196 of 34395)
PASS: LLVM :: CodeGen/ARM/func-argpassing-endian.ll (2197 of 34395)
PASS: LLVM :: CodeGen/X86/sqrt-fastmath.ll (2198 of 34395)
PASS: LLVM :: CodeGen/X86/discriminate-mem-ops-skip-pfetch.ll (2199 of 34395)
PASS: LLVM :: tools/llvm-cov/style.test (2200 of 34395)
PASS: LLVM :: CodeGen/SystemZ/vec-args-02.ll (2201 of 34395)
PASS: LLVM :: CodeGen/X86/ps4-noreturn.ll (2202 of 34395)
PASS: LLVM :: CodeGen/Hexagon/combiner-lts.ll (2203 of 34395)
PASS: LLVM :: Transforms/InstCombine/memmove_chk-1.ll (2204 of 34395)
PASS: LLVM :: CodeGen/WebAssembly/conv.ll (2205 of 34395)
UNSUPPORTED: LLVM :: CodeGen/AVR/software-mul.ll (2206 of 34395)
PASS: LLVM :: tools/llvm-mca/X86/SkylakeClient/resources-avx2.s (2207 of 34395)
PASS: LLVM :: Transforms/LoopVectorize/if-conversion.ll (2208 of 34395)
PASS: LLVM :: CodeGen/SystemZ/vec-args-07.ll (2209 of 34395)
PASS: LLVM :: tools/llvm-dwarfdump/X86/debug-verify-object.s (2210 of 34395)
PASS: LLVM :: Analysis/MemorySSA/cyclicphi.ll (2211 of 34395)
PASS: LLVM :: MC/AArch64/SVE/uqadd-diagnostics.s (2212 of 34395)
PASS: LLVM :: CodeGen/ARM/2009-05-11-CodePlacementCrash.ll (2213 of 34395)
PASS: LLVM :: MC/MachO/PowerPC/coal-sections-powerpc.s (2214 of 34395)
PASS: LLVM :: TableGen/intrinsic-struct.td (2215 of 34395)
PASS: LLVM :: CodeGen/BPF/load.ll (2216 of 34395)
PASS: LLVM-Unit :: ADT/./ADTTests/APIntTest.GetMostSignificantDifferentBitExaustive (2217 of 34395)
PASS: LLVM :: CodeGen/PowerPC/mi-scheduling-lhs.ll (2218 of 34395)
PASS: LLVM-Unit :: Support/./SupportTests/CheckedArithmetic.CheckedMulAddUnsigned (2219 of 34395)
PASS: LLVM :: Transforms/Inline/byval_lifetime.ll (2220 of 34395)
PASS: LLVM :: tools/llvm-mca/X86/option-all-stats-2.s (2221 of 34395)
PASS: LLVM :: CodeGen/Hexagon/aggr-antidep-tied.ll (2222 of 34395)
PASS: LLVM :: Transforms/InstCombine/pr33689_same_bitwidth.ll (2223 of 34395)
PASS: LLVM :: MC/AArch64/SVE/fscale-diagnostics.s (2224 of 34395)
PASS: LLVM :: Analysis/CostModel/X86/reduce-and.ll (2225 of 34395)
PASS: LLVM-Unit :: Support/./SupportTests/AlignmentTest.offsetToAlignment (2226 of 34395)
PASS: LLVM :: CodeGen/X86/rotate-extract.ll (2227 of 34395)
PASS: LLVM-Unit :: Support/./SupportTests/VirtualFileSystemTest.OverlayIteration (2228 of 34395)
PASS: LLVM :: Analysis/LoopAccessAnalysis/wrapping-pointer-ni.ll (2229 of 34395)
PASS: LLVM :: Transforms/InstCombine/fpcast.ll (2230 of 34395)
PASS: LLVM-Unit :: Support/./SupportTests/YAMLIO.TestDirectiveMappingNoValue (2231 of 34395)
PASS: LLVM :: Transforms/MemCpyOpt/process_store.ll (2232 of 34395)
PASS: LLVM :: tools/llvm-objdump/file-headers-coff.test (2233 of 34395)
PASS: LLVM :: Analysis/LoopAccessAnalysis/forward-loop-carried.ll (2234 of 34395)
PASS: LLVM :: CodeGen/Mips/cconv/arguments-small-structures-bigger-than-32bits.ll (2235 of 34395)
PASS: LLVM :: tools/dsymutil/X86/basic-linking-bundle.test (2236 of 34395)
PASS: LLVM :: CodeGen/ARM/vst1.ll (2237 of 34395)
PASS: LLVM :: CodeGen/Hexagon/memcmp.ll (2238 of 34395)
PASS: LLVM :: CodeGen/ARM/ParallelDSP/smlad4.ll (2239 of 34395)
XFAIL: LLVM :: DebugInfo/ARM/line.test (2240 of 34395)
UNSUPPORTED: LLVM :: tools/gold/X86/pr25907.ll (2241 of 34395)
UNSUPPORTED: LLVM :: tools/gold/X86/ctors2.ll (2242 of 34395)
PASS: LLVM :: CodeGen/Hexagon/expand-condsets-impuse.mir (2243 of 34395)
PASS: LLVM :: CodeGen/X86/pr40289-64bit.ll (2244 of 34395)
PASS: LLVM-Unit :: ProfileData/./ProfileDataTests/ParameterizedCovMapTest/CoverageMappingTest.dont_emit_closing_segment_at_new_region_start/2 (2245 of 34395)
PASS: LLVM :: CodeGen/SystemZ/int-sadd-07.ll (2246 of 34395)
PASS: LLVM :: Transforms/InstCombine/2004-12-08-RemInfiniteLoop.ll (2247 of 34395)
PASS: LLVM :: CodeGen/SystemZ/vec-strict-mul-01.ll (2248 of 34395)
PASS: LLVM :: MC/AArch64/SVE/ld1sb-diagnostics.s (2249 of 34395)
PASS: LLVM :: CodeGen/PowerPC/lrint-conv.ll (2250 of 34395)
PASS: LLVM :: Transforms/ObjCARC/provenance.ll (2251 of 34395)
PASS: LLVM :: tools/llvm-objcopy/ELF/regex.test (2252 of 34395)
PASS: LLVM :: CodeGen/SystemZ/alloca-01.ll (2253 of 34395)
PASS: LLVM-Unit :: TextAPI/./TextAPITests/TBDv3.Swift_4_0 (2254 of 34395)
PASS: LLVM :: tools/llvm-objdump/macho-sections.test (2255 of 34395)
PASS: LLVM :: MC/ARM/mve-vcmp.s (2256 of 34395)
PASS: LLVM :: CodeGen/SPARC/stack-protector.ll (2257 of 34395)
PASS: LLVM :: MC/Hexagon/instructions/xtype_pred.s (2258 of 34395)
PASS: LLVM-Unit :: ExecutionEngine/Orc/./OrcJITTests/CoreAPIsStandardTest.TestTrivialCircularDependency (2259 of 34395)
PASS: LLVM :: MC/AArch64/SVE/frintx.s (2260 of 34395)
PASS: LLVM-Unit :: Support/./SupportTests/MVEBuildAttr.testBuildAttr (2261 of 34395)
PASS: LLVM :: CodeGen/ARM/lrint-conv.ll (2262 of 34395)
PASS: LLVM :: Transforms/InferAddressSpaces/NVPTX/bug31948.ll (2263 of 34395)
PASS: LLVM :: DebugInfo/Generic/PR20038.ll (2264 of 34395)
PASS: LLVM :: ExecutionEngine/OrcLazy/global_aliases.ll (2265 of 34395)
PASS: LLVM :: CodeGen/AArch64/arm64-vhsub.ll (2266 of 34395)
PASS: LLVM :: Analysis/CostModel/ARM/arith.ll (2267 of 34395)
PASS: LLVM :: MC/ARM/eh-directive-personality-diagnostics.s (2268 of 34395)
PASS: LLVM-Unit :: Option/./OptionTests/Option.SlurpJoinedOneJoined (2269 of 34395)
PASS: LLVM :: CodeGen/SPARC/missing-sret.ll (2270 of 34395)
PASS: LLVM :: Instrumentation/ThreadSanitizer/tsan-vs-gvn.ll (2271 of 34395)
PASS: LLVM :: CodeGen/AMDGPU/knownbits-recursion.ll (2272 of 34395)
PASS: LLVM :: CodeGen/Thumb2/mve-fmath.ll (2273 of 34395)
PASS: LLVM :: CodeGen/ARM/cmn.ll (2274 of 34395)
PASS: LLVM :: MC/AArch64/SVE/subr-diagnostics.s (2275 of 34395)
PASS: LLVM :: tools/llvm-objcopy/ELF/strip-sections-keep.test (2276 of 34395)
PASS: LLVM :: DebugInfo/X86/abstract_origin.ll (2277 of 34395)
PASS: LLVM :: Bitcode/extractelement.ll (2278 of 34395)
PASS: LLVM :: CodeGen/PowerPC/ppc64-P9-vabsd.ll (2279 of 34395)
PASS: LLVM :: tools/llvm-readobj/note-core-ntfile.test (2280 of 34395)
PASS: LLVM :: Bitcode/upgrade-loop-metadata.ll (2281 of 34395)
PASS: LLVM :: CodeGen/Thumb/2012-04-26-M0ISelBug.ll (2282 of 34395)
PASS: LLVM :: Transforms/SimplifyCFG/2008-12-16-DCECond.ll (2283 of 34395)
PASS: LLVM :: CodeGen/Thumb/consthoist-few-dependents.ll (2284 of 34395)
PASS: LLVM :: Transforms/JumpThreading/phi-known.ll (2285 of 34395)
PASS: LLVM :: MC/AArch64/SVE/ldff1d.s (2286 of 34395)
PASS: LLVM :: Assembler/invalid-uselistorder-function-between-blocks.ll (2287 of 34395)
PASS: LLVM :: CodeGen/X86/pr21099.ll (2288 of 34395)
PASS: LLVM :: MC/X86/RDTSCP-64.s (2289 of 34395)
PASS: LLVM :: MC/X86/RDPMC-32.s (2290 of 34395)
PASS: LLVM :: CodeGen/X86/sse_partial_update.ll (2291 of 34395)
PASS: LLVM :: tools/llvm-mca/X86/intel-syntax.s (2292 of 34395)
PASS: LLVM :: Object/X86/obj2yaml-dup-section-name.s (2293 of 34395)
PASS: LLVM :: CodeGen/AMDGPU/inline-attr.ll (2294 of 34395)
PASS: LLVM :: tools/llvm-profdata/overflow-sample.test (2295 of 34395)
PASS: LLVM :: CodeGen/SystemZ/fp-move-07.ll (2296 of 34395)
PASS: LLVM :: CodeGen/AArch64/unreachable-emergency-spill-slot.mir (2297 of 34395)
PASS: LLVM :: MC/ARM/ldr-pseudo-obj-errors.s (2298 of 34395)
PASS: LLVM :: Transforms/LoopStrengthReduce/missing-phi-operand-update.ll (2299 of 34395)
PASS: LLVM :: CodeGen/PowerPC/no-dead-strip.ll (2300 of 34395)
PASS: LLVM :: CodeGen/X86/system-intrinsics-64-xsave.ll (2301 of 34395)
PASS: LLVM :: CodeGen/NVPTX/tex-read.ll (2302 of 34395)
PASS: LLVM :: CodeGen/AMDGPU/sint_to_fp.ll (2303 of 34395)
PASS: LLVM :: MC/AArch64/SVE/nand.s (2304 of 34395)
PASS: LLVM :: FileCheck/next-no-match.txt (2305 of 34395)
PASS: LLVM-Unit :: Support/./SupportTests/LineIteratorTest.CommentSkippingKeepBlanks (2306 of 34395)
PASS: LLVM :: Transforms/InstCombine/redundant-left-shift-input-masking-after-truncation-variant-f.ll (2307 of 34395)
PASS: LLVM :: CodeGen/X86/fast-isel-float-half-convertion.ll (2308 of 34395)
PASS: LLVM :: tools/llvm-mca/X86/Broadwell/resources-bmi2.s (2309 of 34395)
PASS: LLVM :: MC/AArch64/armv8.1a-pan.s (2310 of 34395)
PASS: LLVM :: CodeGen/SystemZ/atomicrmw-xor-01.ll (2311 of 34395)
PASS: LLVM :: Transforms/LoopVectorize/if-reduction.ll (2312 of 34395)
PASS: LLVM :: CodeGen/AMDGPU/GlobalISel/regbankselect-amdgcn.cvt.pkrtz.mir (2313 of 34395)
PASS: LLVM :: Transforms/ObjCARC/empty-block.ll (2314 of 34395)
PASS: LLVM :: CodeGen/AArch64/GlobalISel/legalize-ceil.mir (2315 of 34395)
PASS: LLVM :: CodeGen/Hexagon/hwloop-noreturn-call.ll (2316 of 34395)
PASS: LLVM :: Transforms/IndVarSimplify/elim-extend.ll (2317 of 34395)
PASS: LLVM-Unit :: ADT/./ADTTests/STLExtrasTest.CountAdaptor (2318 of 34395)
PASS: LLVM-Unit :: Transforms/Scalar/./ScalarTests/LoopPassManagerTest.ModulePassInvalidationOfLoopAnalyses (2319 of 34395)
PASS: LLVM :: tools/llvm-readobj/program-headers.test (2320 of 34395)
PASS: LLVM-Unit :: ExecutionEngine/MCJIT/./MCJITTests/MCJITMultipleModuleTest.three_modules_chain_case_reverse_order (2321 of 34395)
PASS: LLVM :: Analysis/BasicAA/2009-03-04-GEPNoalias.ll (2322 of 34395)
PASS: LLVM :: MC/X86/gfni-encoding.s (2323 of 34395)
PASS: LLVM :: CodeGen/ARM/ldaex-stlex.ll (2324 of 34395)
PASS: LLVM :: YAMLParser/duplicate-key.former-loader-error.test (2325 of 34395)
PASS: LLVM :: MC/AArch64/coff-align.s (2326 of 34395)
PASS: LLVM :: Transforms/Inline/2008-09-02-NoInline.ll (2327 of 34395)
PASS: LLVM-Unit :: BinaryFormat/./BinaryFormatTests/MsgPackReader.TestReadUInt32Zero (2328 of 34395)
PASS: LLVM :: CodeGen/X86/2009-01-27-NullStrings.ll (2329 of 34395)
PASS: LLVM :: CodeGen/X86/sse2-vector-shifts.ll (2330 of 34395)
PASS: LLVM :: Transforms/WholeProgramDevirt/branch-funnel-threshold.ll (2331 of 34395)
PASS: LLVM-Unit :: IR/./IRTests/DILocationTest.Merge (2332 of 34395)
PASS: LLVM :: CodeGen/Generic/div-neg-power-2.ll (2333 of 34395)
PASS: LLVM :: YAMLParser/spec-05-07.test (2334 of 34395)
PASS: LLVM :: Analysis/MemorySSA/pr40509.ll (2335 of 34395)
PASS: LLVM-Unit :: MI/./MITests/LiveIntervalTest.MoveDownEarlyDef (2336 of 34395)
PASS: LLVM :: CodeGen/WebAssembly/simd-bitcasts.ll (2337 of 34395)
PASS: LLVM-Unit :: BinaryFormat/./BinaryFormatTests/MsgPackReader.TestReadUInt8Max (2338 of 34395)
PASS: LLVM :: Transforms/PhaseOrdering/unsigned-multiply-overflow-check.ll (2339 of 34395)
PASS: LLVM :: Transforms/GVN/pr10820.ll (2340 of 34395)
PASS: LLVM :: CodeGen/ARM/fast-isel-indirectbr.ll (2341 of 34395)
PASS: LLVM :: CodeGen/ARM/GlobalISel/thumb-select-casts.mir (2342 of 34395)
PASS: LLVM-Unit :: ADT/./ADTTests/DenseMapTest/2.CopyConstructorFromDefaultTest (2343 of 34395)
UNSUPPORTED: LLVM :: CodeGen/AVR/pseudo/STWPtrRr.mir (2344 of 34395)
PASS: LLVM :: CodeGen/Mips/msa/special.ll (2345 of 34395)
PASS: LLVM :: Analysis/ValueTracking/func-ptr-lsb.ll (2346 of 34395)
PASS: LLVM :: CodeGen/X86/logical-load-fold.ll (2347 of 34395)
PASS: LLVM :: CodeGen/RISCV/exception-pointer-register.ll (2348 of 34395)
PASS: LLVM :: Transforms/PGOProfile/select_hash_conflict.ll (2349 of 34395)
PASS: LLVM :: tools/llvm-readobj/mips-got-overlapped.test (2350 of 34395)
PASS: LLVM :: MC/AArch64/SVE2/ssublb-diagnostics.s (2351 of 34395)
PASS: LLVM :: DebugInfo/X86/containing-type-extension-rust.ll (2352 of 34395)
PASS: LLVM :: CodeGen/Hexagon/intrinsics/atomic_store.ll (2353 of 34395)
PASS: LLVM :: Transforms/InstCombine/cos-sin-intrinsic.ll (2354 of 34395)
PASS: LLVM :: CodeGen/AArch64/windows-SEH-support.ll (2355 of 34395)
PASS: LLVM :: CodeGen/ARM/xray-tail-call-sled.ll (2356 of 34395)
PASS: LLVM :: Transforms/SimplifyCFG/switch_create.ll (2357 of 34395)
PASS: LLVM :: tools/yaml2obj/invalid-docnum.test (2358 of 34395)
PASS: LLVM :: CodeGen/Thumb2/thumb2-str.ll (2359 of 34395)
PASS: LLVM :: Transforms/InstCombine/phi-select-constant.ll (2360 of 34395)
PASS: LLVM :: CodeGen/X86/pr27501.ll (2361 of 34395)
PASS: LLVM :: Transforms/LoopVectorize/X86/pr42674.ll (2362 of 34395)
PASS: LLVM :: CodeGen/Generic/dag-combine-crash.ll (2363 of 34395)
PASS: LLVM :: CodeGen/AArch64/fcopysign.ll (2364 of 34395)
PASS: LLVM :: Transforms/LoopVectorize/tbaa-nodep.ll (2365 of 34395)
PASS: LLVM :: CodeGen/X86/bswap-vector.ll (2366 of 34395)
PASS: LLVM :: MC/ELF/div-by-zero.s (2367 of 34395)
PASS: LLVM-Unit :: Analysis/./AnalysisTests/MatchSelectPatternTest.FMaxMismatchConstantZero1 (2368 of 34395)
PASS: LLVM :: CodeGen/AArch64/fp16_intrinsic_scalar_3op.ll (2369 of 34395)
PASS: LLVM :: Integer/instructions_bt.ll (2370 of 34395)
PASS: LLVM-Unit :: Analysis/./AnalysisTests/MatchSelectPatternTest.FMinMismatchConstantZero5 (2371 of 34395)
PASS: LLVM :: MC/ARM/eh-directive-vsave.s (2372 of 34395)
PASS: LLVM :: CodeGen/ARM/peephole-phi.mir (2373 of 34395)
PASS: LLVM :: CodeGen/X86/isint.ll (2374 of 34395)
PASS: LLVM-Unit :: tools/llvm-cfi-verify/./CFIVerifyTests/BasicX86FileAnalysisTest.BasicDisassemblyTraversalTest (2375 of 34395)
PASS: LLVM-Unit :: ADT/./ADTTests/SmallVectorTest/2.InsertRepeatedTest (2376 of 34395)
PASS: LLVM :: Transforms/LoadStoreVectorizer/AMDGPU/no-implicit-float.ll (2377 of 34395)
PASS: LLVM :: CodeGen/Hexagon/cmp_pred2.ll (2378 of 34395)
PASS: LLVM :: CodeGen/SystemZ/int-mul-04.ll (2379 of 34395)
PASS: LLVM :: tools/llvm-objdump/X86/macho-literal-pointers-x86_64.test (2380 of 34395)
PASS: LLVM :: CodeGen/X86/dynamic-alloca-in-entry.ll (2381 of 34395)
PASS: LLVM :: MC/ELF/reloc-same-name-section.s (2382 of 34395)
PASS: LLVM :: ExecutionEngine/OrcMCJIT/stubs.ll (2383 of 34395)
PASS: LLVM :: CodeGen/MIR/X86/constant-pool-item-redefinition-error.mir (2384 of 34395)
PASS: LLVM :: MC/Disassembler/PowerPC/ppc64-operands.txt (2385 of 34395)
PASS: LLVM :: CodeGen/AArch64/arm64-call-tailcalls.ll (2386 of 34395)
PASS: LLVM-Unit :: IR/./IRTests/PatternMatchTest.FloatingPointUnorderedMax (2387 of 34395)
PASS: LLVM :: CodeGen/ARM/global-merge-1.ll (2388 of 34395)
PASS: LLVM :: CodeGen/AMDGPU/GlobalISel/legalize-cttz.mir (2389 of 34395)
PASS: LLVM :: CodeGen/PowerPC/vec_conv_i8_to_fp64_elts.ll (2390 of 34395)
PASS: LLVM :: CodeGen/SystemZ/asm-20.ll (2391 of 34395)
PASS: LLVM :: CodeGen/Hexagon/asr-rnd64.ll (2392 of 34395)
PASS: LLVM :: CodeGen/X86/sse-align-2.ll (2393 of 34395)
PASS: LLVM :: CodeGen/WebAssembly/f32.ll (2394 of 34395)
PASS: LLVM :: CodeGen/WebAssembly/load-store-pic.ll (2395 of 34395)
PASS: LLVM :: MC/X86/I386-32.s (2396 of 34395)
PASS: LLVM :: CodeGen/Thumb2/mve-intrinsics/scatter-gather.ll (2397 of 34395)
PASS: LLVM :: Transforms/Inline/inline-constexpr-addrspacecast-argument.ll (2398 of 34395)
PASS: LLVM :: Verifier/comdat-decl1.ll (2399 of 34395)
PASS: LLVM :: MC/Mips/cpload-bad.s (2400 of 34395)
PASS: LLVM :: CodeGen/X86/ret-mmx.ll (2401 of 34395)
PASS: LLVM :: tools/llvm-mca/X86/Barcelona/resources-3dnow.s (2402 of 34395)
PASS: LLVM :: CodeGen/AArch64/GlobalISel/select-atomicrmw.mir (2403 of 34395)
PASS: LLVM :: CodeGen/X86/peephole-recurrence.mir (2404 of 34395)
PASS: LLVM :: Transforms/MergeFunc/phi-check-blocks.ll (2405 of 34395)
PASS: LLVM :: tools/llvm-ar/mri3.test (2406 of 34395)
PASS: LLVM :: Analysis/BasicAA/gep-alias.ll (2407 of 34395)
PASS: LLVM :: ExecutionEngine/OrcLazy/anonymous_globals.ll (2408 of 34395)
PASS: LLVM :: CodeGen/X86/widen_cast-2.ll (2409 of 34395)
PASS: LLVM :: Transforms/GlobalOpt/globalsra.ll (2410 of 34395)
PASS: LLVM :: CodeGen/PowerPC/fast-isel-fpconv.ll (2411 of 34395)
PASS: LLVM :: Transforms/LoopDistribute/program-order.ll (2412 of 34395)
PASS: LLVM :: CodeGen/Thumb/ldm-stm-postinc.ll (2413 of 34395)
PASS: LLVM-Unit :: tools/llvm-cfi-verify/./CFIVerifyTests/BasicGraphBuilderTest.BuildFlowGraphTestDualPathDualUd2 (2414 of 34395)
PASS: LLVM :: Instrumentation/AddressSanitizer/do-not-instrument-globals-darwin.ll (2415 of 34395)
PASS: LLVM :: CodeGen/X86/commute-intrinsic.ll (2416 of 34395)
PASS: LLVM-Unit :: Support/./SupportTests/SourceMgrTest.BasicRange (2417 of 34395)
PASS: LLVM-Unit :: IR/./IRTests/DominatorTree.DeletingEdgesIntroducesInfiniteLoop (2418 of 34395)
PASS: LLVM :: CodeGen/ARM/bswap16.ll (2419 of 34395)
PASS: LLVM :: MC/Mips/dspr2/invalid.s (2420 of 34395)
PASS: LLVM :: Transforms/InstCombine/AArch64/tbl1.ll (2421 of 34395)
PASS: LLVM :: CodeGen/X86/atomic-unordered.ll (2422 of 34395)
PASS: LLVM :: Transforms/LoopInterchange/interchange-flow-dep-outer.ll (2423 of 34395)
PASS: LLVM :: CodeGen/MIR/X86/cfi-def-cfa-offset.mir (2424 of 34395)
PASS: LLVM :: MC/AArch64/SVE/fcvt-diagnostics.s (2425 of 34395)
PASS: LLVM :: tools/llvm-dwarfdump/X86/archive.test (2426 of 34395)
PASS: LLVM :: Other/2007-09-10-PassManager.ll (2427 of 34395)
PASS: LLVM :: CodeGen/X86/pr22774.ll (2428 of 34395)
PASS: LLVM :: CodeGen/Thumb2/t2sizereduction.mir (2429 of 34395)
PASS: LLVM :: Verifier/dbg.ll (2430 of 34395)
PASS: LLVM :: CodeGen/X86/inline-asm-n-constraint.ll (2431 of 34395)
UNSUPPORTED: LLVM :: CodeGen/AVR/pre-schedule.ll (2432 of 34395)
PASS: LLVM :: CodeGen/AMDGPU/GlobalISel/regbankselect-uaddo.mir (2433 of 34395)
PASS: LLVM :: CodeGen/X86/avx512vp2intersect-intrinsics.ll (2434 of 34395)
PASS: LLVM :: Analysis/CostModel/X86/reduce-umin.ll (2435 of 34395)
PASS: LLVM :: CodeGen/Hexagon/autohvx/isel-setcc-v256i1.ll (2436 of 34395)
PASS: LLVM :: tools/llvm-mca/X86/BtVer2/reg-move-elimination-4.s (2437 of 34395)
PASS: LLVM :: Verifier/atomics.ll (2438 of 34395)
PASS: LLVM :: CodeGen/AMDGPU/lds-branch-vmem-hazard.mir (2439 of 34395)
PASS: LLVM :: MC/ARM/directive-arch-armv6z.s (2440 of 34395)
PASS: LLVM :: CodeGen/X86/seh-safe-div.ll (2441 of 34395)
PASS: LLVM-Unit :: Support/./SupportTests/CheckedArithmetic.CheckedMulAddSmall (2442 of 34395)
PASS: LLVM :: CodeGen/WebAssembly/f16.ll (2443 of 34395)
PASS: LLVM :: CodeGen/X86/variable-sized-darwin-bzero.ll (2444 of 34395)
PASS: LLVM :: Instrumentation/AddressSanitizer/global_metadata_external_comdat.ll (2445 of 34395)
PASS: LLVM :: Transforms/DeadStoreElimination/tail-byval.ll (2446 of 34395)
PASS: LLVM :: CodeGen/AMDGPU/GlobalISel/global-value.ll (2447 of 34395)
PASS: LLVM :: CodeGen/ARM/Windows/no-frame-register.ll (2448 of 34395)
PASS: LLVM :: CodeGen/XCore/scavenging.ll (2449 of 34395)
PASS: LLVM-Unit :: Support/./SupportTests/NativeFormatTest.HexTests (2450 of 34395)
PASS: LLVM :: CodeGen/AMDGPU/llvm.amdgcn.interp.ll (2451 of 34395)
PASS: LLVM :: Transforms/SimplifyCFG/branch-fold-threshold.ll (2452 of 34395)
PASS: LLVM-Unit :: Analysis/./AnalysisTests/ScalarEvolutionsTest.SCEVExpandInsertCanonicalIV (2453 of 34395)
PASS: LLVM :: CodeGen/SystemZ/int-move-04.ll (2454 of 34395)
PASS: LLVM :: Transforms/SLPVectorizer/X86/long_chains.ll (2455 of 34395)
PASS: LLVM :: Bitcode/upgrade-pointer-address-space.ll (2456 of 34395)
PASS: LLVM :: CodeGen/SystemZ/int-sub-09.ll (2457 of 34395)
PASS: LLVM :: CodeGen/AArch64/GlobalISel/gisel-commandline-option.ll (2458 of 34395)
PASS: LLVM :: MC/AMDGPU/vop3-modifiers.s (2459 of 34395)
PASS: LLVM :: CodeGen/SystemZ/fp-libcall.ll (2460 of 34395)
PASS: LLVM :: CodeGen/Mips/GlobalISel/llvm-ir/float_constants.ll (2461 of 34395)
PASS: LLVM :: CodeGen/AMDGPU/fcmp-cnde-int-args.ll (2462 of 34395)
PASS: LLVM :: CodeGen/Thumb2/mve-vsubqr.ll (2463 of 34395)
PASS: LLVM :: CodeGen/AArch64/neon-scalar-by-elem-fma.ll (2464 of 34395)
PASS: LLVM :: MC/Hexagon/capitalizedEndloop.s (2465 of 34395)
PASS: LLVM :: CodeGen/X86/function-subtarget-features-2.ll (2466 of 34395)
PASS: LLVM-Unit :: ADT/./ADTTests/DenseMapTest/2.IterationTest (2467 of 34395)
PASS: LLVM :: CodeGen/AMDGPU/bfe-patterns.ll (2468 of 34395)
PASS: LLVM :: CodeGen/SystemZ/asm-08.ll (2469 of 34395)
PASS: LLVM :: Transforms/Inline/noinline.ll (2470 of 34395)
PASS: LLVM :: CodeGen/AArch64/unfold-masked-merge-scalar-constmask-innerouter.ll (2471 of 34395)
PASS: LLVM :: MC/Hexagon/instructions/xtype_bit.s (2472 of 34395)
PASS: LLVM :: CodeGen/Mips/sr1.ll (2473 of 34395)
PASS: LLVM :: Transforms/Reassociate/otherops.ll (2474 of 34395)
PASS: LLVM :: MC/X86/avx512ifmavl-encoding.s (2475 of 34395)
PASS: LLVM :: MC/Disassembler/Mips/mips64r2/valid-mips64r2-el.txt (2476 of 34395)
PASS: LLVM :: Object/multi-module.ll (2477 of 34395)
PASS: LLVM :: CodeGen/AArch64/GlobalISel/legalize-fcmp.mir (2478 of 34395)
PASS: LLVM-Unit :: ADT/./ADTTests/OptionalTest.MoveOnlyNullingAssignment (2479 of 34395)
PASS: LLVM :: CodeGen/X86/cfi-inserter-cfg-with-merge.mir (2480 of 34395)
PASS: LLVM :: CodeGen/Hexagon/rdf-multiple-phis-up.ll (2481 of 34395)
PASS: LLVM :: MC/Mips/cnmips/invalid.s (2482 of 34395)
PASS: LLVM :: CodeGen/ARM/arm32-round-conv.ll (2483 of 34395)
PASS: LLVM :: CodeGen/PowerPC/addze.ll (2484 of 34395)
PASS: LLVM :: CodeGen/X86/setjmp-spills.ll (2485 of 34395)
XFAIL: LLVM :: CodeGen/Hexagon/addr-mode-opt.ll (2486 of 34395)
PASS: LLVM :: CodeGen/Hexagon/swp-epilog-reuse.ll (2487 of 34395)
PASS: LLVM-Unit :: ADT/./ADTTests/MappedIteratorTest.FunctionPreservesReferences (2488 of 34395)
PASS: LLVM :: CodeGen/X86/uadd_sat_vec.ll (2489 of 34395)
PASS: LLVM-Unit :: Transforms/Vectorize/./VectorizeTests/VPlanHCFGTest.testBuildHCFGInnerLoop (2490 of 34395)
PASS: LLVM :: CodeGen/Hexagon/addrmode-rr-to-io.mir (2491 of 34395)
PASS: LLVM :: ExecutionEngine/MCJIT/2003-08-23-RegisterAllocatePhysReg.ll (2492 of 34395)
PASS: LLVM :: tools/llvm-extract/extract-multiple-blocks.ll (2493 of 34395)
PASS: LLVM :: CodeGen/AMDGPU/GlobalISel/inst-select-fcmp.mir (2494 of 34395)
PASS: LLVM :: CodeGen/Hexagon/load-abs.ll (2495 of 34395)
PASS: LLVM :: Transforms/ADCE/basictest1.ll (2496 of 34395)
PASS: LLVM :: CodeGen/X86/fast-isel-expect.ll (2497 of 34395)
PASS: LLVM-Unit :: ProfileData/./ProfileDataTests/ParameterizedCovMapTest/CoverageMappingTest.uncovered_function/2 (2498 of 34395)
PASS: LLVM :: Transforms/LoopVectorize/AArch64/induction-trunc.ll (2499 of 34395)
PASS: LLVM-Unit :: Transforms/Utils/./UtilsTests/CloneFunc.NewFunctionCreated (2500 of 34395)
PASS: LLVM :: CodeGen/Hexagon/bug-hcp-tied-kill.ll (2501 of 34395)
PASS: LLVM :: Transforms/LoopIdiom/nontemporal_store.ll (2502 of 34395)
PASS: LLVM-Unit :: ADT/./ADTTests/SmallVectorTest/3.MoveAssignTest (2503 of 34395)
PASS: LLVM :: CodeGen/AMDGPU/si-spill-cf.ll (2504 of 34395)
PASS: LLVM :: DebugInfo/X86/fi-expr.ll (2505 of 34395)
PASS: LLVM :: Object/no-section-header-string-table.test (2506 of 34395)
PASS: LLVM :: CodeGen/Mips/GlobalISel/llvm-ir/long_ambiguous_chain_s64.ll (2507 of 34395)
PASS: LLVM :: Transforms/InstCombine/strncpy_chk-1.ll (2508 of 34395)
PASS: LLVM :: CodeGen/AMDGPU/hsa-metadata-from-llvm-ir-full-v3.ll (2509 of 34395)
PASS: LLVM :: CodeGen/X86/GlobalISel/x86-legalize-GV.mir (2510 of 34395)
PASS: LLVM :: CodeGen/X86/hipe-cc64.ll (2511 of 34395)
PASS: LLVM :: CodeGen/ARM/ParallelDSP/smladx-1.ll (2512 of 34395)
PASS: LLVM :: tools/llvm-dwarfdump/X86/debug-names-verify-completeness.s (2513 of 34395)
PASS: LLVM :: MC/AMDGPU/literal16.s (2514 of 34395)
PASS: LLVM :: DebugInfo/X86/dw_op_minus_direct.ll (2515 of 34395)
PASS: LLVM-Unit :: ADT/./ADTTests/SmallVectorTest/3.DirectVectorTest (2516 of 34395)
PASS: LLVM :: CodeGen/SystemZ/twoaddr-sink.ll (2517 of 34395)
PASS: LLVM :: tools/llvm-readobj/elf-wrong-shstrtab-type.test (2518 of 34395)
PASS: LLVM :: CodeGen/SystemZ/not-01.ll (2519 of 34395)
PASS: LLVM :: Analysis/ConstantFolding/gep-zeroinit-vector.ll (2520 of 34395)
PASS: LLVM :: Assembler/2002-08-15-ConstantExprProblem.ll (2521 of 34395)
PASS: LLVM :: Transforms/InstCombine/cabs-array.ll (2522 of 34395)
XFAIL: LLVM :: MC/Disassembler/Mips/mips64/valid-xfail.txt (2523 of 34395)
PASS: LLVM-Unit :: Transforms/Vectorize/./VectorizeTests/VPInstructionTest.insertBefore (2524 of 34395)
PASS: LLVM :: DebugInfo/COFF/pr28747.ll (2525 of 34395)
PASS: LLVM :: Analysis/LegacyDivergenceAnalysis/AMDGPU/loads.ll (2526 of 34395)
PASS: LLVM :: Transforms/CodeGenPrepare/AArch64/large-offset-gep.ll (2527 of 34395)
PASS: LLVM-Unit :: ProfileData/./ProfileDataTests/ParameterizedCovMapTest/CoverageMappingTest.create_combined_regions/2 (2528 of 34395)
PASS: LLVM :: CodeGen/X86/GlobalISel/select-constant.mir (2529 of 34395)
PASS: LLVM :: CodeGen/Mips/GlobalISel/legalizer/select.mir (2530 of 34395)
PASS: LLVM :: Transforms/IndVarSimplify/pr24952.ll (2531 of 34395)
PASS: LLVM :: Transforms/LoopUnroll/X86/mmx.ll (2532 of 34395)
PASS: LLVM :: CodeGen/X86/overlap-shift.ll (2533 of 34395)
PASS: LLVM-Unit :: ADT/./ADTTests/STLExtrasTest.partition_point (2534 of 34395)
PASS: LLVM :: Transforms/GlobalOpt/heap-sra-2.ll (2535 of 34395)
PASS: LLVM :: CodeGen/X86/basic-promote-integers.ll (2536 of 34395)
PASS: LLVM :: Transforms/Inline/debug-invoke.ll (2537 of 34395)
PASS: LLVM :: CodeGen/AMDGPU/umed3.ll (2538 of 34395)
PASS: LLVM :: Transforms/JumpThreading/thread-loads.ll (2539 of 34395)
PASS: LLVM :: CodeGen/PowerPC/f128-passByValue.ll (2540 of 34395)
PASS: LLVM :: MC/AArch64/SVE2/bgrp.s (2541 of 34395)
PASS: LLVM-Unit :: XRay/./XRayTests/FDRTraceWriterTest.WriteToStringBufferVersion2 (2542 of 34395)
PASS: LLVM-Unit :: ADT/./ADTTests/TripleTest.getARMCPUForArch (2543 of 34395)
PASS: LLVM-Unit :: ADT/./ADTTests/PointeeIteratorTest.Range (2544 of 34395)
PASS: LLVM :: CodeGen/PowerPC/extsh.ll (2545 of 34395)
PASS: LLVM :: LTO/Resolution/X86/link-odr-availextern.ll (2546 of 34395)
PASS: LLVM :: MC/Disassembler/AArch64/armv8.2a-uao.txt (2547 of 34395)
PASS: LLVM :: CodeGen/SystemZ/atomicrmw-sub-02.ll (2548 of 34395)
PASS: LLVM-Unit :: Support/./SupportTests/YAMLParser.ParsesEmptyArray (2549 of 34395)
PASS: LLVM :: CodeGen/ARM/ret_i64_arg2.ll (2550 of 34395)
PASS: LLVM :: CodeGen/X86/unwindraise.ll (2551 of 34395)
PASS: LLVM :: CodeGen/X86/log2_not_readnone.ll (2552 of 34395)
PASS: LLVM :: CodeGen/AMDGPU/GlobalISel/inst-select-ashr.s16.mir (2553 of 34395)
PASS: LLVM :: YAMLParser/spec-05-01-utf8.test (2554 of 34395)
PASS: LLVM :: MC/WebAssembly/assembler-binary.ll (2555 of 34395)
PASS: LLVM :: CodeGen/X86/avx512-vec-cmp.ll (2556 of 34395)
PASS: LLVM :: Transforms/InstCombine/pr19420.ll (2557 of 34395)
PASS: LLVM :: CodeGen/Mips/indirect-jump-hazard/unsupported-mips32.ll (2558 of 34395)
PASS: LLVM :: CodeGen/AArch64/pr40091.ll (2559 of 34395)
PASS: LLVM :: Transforms/LoopVectorize/ARM/tail-loop-folding.ll (2560 of 34395)
PASS: LLVM :: CodeGen/X86/vec_shift2.ll (2561 of 34395)
PASS: LLVM :: tools/llvm-modextract/single.ll (2562 of 34395)
PASS: LLVM :: CodeGen/ARM/ldstrex-m.ll (2563 of 34395)
PASS: LLVM :: CodeGen/Mips/GlobalISel/regbankselect/fptosi_and_fptoui.mir (2564 of 34395)
PASS: LLVM :: ExecutionEngine/RuntimeDyld/PowerPC/ppc32_elf_rel_addr16.s (2565 of 34395)
PASS: LLVM :: CodeGen/Thumb/2011-05-11-DAGLegalizer.ll (2566 of 34395)
PASS: LLVM-Unit :: Support/./SupportTests/FormatVariadicTest.MultipleReplacements (2567 of 34395)
PASS: LLVM-Unit :: ADT/./ADTTests/StringMapTest.InsertOrAssignTest (2568 of 34395)
PASS: LLVM :: CodeGen/WebAssembly/irreducible-cfg.ll (2569 of 34395)
PASS: LLVM-Unit :: ProfileData/./ProfileDataTests/MaybeSparse/MaybeSparseInstrProfTest.get_function_counts/1 (2570 of 34395)
PASS: LLVM :: CodeGen/MIR/AArch64/empty-MF.mir (2571 of 34395)
PASS: LLVM :: tools/llvm-pdbutil/stripped.test (2572 of 34395)
PASS: LLVM :: CodeGen/X86/chain_order.ll (2573 of 34395)
PASS: LLVM :: CodeGen/Hexagon/vcombine_subreg.ll (2574 of 34395)
UNSUPPORTED: LLVM :: CodeGen/AVR/PR37143.ll (2575 of 34395)
PASS: LLVM :: Transforms/LoopVectorize/SystemZ/load-store-scalarization-cost.ll (2576 of 34395)
PASS: LLVM :: CodeGen/AMDGPU/promote-alloca-bitcast-function.ll (2577 of 34395)
PASS: LLVM-Unit :: Option/./OptionTests/Option.ParseWithFlagExclusions (2578 of 34395)
PASS: LLVM :: tools/obj2yaml/elf-sht-symtab-shndx.yaml (2579 of 34395)
PASS: LLVM :: CodeGen/ARM/large-vector.ll (2580 of 34395)
PASS: LLVM :: Analysis/GlobalsModRef/atomic-instrs.ll (2581 of 34395)
PASS: LLVM :: MC/AArch64/SVE2/rax1.s (2582 of 34395)
PASS: LLVM :: DebugInfo/X86/v5-loc.ll (2583 of 34395)
PASS: LLVM :: tools/llvm-mca/X86/Haswell/zero-idioms.s (2584 of 34395)
PASS: LLVM :: Linker/2011-08-04-DebugLoc.ll (2585 of 34395)
PASS: LLVM :: CodeGen/Mips/cconv/pr33883.ll (2586 of 34395)
PASS: LLVM :: MC/AArch64/SVE2/stnt1d-diagnostics.s (2587 of 34395)
PASS: LLVM :: CodeGen/Mips/check-adde-redundant-moves.ll (2588 of 34395)
PASS: LLVM :: CodeGen/MIR/AMDGPU/stack-id.mir (2589 of 34395)
PASS: LLVM :: CodeGen/SystemZ/fp-const-07.ll (2590 of 34395)
PASS: LLVM :: CodeGen/AMDGPU/mad_uint24.ll (2591 of 34395)
PASS: LLVM :: CodeGen/Mips/instverify/dextm-pos.mir (2592 of 34395)
PASS: LLVM :: Assembler/invalid-disubrange-lowerBound-min.ll (2593 of 34395)
PASS: LLVM :: CodeGen/NVPTX/sm-version-62.ll (2594 of 34395)
PASS: LLVM :: CodeGen/ARM/aliases.ll (2595 of 34395)
PASS: LLVM :: Transforms/HotColdSplit/apply-noreturn-bonus.ll (2596 of 34395)
PASS: LLVM :: CodeGen/ARM/2010-03-04-eabi-fp-spill.ll (2597 of 34395)
PASS: LLVM :: CodeGen/AArch64/addcarry-crash.ll (2598 of 34395)
PASS: LLVM :: MC/Disassembler/ARM/mve-vcmp.txt (2599 of 34395)
PASS: LLVM :: CodeGen/ARM/ifcvt_forked_diamond_unanalyzable.mir (2600 of 34395)
PASS: LLVM :: Feature/basictest.ll (2601 of 34395)
PASS: LLVM :: CodeGen/AMDGPU/srem.ll (2602 of 34395)
PASS: LLVM :: Instrumentation/MemorySanitizer/missing_origin.ll (2603 of 34395)
PASS: LLVM :: YAMLParser/null.test (2604 of 34395)
PASS: LLVM :: CodeGen/Generic/donothing.ll (2605 of 34395)
PASS: LLVM :: Transforms/SLPVectorizer/X86/PR35628_1.ll (2606 of 34395)
PASS: LLVM :: CodeGen/Mips/GlobalISel/instruction-select/icmp.mir (2607 of 34395)
PASS: LLVM-Unit :: IR/./IRTests/ConstantsTest.BuildConstantDataArrays (2608 of 34395)
PASS: LLVM-Unit :: ADT/./ADTTests/DenseMapTest/3.EmptyIntMapTest (2609 of 34395)
PASS: LLVM :: MC/Mips/micromips-func-addr.s (2610 of 34395)
UNSUPPORTED: LLVM :: MC/Disassembler/ARC/br.txt (2611 of 34395)
PASS: LLVM :: DebugInfo/X86/noreturn_objc.ll (2612 of 34395)
PASS: LLVM :: MC/AArch64/SVE/andv.s (2613 of 34395)
XFAIL: LLVM :: Analysis/CFLAliasAnalysis/Andersen/struct.ll (2614 of 34395)
PASS: LLVM :: MC/Sparc/sparcv9-instructions.s (2615 of 34395)
PASS: LLVM :: CodeGen/ARM/vcvt-v8.ll (2616 of 34395)
PASS: LLVM :: ObjectYAML/MachO/section_data.yaml (2617 of 34395)
PASS: LLVM :: Transforms/JumpThreading/conservative-lvi.ll (2618 of 34395)
PASS: LLVM :: tools/llvm-objcopy/ELF/group.test (2619 of 34395)
PASS: LLVM :: CodeGen/AArch64/asm-large-immediate.ll (2620 of 34395)
PASS: LLVM :: Assembler/diimportedentity.ll (2621 of 34395)
PASS: LLVM :: CodeGen/AArch64/machine-copy-prop.ll (2622 of 34395)
PASS: LLVM :: tools/llvm-dwarfdump/X86/verbose.test (2623 of 34395)
PASS: LLVM-Unit :: DebugInfo/DWARF/./DebugInfoDWARFTests/DWARFDebugInfo.TestDwarfVerifyCUDontShareLineTable (2624 of 34395)
PASS: LLVM :: MC/COFF/cv-fpo-errors.s (2625 of 34395)
PASS: LLVM :: MC/AArch64/arm64_32-compact-unwind.s (2626 of 34395)
PASS: LLVM :: CodeGen/PowerPC/shrink-wrap.mir (2627 of 34395)
PASS: LLVM :: CodeGen/X86/win32-eh.ll (2628 of 34395)
PASS: LLVM :: CodeGen/PowerPC/ftrunc-vec.ll (2629 of 34395)
PASS: LLVM-Unit :: CodeGen/./CodeGenTests/MachineOperandTest.PrintJumpTableIndex (2630 of 34395)
UNSUPPORTED: LLVM :: CodeGen/AVR/pseudo/POPWRd.mir (2631 of 34395)
PASS: LLVM :: Transforms/GVN/pr36063.ll (2632 of 34395)
PASS: LLVM :: CodeGen/MIR/X86/implicit-register-flag.mir (2633 of 34395)
PASS: LLVM :: MC/Disassembler/ARM/armv8.5a-sb-thumb.txt (2634 of 34395)
PASS: LLVM :: CodeGen/Hexagon/mind.ll (2635 of 34395)
PASS: LLVM :: CodeGen/PowerPC/select-i1-vs-i1.ll (2636 of 34395)
PASS: LLVM :: CodeGen/Mips/GlobalISel/legalizer/sub_vec.mir (2637 of 34395)
PASS: LLVM :: CodeGen/BPF/32-bit-subreg-alu.ll (2638 of 34395)
PASS: LLVM :: YAMLParser/scan-line-break-bug.test (2639 of 34395)
PASS: LLVM :: CodeGen/X86/select-of-fp-constants.ll (2640 of 34395)
PASS: LLVM :: CodeGen/X86/sse-intrinsics-x86_64.ll (2641 of 34395)
PASS: LLVM :: CodeGen/X86/GlobalISel/x86_64-legalize-fptosi.mir (2642 of 34395)
PASS: LLVM :: CodeGen/X86/vector-reduce-fmax-nnan.ll (2643 of 34395)
PASS: LLVM-Unit :: IR/./IRTests/DICompositeTypeTest.get (2644 of 34395)
PASS: LLVM :: CodeGen/X86/pr34397.ll (2645 of 34395)
PASS: LLVM :: Transforms/SimpleLoopUnswitch/infinite-loop.ll (2646 of 34395)
PASS: LLVM-Unit :: ADT/./ADTTests/StringRefTest.Misc (2647 of 34395)
PASS: LLVM :: DebugInfo/COFF/fpo-realign-vframe.ll (2648 of 34395)
PASS: LLVM :: CodeGen/SystemZ/vec-max-02.ll (2649 of 34395)
PASS: LLVM :: Analysis/BasicAA/store-promote.ll (2650 of 34395)
PASS: LLVM :: tools/llvm-objcopy/ELF/strip-debug-and-remove.test (2651 of 34395)
UNSUPPORTED: LLVM :: CodeGen/Mips/2008-07-31-fcopysign.ll (2652 of 34395)
PASS: LLVM :: tools/llvm-mca/X86/BtVer2/reg-move-elimination-3.s (2653 of 34395)
PASS: LLVM :: MC/MachO/ARM/nop-armv6t2-padding.s (2654 of 34395)
PASS: LLVM :: CodeGen/AMDGPU/mubuf.ll (2655 of 34395)
PASS: LLVM :: Analysis/CostModel/SystemZ/divrem-pow2.ll (2656 of 34395)
PASS: LLVM :: CodeGen/Thumb2/ifcvt-no-branch-predictor.ll (2657 of 34395)
PASS: LLVM-Unit :: CodeGen/./CodeGenTests/LowLevelTypeTest.Pointer (2658 of 34395)
PASS: LLVM :: CodeGen/AMDGPU/GlobalISel/inst-select-load-atomic-local.mir (2659 of 34395)
PASS: LLVM :: CodeGen/X86/horizontal-reduce-smin.ll (2660 of 34395)
PASS: LLVM :: CodeGen/PowerPC/combine-sext-and-shl-after-isel.ll (2661 of 34395)
PASS: LLVM :: Transforms/Inline/parallel-loop-md.ll (2662 of 34395)
PASS: LLVM :: MC/AsmParser/cfi-unfinished-frame.s (2663 of 34395)
PASS: LLVM :: CodeGen/X86/bitcast-int-to-vector.ll (2664 of 34395)
PASS: LLVM :: Feature/memorymarkers.ll (2665 of 34395)
PASS: LLVM-Unit :: ExecutionEngine/Orc/./OrcJITTests/RemoteObjectLayer.EmitAndFinalizeFailure (2666 of 34395)
PASS: LLVM :: CodeGen/RISCV/add-before-shl.ll (2667 of 34395)
PASS: LLVM-Unit :: ADT/./ADTTests/SmallVectorTest/4.EraseRangeTest (2668 of 34395)
PASS: LLVM :: Transforms/NewGVN/pr33432.ll (2669 of 34395)
PASS: LLVM :: CodeGen/Hexagon/sfmin_dce.ll (2670 of 34395)
PASS: LLVM :: CodeGen/X86/scalar-int-to-fp.ll (2671 of 34395)
PASS: LLVM :: CodeGen/X86/pr3216.ll (2672 of 34395)
PASS: LLVM :: CodeGen/X86/vec_insert-4.ll (2673 of 34395)
PASS: LLVM :: CodeGen/AMDGPU/hsa-metadata-hidden-args.ll (2674 of 34395)
PASS: LLVM :: Transforms/MergeFunc/alias.ll (2675 of 34395)
PASS: LLVM :: Transforms/InstCombine/bitreverse-known-bits.ll (2676 of 34395)
PASS: LLVM :: DebugInfo/COFF/swift.ll (2677 of 34395)
PASS: LLVM :: CodeGen/Mips/tls-alias.ll (2678 of 34395)
PASS: LLVM-Unit :: Support/./SupportTests/MathExtras.countLeadingOnes (2679 of 34395)
PASS: LLVM :: Transforms/NewGVN/basic-cyclic-opt.ll (2680 of 34395)
PASS: LLVM :: CodeGen/SystemZ/asm-02.ll (2681 of 34395)
PASS: LLVM :: DebugInfo/strip-loop-metadata.ll (2682 of 34395)
PASS: LLVM :: tools/llvm-dwarfdump/X86/debug_expr_convert.s (2683 of 34395)
PASS: LLVM :: Transforms/IndVarSimplify/phi-uses-value-multiple-times.ll (2684 of 34395)
PASS: LLVM :: CodeGen/AMDGPU/GlobalISel/regbankselect-sextload.mir (2685 of 34395)
PASS: LLVM :: MC/Disassembler/X86/invalid-EVEX-R2.txt (2686 of 34395)
PASS: LLVM :: CodeGen/XCore/inline-asm.ll (2687 of 34395)
PASS: LLVM :: YAMLParser/spec-02-23.test (2688 of 34395)
PASS: LLVM :: MC/AArch64/SVE2/smullb-diagnostics.s (2689 of 34395)
PASS: LLVM :: Analysis/ScalarEvolution/trip-count5.ll (2690 of 34395)
PASS: LLVM :: CodeGen/Mips/no-frame-pointer-elim.ll (2691 of 34395)
PASS: LLVM :: Assembler/2002-04-07-HexFloatConstants.ll (2692 of 34395)
PASS: LLVM :: CodeGen/PowerPC/no-dup-of-bdnz.ll (2693 of 34395)
UNSUPPORTED: LLVM :: Transforms/InstCombine/AArch64/2012-04-23-Neon-Intrinsics.ll (2694 of 34395)
PASS: LLVM :: CodeGen/SystemZ/fp-strict-sub-02.ll (2695 of 34395)
PASS: LLVM-Unit :: IR/./IRTests/DataLayoutTest.ValueOrABITypeAlignment (2696 of 34395)
PASS: LLVM :: CodeGen/AArch64/GlobalISel/legalize-cmpxchg.mir (2697 of 34395)
PASS: LLVM :: CodeGen/Thumb2/thumb2-strb.ll (2698 of 34395)
PASS: LLVM :: CodeGen/ARM/big-endian-ret-f64.ll (2699 of 34395)
PASS: LLVM :: Transforms/InstCombine/udiv-simplify.ll (2700 of 34395)
PASS: LLVM-Unit :: ADT/./ADTTests/MapVectorMappedTypeTest/4.DifferentDenseMap (2701 of 34395)
PASS: LLVM :: CodeGen/RISCV/stack-realignment.ll (2702 of 34395)
PASS: LLVM :: CodeGen/X86/atom-shuf.ll (2703 of 34395)
PASS: LLVM-Unit :: BinaryFormat/./BinaryFormatTests/MsgPackDocument.TestInputYAMLArray (2704 of 34395)
PASS: LLVM :: MC/MachO/darwin-x86_64-nobase-relocs.s (2705 of 34395)
PASS: LLVM :: Transforms/InstSimplify/past-the-end.ll (2706 of 34395)
PASS: LLVM :: CodeGen/X86/vmaskmov-offset.ll (2707 of 34395)
PASS: LLVM :: Transforms/InstCombine/constant-fold-math.ll (2708 of 34395)
PASS: LLVM-Unit :: TextAPI/./TextAPITests/TBDv2.ReadFile (2709 of 34395)
PASS: LLVM :: CodeGen/Thumb2/thumb2-ldm.ll (2710 of 34395)
PASS: LLVM :: Transforms/GuardWidening/range-check-merging.ll (2711 of 34395)
PASS: LLVM :: ExecutionEngine/RuntimeDyld/X86/COFF_x86_64_IMGREL.s (2712 of 34395)
PASS: LLVM :: TableGen/ConstraintChecking4.td (2713 of 34395)
PASS: LLVM-Unit :: AsmParser/./AsmParserTests/AsmParserTest.TypeWithSlotMappingParsing (2714 of 34395)
PASS: LLVM :: CodeGen/AArch64/fast-isel-cmpxchg.ll (2715 of 34395)
PASS: LLVM :: Linker/unique-fwd-decl-order.ll (2716 of 34395)
PASS: LLVM :: CodeGen/PowerPC/mem_update.ll (2717 of 34395)
PASS: LLVM :: Instrumentation/SanitizerCoverage/no-func.ll (2718 of 34395)
PASS: LLVM :: CodeGen/Thumb2/mve-ctpop.ll (2719 of 34395)
PASS: LLVM :: Transforms/InstCombine/strcpy-2.ll (2720 of 34395)
PASS: LLVM-Unit :: ADT/./ADTTests/PointerIterator.Basic (2721 of 34395)
PASS: LLVM :: CodeGen/PowerPC/jump-tables-collapse-rotate.ll (2722 of 34395)
PASS: LLVM :: Transforms/LoopSimplify/phi-node-simplify.ll (2723 of 34395)
PASS: LLVM :: Analysis/LoopAccessAnalysis/interleave-innermost.ll (2724 of 34395)
PASS: LLVM :: CodeGen/X86/system-intrinsics-64-xsaveopt.ll (2725 of 34395)
PASS: LLVM :: CodeGen/AMDGPU/select-fabs-fneg-extract-legacy.ll (2726 of 34395)
PASS: LLVM :: Transforms/InstSimplify/shr-nop.ll (2727 of 34395)
UNSUPPORTED: LLVM :: MC/AVR/out-of-range-fixups/sbi-pass.s (2728 of 34395)
PASS: LLVM :: CodeGen/ARM/pr35103.ll (2729 of 34395)
PASS: LLVM :: MC/ARM/directive-arch-armv7.s (2730 of 34395)
PASS: LLVM :: CodeGen/Hexagon/extlow.ll (2731 of 34395)
PASS: LLVM :: CodeGen/X86/packss.ll (2732 of 34395)
PASS: LLVM :: CodeGen/AArch64/GlobalISel/legalize-sin.mir (2733 of 34395)
PASS: LLVM :: MC/AArch64/armv8.4a-mpam.s (2734 of 34395)
PASS: LLVM :: Transforms/InstCombine/fdiv-cos-sin.ll (2735 of 34395)
PASS: LLVM :: MC/X86/x86_64-rand-encoding.s (2736 of 34395)
PASS: LLVM-Unit :: Transforms/Utils/./UtilsTests/CloneFunction.CloneFunctionToDifferentModule (2737 of 34395)
PASS: LLVM :: CodeGen/AMDGPU/fmul.f16.ll (2738 of 34395)
PASS: LLVM :: Transforms/SLPVectorizer/X86/funclet.ll (2739 of 34395)
PASS: LLVM :: CodeGen/SystemZ/int-usub-07.ll (2740 of 34395)
PASS: LLVM :: LTO/Resolution/X86/comdat.ll (2741 of 34395)
PASS: LLVM :: tools/llvm-mca/X86/Barcelona/resources-lzcnt.s (2742 of 34395)
PASS: LLVM :: CodeGen/Mips/vector-load-store.ll (2743 of 34395)
PASS: LLVM :: CodeGen/X86/shift-codegen.ll (2744 of 34395)
PASS: LLVM :: tools/llvm-isel-fuzzer/execname-options.ll (2745 of 34395)
PASS: LLVM :: tools/llvm-mca/X86/SkylakeClient/resources-popcnt.s (2746 of 34395)
PASS: LLVM :: CodeGen/ARM/ldc2l.ll (2747 of 34395)
PASS: LLVM :: DebugInfo/arm-relocs.test (2748 of 34395)
PASS: LLVM :: CodeGen/AMDGPU/lds-misaligned-bug.ll (2749 of 34395)
PASS: LLVM-Unit :: IR/./IRTests/ValueMapTest/1.Null (2750 of 34395)
PASS: LLVM :: CodeGen/ARM/2009-06-02-ISelCrash.ll (2751 of 34395)
PASS: LLVM-Unit :: Support/./SupportTests/RegexTest.IsValid (2752 of 34395)
PASS: LLVM :: Transforms/InstCombine/2008-01-13-AndCmpCmp.ll (2753 of 34395)
PASS: LLVM-Unit :: ADT/./ADTTests/RangeTest.Distance (2754 of 34395)
PASS: LLVM :: CodeGen/BPF/CORE/offset-reloc-struct-anonymous.ll (2755 of 34395)
PASS: LLVM :: tools/llvm-mca/X86/SLM/resources-sse42.s (2756 of 34395)
PASS: LLVM :: Transforms/GlobalOpt/undef-init.ll (2757 of 34395)
PASS: LLVM-Unit :: DebugInfo/DWARF/./DebugInfoDWARFTests/DWARFDebugInfo.TestDwarfVerifyInvalidStmtList (2758 of 34395)
PASS: LLVM :: ExecutionEngine/JITLink/AArch64/MachO_Arm64_relocations.s (2759 of 34395)
PASS: LLVM :: ObjectYAML/wasm/start_section.yaml (2760 of 34395)
PASS: LLVM :: Assembler/private-protected-alias.ll (2761 of 34395)
PASS: LLVM :: CodeGen/X86/fast-isel-trunc-kill-subreg.ll (2762 of 34395)
PASS: LLVM :: Transforms/InstCombine/high-bit-signmask-with-trunc.ll (2763 of 34395)
PASS: LLVM :: CodeGen/X86/negative_zero.ll (2764 of 34395)
PASS: LLVM :: Demangle/ms-templates.test (2765 of 34395)
PASS: LLVM :: MC/MachO/diff-with-two-sections.s (2766 of 34395)
PASS: LLVM :: Transforms/Inline/AArch64/ext.ll (2767 of 34395)
PASS: LLVM :: Transforms/SimplifyCFG/pr39807.ll (2768 of 34395)
PASS: LLVM :: CodeGen/AMDGPU/fma-combine.ll (2769 of 34395)
PASS: LLVM :: MC/ARM/directive-object_arch-3.s (2770 of 34395)
PASS: LLVM :: CodeGen/RISCV/calling-conv-ilp32-ilp32f-ilp32d-common.ll (2771 of 34395)
PASS: LLVM :: CodeGen/AArch64/fast-isel-tbz.ll (2772 of 34395)
PASS: LLVM :: Transforms/InstCombine/pr38915.ll (2773 of 34395)
PASS: LLVM :: tools/llvm-ar/mri-crlf.test (2774 of 34395)
PASS: LLVM :: CodeGen/AArch64/arm64-movi.ll (2775 of 34395)
PASS: LLVM :: MC/Mips/mips-control-instructions.s (2776 of 34395)
PASS: LLVM-Unit :: Support/./SupportTests/Error.UncheckedExpectedInSuccessModeAssignment (2777 of 34395)
PASS: LLVM :: DebugInfo/COFF/type-quals.ll (2778 of 34395)
PASS: LLVM :: Transforms/CodeGenPrepare/skip-merging-case-block.ll (2779 of 34395)
PASS: LLVM :: CodeGen/X86/sse41-intrinsics-x86.ll (2780 of 34395)
PASS: LLVM :: tools/llvm-objdump/X86/section-index.s (2781 of 34395)
PASS: LLVM :: Analysis/ScalarEvolution/trip-count8.ll (2782 of 34395)
PASS: LLVM :: CodeGen/AMDGPU/fold-cndmask.mir (2783 of 34395)
PASS: LLVM :: MC/ELF/debug-loc.s (2784 of 34395)
PASS: LLVM :: Transforms/InstCombine/strrchr-1.ll (2785 of 34395)
PASS: LLVM-Unit :: ADT/./ADTTests/IListNodeBaseTest.setPrevAndNext (2786 of 34395)
PASS: LLVM :: MC/Hexagon/v60-vmem.s (2787 of 34395)
PASS: LLVM :: CodeGen/AMDGPU/computeKnownBits-scalar-to-vector-crash.ll (2788 of 34395)
PASS: LLVM :: tools/llvm-mca/X86/SkylakeServer/resources-sse2.s (2789 of 34395)
PASS: LLVM :: MC/Mips/mips1/invalid-mips4-wrong-error.s (2790 of 34395)
PASS: LLVM :: Transforms/Inline/2003-10-13-AllocaDominanceProblem.ll (2791 of 34395)
PASS: LLVM :: CodeGen/AArch64/byval-type.ll (2792 of 34395)
PASS: LLVM :: Analysis/AliasSet/memset.ll (2793 of 34395)
PASS: LLVM :: CodeGen/ARM/v1-constant-fold.ll (2794 of 34395)
PASS: LLVM :: Transforms/NewGVN/pr43441.ll (2795 of 34395)
PASS: LLVM :: Analysis/BasicAA/2007-08-05-GetOverloadedModRef.ll (2796 of 34395)
PASS: LLVM :: Transforms/MetaRenamer/metarenamer.ll (2797 of 34395)
PASS: LLVM :: CodeGen/AMDGPU/llvm.log10.ll (2798 of 34395)
PASS: LLVM :: Analysis/DependenceAnalysis/StrongSIV.ll (2799 of 34395)
PASS: LLVM :: MC/AsmParser/defsym_error1.s (2800 of 34395)
PASS: LLVM :: MC/AArch64/SVE2/rshrnb.s (2801 of 34395)
PASS: LLVM :: MachineVerifier/test_memccpy_intrinsics.mir (2802 of 34395)
PASS: LLVM-Unit :: ADT/./ADTTests/StringRefTest.EmptyInitializerList (2803 of 34395)
PASS: LLVM :: CodeGen/AMDGPU/udiv.ll (2804 of 34395)
PASS: LLVM :: Transforms/MemCpyOpt/memcpy-undef.ll (2805 of 34395)
PASS: LLVM :: Assembler/ditemplateparameter.ll (2806 of 34395)
PASS: LLVM :: Transforms/BDCE/dce-pure.ll (2807 of 34395)
PASS: LLVM :: CodeGen/X86/merge-consecutive-loads-512.ll (2808 of 34395)
PASS: LLVM :: tools/llvm-symbolizer/space-in-path.s (2809 of 34395)
PASS: LLVM-Unit :: Support/./SupportTests/FileCheckTest.Substitution (2810 of 34395)
PASS: LLVM :: CodeGen/RISCV/float-frem.ll (2811 of 34395)
PASS: LLVM-Unit :: Remarks/./RemarksTests/RemarksStrTab.ParsingEmpty (2812 of 34395)
PASS: LLVM :: CodeGen/SystemZ/fp-conv-11.ll (2813 of 34395)
PASS: LLVM :: Transforms/LoopUnroll/unroll-pragmas.ll (2814 of 34395)
PASS: LLVM-Unit :: ADT/./ADTTests/SmallStringTest.Substr (2815 of 34395)
PASS: LLVM :: CodeGen/AMDGPU/GlobalISel/legalize-atomicrmw-xor.mir (2816 of 34395)
PASS: LLVM :: tools/dsymutil/X86/modules.m (2817 of 34395)
PASS: LLVM-Unit :: Analysis/./AnalysisTests/ScalarEvolutionsTest.SCEVZeroExtendExprNonIntegral (2818 of 34395)
PASS: LLVM :: Assembler/2003-05-21-MalformedShiftCrash.ll (2819 of 34395)
PASS: LLVM :: Transforms/GlobalOpt/load-store-global.ll (2820 of 34395)
PASS: LLVM :: Assembler/invalid-dilexicalblockfile-missing-discriminator.ll (2821 of 34395)
PASS: LLVM :: CodeGen/SystemZ/int-sub-02.ll (2822 of 34395)
PASS: LLVM :: CodeGen/ARM/frame-register.ll (2823 of 34395)
PASS: LLVM :: Transforms/IndVarSimplify/ult-sub-to-eq.ll (2824 of 34395)
PASS: LLVM :: Transforms/ConstProp/2007-02-23-sdiv.ll (2825 of 34395)
PASS: LLVM :: CodeGen/PowerPC/pr13891.ll (2826 of 34395)
PASS: LLVM :: CodeGen/X86/2010-11-02-DbgParameter.ll (2827 of 34395)
PASS: LLVM :: tools/llvm-readobj/note-amdgpu.test (2828 of 34395)
PASS: LLVM :: CodeGen/Hexagon/swp-epilog-phi10.ll (2829 of 34395)
PASS: LLVM-Unit :: ADT/./ADTTests/SmallVectorTest/3.ResizeGrowTest (2830 of 34395)
PASS: LLVM :: CodeGen/Hexagon/reg-scavengebug-4.ll (2831 of 34395)
PASS: LLVM :: Transforms/SLPVectorizer/PowerPC/aggregate.ll (2832 of 34395)
PASS: LLVM :: CodeGen/MIR/X86/escape-function-name.ll (2833 of 34395)
PASS: LLVM :: Transforms/LICM/debug-value.ll (2834 of 34395)
PASS: LLVM :: DebugInfo/X86/vla-global.ll (2835 of 34395)
PASS: LLVM :: tools/llvm-dwarfdump/X86/verify_unit_header_chain.s (2836 of 34395)
PASS: LLVM :: CodeGen/X86/vector-shuffle-sse41.ll (2837 of 34395)
PASS: LLVM :: MC/ELF/relax-arith3.s (2838 of 34395)
PASS: LLVM :: Transforms/SafeStack/X86/constant-geps.ll (2839 of 34395)
PASS: LLVM :: CodeGen/AMDGPU/permute.ll (2840 of 34395)
PASS: LLVM-Unit :: Support/./SupportTests/Error.ConsumeError (2841 of 34395)
PASS: LLVM :: MC/MachO/AArch64/ld64-workaround.s (2842 of 34395)
PASS: LLVM-Unit :: ProfileData/./ProfileDataTests/MaybeSparse/MaybeSparseInstrProfTest.get_icall_data_merge_site_trunc/0 (2843 of 34395)
PASS: LLVM-Unit :: IR/./IRTests/Attributes.EmptyGet (2844 of 34395)
PASS: LLVM-Unit :: IR/./IRTests/DILexicalBlockTest.Overflow (2845 of 34395)
PASS: LLVM :: CodeGen/SPARC/DbgValueOtherTargets.test (2846 of 34395)
PASS: LLVM-Unit :: Analysis/./AnalysisTests/DivergenceAnalysisTest.DANoLCSSA (2847 of 34395)
PASS: LLVM :: CodeGen/X86/merge_store.ll (2848 of 34395)
PASS: LLVM-Unit :: BinaryFormat/./BinaryFormatTests/DwarfTest.TagStringOnInvalid (2849 of 34395)
PASS: LLVM :: DebugInfo/X86/ghost-sdnode-dbgvalues.ll (2850 of 34395)
PASS: LLVM :: Bitcode/metadata-2.ll (2851 of 34395)
PASS: LLVM :: CodeGen/SystemZ/int-usub-10.ll (2852 of 34395)
PASS: LLVM :: CodeGen/SPARC/setjmp.ll (2853 of 34395)
PASS: LLVM :: CodeGen/X86/constant-pool-sharing.ll (2854 of 34395)
PASS: LLVM :: CodeGen/AMDGPU/atomic_cmp_swap_local.ll (2855 of 34395)
PASS: LLVM :: CodeGen/AArch64/branch-relax-bcc.ll (2856 of 34395)
PASS: LLVM :: Transforms/InstSimplify/div-by-0-guard-before-umul_ov-not.ll (2857 of 34395)
PASS: LLVM :: CodeGen/AArch64/cmpxchg-O0.ll (2858 of 34395)
PASS: LLVM :: CodeGen/Thumb2/LowOverheadLoops/revert-after-write.mir (2859 of 34395)
PASS: LLVM :: CodeGen/Mips/GlobalISel/instruction-select/constants.mir (2860 of 34395)
PASS: LLVM :: CodeGen/X86/misched-aa-colored.ll (2861 of 34395)
PASS: LLVM :: CodeGen/PowerPC/i64_fp.ll (2862 of 34395)
PASS: LLVM :: tools/llvm-objcopy/ELF/compress-debug-sections-zlib-gnu.test (2863 of 34395)
PASS: LLVM :: MC/AArch64/SVE2/sqrshrunt.s (2864 of 34395)
PASS: LLVM-Unit :: Support/./SupportTests/ScaledNumberHelpersTest.arithmeticOperators (2865 of 34395)
PASS: LLVM :: MC/AArch64/SVE/prfd-diagnostics.s (2866 of 34395)
PASS: LLVM-Unit :: XRay/./XRayTests/Records/RoundTripTest/1.RoundTripsSingleValue (2867 of 34395)
PASS: LLVM :: Transforms/InstCombine/omit-urem-of-power-of-two-or-zero-when-comparing-with-zero.ll (2868 of 34395)
PASS: LLVM :: MC/ARM/invalid-barrier.s (2869 of 34395)
PASS: LLVM :: CodeGen/PowerPC/fp_to_uint.ll (2870 of 34395)
PASS: LLVM :: Assembler/invalid-fwdref2.ll (2871 of 34395)
PASS: LLVM :: CodeGen/AMDGPU/fcmp64.ll (2872 of 34395)
PASS: LLVM :: MC/AArch64/armv8.2a-uao.s (2873 of 34395)
PASS: LLVM :: Transforms/RewriteStatepointsForGC/constants.ll (2874 of 34395)
PASS: LLVM-Unit :: DebugInfo/DWARF/./DebugInfoDWARFTests/LineTableTestParams/DebugLineParameterisedFixture.ErrorForTooLargePrologueLength/1 (2875 of 34395)
PASS: LLVM :: Analysis/DependenceAnalysis/Separability.ll (2876 of 34395)
PASS: LLVM :: Transforms/LICM/volatile-alias.ll (2877 of 34395)
PASS: LLVM :: DebugInfo/X86/dbg-const-int.ll (2878 of 34395)
PASS: LLVM :: CodeGen/X86/regparm.ll (2879 of 34395)
PASS: LLVM :: MC/AArch64/cfi.s (2880 of 34395)
PASS: LLVM :: Instrumentation/AddressSanitizer/keep_going.ll (2881 of 34395)
PASS: LLVM :: CodeGen/ARM/ldm-stm-base-materialization.ll (2882 of 34395)
PASS: LLVM-Unit :: Support/./SupportTests/DataExtractorTest.getU8_vector (2883 of 34395)
PASS: LLVM :: tools/llvm-objcopy/ELF/relocations-no-symtab.test (2884 of 34395)
PASS: LLVM :: Transforms/InferFunctionAttrs/dereferenceable.ll (2885 of 34395)
PASS: LLVM-Unit :: Support/./SupportTests/SourceMgrTest.LocationAtEndOf255ByteBufferEndingInNewline (2886 of 34395)
PASS: LLVM-Unit :: DebugInfo/DWARF/./DebugInfoDWARFTests/DWARFDebugInfo.TestDWARF32Version4Addr8AllForms (2887 of 34395)
PASS: LLVM :: MC/X86/SVM-64.s (2888 of 34395)
PASS: LLVM :: CodeGen/Hexagon/loop-idiom/pmpy-infinite-loop.ll (2889 of 34395)
PASS: LLVM :: tools/llvm-mca/X86/Barcelona/resources-x86_32.s (2890 of 34395)
PASS: LLVM-Unit :: Support/./SupportTests/DebugCounterTest.CounterCheck (2891 of 34395)
PASS: LLVM :: Transforms/InstCombine/2007-10-28-stacksave.ll (2892 of 34395)
PASS: LLVM :: Transforms/InstCombine/redundant-left-shift-input-masking-variant-f.ll (2893 of 34395)
PASS: LLVM :: CodeGen/X86/pr38952.mir (2894 of 34395)
PASS: LLVM :: Transforms/DeadArgElim/aggregates.ll (2895 of 34395)
PASS: LLVM :: CodeGen/AMDGPU/attr-amdgpu-waves-per-eu.ll (2896 of 34395)
PASS: LLVM :: MC/AArch64/case-insen-reg-names.s (2897 of 34395)
PASS: LLVM-Unit :: Support/./SupportTests/AllocationTests/MappedMemoryTest.ZeroSizeNear/0 (2898 of 34395)
PASS: LLVM :: CodeGen/PowerPC/testComparesllequll.ll (2899 of 34395)
PASS: LLVM :: MC/AArch64/SVE2/sqrshl.s (2900 of 34395)
PASS: LLVM-Unit :: ADT/./ADTTests/StringMapTest.EmptyMapTest (2901 of 34395)
PASS: LLVM :: CodeGen/X86/umul_fix_sat.ll (2902 of 34395)
PASS: LLVM :: CodeGen/X86/x86-64-pic-12.ll (2903 of 34395)
PASS: LLVM :: MC/RISCV/fixups-expr.s (2904 of 34395)
PASS: LLVM :: CodeGen/X86/aligned-comm.ll (2905 of 34395)
PASS: LLVM :: tools/llvm-profdata/merge_empty_profile.test (2906 of 34395)
PASS: LLVM-Unit :: ADT/./ADTTests/SmallVectorTest/3.AppendRepeatedNonForwardIterator (2907 of 34395)
UNSUPPORTED: LLVM :: tools/llvm-exegesis/X86/latency-CMOV32rr.s (2908 of 34395)
PASS: LLVM :: CodeGen/X86/statepoint-no-realign-stack.ll (2909 of 34395)
PASS: LLVM :: tools/llvm-mt/single_file.test (2910 of 34395)
PASS: LLVM :: tools/llvm-elfabi/read-tbe-as-elf.test (2911 of 34395)
PASS: LLVM :: MC/AArch64/SVE/ld1rw-diagnostics.s (2912 of 34395)
PASS: LLVM :: CodeGen/AArch64/GlobalISel/arm64-fallback.ll (2913 of 34395)
PASS: LLVM :: Transforms/LoopPredication/reverse.ll (2914 of 34395)
PASS: LLVM :: Transforms/Inline/inline-invoke-tail.ll (2915 of 34395)
PASS: LLVM :: MC/X86/avx512vl_gfni-encoding.s (2916 of 34395)
PASS: LLVM :: CodeGen/ARM/vargs.ll (2917 of 34395)
PASS: LLVM :: MC/ARM/arm-memory-instructions.s (2918 of 34395)
PASS: LLVM :: CodeGen/Hexagon/hidden-relocation.ll (2919 of 34395)
PASS: LLVM-Unit :: tools/llvm-cfi-verify/./CFIVerifyTests/BasicAArch64FileAnalysisTest.AArch64BasicProtected (2920 of 34395)
PASS: LLVM :: DebugInfo/X86/gmlt.test (2921 of 34395)
PASS: LLVM :: MC/AArch64/SVE/cmplt.s (2922 of 34395)
PASS: LLVM :: CodeGen/PowerPC/sext-vector-inreg.ll (2923 of 34395)
PASS: LLVM :: CodeGen/SystemZ/selectcc-02.ll (2924 of 34395)
PASS: LLVM :: Transforms/LoopUnswitch/simplify-with-nonvalness.ll (2925 of 34395)
PASS: LLVM :: MC/ARM/eh-directive-personalityindex.s (2926 of 34395)
PASS: LLVM :: MC/Mips/micromips32r6/valid.s (2927 of 34395)
PASS: LLVM :: CodeGen/AArch64/fp16_intrinsic_lane.ll (2928 of 34395)
PASS: LLVM :: Other/pr32085.ll (2929 of 34395)
PASS: LLVM :: CodeGen/SystemZ/vec-const-14.ll (2930 of 34395)
PASS: LLVM :: MC/AMDGPU/gfx10_asm_mimg_err.s (2931 of 34395)
PASS: LLVM :: Transforms/LoopVectorize/SystemZ/pr38110.ll (2932 of 34395)
PASS: LLVM :: CodeGen/Mips/seleq.ll (2933 of 34395)
PASS: LLVM :: CodeGen/PowerPC/vec_extract_p9.ll (2934 of 34395)
PASS: LLVM :: CodeGen/Hexagon/trivialmemaliascheck.ll (2935 of 34395)
PASS: LLVM :: MC/X86/VTX-32.s (2936 of 34395)
PASS: LLVM :: CodeGen/AMDGPU/si-annotate-cfg-loop-assert.ll (2937 of 34395)
PASS: LLVM :: Analysis/ScalarEvolution/2007-08-06-Unsigned.ll (2938 of 34395)
PASS: LLVM :: CodeGen/RISCV/calling-conv-lp64-lp64f-lp64d-common.ll (2939 of 34395)
PASS: LLVM :: MC/ELF/empty.s (2940 of 34395)
PASS: LLVM :: CodeGen/X86/atomic-minmax-i6432.ll (2941 of 34395)
PASS: LLVM :: CodeGen/RISCV/div.ll (2942 of 34395)
PASS: LLVM :: DebugInfo/X86/dbg-value-dag-combine.ll (2943 of 34395)
PASS: LLVM :: Transforms/GVNHoist/infinite-loop-indirect.ll (2944 of 34395)
PASS: LLVM :: CodeGen/AArch64/dag-combine-mul-shl.ll (2945 of 34395)
PASS: LLVM :: Transforms/SLPVectorizer/X86/extract.ll (2946 of 34395)
PASS: LLVM :: TableGen/prep-diag9.td (2947 of 34395)
PASS: LLVM :: Transforms/DivRemPairs/X86/div-expanded-rem-pair.ll (2948 of 34395)
PASS: LLVM :: CodeGen/X86/2011-01-10-DagCombineHang.ll (2949 of 34395)
PASS: LLVM :: CodeGen/SPARC/stack-align.ll (2950 of 34395)
PASS: LLVM-Unit :: ProfileData/./ProfileDataTests/ParameterizedCovMapTest/CoverageMappingTest.dont_emit_closing_segment_at_new_region_start/1 (2951 of 34395)
PASS: LLVM :: Other/2007-04-24-eliminate-mostly-empty-blocks.ll (2952 of 34395)
UNSUPPORTED: LLVM :: CodeGen/AVR/div.ll (2953 of 34395)
PASS: LLVM :: CodeGen/X86/avx512-insert-extract.ll (2954 of 34395)
PASS: LLVM :: MC/Mips/mt/invalid.s (2955 of 34395)
PASS: LLVM :: Bitcode/function-nonzero-address-spaces.ll (2956 of 34395)
PASS: LLVM-Unit :: ADT/./ADTTests/SmallVectorTest/0.ResizeGrowTest (2957 of 34395)
PASS: LLVM :: DebugInfo/SystemZ/variable-loc.ll (2958 of 34395)
PASS: LLVM :: MC/PowerPC/pr38945.s (2959 of 34395)
PASS: LLVM :: CodeGen/SystemZ/vec-strict-mul-04.ll (2960 of 34395)
PASS: LLVM :: CodeGen/X86/test_x86condbr_globaladdr.mir (2961 of 34395)
PASS: LLVM-Unit :: Analysis/./AnalysisTests/IsBytewiseValueParamTests/IsBytewiseValueTest.IsBytewiseValue/50 (2962 of 34395)
PASS: LLVM-Unit :: Remarks/./RemarksTests/BitstreamRemarksFormat.BlockIDs (2963 of 34395)
PASS: LLVM :: CodeGen/SystemZ/ghc-cc-05.ll (2964 of 34395)
PASS: LLVM-Unit :: Analysis/./AnalysisTests/SparsePropagationTest.GlobalVariableConstant (2965 of 34395)
PASS: LLVM :: Transforms/Inline/inline-varargs.ll (2966 of 34395)
PASS: LLVM :: DebugInfo/X86/union-const.ll (2967 of 34395)
PASS: LLVM :: CodeGen/ARM/vabs.ll (2968 of 34395)
PASS: LLVM :: MC/ARM/neont2-cmp-encoding.s (2969 of 34395)
PASS: LLVM :: MC/Disassembler/AArch64/arm64-canonical-form.txt (2970 of 34395)
PASS: LLVM :: CodeGen/AArch64/fp16_intrinsic_vector_3op.ll (2971 of 34395)
PASS: LLVM-Unit :: Support/./SupportTests/YAMLIO.TestTaggedDocuments (2972 of 34395)
PASS: LLVM :: Transforms/GVN/2009-03-10-PREOnVoid.ll (2973 of 34395)
PASS: LLVM-Unit :: ADT/./ADTTests/DenseMapTest/0.SingleEntryMapTest (2974 of 34395)
PASS: LLVM :: CodeGen/X86/stack-folding-fp-avx1.ll (2975 of 34395)
PASS: LLVM :: CodeGen/X86/psadbw.ll (2976 of 34395)
PASS: LLVM :: Transforms/InstCombine/sub-or-and-xor.ll (2977 of 34395)
PASS: LLVM :: CodeGen/X86/pr23664.ll (2978 of 34395)
PASS: LLVM-Unit :: tools/llvm-exegesis/X86/./LLVMExegesisX86Tests/UopsSnippetGeneratorTest.NoTiedVariables (2979 of 34395)
PASS: LLVM :: CodeGen/AArch64/arm64-fmuladd.ll (2980 of 34395)
PASS: LLVM :: CodeGen/BPF/BTF/struct-enum.ll (2981 of 34395)
PASS: LLVM :: CodeGen/AArch64/shrink-wrap.ll (2982 of 34395)
PASS: LLVM :: CodeGen/AMDGPU/GlobalISel/regbankselect-sitofp.mir (2983 of 34395)
PASS: LLVM :: tools/llvm-objcopy/ELF/adjacent-segments.test (2984 of 34395)
PASS: LLVM :: CodeGen/AArch64/O3-pipeline.ll (2985 of 34395)
PASS: LLVM :: Transforms/LoopRotate/pr37205.ll (2986 of 34395)
PASS: LLVM :: Transforms/SimplifyCFG/bbi-23595.ll (2987 of 34395)
PASS: LLVM :: CodeGen/X86/inline-asm-ptr-cast.ll (2988 of 34395)
PASS: LLVM :: CodeGen/X86/i686-win-shrink-wrapping.ll (2989 of 34395)
PASS: LLVM :: Linker/addrspace.ll (2990 of 34395)
PASS: LLVM :: CodeGen/SystemZ/vec-and-04.ll (2991 of 34395)
PASS: LLVM :: Transforms/GlobalOpt/2007-06-04-PackedStruct.ll (2992 of 34395)
PASS: LLVM :: Transforms/Reassociate/2003-08-12-InfiniteLoop.ll (2993 of 34395)
PASS: LLVM :: Transforms/PGOProfile/thinlto_cspgo_use.ll (2994 of 34395)
PASS: LLVM :: Transforms/LoopSimplify/pr26682.ll (2995 of 34395)
PASS: LLVM :: CodeGen/X86/2012-07-16-fp2ui-i1.ll (2996 of 34395)
PASS: LLVM :: Transforms/SimplifyCFG/seh-nounwind.ll (2997 of 34395)
PASS: LLVM :: CodeGen/AMDGPU/fence-barrier.ll (2998 of 34395)
PASS: LLVM :: Transforms/InstCombine/2012-02-28-ICmp.ll (2999 of 34395)
PASS: LLVM :: CodeGen/X86/vector-reduce-smax.ll (3000 of 34395)
PASS: LLVM :: Transforms/InstCombine/struct-assign-tbaa.ll (3001 of 34395)
PASS: LLVM :: CodeGen/X86/global-sections.ll (3002 of 34395)
PASS: LLVM :: tools/llvm-objcopy/ELF/check-addr-offset-align.test (3003 of 34395)
PASS: LLVM :: Transforms/RewriteStatepointsForGC/leaf-function.ll (3004 of 34395)
PASS: LLVM :: Transforms/SimplifyCFG/preserve-load-metadata-2.ll (3005 of 34395)
PASS: LLVM :: CodeGen/AMDGPU/mubuf-offset-private.ll (3006 of 34395)
PASS: LLVM :: CodeGen/AMDGPU/cvt_rpi_i32_f32.ll (3007 of 34395)
PASS: LLVM :: CodeGen/AMDGPU/divergent-branch-uniform-condition.ll (3008 of 34395)
PASS: LLVM :: tools/llvm-objcopy/ELF/build-id-link-dir.test (3009 of 34395)
PASS: LLVM :: MC/AArch64/SVE/dupm.s (3010 of 34395)
PASS: LLVM :: MC/Mips/macro-bcc-imm-bad.s (3011 of 34395)
PASS: LLVM :: Transforms/RewriteStatepointsForGC/base-pointers-1.ll (3012 of 34395)
PASS: LLVM :: MC/MachO/ARM/thumb-bl-jbits.s (3013 of 34395)
PASS: LLVM-Unit :: DebugInfo/MSF/./DebugInfoMSFTests/MSFBuilderTest.TestGrowStreamNoBlockIncrease (3014 of 34395)
PASS: LLVM :: CodeGen/ARM/cortex-a57-misched-vfma.ll (3015 of 34395)
PASS: LLVM :: CodeGen/Thumb2/mve-vdup.ll (3016 of 34395)
PASS: LLVM :: DebugInfo/X86/subregisters.ll (3017 of 34395)
PASS: LLVM :: CodeGen/ARM/2009-11-13-CoalescerCrash.ll (3018 of 34395)
PASS: LLVM :: Transforms/MergeFunc/ptr-int-transitivity-1.ll (3019 of 34395)
PASS: LLVM :: CodeGen/X86/2013-10-14-FastISel-incorrect-vreg.ll (3020 of 34395)
PASS: LLVM :: DebugInfo/X86/sdag-legalize-multires.ll (3021 of 34395)
PASS: LLVM-Unit :: Support/./SupportTests/FileSystemTest.getUmask (3022 of 34395)
PASS: LLVM :: Analysis/TypeBasedAliasAnalysis/cyclic.ll (3023 of 34395)
PASS: LLVM :: Transforms/InstCombine/fold-fops-into-selects.ll (3024 of 34395)
PASS: LLVM-Unit :: ADT/./ADTTests/StringRefTest.getAsDouble (3025 of 34395)
UNSUPPORTED: LLVM :: MC/AVR/inst-sbrs.s (3026 of 34395)
PASS: LLVM :: CodeGen/PowerPC/testComparesilesi.ll (3027 of 34395)
PASS: LLVM :: Transforms/AddDiscriminators/memcpy-discriminator.ll (3028 of 34395)
PASS: LLVM :: CodeGen/X86/funclet-layout.ll (3029 of 34395)
PASS: LLVM :: MC/MachO/reloc-pcrel.s (3030 of 34395)
PASS: LLVM :: CodeGen/AMDGPU/GlobalISel/regbankselect-fadd.mir (3031 of 34395)
PASS: LLVM :: tools/llvm-pdbutil/partial-type-stream.test (3032 of 34395)
PASS: LLVM :: CodeGen/Mips/GlobalISel/instruction-select/fptosi_and_fptoui.mir (3033 of 34395)
PASS: LLVM :: MC/AArch64/SVE/wrffr-diagnostics.s (3034 of 34395)
PASS: LLVM :: CodeGen/PowerPC/emutls_generic.ll (3035 of 34395)
PASS: LLVM :: MC/AMDGPU/elf-notes-verify-r600.s (3036 of 34395)
PASS: LLVM-Unit :: BinaryFormat/./BinaryFormatTests/MsgPackWriter.TestWriteStr16 (3037 of 34395)
PASS: LLVM :: CodeGen/Hexagon/formal-args-i1.ll (3038 of 34395)
UNSUPPORTED: LLVM :: MC/AVR/inst-movw.s (3039 of 34395)
PASS: LLVM-Unit :: Transforms/Utils/./UtilsTests/ValueMapperTest.mapValueLocalAsMetadataToConstant (3040 of 34395)
PASS: LLVM :: Transforms/SimplifyCFG/switch_thread.ll (3041 of 34395)
PASS: LLVM :: MC/ARM/directive-arch-armv7m.s (3042 of 34395)
PASS: LLVM :: CodeGen/Thumb2/constant-islands-new-island.ll (3043 of 34395)
PASS: LLVM :: MC/WebAssembly/external-data.ll (3044 of 34395)
PASS: LLVM :: CodeGen/X86/GlobalISel/select-ptr-add.mir (3045 of 34395)
PASS: LLVM :: Transforms/LoopSimplify/preserve-llvm-loop-metadata.ll (3046 of 34395)
PASS: LLVM :: CodeGen/X86/2006-08-07-CycleInDAG.ll (3047 of 34395)
PASS: LLVM :: CodeGen/X86/3addr-or.ll (3048 of 34395)
PASS: LLVM :: MC/AArch64/SVE/fneg-diagnostics.s (3049 of 34395)
PASS: LLVM :: MC/AArch64/SVE/fminnm.s (3050 of 34395)
PASS: LLVM :: MC/AArch64/elf-reloc-pcreladdressing.s (3051 of 34395)
PASS: LLVM-Unit :: ADT/./ADTTests/ArrayRefTest.DropFront (3052 of 34395)
PASS: LLVM :: CodeGen/AMDGPU/i1_copy_phi_with_phi_incoming_value.mir (3053 of 34395)
PASS: LLVM :: Transforms/InstCombine/partally-redundant-left-shift-input-masking-after-truncation-variant-b.ll (3054 of 34395)
PASS: LLVM :: tools/llvm-mca/X86/Atom/resources-ssse3.s (3055 of 34395)
PASS: LLVM :: CodeGen/Mips/Fast-ISel/constexpr-address.ll (3056 of 34395)
PASS: LLVM-Unit :: Support/./SupportTests/SourceMgrTest.LocationPastEndOf256ByteBuffer (3057 of 34395)
PASS: LLVM :: CodeGen/PowerPC/pr15630.ll (3058 of 34395)
PASS: LLVM :: CodeGen/ARM/global-merge-external.ll (3059 of 34395)
PASS: LLVM :: DebugInfo/X86/formal_parameter.ll (3060 of 34395)
PASS: LLVM :: CodeGen/Hexagon/vect/vect-no-tfrs-1.ll (3061 of 34395)
PASS: LLVM-Unit :: Support/./SupportTests/InMemoryFileSystemTest.AddHardLinkToAFileThatWasNotAddedBefore (3062 of 34395)
PASS: LLVM :: Transforms/AtomicExpand/Mips/atomicrmw-fp.ll (3063 of 34395)
PASS: LLVM :: CodeGen/AMDGPU/atomic_optimizations_pixelshader.ll (3064 of 34395)
PASS: LLVM :: Linker/funcimport_comdat.ll (3065 of 34395)
PASS: LLVM :: CodeGen/ARM/ifcvt_simple_bad_zero_prob_succ.mir (3066 of 34395)
PASS: LLVM :: CodeGen/SPARC/2013-05-17-CallFrame.ll (3067 of 34395)
PASS: LLVM :: CodeGen/Hexagon/ifcvt-diamond-bad.ll (3068 of 34395)
PASS: LLVM-Unit :: IR/./IRTests/ModuleWithFunctionTest.InvokeInst (3069 of 34395)
PASS: LLVM :: CodeGen/Thumb/triple.ll (3070 of 34395)
PASS: LLVM-Unit :: ADT/./ADTTests/PointerIntPairTest.DefaultInitialize (3071 of 34395)
PASS: LLVM :: CodeGen/PowerPC/sat-add.ll (3072 of 34395)
PASS: LLVM :: Transforms/InstCombine/should-change-type.ll (3073 of 34395)
PASS: LLVM :: CodeGen/AArch64/neon-fpround_f128.ll (3074 of 34395)
PASS: LLVM :: CodeGen/PowerPC/sjlj.ll (3075 of 34395)
PASS: LLVM :: tools/llvm-mca/X86/BtVer2/xchg.s (3076 of 34395)
PASS: LLVM :: Transforms/GlobalOpt/int_sideeffect.ll (3077 of 34395)
PASS: LLVM-Unit :: DebugInfo/CodeView/./DebugInfoCodeViewTests/TypeIndexIteratorTest.Struct (3078 of 34395)
PASS: LLVM :: CodeGen/AMDGPU/reg-coalescer-sched-crash.ll (3079 of 34395)
PASS: LLVM :: ThinLTO/X86/dot-dumper2.ll (3080 of 34395)
PASS: LLVM :: CodeGen/XCore/aliases.ll (3081 of 34395)
PASS: LLVM :: Transforms/InstCombine/assume_inevitable.ll (3082 of 34395)
PASS: LLVM :: Transforms/InstCombine/2008-08-05-And.ll (3083 of 34395)
PASS: LLVM :: tools/llvm-split/comdat.ll (3084 of 34395)
PASS: LLVM :: Linker/module-flags-6-b.ll (3085 of 34395)
PASS: LLVM :: CodeGen/AArch64/GlobalISel/legalize-cmpxchg-with-success.mir (3086 of 34395)
PASS: LLVM :: MC/AsmParser/exprs-invalid.s (3087 of 34395)
PASS: LLVM :: Transforms/Inline/alloca-dbgdeclare-merge.ll (3088 of 34395)
PASS: LLVM :: tools/llvm-readobj/ARM/attribute-136.s (3089 of 34395)
PASS: LLVM :: Transforms/InstCombine/2012-05-28-select-hang.ll (3090 of 34395)
PASS: LLVM :: CodeGen/AMDGPU/udivrem64.ll (3091 of 34395)
PASS: LLVM :: ObjectYAML/MachO/DWARF5-abbrevValues.yaml (3092 of 34395)
PASS: LLVM :: Verifier/bitcast-address-space-through-gep.ll (3093 of 34395)
PASS: LLVM-Unit :: IR/./IRTests/VerifierTest.InvalidVariableLinkage (3094 of 34395)
PASS: LLVM :: Transforms/LowerSwitch/phi-in-dead-block.ll (3095 of 34395)
PASS: LLVM :: CodeGen/X86/catchpad-reuse.ll (3096 of 34395)
PASS: LLVM :: Transforms/LoopStrengthReduce/2008-09-09-Overflow.ll (3097 of 34395)
PASS: LLVM :: MC/Disassembler/AArch64/speculation-barriers.txt (3098 of 34395)
PASS: LLVM :: CodeGen/X86/2009-09-21-NoSpillLoopCount.ll (3099 of 34395)
PASS: LLVM :: CodeGen/ARM/tail-call.ll (3100 of 34395)
PASS: LLVM :: Transforms/LICM/pr27262.ll (3101 of 34395)
PASS: LLVM :: CodeGen/Hexagon/check-dot-new.ll (3102 of 34395)
PASS: LLVM :: CodeGen/Lanai/i32.ll (3103 of 34395)
PASS: LLVM :: FileCheck/match-full-lines.txt (3104 of 34395)
PASS: LLVM-Unit :: ADT/./ADTTests/SmallVectorTest/0.InsertEmptyRangeTest (3105 of 34395)
PASS: LLVM :: CodeGen/X86/2006-07-20-InlineAsm.ll (3106 of 34395)
PASS: LLVM :: CodeGen/X86/machine-sink.ll (3107 of 34395)
PASS: LLVM :: CodeGen/ARM/2013-10-11-select-stalls.ll (3108 of 34395)
PASS: LLVM :: DebugInfo/COFF/int8-char-type.ll (3109 of 34395)
PASS: LLVM :: MC/AArch64/SVE/uzp1.s (3110 of 34395)
PASS: LLVM :: CodeGen/X86/machine-cse.ll (3111 of 34395)
PASS: LLVM :: Transforms/PGOProfile/branch2.ll (3112 of 34395)
PASS: LLVM :: CodeGen/ARM/2013-05-13-AAPCS-byval-padding.ll (3113 of 34395)
PASS: LLVM-Unit :: Support/./SupportTests/AllocationTests/MappedMemoryTest.EnabledWrite/4 (3114 of 34395)
PASS: LLVM :: CodeGen/X86/atomic-monotonic.ll (3115 of 34395)
PASS: LLVM :: CodeGen/X86/dynamic-alloca-lifetime.ll (3116 of 34395)
PASS: LLVM :: YAMLParser/yaml.test (3117 of 34395)
PASS: LLVM :: CodeGen/ARM/rbit.ll (3118 of 34395)
PASS: LLVM :: CodeGen/X86/vector-shift-ashr-128.ll (3119 of 34395)
PASS: LLVM-Unit :: Support/./SupportTests/raw_fd_ostreamTest.multiple_raw_fd_ostream_to_stdout (3120 of 34395)
PASS: LLVM :: Transforms/AtomicExpand/AMDGPU/expand-atomic-i16.ll (3121 of 34395)
PASS: LLVM :: MC/AArch64/armv8.5a-predres-error.s (3122 of 34395)
PASS: LLVM :: MC/AArch64/SVE/mls-diagnostics.s (3123 of 34395)
PASS: LLVM :: CodeGen/ARM/sub.ll (3124 of 34395)
PASS: LLVM :: Transforms/SafeStack/ARM/debug.ll (3125 of 34395)
PASS: LLVM :: CodeGen/WebAssembly/simd-unsupported.ll (3126 of 34395)
PASS: LLVM :: Transforms/PruneEH/musttail.ll (3127 of 34395)
PASS: LLVM-Unit :: Support/./SupportTests/CommandLineTest.TokenizeConfigFile8 (3128 of 34395)
PASS: LLVM :: MC/ARM/idiv.s (3129 of 34395)
PASS: LLVM :: Transforms/PhaseOrdering/lifetime-sanitizer.ll (3130 of 34395)
PASS: LLVM :: CodeGen/AArch64/sve-vector-splat.ll (3131 of 34395)
PASS: LLVM :: Verifier/fpmath.ll (3132 of 34395)
PASS: LLVM :: CodeGen/AMDGPU/llvm.amdgcn.div.scale.ll (3133 of 34395)
PASS: LLVM :: Transforms/InstCombine/select_arithmetic.ll (3134 of 34395)
PASS: LLVM :: CodeGen/AMDGPU/GlobalISel/regbankselect-amdgcn.wqm.mir (3135 of 34395)
PASS: LLVM :: CodeGen/Hexagon/mux-basic.ll (3136 of 34395)
PASS: LLVM :: CodeGen/X86/fast-isel-constant.ll (3137 of 34395)
PASS: LLVM-Unit :: Transforms/Utils/./UtilsTests/CloneModule.Verify (3138 of 34395)
PASS: LLVM :: CodeGen/Hexagon/autohvx/shuff-64b.ll (3139 of 34395)
PASS: LLVM :: Transforms/Inline/inline_invoke.ll (3140 of 34395)
PASS: LLVM :: tools/llvm-objcopy/ELF/symbol-copy.test (3141 of 34395)
PASS: LLVM :: tools/llvm-profdata/threaded-count-mismatch.test (3142 of 34395)
PASS: LLVM :: Transforms/EliminateAvailableExternally/visibility.ll (3143 of 34395)
PASS: LLVM :: CodeGen/X86/stack-folding-int-avx512vl.ll (3144 of 34395)
PASS: LLVM :: MC/AsmParser/reassign.s (3145 of 34395)
PASS: LLVM :: CodeGen/Mips/msa/msa-nooddspreg.ll (3146 of 34395)
PASS: LLVM :: Assembler/thinlto-bad-summary3.ll (3147 of 34395)
PASS: LLVM :: MC/RISCV/target-abi-valid.s (3148 of 34395)
PASS: LLVM :: ExecutionEngine/MCJIT/test-cast.ll (3149 of 34395)
PASS: LLVM :: CodeGen/X86/2008-01-09-LongDoubleSin.ll (3150 of 34395)
PASS: LLVM :: CodeGen/AArch64/shadow-call-stack.ll (3151 of 34395)
PASS: LLVM :: Transforms/InstSimplify/log-exp-intrinsic.ll (3152 of 34395)
PASS: LLVM-Unit :: Support/./SupportTests/YAMLIO.TestGivenFilename (3153 of 34395)
PASS: LLVM :: Transforms/GlobalOpt/blockaddress.ll (3154 of 34395)
PASS: LLVM :: CodeGen/PowerPC/expand-isel-2.mir (3155 of 34395)
PASS: LLVM :: CodeGen/RISCV/srem-lkk.ll (3156 of 34395)
PASS: LLVM :: Transforms/RewriteStatepointsForGC/statepoint-coreclr.ll (3157 of 34395)
PASS: LLVM :: tools/llvm-nm/X86/macho-format-sysv.test (3158 of 34395)
PASS: LLVM :: CodeGen/X86/extended-fma-contraction.ll (3159 of 34395)
PASS: LLVM :: MC/Disassembler/Mips/mips32r5/valid-mips32r5.txt (3160 of 34395)
PASS: LLVM :: CodeGen/X86/TruncAssertZext.ll (3161 of 34395)
PASS: LLVM :: Analysis/LoopCacheAnalysis/PowerPC/matmul.ll (3162 of 34395)
PASS: LLVM :: CodeGen/X86/nonconst-static-ev.ll (3163 of 34395)
PASS: LLVM :: Analysis/ValueTracking/knownnonzero-shift.ll (3164 of 34395)
PASS: LLVM :: CodeGen/X86/addr-of-ret-addr.ll (3165 of 34395)
PASS: LLVM :: CodeGen/Hexagon/cfi-offset.ll (3166 of 34395)
PASS: LLVM :: Transforms/InstCombine/assume.ll (3167 of 34395)
PASS: LLVM :: CodeGen/AMDGPU/smrd-gfx10.ll (3168 of 34395)
PASS: LLVM :: CodeGen/Mips/compactbranches/empty-block.mir (3169 of 34395)
PASS: LLVM :: Object/nm-universal-binary.test (3170 of 34395)
PASS: LLVM :: Transforms/InstCombine/logical-select.ll (3171 of 34395)
PASS: LLVM :: CodeGen/RISCV/sdata-limit-0.ll (3172 of 34395)
PASS: LLVM :: CodeGen/ARM/ifcvt5.ll (3173 of 34395)
PASS: LLVM :: tools/llvm-objcopy/ELF/bad-build-id.test (3174 of 34395)
PASS: LLVM :: Transforms/NewGVN/simp-to-self.ll (3175 of 34395)
PASS: LLVM :: CodeGen/X86/2008-09-26-FrameAddrBug.ll (3176 of 34395)
PASS: LLVM :: MC/Disassembler/AArch64/ldp-postind.predictable.txt (3177 of 34395)
PASS: LLVM :: CodeGen/Hexagon/bit-extract-off.ll (3178 of 34395)
PASS: LLVM-Unit :: Support/./SupportTests/TargetParserTest.testARMExtension (3179 of 34395)
PASS: LLVM :: CodeGen/PowerPC/branch_coalesce.ll (3180 of 34395)
PASS: LLVM :: tools/llvm-objcopy/ELF/strict-no-add.test (3181 of 34395)
PASS: LLVM :: Transforms/GVN/cond_br.ll (3182 of 34395)
PASS: LLVM :: MC/Disassembler/AMDGPU/sop2_vi.txt (3183 of 34395)
PASS: LLVM :: Verifier/token7.ll (3184 of 34395)
PASS: LLVM :: CodeGen/Thumb2/mve-pred-xor.ll (3185 of 34395)
PASS: LLVM :: MC/AArch64/SVE2/sqdmullt-diagnostics.s (3186 of 34395)
PASS: LLVM-Unit :: ADT/./ADTTests/StringMapTest.MoveAssignment (3187 of 34395)
PASS: LLVM :: CodeGen/AMDGPU/GlobalISel/legalize-load-private.mir (3188 of 34395)
PASS: LLVM :: Analysis/BranchProbabilityInfo/libfunc_call.ll (3189 of 34395)
PASS: LLVM :: CodeGen/Mips/remu.ll (3190 of 34395)
PASS: LLVM :: Transforms/SimplifyCFG/HoistCode.ll (3191 of 34395)
PASS: LLVM :: CodeGen/X86/neg-of-3ops-lea.ll (3192 of 34395)
PASS: LLVM :: MC/AArch64/SVE/fcvtzs-diagnostics.s (3193 of 34395)
PASS: LLVM :: CodeGen/AArch64/fence-singlethread.ll (3194 of 34395)
PASS: LLVM :: CodeGen/Hexagon/swp-order-deps5.ll (3195 of 34395)
PASS: LLVM :: CodeGen/Hexagon/vect/vect-mul-v4i8.ll (3196 of 34395)
PASS: LLVM :: Transforms/SLPVectorizer/AArch64/horizontal.ll (3197 of 34395)
PASS: LLVM :: Linker/2003-04-26-NullPtrLinkProblem.ll (3198 of 34395)
PASS: LLVM :: Analysis/CostModel/AArch64/div_cte.ll (3199 of 34395)
PASS: LLVM :: TableGen/UnterminatedComment.td (3200 of 34395)
PASS: LLVM :: CodeGen/X86/2011-12-8-bitcastintprom.ll (3201 of 34395)
PASS: LLVM-Unit :: ADT/./ADTTests/ArrayRefTest.TakeWhile (3202 of 34395)
PASS: LLVM :: CodeGen/X86/avx512er-intrinsics.ll (3203 of 34395)
PASS: LLVM :: CodeGen/Hexagon/builtin-prefetch.ll (3204 of 34395)
PASS: LLVM :: CodeGen/Thumb2/thumb2-ldrd.ll (3205 of 34395)
PASS: LLVM :: CodeGen/X86/pr38639.ll (3206 of 34395)
PASS: LLVM-Unit :: CodeGen/GlobalISel/./GlobalISelTests/GISelMITest.TestBuildFPInsts (3207 of 34395)
PASS: LLVM-Unit :: Support/./SupportTests/AllocationTests/MappedMemoryTest.ZeroNear/2 (3208 of 34395)
PASS: LLVM-Unit :: IR/./IRTests/DILocationTest.discriminatorSpecialCases (3209 of 34395)
PASS: LLVM :: Transforms/NewGVN/rle.ll (3210 of 34395)
PASS: LLVM :: TableGen/SuperSubclassSameName.td (3211 of 34395)
PASS: LLVM :: DebugInfo/X86/undef-fragment.ll (3212 of 34395)
PASS: LLVM :: CodeGen/AMDGPU/GlobalISel/legalize-ctpop.mir (3213 of 34395)
PASS: LLVM :: Transforms/SimplifyCFG/bug-25299.ll (3214 of 34395)
PASS: LLVM :: CodeGen/PowerPC/ppc64-pre-inc-no-extra-phi.ll (3215 of 34395)
PASS: LLVM :: CodeGen/X86/bitcast-and-setcc-512.ll (3216 of 34395)
PASS: LLVM :: CodeGen/AMDGPU/GlobalISel/legalize-usubo.mir (3217 of 34395)
PASS: LLVM :: Transforms/SimplifyCFG/wineh-unreachable.ll (3218 of 34395)
PASS: LLVM-Unit :: ADT/./ADTTests/BitVectorTest.FindInRangeSingleWord (3219 of 34395)
PASS: LLVM :: MC/ELF/cfi-def-cfa.s (3220 of 34395)
PASS: LLVM :: MC/ARM/thumb-add-sub-width.s (3221 of 34395)
PASS: LLVM :: CodeGen/AMDGPU/dead-mi-use-same-intr.mir (3222 of 34395)
PASS: LLVM :: Instrumentation/MemorySanitizer/Mips/vararg-mips64.ll (3223 of 34395)
PASS: LLVM :: Linker/broken.ll (3224 of 34395)
PASS: LLVM :: CodeGen/X86/pr34657.ll (3225 of 34395)
PASS: LLVM :: MC/Disassembler/Mips/mips32r6/valid-mips32r6-el.txt (3226 of 34395)
PASS: LLVM :: Transforms/LoopVectorize/PowerPC/pr30990.ll (3227 of 34395)
PASS: LLVM :: CodeGen/AMDGPU/GlobalISel/llvm.amdgcn.if.break.i32.ll (3228 of 34395)
PASS: LLVM :: Analysis/CostModel/AMDGPU/br.ll (3229 of 34395)
PASS: LLVM :: CodeGen/X86/seh-localaddress.ll (3230 of 34395)
PASS: LLVM :: CodeGen/ARM/2008-04-10-ScavengerAssert.ll (3231 of 34395)
PASS: LLVM :: MC/ARM/it-nv.s (3232 of 34395)
PASS: LLVM :: CodeGen/AMDGPU/macro-fusion-cluster-vcc-uses.mir (3233 of 34395)
PASS: LLVM-Unit :: Support/./SupportTests/AllocationTests/MappedMemoryTest.MultipleAllocAndRelease/2 (3234 of 34395)
PASS: LLVM :: CodeGen/AMDGPU/fold-imm-f16-f32.mir (3235 of 34395)
PASS: LLVM :: CodeGen/Generic/dwarf-source.ll (3236 of 34395)
PASS: LLVM :: CodeGen/X86/2008-07-22-CombinerCrash.ll (3237 of 34395)
PASS: LLVM :: CodeGen/AArch64/Redundantstore.ll (3238 of 34395)
PASS: LLVM :: CodeGen/X86/haddsub-broadcast.ll (3239 of 34395)
PASS: LLVM :: CodeGen/NVPTX/fast-math.ll (3240 of 34395)
PASS: LLVM :: MC/RISCV/rv64-machine-csr-names.s (3241 of 34395)
PASS: LLVM :: tools/llvm-mca/X86/BtVer2/clear-super-register-1.s (3242 of 34395)
PASS: LLVM :: MC/ARM/mode-switch.s (3243 of 34395)
PASS: LLVM :: CodeGen/ARM/vector-DAGCombine.ll (3244 of 34395)
PASS: LLVM :: CodeGen/PowerPC/csr-save-restore-order.ll (3245 of 34395)
PASS: LLVM :: CodeGen/ARM/vshift.ll (3246 of 34395)
PASS: LLVM :: Transforms/GVNHoist/hoist-unsafe-pr31729.ll (3247 of 34395)
PASS: LLVM-Unit :: DebugInfo/MSF/./DebugInfoMSFTests/MappedBlockStreamTest.TestWriteBytesNoBreakBoundary (3248 of 34395)
PASS: LLVM :: CodeGen/BPF/CORE/offset-reloc-typedef-struct.ll (3249 of 34395)
PASS: LLVM :: MC/Mips/mips2/invalid-mips32r2.s (3250 of 34395)
PASS: LLVM :: tools/llvm-mca/X86/BdVer2/xop-super-registers-2.s (3251 of 34395)
PASS: LLVM :: CodeGen/AArch64/GlobalISel/select-with-no-legality-check.mir (3252 of 34395)
PASS: LLVM :: Analysis/MemorySSA/multiple-backedges-hal.ll (3253 of 34395)
PASS: LLVM-Unit :: ADT/./ADTTests/APIntTest.divrem_big5 (3254 of 34395)
PASS: LLVM :: Transforms/LoopVectorize/gep_with_bitcast.ll (3255 of 34395)
PASS: LLVM-Unit :: ADT/./ADTTests/SmallMapVectorSmallTest.erase (3256 of 34395)
PASS: LLVM :: MC/Mips/mips64r6/invalid-mips1-wrong-error.s (3257 of 34395)
PASS: LLVM :: CodeGen/BPF/BTF/static-var-readonly-sec.ll (3258 of 34395)
PASS: LLVM :: CodeGen/Hexagon/i128-bitop.ll (3259 of 34395)
UNSUPPORTED: LLVM :: tools/llvm-exegesis/AArch64/latency-by-opcode-name.s (3260 of 34395)
PASS: LLVM :: FileCheck/check-dag-multi-prefix.txt (3261 of 34395)
PASS: LLVM :: CodeGen/AMDGPU/trunc-cmp-constant.ll (3262 of 34395)
PASS: LLVM :: tools/llvm-objdump/AArch64/macho-link-opt-hints.test (3263 of 34395)
PASS: LLVM :: CodeGen/AArch64/arm64-spill-remarks.ll (3264 of 34395)
PASS: LLVM :: Transforms/HotColdSplit/coldentrycount.ll (3265 of 34395)
PASS: LLVM :: CodeGen/X86/2009-10-25-RewriterBug.ll (3266 of 34395)
PASS: LLVM :: CodeGen/X86/vecloadextract.ll (3267 of 34395)
PASS: LLVM :: CodeGen/PowerPC/simplifyConstCmpToISEL.ll (3268 of 34395)
PASS: LLVM-Unit :: DebugInfo/CodeView/./DebugInfoCodeViewTests/TypeIndexIteratorTest.Bitfield (3269 of 34395)
PASS: LLVM-Unit :: TextAPI/./TextAPITests/TBDv3.Platform_tvOS (3270 of 34395)
PASS: LLVM :: CodeGen/ARM/arm-insert-subvector.ll (3271 of 34395)
PASS: LLVM :: CodeGen/MSP430/shift-amount-threshold-b.ll (3272 of 34395)
PASS: LLVM :: CodeGen/X86/2013-01-09-DAGCombineBug.ll (3273 of 34395)
PASS: LLVM :: MC/AArch64/SVE2/sqrshlr.s (3274 of 34395)
PASS: LLVM :: CodeGen/X86/negate.ll (3275 of 34395)
PASS: LLVM :: CodeGen/MIR/AArch64/addrspace-memoperands.mir (3276 of 34395)
PASS: LLVM-Unit :: ADT/./ADTTests/BitVectorTest/1.EmptyVector (3277 of 34395)
PASS: LLVM :: TableGen/DefmInsideMultiClass.td (3278 of 34395)
PASS: LLVM :: CodeGen/ARM/ipra-no-csr.ll (3279 of 34395)
PASS: LLVM :: CodeGen/X86/avx-intrinsics-fast-isel.ll (3280 of 34395)
PASS: LLVM :: Transforms/TailCallElim/reorder_load.ll (3281 of 34395)
PASS: LLVM :: CodeGen/X86/pr28173.ll (3282 of 34395)
PASS: LLVM-Unit :: ADT/./ADTTests/TinyPtrVectorTest/2.InsertRange (3283 of 34395)
UNSUPPORTED: LLVM :: CodeGen/SystemZ/Large/branch-01.ll (3284 of 34395)
PASS: LLVM :: DebugInfo/symbolize-no-debug-str.test (3285 of 34395)
PASS: LLVM :: CodeGen/AMDGPU/schedule-if-2.ll (3286 of 34395)
PASS: LLVM :: CodeGen/Thumb2/bfi.ll (3287 of 34395)
PASS: LLVM :: CodeGen/ARM/ifcvt-branch-weight.ll (3288 of 34395)
PASS: LLVM :: CodeGen/AArch64/GlobalISel/vec-s16-param.ll (3289 of 34395)
PASS: LLVM :: CodeGen/AArch64/misched-fusion-csel.ll (3290 of 34395)
PASS: LLVM :: MC/AArch64/SVE/stnt1w.s (3291 of 34395)
PASS: LLVM :: DebugInfo/X86/line-info.ll (3292 of 34395)
PASS: LLVM :: CodeGen/PowerPC/hello-reloc.s (3293 of 34395)
PASS: LLVM :: CodeGen/X86/vector-idiv-udiv-256.ll (3294 of 34395)
PASS: LLVM :: Transforms/InstCombine/vector_gep1.ll (3295 of 34395)
PASS: LLVM-Unit :: ProfileData/./ProfileDataTests/SampleProfTest.remap_ext_binary_profile (3296 of 34395)
PASS: LLVM :: MC/AsmParser/directive_include.s (3297 of 34395)
PASS: LLVM :: CodeGen/X86/vector-shuffle-128-unpck.ll (3298 of 34395)
PASS: LLVM :: MC/Disassembler/ARM/thumb-tests.txt (3299 of 34395)
PASS: LLVM :: CodeGen/X86/2010-06-14-fast-isel-fs-load.ll (3300 of 34395)
PASS: LLVM :: MC/AMDGPU/hsa-metadata-unknown-key.s (3301 of 34395)
PASS: LLVM :: CodeGen/Mips/largeimmprinting.ll (3302 of 34395)
PASS: LLVM :: Analysis/ScalarEvolution/sext-iv-0.ll (3303 of 34395)
PASS: LLVM :: CodeGen/Mips/inlineasm-constraint-R.ll (3304 of 34395)
PASS: LLVM :: CodeGen/X86/ragreedy-bug.ll (3305 of 34395)
PASS: LLVM :: CodeGen/ARM/align.ll (3306 of 34395)
PASS: LLVM-Unit :: BinaryFormat/./BinaryFormatTests/MsgPackWriter.TestWriteUInt64Min (3307 of 34395)
PASS: LLVM :: CodeGen/X86/slow-incdec.ll (3308 of 34395)
PASS: LLVM :: CodeGen/ARM/softfp-fabs-fneg.ll (3309 of 34395)
PASS: LLVM :: MC/Mips/mips-alu-instructions.s (3310 of 34395)
PASS: LLVM :: CodeGen/ARM/thread_pointer.ll (3311 of 34395)
PASS: LLVM :: CodeGen/AArch64/fp16-vector-bitcast.ll (3312 of 34395)
PASS: LLVM :: Transforms/CanonicalizeAliases/canonicalize.ll (3313 of 34395)
PASS: LLVM :: MC/AArch64/SVE/add.s (3314 of 34395)
PASS: LLVM :: CodeGen/Hexagon/early-if-phi-i1.ll (3315 of 34395)
PASS: LLVM :: Transforms/LoopVectorize/X86/vectorization-remarks-missed.ll (3316 of 34395)
PASS: LLVM :: ExecutionEngine/OrcMCJIT/remote/test-ptr-reloc-remote.ll (3317 of 34395)
PASS: LLVM :: Assembler/invalid-dilocation-field-twice.ll (3318 of 34395)
PASS: LLVM :: CodeGen/X86/haddsub-shuf.ll (3319 of 34395)
PASS: LLVM :: Analysis/ScalarEvolution/exact-exit-count-more-precise.ll (3320 of 34395)
PASS: LLVM :: CodeGen/SystemZ/stackmap-nops.ll (3321 of 34395)
PASS: LLVM :: YAMLParser/spec-08-08.test (3322 of 34395)
PASS: LLVM :: CodeGen/AArch64/branch-target-enforcement-indirect-calls.ll (3323 of 34395)
PASS: LLVM :: MC/Disassembler/AMDGPU/vop3-literal.txt (3324 of 34395)
PASS: LLVM-Unit :: ADT/./ADTTests/StringMapTest.InsertPairTest (3325 of 34395)
PASS: LLVM :: CodeGen/Mips/lhu1.ll (3326 of 34395)
PASS: LLVM :: Analysis/BasicAA/phi-aa.ll (3327 of 34395)
PASS: LLVM :: MC/Disassembler/AMDGPU/lds_direct_gfx9.txt (3328 of 34395)
PASS: LLVM :: CodeGen/AMDGPU/GlobalISel/legalize-fadd.mir (3329 of 34395)
PASS: LLVM :: tools/llvm-objcopy/ELF/strip-preserve-arm-attributes.test (3330 of 34395)
PASS: LLVM :: MC/X86/intel-syntax-x86-avx512dq_vl.s (3331 of 34395)
PASS: LLVM :: Transforms/Mem2Reg/optnone.ll (3332 of 34395)
PASS: LLVM :: CodeGen/PowerPC/pr16556.ll (3333 of 34395)
PASS: LLVM :: Transforms/InstCombine/mul.ll (3334 of 34395)
PASS: LLVM-Unit :: Transforms/Utils/./UtilsTests/CloneInstruction.Inbounds (3335 of 34395)
PASS: LLVM-Unit :: Support/./SupportTests/VirtualFileSystemTest.BaseOnlyOverlay (3336 of 34395)
PASS: LLVM :: CodeGen/AMDGPU/packetizer.ll (3337 of 34395)
PASS: LLVM :: Transforms/CodeExtractor/PartialInlineAlloca5.ll (3338 of 34395)
PASS: LLVM :: CodeGen/AArch64/minmax-of-minmax.ll (3339 of 34395)
PASS: LLVM :: DebugInfo/Generic/instcombine-phi.ll (3340 of 34395)
PASS: LLVM :: MC/Disassembler/PowerPC/ppc32-extpid-e500.txt (3341 of 34395)
PASS: LLVM :: CodeGen/X86/2011-04-19-sclr-bb.ll (3342 of 34395)
PASS: LLVM :: Demangle/ms-conversion-operators.test (3343 of 34395)
PASS: LLVM :: Transforms/LoopIdiom/unroll-custom-dl.ll (3344 of 34395)
PASS: LLVM :: CodeGen/AMDGPU/GlobalISel/regbankselect-uadde.mir (3345 of 34395)
PASS: LLVM :: Transforms/CodeExtractor/ExtractedFnEntryCount.ll (3346 of 34395)
PASS: LLVM :: CodeGen/AMDGPU/GlobalISel/regbankselect-ptr-add.mir (3347 of 34395)
PASS: LLVM :: Transforms/Inline/monster_scc.ll (3348 of 34395)
PASS: LLVM :: CodeGen/AMDGPU/fcmp.f16.ll (3349 of 34395)
PASS: LLVM :: ThinLTO/X86/cfi.ll (3350 of 34395)
PASS: LLVM :: tools/llvm-mca/X86/BdVer2/resources-aes.s (3351 of 34395)
PASS: LLVM :: Analysis/ScalarEvolution/huge_expression_limit.ll (3352 of 34395)
PASS: LLVM :: CodeGen/ARM/hoist-and-by-const-from-shl-in-eqcmp-zero.ll (3353 of 34395)
PASS: LLVM :: CodeGen/PowerPC/ppc32-nest.ll (3354 of 34395)
PASS: LLVM :: MC/AArch64/adrp-relocation.s (3355 of 34395)
PASS: LLVM :: TableGen/prep-ifndef.td (3356 of 34395)
PASS: LLVM :: CodeGen/AMDGPU/GlobalISel/regbankselect-phi.mir (3357 of 34395)
PASS: LLVM :: MC/AArch64/SVE2/raddhnb-diagnostics.s (3358 of 34395)
PASS: LLVM :: DebugInfo/Generic/debug-label-opt.ll (3359 of 34395)
PASS: LLVM :: Instrumentation/AddressSanitizer/do-not-touch-odr-global.ll (3360 of 34395)
PASS: LLVM :: Assembler/invalid-uselistorder_bb-missing-bb.ll (3361 of 34395)
PASS: LLVM :: Other/2004-08-16-PackedSimple.ll (3362 of 34395)
PASS: LLVM :: CodeGen/X86/regalloc-advanced-split-cost.ll (3363 of 34395)
PASS: LLVM :: CodeGen/NVPTX/ctpop.ll (3364 of 34395)
PASS: LLVM :: MC/MachO/AArch64/reloc-crash.s (3365 of 34395)
PASS: LLVM :: CodeGen/ARM/inlineasm-operand-implicit-cast.ll (3366 of 34395)
PASS: LLVM :: tools/llvm-lipo/create-default-alignment.test (3367 of 34395)
PASS: LLVM :: Instrumentation/AddressSanitizer/lifetime-uar-uas.ll (3368 of 34395)
PASS: LLVM :: CodeGen/AArch64/GlobalISel/select-fabs.mir (3369 of 34395)
PASS: LLVM :: Transforms/InstCombine/prevent-cmp-merge.ll (3370 of 34395)
PASS: LLVM :: CodeGen/AArch64/jump-table-compress.mir (3371 of 34395)
PASS: LLVM :: MC/AsmParser/debug-empty-source.s (3372 of 34395)
PASS: LLVM :: MC/Mips/reloc-directive-bad.s (3373 of 34395)
PASS: LLVM :: Feature/global_section.ll (3374 of 34395)
PASS: LLVM :: CodeGen/BPF/remove_truncate_6.ll (3375 of 34395)
PASS: LLVM :: MC/MachO/variable-errors.s (3376 of 34395)
UNSUPPORTED: LLVM :: Bindings/OCaml/ipo.ml (3377 of 34395)
PASS: LLVM :: CodeGen/Hexagon/addrmode-offset.ll (3378 of 34395)
PASS: LLVM :: Transforms/InstCombine/icmp-dom.ll (3379 of 34395)
PASS: LLVM-Unit :: DebugInfo/GSYM/./DebugInfoGSYMTests/GSYMTest.TestGsymCreatorEncodeErrors (3380 of 34395)
PASS: LLVM :: MC/ARM/neon-table-encoding.s (3381 of 34395)
PASS: LLVM :: Transforms/InstCombine/2006-12-08-Phi-ICmp-Op-Fold.ll (3382 of 34395)
PASS: LLVM :: CodeGen/X86/2009-11-04-SubregCoalescingBug.ll (3383 of 34395)
PASS: LLVM-Unit :: Transforms/Scalar/./ScalarTests/LoopPassManagerTest.LoopPeerInsertion (3384 of 34395)
PASS: LLVM :: MC/MachO/ARM/thumb2-movw-fixup.s (3385 of 34395)
PASS: LLVM :: CodeGen/ARM/GlobalISel/thumb-select-shifts.mir (3386 of 34395)
PASS: LLVM :: MC/AArch64/SVE2/sqsub-diagnostics.s (3387 of 34395)
PASS: LLVM :: Analysis/MemorySSA/renamephis.ll (3388 of 34395)
PASS: LLVM :: MC/ELF/common-error3.s (3389 of 34395)
PASS: LLVM :: CodeGen/X86/sse-align-8.ll (3390 of 34395)
PASS: LLVM :: MC/AMDGPU/sop2.s (3391 of 34395)
PASS: LLVM :: CodeGen/X86/win64-long-double.ll (3392 of 34395)
PASS: LLVM :: CodeGen/AArch64/arm64-mul.ll (3393 of 34395)
PASS: LLVM :: CodeGen/X86/dbg-changes-codegen.ll (3394 of 34395)
PASS: LLVM :: CodeGen/Mips/mirparser/target-flags-pic-o32.mir (3395 of 34395)
PASS: LLVM :: Transforms/EarlyCSE/instsimplify-dom.ll (3396 of 34395)
PASS: LLVM-Unit :: Analysis/./AnalysisTests/MemorySSATest.DefOptimizationsAreInvalidatedOnMoving (3397 of 34395)
PASS: LLVM :: CodeGen/AMDGPU/llvm.amdgcn.raw.buffer.load.format.d16.ll (3398 of 34395)
PASS: LLVM :: LTO/X86/current-section.ll (3399 of 34395)
PASS: LLVM :: MC/Disassembler/AArch64/armv8.4a-virt.txt (3400 of 34395)
PASS: LLVM :: Transforms/GVNHoist/hoist-pr20242.ll (3401 of 34395)
PASS: LLVM :: CodeGen/X86/combine-smax.ll (3402 of 34395)
PASS: LLVM :: CodeGen/AMDGPU/load-local-f32-no-ds128.ll (3403 of 34395)
PASS: LLVM :: MC/RISCV/rv32c-only-valid.s (3404 of 34395)
PASS: LLVM :: CodeGen/X86/vec_partial.ll (3405 of 34395)
PASS: LLVM :: ExecutionEngine/OrcMCJIT/2003-06-04-bzip2-bug.ll (3406 of 34395)
PASS: LLVM :: CodeGen/Hexagon/common-global-addr.ll (3407 of 34395)
PASS: LLVM :: CodeGen/Hexagon/calling-conv.ll (3408 of 34395)
PASS: LLVM :: CodeGen/X86/fast-isel-shift.ll (3409 of 34395)
PASS: LLVM :: CodeGen/Mips/msa/llvm-stress-s1704963983.ll (3410 of 34395)
PASS: LLVM :: Transforms/InstCombine/memset-1.ll (3411 of 34395)
PASS: LLVM :: CodeGen/SystemZ/fp-move-12.ll (3412 of 34395)
PASS: LLVM :: tools/obj2yaml/elf-llvm-addrsig-section.yaml (3413 of 34395)
PASS: LLVM :: CodeGen/X86/2008-04-26-Asm-Optimize-Imm.ll (3414 of 34395)
PASS: LLVM :: CodeGen/Mips/Fast-ISel/shift.ll (3415 of 34395)
PASS: LLVM :: tools/llvm-mt/help.test (3416 of 34395)
PASS: LLVM :: CodeGen/Hexagon/swp-loopval.ll (3417 of 34395)
PASS: LLVM-Unit :: Analysis/./AnalysisTests/ValueLatticeTest.getCompareFloat (3418 of 34395)
PASS: LLVM :: CodeGen/SystemZ/vec-move-05.ll (3419 of 34395)
PASS: LLVM :: Instrumentation/ThreadSanitizer/tsan_basic.ll (3420 of 34395)
PASS: LLVM :: CodeGen/AArch64/arm64-stackmap-nops.ll (3421 of 34395)
PASS: LLVM :: DebugInfo/high-pc-constant.test (3422 of 34395)
PASS: LLVM :: CodeGen/RISCV/mul.ll (3423 of 34395)
PASS: LLVM :: CodeGen/X86/eh-frame-unreachable.ll (3424 of 34395)
PASS: LLVM :: Object/nm-pe-image.test (3425 of 34395)
PASS: LLVM :: MC/AArch64/SVE/clastb-diagnostics.s (3426 of 34395)
PASS: LLVM :: CodeGen/Generic/BasicInstrs.ll (3427 of 34395)
PASS: LLVM-Unit :: Remarks/./RemarksTests/YAMLRemarks.Contents (3428 of 34395)
PASS: LLVM :: Transforms/InstCombine/2007-02-23-PhiFoldInfLoop.ll (3429 of 34395)
PASS: LLVM :: CodeGen/Hexagon/cext-opt-range-assert.mir (3430 of 34395)
PASS: LLVM :: CodeGen/Thumb2/LowOverheadLoops/mov-after-dls.mir (3431 of 34395)
PASS: LLVM :: CodeGen/X86/fast-isel-uint-float-conversion-x86-64.ll (3432 of 34395)
PASS: LLVM :: Other/print-debug-counter.ll (3433 of 34395)
PASS: LLVM-Unit :: Support/./SupportTests/BinaryStreamTest.StreamReaderULEB128 (3434 of 34395)
PASS: LLVM :: CodeGen/Hexagon/bit-phi.ll (3435 of 34395)
PASS: LLVM :: Analysis/BasicAA/global-size.ll (3436 of 34395)
PASS: LLVM :: CodeGen/AArch64/ragreedy-local-interval-cost.ll (3437 of 34395)
PASS: LLVM :: Transforms/GlobalOpt/invariant-nodatalayout.ll (3438 of 34395)
PASS: LLVM :: CodeGen/X86/tlv-1.ll (3439 of 34395)
PASS: LLVM :: tools/llvm-mca/X86/BdVer2/hadd-read-after-ld-2.s (3440 of 34395)
PASS: LLVM :: Transforms/SimplifyCFG/switch-to-icmp.ll (3441 of 34395)
PASS: LLVM :: MC/Disassembler/AArch64/basic-a64-undefined.txt (3442 of 34395)
PASS: LLVM :: tools/llvm-objdump/ARM/v5tej-subarch.s (3443 of 34395)
PASS: LLVM :: DebugInfo/Generic/missing-abstract-variable.ll (3444 of 34395)
PASS: LLVM :: CodeGen/X86/system-intrinsics-xsavec.ll (3445 of 34395)
PASS: LLVM :: CodeGen/AArch64/fast-isel-trunc.ll (3446 of 34395)
PASS: LLVM :: Transforms/GVN/PRE/preserve-tbaa.ll (3447 of 34395)
PASS: LLVM :: CodeGen/X86/2008-05-28-CoalescerBug.ll (3448 of 34395)
PASS: LLVM :: tools/llvm-mca/X86/no-sched-model.s (3449 of 34395)
PASS: LLVM :: CodeGen/ARM/lsr-icmp-imm.ll (3450 of 34395)
PASS: LLVM :: CodeGen/SPARC/codemodel.ll (3451 of 34395)
PASS: LLVM :: CodeGen/X86/vshift-4.ll (3452 of 34395)
PASS: LLVM-Unit :: Support/./SupportTests/raw_ostreamTest.FormatDecimal (3453 of 34395)
PASS: LLVM-Unit :: Support/./SupportTests/MathExtras.MinAlign (3454 of 34395)
PASS: LLVM :: CodeGen/SystemZ/bswap-05.ll (3455 of 34395)
PASS: LLVM :: tools/llvm-mca/X86/BtVer2/rank.s (3456 of 34395)
PASS: LLVM :: MC/X86/CET-32.s (3457 of 34395)
PASS: LLVM :: CodeGen/Mips/adjust-callstack-sp.ll (3458 of 34395)
PASS: LLVM :: CodeGen/Generic/call-ret0.ll (3459 of 34395)
PASS: LLVM :: MC/Mips/macro-seq.s (3460 of 34395)
PASS: LLVM-Unit :: Analysis/./AnalysisTests/VectorUtilsTest.isSplatValue_Select_NotOp1 (3461 of 34395)
PASS: LLVM :: CodeGen/Thumb2/2010-08-10-VarSizedAllocaBug.ll (3462 of 34395)
PASS: LLVM :: CodeGen/PowerPC/post-ra-ec.ll (3463 of 34395)
PASS: LLVM :: CodeGen/AMDGPU/llvm.amdgcn.fract.ll (3464 of 34395)
PASS: LLVM :: Other/loop-pass-printer.ll (3465 of 34395)
PASS: LLVM :: CodeGen/ARM/2013-07-29-vector-or-combine.ll (3466 of 34395)
PASS: LLVM :: Verifier/scatter_gather.ll (3467 of 34395)
PASS: LLVM :: CodeGen/PowerPC/ctrloop-sums.ll (3468 of 34395)
PASS: LLVM :: Transforms/Inline/inline-hot-callsite-2.ll (3469 of 34395)
PASS: LLVM :: CodeGen/Mips/GlobalISel/llvm-ir/branch.ll (3470 of 34395)
PASS: LLVM :: CodeGen/NVPTX/machine-sink.ll (3471 of 34395)
PASS: LLVM :: Analysis/ScalarEvolution/2007-11-14-SignedAddRec.ll (3472 of 34395)
PASS: LLVM :: Transforms/GlobalDCE/global-ifunc.ll (3473 of 34395)
PASS: LLVM :: TableGen/ClassInstanceValue.td (3474 of 34395)
PASS: LLVM :: CodeGen/X86/indirect-branch-tracking.ll (3475 of 34395)
PASS: LLVM :: CodeGen/AMDGPU/indirect-addressing-term.ll (3476 of 34395)
PASS: LLVM :: CodeGen/AArch64/GlobalISel/regbank-ceil.ll (3477 of 34395)
PASS: LLVM :: CodeGen/Generic/2006-02-12-InsertLibcall.ll (3478 of 34395)
PASS: LLVM :: CodeGen/Mips/mul.ll (3479 of 34395)
PASS: LLVM :: CodeGen/Hexagon/callr-dep-edge.ll (3480 of 34395)
PASS: LLVM-Unit :: IR/./IRTests/FunctionAttachmentTest.setMetadata (3481 of 34395)
PASS: LLVM :: Bitcode/upgrade-clang-arc-use.ll (3482 of 34395)
PASS: LLVM :: CodeGen/ARM/va_arg.ll (3483 of 34395)
PASS: LLVM :: CodeGen/X86/complex-asm.ll (3484 of 34395)
PASS: LLVM :: CodeGen/X86/atom-sched.ll (3485 of 34395)
PASS: LLVM :: CodeGen/AMDGPU/wait.ll (3486 of 34395)
PASS: LLVM :: CodeGen/X86/machine-outliner-noredzone.ll (3487 of 34395)
PASS: LLVM :: DebugInfo/Mips/processes-relocations.ll (3488 of 34395)
PASS: LLVM :: CodeGen/PowerPC/pr18663.ll (3489 of 34395)
PASS: LLVM :: DebugInfo/Generic/inline-no-debug-info.ll (3490 of 34395)
PASS: LLVM :: CodeGen/X86/avx512-mov.ll (3491 of 34395)
PASS: LLVM :: CodeGen/X86/stack-probes.ll (3492 of 34395)
PASS: LLVM :: CodeGen/SystemZ/int-uadd-12.ll (3493 of 34395)
PASS: LLVM :: Other/2008-02-14-PassManager.ll (3494 of 34395)
PASS: LLVM :: CodeGen/X86/fast-isel-load-i1.ll (3495 of 34395)
PASS: LLVM :: Object/nm-archive.test (3496 of 34395)
PASS: LLVM :: CodeGen/SystemZ/fp-strict-add-02.ll (3497 of 34395)
PASS: LLVM :: CodeGen/SystemZ/vec-cmp-05.ll (3498 of 34395)
PASS: LLVM :: CodeGen/AArch64/literal_pools_float.ll (3499 of 34395)
PASS: LLVM :: Transforms/InstCombine/stacksave-debuginfo.ll (3500 of 34395)
PASS: LLVM :: CodeGen/SystemZ/dag-combine-04.ll (3501 of 34395)
PASS: LLVM :: MC/AArch64/SVE2/pmul.s (3502 of 34395)
PASS: LLVM :: CodeGen/SystemZ/asm-09.ll (3503 of 34395)
PASS: LLVM-Unit :: ExecutionEngine/Orc/./OrcJITTests/CoreAPIsStandardTest.FailAfterMaterialization (3504 of 34395)
PASS: LLVM :: CodeGen/X86/pr2182.ll (3505 of 34395)
PASS: LLVM :: CodeGen/ARM/2009-11-01-NeonMoves.ll (3506 of 34395)
PASS: LLVM :: Transforms/CodeGenPrepare/invariant.group.ll (3507 of 34395)
PASS: LLVM :: CodeGen/AArch64/arm64-inline-asm.ll (3508 of 34395)
PASS: LLVM-Unit :: ADT/./ADTTests/TripleTest.NormalizeARM (3509 of 34395)
PASS: LLVM :: Transforms/PGOProfile/select2.ll (3510 of 34395)
PASS: LLVM :: Assembler/invalid-name2.ll (3511 of 34395)
PASS: LLVM :: CodeGen/X86/fp128-compare.ll (3512 of 34395)
PASS: LLVM :: CodeGen/X86/vector-gep.ll (3513 of 34395)
PASS: LLVM :: ExecutionEngine/MCJIT/2003-01-15-AlignmentTest.ll (3514 of 34395)
PASS: LLVM-Unit :: Support/./SupportTests/DataExtractorTest.LEB128 (3515 of 34395)
PASS: LLVM :: Transforms/InstSimplify/floating-point-arithmetic.ll (3516 of 34395)
PASS: LLVM-Unit :: Support/./SupportTests/raw_pwrite_ostreamTest.TestDevNull (3517 of 34395)
PASS: LLVM :: Analysis/CostModel/X86/vshift-ashr-cost.ll (3518 of 34395)
PASS: LLVM :: CodeGen/PowerPC/sms-cpy-1.ll (3519 of 34395)
PASS: LLVM-Unit :: IR/./IRTests/PatternMatchTest.SpecificIntULE (3520 of 34395)
PASS: LLVM :: CodeGen/RISCV/interrupt-attr-nocall.ll (3521 of 34395)
PASS: LLVM :: tools/llvm-objcopy/ELF/reloc-error-remove-symtab.test (3522 of 34395)
PASS: LLVM :: MC/AArch64/SVE/decd-diagnostics.s (3523 of 34395)
PASS: LLVM :: tools/llvm-mca/X86/llvm-mca-markers-3.s (3524 of 34395)
PASS: LLVM :: CodeGen/RISCV/disable-tail-calls.ll (3525 of 34395)
PASS: LLVM :: CodeGen/X86/GlobalISel/select-memop-scalar-unordered.mir (3526 of 34395)
PASS: LLVM :: Transforms/IRCE/empty_ranges.ll (3527 of 34395)
PASS: LLVM :: CodeGen/X86/rdtsc.ll (3528 of 34395)
UNSUPPORTED: LLVM :: tools/opt-viewer/basic.test (3529 of 34395)
PASS: LLVM :: MC/AArch64/arm64-advsimd.s (3530 of 34395)
PASS: LLVM :: Analysis/MemorySSA/loop-rotate-inv-template.ll (3531 of 34395)
PASS: LLVM :: tools/llvm-objcopy/ELF/reloc-no-symtab.test (3532 of 34395)
PASS: LLVM :: CodeGen/ARM/fast-isel-call-multi-reg-return.ll (3533 of 34395)
PASS: LLVM :: MC/ARM/negative-immediates-thumb1.s (3534 of 34395)
PASS: LLVM :: CodeGen/AArch64/uaddo.ll (3535 of 34395)
PASS: LLVM :: Instrumentation/SanitizerCoverage/inline-8bit-counters.ll (3536 of 34395)
PASS: LLVM :: CodeGen/PowerPC/ifcvt-diamond-ret.mir (3537 of 34395)
PASS: LLVM :: Linker/2008-07-06-AliasFnDecl.ll (3538 of 34395)
PASS: LLVM :: CodeGen/Hexagon/packetize-nvstore.mir (3539 of 34395)
PASS: LLVM :: Linker/ident.ll (3540 of 34395)
PASS: LLVM :: CodeGen/X86/GlobalISel/ashr-scalar.ll (3541 of 34395)
PASS: LLVM :: Feature/weak_constant.ll (3542 of 34395)
PASS: LLVM :: CodeGen/X86/phaddsub-undef.ll (3543 of 34395)
PASS: LLVM :: Transforms/InstCombine/intptr4.ll (3544 of 34395)
PASS: LLVM :: MC/AMDGPU/elf-lds.s (3545 of 34395)
PASS: LLVM :: CodeGen/Thumb/2007-02-02-JoinIntervalsCrash.ll (3546 of 34395)
PASS: LLVM :: MC/AMDGPU/labels-branch-gfx9.s (3547 of 34395)
PASS: LLVM-Unit :: Transforms/Utils/./UtilsTests/CloneFunc.DebugIntrinsics (3548 of 34395)
PASS: LLVM :: Transforms/IndVarSimplify/loop_evaluate_6.ll (3549 of 34395)
PASS: LLVM :: CodeGen/SystemZ/int-div-06.ll (3550 of 34395)
PASS: LLVM :: CodeGen/SystemZ/and-02.ll (3551 of 34395)
PASS: LLVM :: Transforms/InstCombine/redundant-left-shift-input-masking-after-truncation-variant-b.ll (3552 of 34395)
PASS: LLVM :: MC/AArch64/SVE2/mls.s (3553 of 34395)
PASS: LLVM :: Transforms/SimplifyCFG/switch-on-const-select.ll (3554 of 34395)
PASS: LLVM :: MC/Mips/macro-aliases-invalid-wrong-error.s (3555 of 34395)
PASS: LLVM :: tools/llvm-objcopy/ELF/explicit-keep-remove.test (3556 of 34395)
PASS: LLVM :: CodeGen/SystemZ/rosbg-02.ll (3557 of 34395)
PASS: LLVM :: CodeGen/WebAssembly/wasmehprepare.ll (3558 of 34395)
PASS: LLVM-Unit :: Support/./SupportTests/TrigramIndexTest.Empty (3559 of 34395)
PASS: LLVM :: Transforms/LoopVectorize/pr35743.ll (3560 of 34395)
PASS: LLVM :: CodeGen/AArch64/misched-fusion-addr.ll (3561 of 34395)
PASS: LLVM-Unit :: ADT/./ADTTests/APIntTest.getHiBits (3562 of 34395)
PASS: LLVM-Unit :: TableGen/./TableGenTests/CodeExpander.Escape (3563 of 34395)
PASS: LLVM :: CodeGen/X86/bitcast-int-to-vector-bool.ll (3564 of 34395)
PASS: LLVM :: Transforms/InstCombine/2005-04-07-UDivSelectCrash.ll (3565 of 34395)
PASS: LLVM :: CodeGen/ARM/tail-call-scheduling.ll (3566 of 34395)
PASS: LLVM :: tools/llvm-dwp/X86/invalid_cu_index.test (3567 of 34395)
PASS: LLVM :: CodeGen/X86/vector-compare-any_of.ll (3568 of 34395)
PASS: LLVM-Unit :: Analysis/./AnalysisTests/LazyCallGraphTest.InternalRefEdgeToCallNoCycleInterleaved (3569 of 34395)
PASS: LLVM-Unit :: ADT/./ADTTests/SparseSetTest.PopBack (3570 of 34395)
PASS: LLVM :: CodeGen/Mips/llvm-ir/store.ll (3571 of 34395)
PASS: LLVM :: CodeGen/X86/fp-load-trunc.ll (3572 of 34395)
PASS: LLVM :: CodeGen/Hexagon/intrinsics/system_user.ll (3573 of 34395)
PASS: LLVM :: MC/Disassembler/AArch64/armv8.4a-actmon.txt (3574 of 34395)
PASS: LLVM :: CodeGen/X86/sse2-intrinsics-x86_64-upgrade.ll (3575 of 34395)
PASS: LLVM :: Transforms/Coroutines/coro-frame.ll (3576 of 34395)
PASS: LLVM-Unit :: Support/./SupportTests/BinaryStreamTest.StreamReaderBounds (3577 of 34395)
PASS: LLVM :: CodeGen/PowerPC/vec_abs.ll (3578 of 34395)
PASS: LLVM :: CodeGen/ARM/dbg.ll (3579 of 34395)
PASS: LLVM :: CodeGen/Hexagon/early-if-predicator.mir (3580 of 34395)
PASS: LLVM-Unit :: CodeGen/GlobalISel/./GlobalISelTests/GISelMITest.FewerElementsPhi (3581 of 34395)
PASS: LLVM :: CodeGen/X86/2008-04-16-CoalescerBug.ll (3582 of 34395)
PASS: LLVM :: CodeGen/ARM/2010-08-04-StackVariable.ll (3583 of 34395)
PASS: LLVM :: Transforms/InstSimplify/result-of-add-of-negative-is-non-zero-and-no-underflow.ll (3584 of 34395)
XFAIL: LLVM :: CodeGen/X86/asm-modifier-P.ll (3585 of 34395)
PASS: LLVM :: MC/ARM/eh-directive-personalityindex-diagnostics.s (3586 of 34395)
PASS: LLVM :: DebugInfo/X86/dwarf-aranges.ll (3587 of 34395)
PASS: LLVM :: Assembler/2009-02-01-UnnamedForwardRef.ll (3588 of 34395)
PASS: LLVM :: MachineVerifier/test_g_load.mir (3589 of 34395)
PASS: LLVM :: tools/llvm-readobj/file-name.test (3590 of 34395)
PASS: LLVM :: CodeGen/SystemZ/asm-10.ll (3591 of 34395)
PASS: LLVM :: Transforms/BlockExtractor/extract-blocks-with-groups.ll (3592 of 34395)
PASS: LLVM :: CodeGen/X86/2010-05-05-LocalAllocEarlyClobber.ll (3593 of 34395)
PASS: LLVM :: MC/ARM/directive-fpu-instrs.s (3594 of 34395)
PASS: LLVM :: MC/Mips/mips2/invalid-mips3.s (3595 of 34395)
PASS: LLVM :: CodeGen/X86/win32-spill-xmm.ll (3596 of 34395)
PASS: LLVM :: MC/Sparc/sparc-coproc.s (3597 of 34395)
PASS: LLVM :: MC/AArch64/SVE/ldnf1sb-diagnostics.s (3598 of 34395)
PASS: LLVM :: MC/AMDGPU/wave_any.s (3599 of 34395)
PASS: LLVM :: MC/AArch64/SVE2/tbl-diagnostics.s (3600 of 34395)
PASS: LLVM :: CodeGen/Hexagon/hwloop-le.ll (3601 of 34395)
PASS: LLVM :: MC/AArch64/SVE/orrs.s (3602 of 34395)
PASS: LLVM :: CodeGen/SystemZ/vec-cmp-cmp-logic-select.ll (3603 of 34395)
PASS: LLVM-Unit :: BinaryFormat/./BinaryFormatTests/MsgPackReader.TestReadMap32One (3604 of 34395)
PASS: LLVM :: CodeGen/PowerPC/pr25157.ll (3605 of 34395)
PASS: LLVM :: CodeGen/AMDGPU/amdgpu-codegenprepare-i16-to-i32.ll (3606 of 34395)
PASS: LLVM :: CodeGen/AArch64/combine-and-like.ll (3607 of 34395)
PASS: LLVM :: CodeGen/AArch64/fcvt-int.ll (3608 of 34395)
PASS: LLVM :: MC/Mips/sext_64_32.ll (3609 of 34395)
PASS: LLVM-Unit :: Support/./SupportTests/CommandLineTest.SetDefautValue (3610 of 34395)
PASS: LLVM :: Transforms/InstCombine/gep-vector.ll (3611 of 34395)
PASS: LLVM :: ThinLTO/X86/devirt_promote.ll (3612 of 34395)
PASS: LLVM :: CodeGen/ARM/register-scavenger-exceptions.mir (3613 of 34395)
PASS: LLVM :: CodeGen/PowerPC/vec-trunc.ll (3614 of 34395)
PASS: LLVM :: CodeGen/Hexagon/hwloop-preheader.ll (3615 of 34395)
PASS: LLVM-Unit :: DebugInfo/MSF/./DebugInfoMSFTests/MappedBlockStreamTest.ZeroCopyReadContiguousBreak (3616 of 34395)
PASS: LLVM-Unit :: IR/./IRTests/DominatorTreeBatchUpdates.LegalizeDomUpdates (3617 of 34395)
PASS: LLVM :: CodeGen/X86/2010-06-25-asm-RA-crash.ll (3618 of 34395)
PASS: LLVM :: Transforms/LoopStrengthReduce/2011-10-06-ReusePhi.ll (3619 of 34395)
PASS: LLVM :: tools/llvm-readobj/ppc64-glink.test (3620 of 34395)
PASS: LLVM :: CodeGen/X86/memcmp-optsize.ll (3621 of 34395)
PASS: LLVM :: CodeGen/MIR/AMDGPU/target-flags.mir (3622 of 34395)
PASS: LLVM :: Transforms/SLPVectorizer/SystemZ/pr34619.ll (3623 of 34395)
PASS: LLVM :: Transforms/LowerExpectIntrinsic/basic.ll (3624 of 34395)
PASS: LLVM :: CodeGen/ARM/arm-storebytesmerge.ll (3625 of 34395)
PASS: LLVM-Unit :: ProfileData/./ProfileDataTests/ParameterizedCovMapTest/CoverageMappingTest.handle_consecutive_regions_with_zero_length/0 (3626 of 34395)
PASS: LLVM :: Transforms/Coroutines/coro-frame-unreachable.ll (3627 of 34395)
PASS: LLVM :: tools/llvm-objdump/verneed-elf.test (3628 of 34395)
PASS: LLVM :: CodeGen/AMDGPU/GlobalISel/legalize-smax.mir (3629 of 34395)
PASS: LLVM :: MC/AArch64/SVE2/fcvtnt-diagnostics.s (3630 of 34395)
PASS: LLVM :: MC/Mips/memory-offsets.s (3631 of 34395)
PASS: LLVM :: Transforms/InstCombine/2006-04-28-ShiftShiftLongLong.ll (3632 of 34395)
PASS: LLVM :: CodeGen/AMDGPU/GlobalISel/regbankselect-load.mir (3633 of 34395)
PASS: LLVM :: CodeGen/Hexagon/bitmanip.ll (3634 of 34395)
PASS: LLVM :: CodeGen/AArch64/GlobalISel/select-cmpxchg.mir (3635 of 34395)
PASS: LLVM :: CodeGen/SPARC/2009-08-28-WeakLinkage.ll (3636 of 34395)
PASS: LLVM :: TableGen/generic-tables-instruction.td (3637 of 34395)
PASS: LLVM :: CodeGen/PowerPC/aa-tbaa.ll (3638 of 34395)
PASS: LLVM :: DebugInfo/MIR/AArch64/dbgcall-site-interpret-movzxi.mir (3639 of 34395)
PASS: LLVM :: CodeGen/X86/2006-05-08-InstrSched.ll (3640 of 34395)
PASS: LLVM-Unit :: Target/WebAssembly/./WebAssemblyTests/WebAssemblyExceptionInfoTest.TEST1 (3641 of 34395)
PASS: LLVM :: CodeGen/X86/TruncAssertSext.ll (3642 of 34395)
PASS: LLVM :: CodeGen/PowerPC/ppc64-sibcall-shrinkwrap.ll (3643 of 34395)
PASS: LLVM :: Transforms/LoopUnrollAndJam/disable_nonforced.ll (3644 of 34395)
PASS: LLVM :: tools/dsymutil/arch-option.test (3645 of 34395)
PASS: LLVM :: CodeGen/X86/2007-02-23-DAGCombine-Miscompile.ll (3646 of 34395)
PASS: LLVM :: Instrumentation/AddressSanitizer/ps4.ll (3647 of 34395)
PASS: LLVM :: MC/AArch64/SVE2/uqshl-diagnostics.s (3648 of 34395)
PASS: LLVM :: CodeGen/PowerPC/testComparesigeui.ll (3649 of 34395)
PASS: LLVM :: CodeGen/PowerPC/bv-widen-undef.ll (3650 of 34395)
PASS: LLVM-Unit :: ADT/./ADTTests/StringRefTest.EndsWithLower (3651 of 34395)
PASS: LLVM-Unit :: ADT/./ADTTests/SmallVectorTest/0.PushPopTest (3652 of 34395)
PASS: LLVM-Unit :: ProfileData/./ProfileDataTests/ParameterizedCovMapTest/CoverageMappingTest.load_coverage_for_more_than_two_files/2 (3653 of 34395)
PASS: LLVM :: CodeGen/AMDGPU/vi-removed-intrinsics.ll (3654 of 34395)
PASS: LLVM :: MC/Mips/macro-aliases.s (3655 of 34395)
PASS: LLVM :: Transforms/GlobalDCE/2009-02-17-AliasUsesAliasee.ll (3656 of 34395)
PASS: LLVM :: CodeGen/Thumb2/mve-intrinsics/vcvt.ll (3657 of 34395)
PASS: LLVM :: MC/COFF/assoc-undef.s (3658 of 34395)
PASS: LLVM :: CodeGen/AMDGPU/llvm.amdgcn.raw.buffer.store.ll (3659 of 34395)
PASS: LLVM :: tools/lto/print-stats.ll (3660 of 34395)
PASS: LLVM :: CodeGen/SystemZ/splitMove_undefReg_mverifier.ll (3661 of 34395)
PASS: LLVM :: CodeGen/X86/fast-isel-mem.ll (3662 of 34395)
PASS: LLVM :: CodeGen/X86/bitcast-setcc-128.ll (3663 of 34395)
PASS: LLVM :: CodeGen/Generic/hello.ll (3664 of 34395)
PASS: LLVM :: CodeGen/Hexagon/fusedandshift.ll (3665 of 34395)
PASS: LLVM :: MC/AArch64/SVE2/urshlr.s (3666 of 34395)
PASS: LLVM :: tools/llvm-mca/X86/SkylakeServer/resources-fsgsbase.s (3667 of 34395)
PASS: LLVM :: tools/yaml2obj/program-header.yaml (3668 of 34395)
PASS: LLVM :: CodeGen/X86/movddup-load-fold.ll (3669 of 34395)
PASS: LLVM-Unit :: LineEditor/./LineEditorTests/LineEditorTest.HistorySaveLoad (3670 of 34395)
PASS: LLVM :: Transforms/SampleProfile/syntax.ll (3671 of 34395)
PASS: LLVM :: CodeGen/PowerPC/early-ret2.ll (3672 of 34395)
UNSUPPORTED: LLVM :: CodeGen/AVR/pseudo/LDSWRdK.mir (3673 of 34395)
PASS: LLVM :: Transforms/LICM/pr26843.ll (3674 of 34395)
PASS: LLVM :: ExecutionEngine/RuntimeDyld/ARM/COFF_Thumb.s (3675 of 34395)
PASS: LLVM :: CodeGen/Hexagon/callR_noreturn.ll (3676 of 34395)
PASS: LLVM-Unit :: ADT/./ADTTests/ArrayRefTest.TakeUntil (3677 of 34395)
PASS: LLVM :: CodeGen/Mips/sll1.ll (3678 of 34395)
PASS: LLVM :: CodeGen/AArch64/GlobalISel/arm64-regbankselect.mir (3679 of 34395)
PASS: LLVM :: CodeGen/Thumb2/mve-div-expand.ll (3680 of 34395)
PASS: LLVM :: CodeGen/X86/pr10526.ll (3681 of 34395)
PASS: LLVM-Unit :: ProfileData/./ProfileDataTests/ParameterizedCovMapTest/CoverageMappingTest.restore_combined_counter_after_nested_region/3 (3682 of 34395)
PASS: LLVM :: CodeGen/SystemZ/int-sub-06.ll (3683 of 34395)
PASS: LLVM :: CodeGen/X86/shift-coalesce.ll (3684 of 34395)
PASS: LLVM :: CodeGen/ARM/Windows/memset.ll (3685 of 34395)
PASS: LLVM :: CodeGen/Thumb2/thumb2-ldr_post.ll (3686 of 34395)
PASS: LLVM :: Transforms/InstCombine/phi-load-metadata-dominance.ll (3687 of 34395)
PASS: LLVM :: MC/ARM/directive-literals.s (3688 of 34395)
PASS: LLVM-Unit :: Support/./SupportTests/Parallel.sort (3689 of 34395)
PASS: LLVM-Unit :: Support/./SupportTests/EndianStream.WriteInt64LE (3690 of 34395)
PASS: LLVM :: CodeGen/PowerPC/and_add.ll (3691 of 34395)
PASS: LLVM :: MC/RISCV/rvf-pseudos.s (3692 of 34395)
PASS: LLVM :: tools/llvm-objcopy/ELF/auto-remove-shndx.test (3693 of 34395)
PASS: LLVM :: CodeGen/Mips/2008-08-08-ctlz.ll (3694 of 34395)
PASS: LLVM :: MC/Disassembler/AMDGPU/sop1_vi.txt (3695 of 34395)
PASS: LLVM :: CodeGen/Hexagon/64bit_tstbit.ll (3696 of 34395)
PASS: LLVM :: CodeGen/SystemZ/fp-conv-03.ll (3697 of 34395)
PASS: LLVM :: Transforms/InstCombine/double-float-shrink-1.ll (3698 of 34395)
PASS: LLVM :: CodeGen/X86/imul-lea-2.ll (3699 of 34395)
PASS: LLVM :: Transforms/InstCombine/nsw.ll (3700 of 34395)
PASS: LLVM :: MC/AMDGPU/sop1.s (3701 of 34395)
PASS: LLVM :: Transforms/MemCpyOpt/smaller.ll (3702 of 34395)
PASS: LLVM-Unit :: ADT/./ADTTests/APIntTest.ArithmeticRightShift (3703 of 34395)
PASS: LLVM :: tools/llvm-objcopy/ELF/weaken-all.test (3704 of 34395)
PASS: LLVM :: Transforms/SCCP/switch-undef-constantfoldterminator.ll (3705 of 34395)
PASS: LLVM :: MC/Hexagon/dealloc-return-jump.s (3706 of 34395)
PASS: LLVM :: CodeGen/X86/undef-ops.ll (3707 of 34395)
PASS: LLVM :: CodeGen/Hexagon/storerinewabs.ll (3708 of 34395)
PASS: LLVM :: Transforms/LICM/2003-12-11-SinkingToPHI.ll (3709 of 34395)
PASS: LLVM :: Transforms/HotColdSplit/multiple-exits.ll (3710 of 34395)
PASS: LLVM :: Transforms/SafeStack/X86/struct.ll (3711 of 34395)
PASS: LLVM :: CodeGen/X86/masked_expandload.ll (3712 of 34395)
PASS: LLVM :: Transforms/SCCP/definite-initializer.ll (3713 of 34395)
PASS: LLVM :: Analysis/MemorySSA/reduce_clobber_limit.ll (3714 of 34395)
PASS: LLVM :: CodeGen/X86/2010-05-28-Crash.ll (3715 of 34395)
PASS: LLVM :: Transforms/HotColdSplit/delete-use-without-def-dbg-val.ll (3716 of 34395)
PASS: LLVM :: MC/Disassembler/ARM/memory-arm-instructions.txt (3717 of 34395)
PASS: LLVM :: Transforms/LoopStrengthReduce/X86/2011-07-20-DoubleIV.ll (3718 of 34395)
PASS: LLVM :: CodeGen/X86/rot16.ll (3719 of 34395)
PASS: LLVM :: Transforms/SimplifyCFG/preserve-branchweights-switch-create.ll (3720 of 34395)
PASS: LLVM :: MC/MSP430/opcode.s (3721 of 34395)
PASS: LLVM :: tools/llvm-opt-fuzzer/simple-run.ll (3722 of 34395)
PASS: LLVM :: MC/ARM/elf-reloc-condcall.s (3723 of 34395)
PASS: LLVM :: MC/AArch64/SVE2/shsub.s (3724 of 34395)
PASS: LLVM-Unit :: Remarks/./RemarksTests/YAMLRemarks.ParsingNotYAML (3725 of 34395)
PASS: LLVM :: MC/AArch64/ir-to-imgrel.ll (3726 of 34395)
PASS: LLVM :: CodeGen/X86/vector-idiv-sdiv-128.ll (3727 of 34395)
PASS: LLVM :: FileCheck/numeric-defines-diagnostics.txt (3728 of 34395)
PASS: LLVM :: CodeGen/AArch64/arm64-never-combine-csr-local-stack-bump-for-size.ll (3729 of 34395)
PASS: LLVM :: CodeGen/X86/GlobalISel/select-unmerge-vec256.mir (3730 of 34395)
PASS: LLVM :: MC/MachO/section-align-2.s (3731 of 34395)
PASS: LLVM :: CodeGen/SystemZ/vec-strict-round-02.ll (3732 of 34395)
PASS: LLVM-Unit :: Support/./SupportTests/SpecialCaseListTest.SpecialSymbolRule (3733 of 34395)
PASS: LLVM :: CodeGen/X86/addrsig.ll (3734 of 34395)
UNSUPPORTED: LLVM :: tools/gold/X86/linkonce_odr_unnamed_addr.ll (3735 of 34395)
PASS: LLVM :: Transforms/IPConstantProp/return-argument.ll (3736 of 34395)
PASS: LLVM :: CodeGen/AMDGPU/GlobalISel/regbankselect-amdgcn.readfirstlane.mir (3737 of 34395)
PASS: LLVM :: CodeGen/AMDGPU/GlobalISel/regbankselect-usube.mir (3738 of 34395)
PASS: LLVM :: MC/Disassembler/Mips/virt/valid-64.txt (3739 of 34395)
PASS: LLVM :: Transforms/LoopSimplifyCFG/pr39783.ll (3740 of 34395)
PASS: LLVM :: CodeGen/Mips/fpneeded.ll (3741 of 34395)
UNSUPPORTED: LLVM :: tools/gold/X86/thinlto_alias.ll (3742 of 34395)
PASS: LLVM :: MC/AArch64/SVE2/nbsl.s (3743 of 34395)
PASS: LLVM :: Assembler/invalid-uselistorder_bb-not-func.ll (3744 of 34395)
PASS: LLVM :: DebugInfo/dwarfdump-decompression-error.test (3745 of 34395)
PASS: LLVM :: CodeGen/X86/code_placement_ignore_succ_in_inner_loop.ll (3746 of 34395)
PASS: LLVM :: CodeGen/ARM/2012-10-04-LDRB_POST_IMM-Crash.ll (3747 of 34395)
PASS: LLVM :: MC/AArch64/SVE2/whilehs-diagnostics.s (3748 of 34395)
PASS: LLVM :: CodeGen/X86/2007-03-24-InlineAsmMultiRegConstraint.ll (3749 of 34395)
PASS: LLVM :: Transforms/InstCombine/deadcode.ll (3750 of 34395)
XFAIL: LLVM :: MC/Disassembler/Mips/mips1/invalid-xfail.txt (3751 of 34395)
PASS: LLVM :: DebugInfo/symbolize-stripped-sections.test (3752 of 34395)
PASS: LLVM :: CodeGen/Mips/dsp-r1.ll (3753 of 34395)
PASS: LLVM :: TableGen/GeneralList.td (3754 of 34395)
PASS: LLVM-Unit :: ADT/./ADTTests/BitVectorTest/0.MoveConstructor (3755 of 34395)
PASS: LLVM :: MC/ARM/basic-arm-instructions.s (3756 of 34395)
PASS: LLVM :: Transforms/ArgumentPromotion/crash.ll (3757 of 34395)
PASS: LLVM :: Transforms/InstCombine/strcpy_chk-1.ll (3758 of 34395)
PASS: LLVM :: CodeGen/X86/pr34080.ll (3759 of 34395)
PASS: LLVM :: MC/Mips/micromips-jump-instructions.s (3760 of 34395)
PASS: LLVM :: CodeGen/X86/2009-03-23-MultiUseSched.ll (3761 of 34395)
PASS: LLVM :: MC/Disassembler/SystemZ/insns-z15.txt (3762 of 34395)
PASS: LLVM-Unit :: ADT/./ADTTests/APFloatTest.PPCDoubleDoubleScalbn (3763 of 34395)
PASS: LLVM :: CodeGen/AMDGPU/mad.u16.ll (3764 of 34395)
PASS: LLVM :: CodeGen/X86/ssub_sat_vec.ll (3765 of 34395)
PASS: LLVM :: CodeGen/X86/vec-strict-128.ll (3766 of 34395)
PASS: LLVM :: CodeGen/X86/avx512vbmi2-funnel-shifts.ll (3767 of 34395)
PASS: LLVM-Unit :: Support/./SupportTests/swapByteOrder.int64_t (3768 of 34395)
PASS: LLVM :: CodeGen/AMDGPU/sched-assert-onlydbg-value-empty-region.mir (3769 of 34395)
PASS: LLVM-Unit :: ADT/./ADTTests/StringRefTest.Split2 (3770 of 34395)
PASS: LLVM :: MC/AArch64/SVE2/smlslt.s (3771 of 34395)
PASS: LLVM :: MC/AsmParser/dash-n.s (3772 of 34395)
PASS: LLVM :: CodeGen/Hexagon/restore-single-reg.ll (3773 of 34395)
PASS: LLVM :: CodeGen/Mips/octeon_popcnt.ll (3774 of 34395)
PASS: LLVM-Unit :: Support/./SupportTests/VFSFromYAMLTest.CaseSensitive (3775 of 34395)
PASS: LLVM-Unit :: ADT/./ADTTests/DenseMapTest/3.ClearTest (3776 of 34395)
PASS: LLVM :: CodeGen/Hexagon/sub-add.ll (3777 of 34395)
PASS: LLVM :: Transforms/WholeProgramDevirt/branch-funnel.ll (3778 of 34395)
PASS: LLVM :: CodeGen/RISCV/float-arith.ll (3779 of 34395)
PASS: LLVM :: tools/llvm-readobj/xcoff-overflow-section.test (3780 of 34395)
PASS: LLVM :: CodeGen/Mips/GlobalISel/llvm-ir/select.ll (3781 of 34395)
PASS: LLVM :: MC/AArch64/SVE/fneg.s (3782 of 34395)
PASS: LLVM :: CodeGen/ARM/lsr-code-insertion.ll (3783 of 34395)
PASS: LLVM :: MC/AArch64/SVE2/bsl2n-diagnostics.s (3784 of 34395)
PASS: LLVM-Unit :: Support/./SupportTests/raw_sha1_ostreamTest.Basic (3785 of 34395)
PASS: LLVM :: CodeGen/MIR/X86/call-site-info-error4.mir (3786 of 34395)
PASS: LLVM :: Transforms/InstCombine/apint-call-cast-target.ll (3787 of 34395)
PASS: LLVM-Unit :: ExecutionEngine/MCJIT/./MCJITTests/MCJITTest.multiple_decl_lookups (3788 of 34395)
PASS: LLVM :: MC/Hexagon/common-redeclare.s (3789 of 34395)
PASS: LLVM :: CodeGen/SystemZ/fp-mul-04.ll (3790 of 34395)
PASS: LLVM :: CodeGen/Generic/builtin-expect.ll (3791 of 34395)
PASS: LLVM :: MC/Mips/crc/invalid64.s (3792 of 34395)
PASS: LLVM :: MC/AArch64/SVE2/uaddlt.s (3793 of 34395)
PASS: LLVM :: CodeGen/AMDGPU/sitofp.f16.ll (3794 of 34395)
PASS: LLVM-Unit :: Support/./SupportTests/OverflowTest/4.SubOverflowToMax (3795 of 34395)
PASS: LLVM :: CodeGen/Mips/addressing-mode.ll (3796 of 34395)
PASS: LLVM :: CodeGen/X86/tailcall-pseudo-64.mir (3797 of 34395)
PASS: LLVM :: CodeGen/SPARC/func-addr.ll (3798 of 34395)
PASS: LLVM :: Transforms/LICM/call-hoisting.ll (3799 of 34395)
PASS: LLVM :: CodeGen/X86/dag-update-nodetomatch.ll (3800 of 34395)
PASS: LLVM :: CodeGen/AMDGPU/lds-global-non-entry-func.ll (3801 of 34395)
PASS: LLVM :: Transforms/IndVarSimplify/lftr.ll (3802 of 34395)
PASS: LLVM :: Assembler/insertvalue-invalid-type-1.ll (3803 of 34395)
PASS: LLVM :: CodeGen/ARM/fpcmp.ll (3804 of 34395)
PASS: LLVM-Unit :: Support/./SupportTests/FileCollectorTest.Symlinks (3805 of 34395)
PASS: LLVM :: CodeGen/Hexagon/usr-ovf-dep.ll (3806 of 34395)
PASS: LLVM :: Transforms/MergeFunc/ptr-int-transitivity-3.ll (3807 of 34395)
PASS: LLVM :: CodeGen/X86/branchfolding-undef.mir (3808 of 34395)
PASS: LLVM :: CodeGen/Thumb/2009-07-27-PEIAssert.ll (3809 of 34395)
PASS: LLVM :: CodeGen/MIR/X86/liveout-register-mask.mir (3810 of 34395)
PASS: LLVM :: CodeGen/X86/combine-mulo.ll (3811 of 34395)
PASS: LLVM :: Transforms/InstCombine/2008-11-01-SRemDemandedBits.ll (3812 of 34395)
PASS: LLVM :: CodeGen/SPARC/analyze-branch.ll (3813 of 34395)
PASS: LLVM :: MC/AArch64/SVE/ld1sw.s (3814 of 34395)
PASS: LLVM :: CodeGen/AMDGPU/drop-mem-operand-move-smrd.ll (3815 of 34395)
PASS: LLVM-Unit :: IR/./IRTests/MDNodeTest.replaceWithUniquedDeletedOperand (3816 of 34395)
PASS: LLVM :: Transforms/InterleavedAccess/AArch64/interleaved-accesses.ll (3817 of 34395)
PASS: LLVM :: CodeGen/Hexagon/hexagon-tfr-add.ll (3818 of 34395)
PASS: LLVM :: tools/llvm-objdump/private-headers-no-dynamic-segment.test (3819 of 34395)
PASS: LLVM :: Assembler/invalid_cast4.ll (3820 of 34395)
PASS: LLVM :: CodeGen/AMDGPU/GlobalISel/inst-select-amdgcn.cvt.pkrtz.mir (3821 of 34395)
PASS: LLVM-Unit :: Analysis/./AnalysisTests/DivergenceAnalysisTest.DALCSSA (3822 of 34395)
PASS: LLVM :: Transforms/SLPVectorizer/AArch64/sdiv-pow2.ll (3823 of 34395)
PASS: LLVM :: CodeGen/X86/misched-crash.ll (3824 of 34395)
PASS: LLVM :: Transforms/LoopVectorize/infiniteloop.ll (3825 of 34395)
PASS: LLVM :: CodeGen/X86/2011-03-30-CreateFixedObjCrash.ll (3826 of 34395)
PASS: LLVM :: MC/ARM/eh-directive-section-comdat.s (3827 of 34395)
PASS: LLVM :: Transforms/SLPVectorizer/X86/broadcast.ll (3828 of 34395)
PASS: LLVM :: CodeGen/PowerPC/2006-04-01-FloatDoubleExtend.ll (3829 of 34395)
PASS: LLVM :: tools/llvm-mca/X86/BtVer2/add-sequence.s (3830 of 34395)
PASS: LLVM :: CodeGen/AMDGPU/GlobalISel/legalize-xor.mir (3831 of 34395)
PASS: LLVM-Unit :: IR/./IRTests/ValueMapTest/1.DefaultCollisionBehavior (3832 of 34395)
PASS: LLVM :: CodeGen/ARM/ParallelDSP/pr43073.ll (3833 of 34395)
PASS: LLVM :: MC/X86/X87-32.s (3834 of 34395)
PASS: LLVM :: CodeGen/SystemZ/and-04.ll (3835 of 34395)
PASS: LLVM :: MC/AArch64/SVE2/bcax.s (3836 of 34395)
PASS: LLVM :: tools/llvm-mca/X86/Haswell/cmpxchg16b.s (3837 of 34395)
PASS: LLVM :: MC/Disassembler/AArch64/arm64-arithmetic.txt (3838 of 34395)
PASS: LLVM :: CodeGen/Mips/GlobalISel/regbankselect/fabs_vec.mir (3839 of 34395)
PASS: LLVM :: Analysis/ScalarEvolution/sle.ll (3840 of 34395)
PASS: LLVM :: MC/AArch64/SVE/fadda-diagnostics.s (3841 of 34395)
PASS: LLVM-Unit :: IR/./IRTests/IRBuilderTest.InsertExtractElement (3842 of 34395)
PASS: LLVM-Unit :: DebugInfo/DWARF/./DebugInfoDWARFTests/DWARFDebugInfo.TestDwarfVerifyInvalidStrp (3843 of 34395)
PASS: LLVM-Unit :: ADT/./ADTTests/APFloatTest.makeNaN (3844 of 34395)
PASS: LLVM :: CodeGen/PowerPC/2007-01-15-AsmDialect.ll (3845 of 34395)
PASS: LLVM :: Transforms/LoopVectorize/X86/reduction-crash.ll (3846 of 34395)
PASS: LLVM :: Transforms/AddDiscriminators/diamond.ll (3847 of 34395)
PASS: LLVM :: MC/AArch64/SVE2/stnt1h-diagnostics.s (3848 of 34395)
PASS: LLVM :: CodeGen/NVPTX/barrier.ll (3849 of 34395)
UNSUPPORTED: LLVM :: ExecutionEngine/Interpreter/alias.ll (3850 of 34395)
PASS: LLVM :: tools/llvm-elfabi/binary-read-syms-sysv-hash.test (3851 of 34395)
PASS: LLVM :: tools/llvm-mca/X86/Broadwell/resources-popcnt.s (3852 of 34395)
PASS: LLVM :: MC/AArch64/SVE2/shsubr-diagnostics.s (3853 of 34395)
PASS: LLVM :: Transforms/InstCombine/pr25342.ll (3854 of 34395)
PASS: LLVM :: tools/llvm-readobj/elf-symbol-binding.test (3855 of 34395)
PASS: LLVM-Unit :: Support/./SupportTests/HostTest.NumPhysicalCores (3856 of 34395)
PASS: LLVM :: CodeGen/Hexagon/vect/vect-bitcast.ll (3857 of 34395)
PASS: LLVM :: Analysis/BlockFrequencyInfo/redundant_edges.ll (3858 of 34395)
PASS: LLVM :: CodeGen/X86/fast-isel-uint-float-conversion.ll (3859 of 34395)
PASS: LLVM :: MC/ARM/armv8.2a-dotprod-a32.s (3860 of 34395)
PASS: LLVM :: Transforms/IRCE/only-lower-check.ll (3861 of 34395)
PASS: LLVM :: Transforms/SLPVectorizer/X86/shift-lshr.ll (3862 of 34395)
PASS: LLVM :: DebugInfo/X86/byvalstruct.ll (3863 of 34395)
PASS: LLVM :: Verifier/inalloca-vararg.ll (3864 of 34395)
PASS: LLVM :: Transforms/SCCP/2007-05-16-InvokeCrash.ll (3865 of 34395)
PASS: LLVM :: tools/llvm-mca/X86/BdVer2/instruction-info-view.s (3866 of 34395)
PASS: LLVM :: CodeGen/X86/selectiondag-debug-loc.ll (3867 of 34395)
PASS: LLVM :: Transforms/SimplifyCFG/EqualPHIEdgeBlockMerge.ll (3868 of 34395)
PASS: LLVM :: CodeGen/PowerPC/ppc-crbits-onoff.ll (3869 of 34395)
PASS: LLVM :: MC/ELF/file.s (3870 of 34395)
PASS: LLVM :: CodeGen/PowerPC/vsx-ldst.ll (3871 of 34395)
PASS: LLVM :: Transforms/SLPVectorizer/X86/arith-fix.ll (3872 of 34395)
PASS: LLVM :: CodeGen/ARM/default-float-abi.ll (3873 of 34395)
PASS: LLVM :: MC/AArch64/mapping-across-sections.s (3874 of 34395)
PASS: LLVM :: Transforms/PGOProfile/criticaledge.ll (3875 of 34395)
PASS: LLVM :: CodeGen/X86/avx512vlcd-intrinsics-fast-isel.ll (3876 of 34395)
PASS: LLVM :: Transforms/LoadStoreVectorizer/int_sideeffect.ll (3877 of 34395)
PASS: LLVM :: CodeGen/X86/extract-fp.ll (3878 of 34395)
PASS: LLVM :: tools/llvm-symbolizer/split-dwarf.test (3879 of 34395)
PASS: LLVM-Unit :: TextAPI/./TextAPITests/TBDv1.Swift_3_0 (3880 of 34395)
PASS: LLVM :: CodeGen/Mips/GlobalISel/instruction-select/fabs.mir (3881 of 34395)
PASS: LLVM-Unit :: ProfileData/./ProfileDataTests/ParameterizedCovMapTest/CoverageMappingTest.load_coverage_with_bogus_function_name/2 (3882 of 34395)
PASS: LLVM :: CodeGen/Generic/2005-10-21-longlonggtu.ll (3883 of 34395)
PASS: LLVM :: CodeGen/X86/2010-08-04-MingWCrash.ll (3884 of 34395)
PASS: LLVM :: CodeGen/MIR/X86/spill-slot-fixed-stack-objects.mir (3885 of 34395)
PASS: LLVM :: CodeGen/AArch64/arm64-2012-05-07-MemcpyAlignBug.ll (3886 of 34395)
PASS: LLVM-Unit :: IR/./IRTests/VerifierTest.CrossModuleRef (3887 of 34395)
PASS: LLVM :: CodeGen/MIR/AArch64/parse-shufflemask.mir (3888 of 34395)
PASS: LLVM-Unit :: ProfileData/./ProfileDataTests/ParameterizedCovMapTest/CoverageMappingTest.correct_deserialize_for_more_than_two_files/2 (3889 of 34395)
PASS: LLVM :: CodeGen/AMDGPU/offset-split-flat.ll (3890 of 34395)
PASS: LLVM :: Transforms/PGOProfile/comdat_rename.ll (3891 of 34395)
PASS: LLVM :: Transforms/LoopVectorize/diag-with-hotness-info.ll (3892 of 34395)
PASS: LLVM :: Transforms/SafeStack/X86/array-aligned.ll (3893 of 34395)
PASS: LLVM-Unit :: Support/./SupportTests/CommandLineTest.GroupingAndPrefix (3894 of 34395)
PASS: LLVM :: CodeGen/Mips/nmadd.ll (3895 of 34395)
PASS: LLVM :: CodeGen/X86/avx512vbmi2vl-intrinsics-upgrade.ll (3896 of 34395)
PASS: LLVM :: CodeGen/Generic/badFoldGEP.ll (3897 of 34395)
PASS: LLVM :: MC/Hexagon/instructions/xtype_fp.s (3898 of 34395)
PASS: LLVM :: CodeGen/Thumb/mul.ll (3899 of 34395)
PASS: LLVM :: Transforms/RewriteStatepointsForGC/base-pointers-3.ll (3900 of 34395)
PASS: LLVM :: MachineVerifier/test_g_dyn_stackalloc.mir (3901 of 34395)
PASS: LLVM-Unit :: ADT/./ADTTests/SmallSetTest.IteratorString (3902 of 34395)
PASS: LLVM :: CodeGen/AArch64/arm64-csldst-mmo.ll (3903 of 34395)
PASS: LLVM :: Transforms/InstSimplify/logic-of-fcmps.ll (3904 of 34395)
PASS: LLVM :: tools/llvm-ar/mri1.test (3905 of 34395)
PASS: LLVM :: CodeGen/PowerPC/available-externally.ll (3906 of 34395)
PASS: LLVM :: CodeGen/X86/equiv_with_fndef.ll (3907 of 34395)
PASS: LLVM :: CodeGen/Mips/GlobalISel/llvm-ir/global_address_pic.ll (3908 of 34395)
PASS: LLVM :: Transforms/PlaceSafepoints/call-in-loop.ll (3909 of 34395)
PASS: LLVM :: CodeGen/X86/x86-64-double-precision-shift-left.ll (3910 of 34395)
PASS: LLVM :: CodeGen/Hexagon/v6vect-vsplat.ll (3911 of 34395)
PASS: LLVM :: CodeGen/AArch64/arm64_32-pointer-extend.ll (3912 of 34395)
PASS: LLVM :: CodeGen/X86/ssub_sat.ll (3913 of 34395)
PASS: LLVM :: MC/AArch64/SVE/ldnt1d-diagnostics.s (3914 of 34395)
PASS: LLVM :: CodeGen/SystemZ/fp-strict-sub-01.ll (3915 of 34395)
PASS: LLVM :: CodeGen/Thumb2/LowOverheadLoops/revert-after-call.mir (3916 of 34395)
PASS: LLVM :: CodeGen/PowerPC/2008-06-19-LegalizerCrash.ll (3917 of 34395)
PASS: LLVM :: CodeGen/AMDGPU/amdpal-msgpack-es.ll (3918 of 34395)
PASS: LLVM :: Transforms/LoopPredication/basic.ll (3919 of 34395)
PASS: LLVM :: MC/AArch64/SVE/uaddv-diagnostics.s (3920 of 34395)
PASS: LLVM :: CodeGen/SystemZ/int-cmp-54.ll (3921 of 34395)
PASS: LLVM :: Transforms/IndVarSimplify/2011-09-27-hoistsext.ll (3922 of 34395)
PASS: LLVM :: CodeGen/SystemZ/fp-strict-add-03.ll (3923 of 34395)
PASS: LLVM :: CodeGen/X86/x32-function_pointer-2.ll (3924 of 34395)
PASS: LLVM :: CodeGen/Thumb2/thumb2-sub3.ll (3925 of 34395)
PASS: LLVM :: CodeGen/Mips/const1.ll (3926 of 34395)
PASS: LLVM :: CodeGen/X86/2008-12-02-dagcombine-1.ll (3927 of 34395)
PASS: LLVM :: MC/AArch64/neon-saturating-rounding-shift.s (3928 of 34395)
PASS: LLVM :: MC/Mips/module-hardfloat.s (3929 of 34395)
PASS: LLVM :: CodeGen/X86/2008-01-16-FPStackifierAssert.ll (3930 of 34395)
PASS: LLVM :: CodeGen/X86/merge-consecutive-loads-128.ll (3931 of 34395)
PASS: LLVM-Unit :: Support/./SupportTests/VirtualizationBuildAttr.testBuildAttr (3932 of 34395)
PASS: LLVM :: Transforms/IndVarSimplify/tripcount_infinite.ll (3933 of 34395)
PASS: LLVM :: CodeGen/Generic/badarg6.ll (3934 of 34395)
PASS: LLVM :: CodeGen/ARM/divmod.ll (3935 of 34395)
PASS: LLVM :: CodeGen/ARM/tail-dup-bundle.mir (3936 of 34395)
PASS: LLVM :: Transforms/ArgumentPromotion/variadic.ll (3937 of 34395)
PASS: LLVM :: Transforms/InstCombine/int_sideeffect.ll (3938 of 34395)
PASS: LLVM :: CodeGen/MIR/X86/renamable-register-flag.mir (3939 of 34395)
PASS: LLVM :: MC/ELF/debug-source.s (3940 of 34395)
PASS: LLVM :: CodeGen/SystemZ/vec-strict-sub-01.ll (3941 of 34395)
PASS: LLVM-Unit :: ProfileData/./ProfileDataTests/SampleProfTest.roundtrip_compact_binary_profile (3942 of 34395)
PASS: LLVM :: CodeGen/AArch64/dont-shrink-wrap-stack-mayloadorstore.mir (3943 of 34395)
PASS: LLVM :: CodeGen/X86/vec_shift4.ll (3944 of 34395)
PASS: LLVM :: CodeGen/Mips/GlobalISel/instruction-select/mul_vec.mir (3945 of 34395)
XFAIL: LLVM :: Transforms/NewGVN/calls-nonlocal.ll (3946 of 34395)
PASS: LLVM :: Transforms/LoopVectorize/AArch64/interleaved-vs-scalar.ll (3947 of 34395)
PASS: LLVM :: CodeGen/SystemZ/vec-perm-13.ll (3948 of 34395)
PASS: LLVM :: CodeGen/PowerPC/non-simple-args-intrin.ll (3949 of 34395)
PASS: LLVM-Unit :: ADT/./ADTTests/APFloatTest.abs (3950 of 34395)
PASS: LLVM :: CodeGen/X86/system-intrinsics-xgetbv.ll (3951 of 34395)
PASS: LLVM :: MC/MachO/reloc-diff.s (3952 of 34395)
PASS: LLVM :: CodeGen/Mips/inlineasm-constraint-reg.ll (3953 of 34395)
PASS: LLVM-Unit :: ADT/./ADTTests/PriorityWorklistTest/0.InsertSequence (3954 of 34395)
PASS: LLVM :: MC/AArch64/SVE/sxtw-diagnostics.s (3955 of 34395)
PASS: LLVM :: CodeGen/AArch64/GlobalISel/gisel-abort.ll (3956 of 34395)
PASS: LLVM :: MC/Mips/macro-rem.s (3957 of 34395)
PASS: LLVM :: CodeGen/AMDGPU/reassoc-scalar.ll (3958 of 34395)
PASS: LLVM :: Transforms/InstCombine/shl-unsigned-cmp-const.ll (3959 of 34395)
PASS: LLVM-Unit :: Support/./SupportTests/AlignmentDeathTest.Log2 (3960 of 34395)
PASS: LLVM :: MC/AArch64/SVE/ldff1b.s (3961 of 34395)
PASS: LLVM :: tools/llvm-readobj/imports.test (3962 of 34395)
PASS: LLVM-Unit :: ADT/./ADTTests/DenseMapTest/1.EraseTest2 (3963 of 34395)
PASS: LLVM :: DebugInfo/X86/sroasplit-dbg-declare.ll (3964 of 34395)
PASS: LLVM :: Bitcode/DIGlobalVariableExpression.ll (3965 of 34395)
PASS: LLVM :: CodeGen/PowerPC/fast-isel-rsp.ll (3966 of 34395)
PASS: LLVM-Unit :: Analysis/./AnalysisTests/DomTreeUpdater.LazyUpdateStepTest (3967 of 34395)
PASS: LLVM :: CodeGen/Mips/long-call-attr.ll (3968 of 34395)
PASS: LLVM :: CodeGen/WebAssembly/simd-nested-shuffles.ll (3969 of 34395)
PASS: LLVM :: Transforms/EarlyCSE/readnone-mayunwind.ll (3970 of 34395)
PASS: LLVM :: Transforms/InstCombine/unsigned-add-overflow-check-via-add.ll (3971 of 34395)
PASS: LLVM :: CodeGen/X86/regpressure.ll (3972 of 34395)
PASS: LLVM :: Bitcode/DIGlobalVariableExpression2.ll (3973 of 34395)
PASS: LLVM :: tools/llvm-xray/X86/account-deduce-tail-call.yaml (3974 of 34395)
PASS: LLVM :: Verifier/immarg-param-attribute-invalid.ll (3975 of 34395)
PASS: LLVM :: Transforms/LoadStoreVectorizer/AMDGPU/vect-ptr-ptr-size-mismatch.ll (3976 of 34395)
PASS: LLVM :: CodeGen/AMDGPU/llvm.amdgcn.set.inactive.ll (3977 of 34395)
PASS: LLVM :: CodeGen/X86/scalarize-fp.ll (3978 of 34395)
PASS: LLVM :: MC/Mips/elf_eflags_nanlegacy.s (3979 of 34395)
PASS: LLVM-Unit :: Support/./SupportTests/SpecialCaseListTest.CorrectErrorLineNumberWithBlankLine (3980 of 34395)
PASS: LLVM :: Transforms/GVN/phi-translate-partial-alias.ll (3981 of 34395)
PASS: LLVM :: CodeGen/SystemZ/shift-05.ll (3982 of 34395)
PASS: LLVM :: Analysis/ValueTracking/monotonic-phi.ll (3983 of 34395)
PASS: LLVM :: CodeGen/AMDGPU/vselect.ll (3984 of 34395)
PASS: LLVM-Unit :: ADT/./ADTTests/FoldingSetTest.IDComparison (3985 of 34395)
PASS: LLVM :: Analysis/CostModel/ARM/select.ll (3986 of 34395)
PASS: LLVM :: CodeGen/ARM/neon-fma.ll (3987 of 34395)
PASS: LLVM :: Linker/2003-08-28-TypeResolvesGlobal2.ll (3988 of 34395)
PASS: LLVM :: DebugInfo/X86/loclists-dwp.ll (3989 of 34395)
PASS: LLVM :: CodeGen/X86/anyregcc.ll (3990 of 34395)
PASS: LLVM :: Assembler/2004-11-28-InvalidTypeCrash.ll (3991 of 34395)
PASS: LLVM-Unit :: Support/./SupportTests/SymbolRemappingReaderTest.BadMappingOrder (3992 of 34395)
PASS: LLVM-Unit :: IR/./IRTests/ConstantsTest.GEPReplaceWithConstant (3993 of 34395)
PASS: LLVM-Unit :: IR/./IRTests/MDBuilderTest.createTBAANode (3994 of 34395)
PASS: LLVM :: CodeGen/PowerPC/float-load-store-pair.ll (3995 of 34395)
PASS: LLVM :: CodeGen/ARM/ldm-stm-i256.ll (3996 of 34395)
PASS: LLVM :: Transforms/LICM/speculate.ll (3997 of 34395)
PASS: LLVM :: CodeGen/X86/avx512vl-vec-test-testn.ll (3998 of 34395)
PASS: LLVM :: CodeGen/AMDGPU/GlobalISel/inst-select-amdgcn.sin.mir (3999 of 34395)
PASS: LLVM :: Transforms/ConstProp/extractvalue.ll (4000 of 34395)
PASS: LLVM :: CodeGen/Thumb2/mve-masked-store.ll (4001 of 34395)
PASS: LLVM :: CodeGen/SystemZ/int-mul-06.ll (4002 of 34395)
PASS: LLVM-Unit :: tools/llvm-cfi-verify/./CFIVerifyTests/BasicX86FileAnalysisTest.CFIProtectionWithUnconditionalJumpInFallthrough (4003 of 34395)
PASS: LLVM :: CodeGen/MIR/AMDGPU/intrinsics.mir (4004 of 34395)
UNSUPPORTED: LLVM :: Bindings/OCaml/ext_exc.ml (4005 of 34395)
PASS: LLVM :: MC/ELF/no-reloc.s (4006 of 34395)
PASS: LLVM :: CodeGen/X86/x86-32-intrcc.ll (4007 of 34395)
PASS: LLVM :: Analysis/CFLAliasAnalysis/Steensgaard/interproc-store-arg-unknown.ll (4008 of 34395)
PASS: LLVM :: CodeGen/Hexagon/hwloop-preh.ll (4009 of 34395)
PASS: LLVM-Unit :: Support/./SupportTests/Error.CheckJoinErrors (4010 of 34395)
PASS: LLVM :: CodeGen/AMDGPU/control-flow-fastregalloc.ll (4011 of 34395)
PASS: LLVM :: LTO/X86/attrs.ll (4012 of 34395)
PASS: LLVM :: MC/AArch64/armv8.4a-trace-error.s (4013 of 34395)
PASS: LLVM :: tools/llvm-objcopy/ELF/keep-symbol-remove-section.test (4014 of 34395)
PASS: LLVM :: CodeGen/PowerPC/NoCRFieldRedefWhenSpillingCRBIT.mir (4015 of 34395)
PASS: LLVM :: CodeGen/X86/fma4-intrinsics-x86.ll (4016 of 34395)
PASS: LLVM :: CodeGen/X86/ssp-data-layout.ll (4017 of 34395)
PASS: LLVM :: MC/Disassembler/AMDGPU/buf_fmt_packed_d16.txt (4018 of 34395)
PASS: LLVM :: CodeGen/AArch64/zero-reg.ll (4019 of 34395)
PASS: LLVM :: CodeGen/AMDGPU/sdivrem24.ll (4020 of 34395)
PASS: LLVM :: Bindings/llvm-c/set_metadata.ll (4021 of 34395)
PASS: LLVM :: CodeGen/ARM/uxtb.ll (4022 of 34395)
PASS: LLVM :: MC/Disassembler/ARM/armv8.2a-dotprod-t32.s (4023 of 34395)
PASS: LLVM :: tools/llvm-objdump/X86/macho-private-headers.test (4024 of 34395)
PASS: LLVM :: CodeGen/MIR/AArch64/generic-virtual-registers-error.mir (4025 of 34395)
PASS: LLVM :: CodeGen/PowerPC/seteq-0.ll (4026 of 34395)
PASS: LLVM :: DebugInfo/Generic/enum.ll (4027 of 34395)
PASS: LLVM :: Instrumentation/SanitizerCoverage/switch-tracing.ll (4028 of 34395)
PASS: LLVM :: CodeGen/X86/fast-isel-x86.ll (4029 of 34395)
PASS: LLVM :: CodeGen/X86/statepoint-far-call.ll (4030 of 34395)
PASS: LLVM :: CodeGen/AArch64/GlobalISel/select.mir (4031 of 34395)
PASS: LLVM-Unit :: ADT/./ADTTests/SmallVectorTest/0.ResizeShrinkTest (4032 of 34395)
PASS: LLVM :: CodeGen/MIR/X86/immediate-operands.mir (4033 of 34395)
PASS: LLVM :: DebugInfo/Generic/location-verifier.ll (4034 of 34395)
PASS: LLVM :: CodeGen/X86/vec_minmax_uint.ll (4035 of 34395)
PASS: LLVM :: Bitcode/value-with-long-name.ll (4036 of 34395)
PASS: LLVM :: CodeGen/AArch64/machine_cse.ll (4037 of 34395)
PASS: LLVM :: Transforms/AtomicExpand/AMDGPU/expand-atomic-rmw-fsub.ll (4038 of 34395)
PASS: LLVM :: CodeGen/Hexagon/hwloop-pos-ivbump1.ll (4039 of 34395)
PASS: LLVM :: tools/llvm-readobj/coff-file-headers.test (4040 of 34395)
PASS: LLVM :: Analysis/CostModel/ARM/insertelement.ll (4041 of 34395)
PASS: LLVM :: CodeGen/PowerPC/2016-01-07-BranchWeightCrash.ll (4042 of 34395)
PASS: LLVM :: Transforms/IndVarSimplify/pr28935.ll (4043 of 34395)
PASS: LLVM :: CodeGen/XCore/sr-intrinsics.ll (4044 of 34395)
PASS: LLVM :: Transforms/Inline/inline-indirect.ll (4045 of 34395)
PASS: LLVM-Unit :: ExecutionEngine/MCJIT/./MCJITTests/MCJITTest.return_global (4046 of 34395)
PASS: LLVM :: CodeGen/Hexagon/always-ext.ll (4047 of 34395)
PASS: LLVM :: CodeGen/X86/llc-start-stop-instance.ll (4048 of 34395)
PASS: LLVM-Unit :: ADT/./ADTTests/DenseMapTest/5.SingleEntryMapTest (4049 of 34395)
PASS: LLVM :: CodeGen/PowerPC/bperm.ll (4050 of 34395)
PASS: LLVM :: CodeGen/X86/pr32659.ll (4051 of 34395)
PASS: LLVM :: CodeGen/NVPTX/shfl-sync.ll (4052 of 34395)
PASS: LLVM-Unit :: ADT/./ADTTests/DepthFirstIteratorTest.ActuallyUpdateIterator (4053 of 34395)
PASS: LLVM :: MC/AArch64/SVE/frsqrte.s (4054 of 34395)
PASS: LLVM-Unit :: ADT/./ADTTests/FallibleIteratorTest.CheckStructDerefOperatorSupport (4055 of 34395)
PASS: LLVM :: CodeGen/Thumb/shift-and.ll (4056 of 34395)
UNSUPPORTED: LLVM :: MC/AVR/inst-spm.s (4057 of 34395)
PASS: LLVM :: CodeGen/XCore/switch_long.ll (4058 of 34395)
PASS: LLVM :: CodeGen/PowerPC/xvcmpeqdp-v2f64.ll (4059 of 34395)
PASS: LLVM :: MC/ARM/neont2-shiftaccum-encoding.s (4060 of 34395)
PASS: LLVM :: CodeGen/ARM/arm-vlddup-update.ll (4061 of 34395)
PASS: LLVM :: Transforms/InstCombine/2010-11-21-SizeZeroTypeGEP.ll (4062 of 34395)
PASS: LLVM :: MC/ARM/neont2-reciprocal-encoding.s (4063 of 34395)
PASS: LLVM-Unit :: Analysis/./AnalysisTests/VFABIParserTest.ParseVectorName (4064 of 34395)
PASS: LLVM :: CodeGen/AMDGPU/GlobalISel/regbankselect-mul.mir (4065 of 34395)
PASS: LLVM :: MC/AMDGPU/literalv216-err.s (4066 of 34395)
PASS: LLVM-Unit :: Support/./SupportTests/FormatVariadicTest.FormatError (4067 of 34395)
XFAIL: LLVM :: CodeGen/Hexagon/constp-combine-neg.ll (4068 of 34395)
PASS: LLVM :: tools/llvm-symbolizer/coff-exports.test (4069 of 34395)
PASS: LLVM :: CodeGen/X86/2009-04-12-picrel.ll (4070 of 34395)
PASS: LLVM-Unit :: CodeGen/./CodeGenTests/MachineOperandTest.PrintTargetIndexName (4071 of 34395)
PASS: LLVM :: Transforms/Internalize/vcall-visibility.ll (4072 of 34395)
PASS: LLVM :: DebugInfo/COFF/scopes.ll (4073 of 34395)
PASS: LLVM :: Bitcode/DINamespace.ll (4074 of 34395)
PASS: LLVM :: CodeGen/X86/2011-09-14-valcoalesce.ll (4075 of 34395)
PASS: LLVM :: MC/AArch64/SVE/not.s (4076 of 34395)
PASS: LLVM :: Transforms/LoopVectorize/vect-phiscev-sext-trunc.ll (4077 of 34395)
PASS: LLVM :: CodeGen/X86/ins_split_regalloc.ll (4078 of 34395)
PASS: LLVM :: Transforms/SimplifyCFG/DeadSetCC.ll (4079 of 34395)
PASS: LLVM :: CodeGen/X86/2007-05-14-LiveIntervalAssert.ll (4080 of 34395)
PASS: LLVM :: MC/AArch64/armv8.5a-specrestrict.s (4081 of 34395)
PASS: LLVM :: DebugInfo/X86/sdagsplit-1.ll (4082 of 34395)
PASS: LLVM :: tools/llvm-objcopy/MachO/real-world-input-copy.test (4083 of 34395)
PASS: LLVM :: CodeGen/AArch64/inlineasm-S-constraint.ll (4084 of 34395)
PASS: LLVM :: CodeGen/X86/empty-struct-return-type.ll (4085 of 34395)
PASS: LLVM :: LTO/X86/list-dependent-libraries.ll (4086 of 34395)
UNSUPPORTED: LLVM :: CodeGen/AVR/copy-data-to-ram.ll (4087 of 34395)
PASS: LLVM :: MC/ARM/directive-arch-armv5te.s (4088 of 34395)
PASS: LLVM :: CodeGen/Hexagon/csr-func-usedef.ll (4089 of 34395)
PASS: LLVM :: Analysis/BasicAA/sequential-gep.ll (4090 of 34395)
PASS: LLVM :: MC/ARM/directive-arch-armv2.s (4091 of 34395)
PASS: LLVM-Unit :: ProfileData/./ProfileDataTests/MaybeSparse/MaybeSparseInstrProfTest.get_icall_data_read_write/0 (4092 of 34395)
PASS: LLVM :: MC/X86/x86-64-avx512bw.s (4093 of 34395)
PASS: LLVM :: CodeGen/AMDGPU/GlobalISel/regbankselect-intrinsic-round.mir (4094 of 34395)
PASS: LLVM :: Transforms/PhaseOrdering/two-shifts-by-sext.ll (4095 of 34395)
PASS: LLVM-Unit :: IR/./IRTests/DominatorTree.DeleteUnreachable (4096 of 34395)
PASS: LLVM :: CodeGen/Mips/Fast-ISel/rem1.ll (4097 of 34395)
PASS: LLVM :: Transforms/LoopUnswitch/2007-07-18-DomInfo.ll (4098 of 34395)
PASS: LLVM :: CodeGen/AMDGPU/waitcnt-vscnt.ll (4099 of 34395)
PASS: LLVM :: MC/AMDGPU/sopc.s (4100 of 34395)
PASS: LLVM :: CodeGen/Generic/2002-04-14-UnexpectedUnsignedType.ll (4101 of 34395)
PASS: LLVM :: DebugInfo/Generic/debug-names-many-cu.ll (4102 of 34395)
PASS: LLVM :: tools/llvm-split/function.ll (4103 of 34395)
PASS: LLVM :: MC/ARM/thumb-cb-offsets.s (4104 of 34395)
PASS: LLVM :: CodeGen/X86/pr33954.ll (4105 of 34395)
PASS: LLVM :: CodeGen/Thumb2/2013-03-06-vector-sext-operand-scalarize.ll (4106 of 34395)
PASS: LLVM :: Transforms/JumpThreading/pr15851_hang.ll (4107 of 34395)
PASS: LLVM :: tools/yaml2obj/implicit-sections-info.yaml (4108 of 34395)
PASS: LLVM :: Transforms/ArgumentPromotion/2008-02-01-ReturnAttrs.ll (4109 of 34395)
PASS: LLVM :: CodeGen/Mips/llvm-ir/atomicrmx.ll (4110 of 34395)
PASS: LLVM :: Transforms/MergeFunc/ranges-multiple.ll (4111 of 34395)
PASS: LLVM :: Bitcode/thinlto-function-summary-callgraph-pgo.ll (4112 of 34395)
PASS: LLVM :: CodeGen/X86/stack-align.ll (4113 of 34395)
PASS: LLVM :: Assembler/2002-03-08-NameCollision.ll (4114 of 34395)
PASS: LLVM :: DebugInfo/NVPTX/debug-empty.ll (4115 of 34395)
PASS: LLVM :: tools/yaml2obj/linker-options.yaml (4116 of 34395)
PASS: LLVM :: MC/Disassembler/AArch64/arm64-basic-a64-undefined.txt (4117 of 34395)
PASS: LLVM-Unit :: Support/./SupportTests/PCS_ROBuildAttr.testBuildAttr (4118 of 34395)
PASS: LLVM :: CodeGen/PowerPC/crsave.ll (4119 of 34395)
PASS: LLVM-Unit :: ADT/./ADTTests/BitVectorTest/0.RangeOps (4120 of 34395)
PASS: LLVM :: CodeGen/Hexagon/M4_mpyri_addi_global.ll (4121 of 34395)
PASS: LLVM :: DebugInfo/X86/sdag-salvage-add.ll (4122 of 34395)
PASS: LLVM :: CodeGen/X86/fma-fneg-combine-2.ll (4123 of 34395)
PASS: LLVM :: CodeGen/Mips/inlineasm-constraint.ll (4124 of 34395)
PASS: LLVM :: CodeGen/PowerPC/BoolRetToIntTest.ll (4125 of 34395)
PASS: LLVM :: CodeGen/X86/GlobalISel/legalize-ashr-scalar.mir (4126 of 34395)
PASS: LLVM :: CodeGen/SystemZ/vec-neg-01.ll (4127 of 34395)
PASS: LLVM :: CodeGen/AMDGPU/store-global.ll (4128 of 34395)
PASS: LLVM :: MC/AArch64/SVE2/xar.s (4129 of 34395)
UNSUPPORTED: LLVM :: CodeGen/AVR/atomics/load32.ll (4130 of 34395)
PASS: LLVM :: tools/llvm-objcopy/ELF/compress-and-decompress-debug-sections-error.test (4131 of 34395)
PASS: LLVM :: CodeGen/ARM/swift-atomics.ll (4132 of 34395)
PASS: LLVM-Unit :: BinaryFormat/./BinaryFormatTests/MsgPackWriter.TestWriteMap16Max (4133 of 34395)
PASS: LLVM-Unit :: Analysis/./AnalysisTests/IsBytewiseValueParamTests/IsBytewiseValueTest.IsBytewiseValue/11 (4134 of 34395)
PASS: LLVM :: MC/Disassembler/Hexagon/ld.txt (4135 of 34395)
PASS: LLVM :: MC/Disassembler/ARM/unpredictable-MRS-arm.txt (4136 of 34395)
PASS: LLVM :: ExecutionEngine/RuntimeDyld/Mips/ELF_N64R6_relocations.s (4137 of 34395)
PASS: LLVM :: Analysis/MemorySSA/optimize-use.ll (4138 of 34395)
PASS: LLVM :: CodeGen/AArch64/machine-outliner-compatible-candidates.mir (4139 of 34395)
PASS: LLVM :: ThinLTO/X86/debuginfo-compositetype-import.ll (4140 of 34395)
PASS: LLVM-Unit :: Support/./SupportTests/YAMLIO.TestReadBuiltInTypesint64UnderError (4141 of 34395)
PASS: LLVM :: MC/ARM/mve-qdest-qsrc.s (4142 of 34395)
PASS: LLVM :: CodeGen/PowerPC/rounding-ops.ll (4143 of 34395)
PASS: LLVM :: Linker/metadata-b.ll (4144 of 34395)
PASS: LLVM-Unit :: tools/llvm-cfi-verify/./CFIVerifyTests/BasicGraphBuilderTest.BuildFlowGraphTestSinglePathJumpUd2 (4145 of 34395)
PASS: LLVM :: Analysis/CFLAliasAnalysis/Steensgaard/arguments-globals.ll (4146 of 34395)
[Pipeline] }
[Pipeline] // timeout
[Pipeline] }
[Pipeline] // stage
[Pipeline] stage
[Pipeline] { (Declarative: Post Actions)
[Pipeline] scanForIssues
No credentials specified
[Clang (LLVM based)] Sleeping for 5 seconds due to JENKINS-32191...
[Clang (LLVM based)] Parsing console log (workspace: '/Users/buildslave/jenkins/workspace/coverage')
[Clang (LLVM based)] [-ERROR-] Can't determine head commit using 'git rev-parse'. Skipping blame.
[Clang (LLVM based)] [-ERROR-] hudson.plugins.git.GitException: Command "git rev-parse HEAD^{commit}" returned status code 128:
stdout: 
stderr: fatal: not a git repository (or any of the parent directories): .git

Hide Details

[Clang (LLVM based)] [-ERROR-] at org.jenkinsci.plugins.gitclient.CliGitAPIImpl.launchCommandIn(CliGitAPIImpl.java:2172) [Clang (LLVM based)] [-ERROR-] at org.jenkinsci.plugins.gitclient.CliGitAPIImpl.launchCommandIn(CliGitAPIImpl.java:2140) [Clang (LLVM based)] [-ERROR-] at org.jenkinsci.plugins.gitclient.CliGitAPIImpl.launchCommandIn(CliGitAPIImpl.java:2136) [Clang (LLVM based)] [-ERROR-] at org.jenkinsci.plugins.gitclient.CliGitAPIImpl.launchCommand(CliGitAPIImpl.java:1741) [Clang (LLVM based)] [-ERROR-] at org.jenkinsci.plugins.gitclient.CliGitAPIImpl.launchCommand(CliGitAPIImpl.java:1753) [Clang (LLVM based)] [-ERROR-] at org.jenkinsci.plugins.gitclient.CliGitAPIImpl.revParse(CliGitAPIImpl.java:938) [Clang (LLVM based)] [-ERROR-] at hudson.plugins.git.GitAPI.revParse(GitAPI.java:316) [Clang (LLVM based)] [-ERROR-] at io.jenkins.plugins.analysis.core.scm.GitBlamer.blame(GitBlamer.java:65) [Clang (LLVM based)] [-ERROR-] at io.jenkins.plugins.analysis.core.steps.IssuesScanner$ReportPostProcessor.invoke(IssuesScanner.java:180) [Clang (LLVM based)] [-ERROR-] at io.jenkins.plugins.analysis.core.steps.IssuesScanner$ReportPostProcessor.invoke(IssuesScanner.java:148) [Clang (LLVM based)] [-ERROR-] at hudson.FilePath$FileCallableWrapper.call(FilePath.java:3050) [Clang (LLVM based)] [-ERROR-] at hudson.remoting.UserRequest.perform(UserRequest.java:212) [Clang (LLVM based)] [-ERROR-] at hudson.remoting.UserRequest.perform(UserRequest.java:54) [Clang (LLVM based)] [-ERROR-] at hudson.remoting.Request$2.run(Request.java:369) [Clang (LLVM based)] [-ERROR-] at hudson.remoting.InterceptingExecutorService$1.call(InterceptingExecutorService.java:72) [Clang (LLVM based)] [-ERROR-] at java.util.concurrent.FutureTask.run(FutureTask.java:266) [Clang (LLVM based)] [-ERROR-] at java.util.concurrent.ThreadPoolExecutor.runWorker(ThreadPoolExecutor.java:1149) [Clang (LLVM based)] [-ERROR-] at java.util.concurrent.ThreadPoolExecutor$Worker.run(ThreadPoolExecutor.java:624) [Clang (LLVM based)] [-ERROR-] at java.lang.Thread.run(Thread.java:748) [Clang (LLVM based)] Post processing issues on 'green-dragon-23' with source code encoding 'UTF-8' [Clang (LLVM based)] Resolving absolute file names for all issues in workspace '/Users/buildslave/jenkins/workspace/coverage' [Clang (LLVM based)] -> 0 resolved, 0 unresolved, 2 already resolved [Clang (LLVM based)] Copying affected files to Jenkins' build folder '/Users/Shared/Jenkins/Home/jobs/coverage/builds/93/files-with-issues' [Clang (LLVM based)] -> 2 copied, 0 not in workspace, 0 not-found, 0 with I/O error [Clang (LLVM based)] Resolving module names from module definitions (build.xml, pom.xml, or Manifest.mf files) [Clang (LLVM based)] -> resolved module names for 2 issues [Clang (LLVM based)] Resolving package names (or namespaces) by parsing the affected files [Clang (LLVM based)] -> resolved package names of 2 affected files [Clang (LLVM based)] No filter has been set, publishing all 2 issues [Clang (LLVM based)] Creating fingerprints for all affected code blocks to track issues over different builds [Clang (LLVM based)] -> created fingerprints for 2 issues [Clang (LLVM based)] Invoking Git blamer to create author and commit information for all affected files [Clang (LLVM based)] GIT_COMMIT env = 'HEAD' [Clang (LLVM based)] Git working tree = '/Users/buildslave/jenkins/workspace/coverage' [Pipeline] junit Recording test results > git rev-parse HEAD^{commit} # timeout=10 [Pipeline] } [Pipeline] // stage [Pipeline] } [Pipeline] // node [Pipeline] End of Pipeline [BFA] Scanning build for known causes... [BFA] Found failure cause(s): [BFA] Compile Error from category Compile [BFA] Regression test failed from category Test [BFA] Link error [BFA] Ninja target failed from category Compile [BFA] Done. 2s java.io.FileNotFoundException: /Users/Shared/Jenkins/Home/jobs/coverage/builds/93/atomic1834600994503971745.tmp (Too many open files) at java.io.RandomAccessFile.open0(Native Method) at java.io.RandomAccessFile.open(RandomAccessFile.java:316) at java.io.RandomAccessFile.<init>(RandomAccessFile.java:243) at org.jenkinsci.plugins.workflow.support.pickles.serialization.RiverWriter.close(RiverWriter.java:176) at org.jenkinsci.plugins.workflow.cps.CpsThreadGroup.saveProgram(CpsThreadGroup.java:525) at org.jenkinsci.plugins.workflow.cps.CpsThreadGroup.saveProgram(CpsThreadGroup.java:499) at org.jenkinsci.plugins.workflow.cps.CpsStepContext$3.onSuccess(CpsStepContext.java:531) at org.jenkinsci.plugins.workflow.cps.CpsStepContext$3.onSuccess(CpsStepContext.java:525) at org.jenkinsci.plugins.workflow.cps.CpsFlowExecution$4$1.run(CpsFlowExecution.java:907) at org.jenkinsci.plugins.workflow.cps.CpsVmExecutorService$1.run(CpsVmExecutorService.java:37) at java.util.concurrent.Executors$RunnableAdapter.call(Executors.java:511) at java.util.concurrent.FutureTask.run(FutureTask.java:266) at hudson.remoting.SingleLaneExecutorService$1.run(SingleLaneExecutorService.java:131) at jenkins.util.ContextResettingExecutorService$1.run(ContextResettingExecutorService.java:28) at jenkins.security.ImpersonatingExecutorService$1.run(ImpersonatingExecutorService.java:59) at java.util.concurrent.Executors$RunnableAdapter.call(Executors.java:511) at java.util.concurrent.FutureTask.run(FutureTask.java:266) at java.util.concurrent.ThreadPoolExecutor.runWorker(ThreadPoolExecutor.java:1149) at java.util.concurrent.ThreadPoolExecutor$Worker.run(ThreadPoolExecutor.java:624) at java.lang.Thread.run(Thread.java:748) Finished: FAILURE