FailedConsole Output

Skipping 712 KB.. Full Log
-hook index.)
	_regexp-up        -- Select an older stack frame.  Defaults to moving one frame, a numeric argument can specify an arbitrary number.
	apropos           -- List debugger commands related to a word or subject.
	breakpoint        -- Commands for operating on breakpoints (see 'help b' for shorthand.)
	command           -- Commands for managing custom LLDB commands.
	disassemble       -- Disassemble specified instructions in the current target.  Defaults to the current function for the current thread and stack frame.
	expression        -- Evaluate an expression on the current thread.  Displays any returned value with LLDB's default formatting.
	frame             -- Commands for selecting and examing the current thread's stack frames.
	gdb-remote        -- Connect to a process via remote GDB server.  If no host is specifed, localhost is assumed.
	gui               -- Switch into the curses based GUI mode.
	help              -- Show a list of all debugger commands, or give details about a specific command.
	kdp-remote        -- Connect to a process via remote KDP server.  If no UDP port is specified, port 41139 is assumed.
	language          -- Commands specific to a source language.
	log               -- Commands controlling LLDB internal logging.
	memory            -- Commands for operating on memory in the current target process.
	platform          -- Commands to manage and create platforms.
	plugin            -- Commands for managing LLDB plugins.
	process           -- Commands for interacting with processes on the current platform.
	quit              -- Quit the LLDB debugger.
	register          -- Commands to access registers for the current thread and stack frame.
	reproducer   regi	     -- Commands for manipulate the reproducer functionality.
	script            -- Invoke the script interpreter with provided code and display any results.  Start the interactive interpreter if no code is supplied.
	settings          -- Commands for managing LLDB settings.
	source            -- Commands for examining source code described by debug information for the current target process.
	statistics        -- Print statistics about a debugging session
	target            -- Commands for operating on debugger targets.
	thread            -- Commands for operating on one or more threads in the current process.
	type              -- Commands for operating on the type system.
	version           -- Show the LLDB debugger version.
	watchpoint        -- Commands for operating on watchpoints.
	add-dsym          -- Add a debug symbol file to one of the target's current modules by specifying a path to a debug symbols file, or using the options to specify a module to download symbols for.
More (Y/n/a): 
	attach            -- Attach to process by ID or name.
	b                 -- Set a breakpoint using one of several shorthand formats.
	bt                -- Show the current thread's call stack.  Any numeric argument displays at most that many frames.  The argument 'all' displays all threads.  Use 'settings set frame-format' to customize the printing of individual frames and 'settings set thread-format' to customize the thread header.
	c                 -- Continue execution of all threads in the current process.
	call              -- Evaluate an expression on the current thread.  Displays any returned value with LLDB's default formatting.
	continue          -- Continue execution of all threads in the current process.
	detach            -- Detach from the current target process.
	di                -- Disassemble specified instructions in the current target.  Defaults to the current function for the current thread and stack frame.
	dis               -- Disassemble specified instructions in the current target.  Defaults to the current function for the current thread and stack frame.
	display           -- Evaluate an expression at every stop (see 'help target stop-hook'.)
	down              -- Select a newer stack frame.  Defaults to moving one frame, a numeric argument can specify an arbitrary number.
	env               -- Shorthand for viewing and setting environment variables.
	exit              -- Quit the LLDB debugger.
	f                 -- Select the current stack frame by index from within the current thread (see 'thread backtrace'.)
	file              -- Create a target using the argument as the main executable.
	finish            -- Finish executing the current stack frame and stop after returning.  Defaults to current thread unless specified.
	image             -- Commands for accessing information for one or more target modules.
	j                 -- Set the program counter to a new address.
	jump              -- Set the program counter to a new address.
	kill              -- Terminate the current target process.
	l                 -- List relevant source code using one of several shorthand formats.
	list              -- List relevant source code using one of several shorthand formats.
	n                 -- Source level single step, stepping over calls.  Defaults to current thread unless specified.
	next              -- Source level single step, stepping over calls.  Defaults to current thread unless specified.
	nexti             -- Instruction level single step, stepping over calls.  Defaults to current thread unless specified.
	ni                -- Instruction level single step, stepping over calls.  Defaults to current thread unless specified.
	p                 -- Evaluate an expression on the current thread.  Displays any returned value with LLDB's default formatting.
	parray            -- Evaluate an expression on the current thread.  Displays any returned value with LLDB's default formatting.
	po                -- Evaluate an expression on the current thread.  Displays any returned value with formatting controlled by the type's author.
	poarray           -- Evaluate an expression on the current thread.  Displays any returned value with LLDB's default formatting.
	print             -- Evaluate an expression on the current thread.  Displays any returned value with LLDB's default formatting.
	q                 -- Quit the LLDB debugger.
	r                 -- Launch the executable in the debugger.
	rbreak            -- Sets a breakpoint or set of breakpoints in the executable.
	re                -- Commands to access registers for the current thread and stack frame.
	run               -- Launch the executable in the debugger.
	s                 -- Source level single step, stepping into calls.  Defaults to current thread unless specified.
	si                -- Instruction level single step, stepping into calls.  Defaults to current thread unless specified.
	sif               -- Step through the current block, stopping if you step directly into a function whose name matches the TargetFunctionName.
	step              -- Source level single step, stepping into calls.  Defaults to current thread unless specified.
More (Y/n/a): 
	stepi             -- Instruction level single step, stepping into calls.  Defaults to current thread unless specified.
	t                 -- Change the currently selected thread.
	tbreak            -- Set a one-shot breakpoint using one of several shorthand formats.
	undisplay         -- Stop displaying expression at every stop (specified by stop-hook index.)
	up                -- Select an older stack frame.  Defaults to moving one frame, a numeric argument can specify an arbitrary number.
	v                 -- Show variables for the current stack frame. Defaults to all arguments and local variables in scope. Names of argument, local, file static and file global variables can be specified. Children of aggregate variables can be specified such as 'var->child.x'.  The -> and [] operators in 'frame variable' do not invoke operator overloads if they exist, but directly access the specified element.  If you want to trigger operator overloads use the expression command to print the variable instead.
It is worth noting that except for overloaded operators, when printing local variables 'expr local_var' and 'frame var local_var' produce the same results.  However, 'frame variable' is more efficient, since it uses debug information and memory reads directly, rather than parsing and evaluating an expression, which may even involve JITing and running code in the target program.
	var               -- Show variables for the current stack frame. Defaults to all arguments and local variables in scope. Names of argument, local, file static and file global variables can be specified. Children of aggregate variables can be specified such as 'var->child.x'.  The -> and [] operators in 'frame variable' do not invoke operator overloads if they exist, but directly access the specified element.  If you want to trigger operator overloads use the expression command to print the variable instead.
It is worth noting that except for overloaded operators, when printing local variables 'expr local_var' and 'frame var local_var' produce the same results.  However, 'frame variable' is more efficient, since it uses debug information and memory reads directly, rather than parsing and evaluating an expression, which may even involve JITing and running code in the target program.
	vo                -- Show variables for the current stack frame. Defaults to all arguments and local variables in scope. Names of argument, local, file static and file global variables can be specified. Children of aggregate variables can be specified such as 'var->child.x'.  The -> and [] operators in 'frame variable' do not invoke operator overloads if they exist, but directly access the specified element.  If you want to trigger operator overloads use the expression command to print the variable instead.
It is worth noting that except for overloaded operators, when printing local variables 'expr local_var' and 'frame var local_var' produce the same results.  However, 'frame variable' is more efficient, since it uses debug information and memory reads directly, rather than parsing and evaluating an expression, which may even involve JITing and running code in the target program.
	x                 -- Read from the memory of the current target process.
(lldb)  
(lldb) regi
(lldb) register 

Hide Details

Commands to access registers for the current thread and stack frame.

Hide Details

Syntax: register [read|write] ...

Hide Details

The following subcommands are supported:

Hide Details

read -- Dump the contents of one or more register values from the current frame. If no register is specified, dumps them all. write -- Modify a single register value.

Hide Details

For more help on any particular subcommand, type 'help <command> <subcommand>'. (lldb) file /Users/buildslave/jenkins/workspace/lldb-cmake-sanitized/llvm-project/lldb/packages/Python/lldbsuite/test/iohandler/completion file /Users/buildslave/jenkins/workspace/lldb-cmake-sanitized/llvm-project/lldb/packages/Python/lldbsuite/test/iohandler/completion (lldb) file /Users/buildslave/jenkins/workspace/lldb-cmake-sanitized/llvm-project/lldb/packages/Python/lldbsuite/test/iohandler/completion/TestIOHandler TestIOHandler (lldb) file /Users/buildslave/jenkins/workspace/lldb-cmake-sanitized/llvm-project/lldb/packages/Python/lldbsuite/test/iohandler/completion/TestIOHandlerCompletion.py

Hide Details

error: '/Users/buildslave/jenkins/workspace/lldb-cmake-sanitized/llvm-project/lldb/packages/Python/lldbsuite/test/iohandler/completion/TestIOHandlerCompletion.py' doesn't contain any 'host' platform architectures: x86_64, i386 (lldb) Available completions: _regexp-attach -- Attach to process by ID or name. _regexp-break -- Set a breakpoint using one of several shorthand formats. _regexp-bt -- Show the current thread's call stack. Any numeric argument displays at most that many frames. The argument 'all' displays all threads. Use 'settings set frame-format' to customize the printing of individual frames and 'settings set thread-format' to customize the thread header. _regexp-display -- Evaluate an expression at every stop (see 'help target stop-hook'.) _regexp-down -- Select a newer stack frame. Defaults to moving one frame, a numeric argument can specify an arbitrary number. _regexp-env -- Shorthand for viewing and setting environment variables. _regexp-jump -- Set the program counter to a new address. _regexp-list -- List relevant source code using one of several shorthand formats. _regexp-tbreak -- Set a one-shot breakpoint using one of several shorthand formats. _regexp-undisplay -- Stop displaying expression at every stop (specified by stop-hook index.) _regexp-up -- Select an older stack frame. Defaults to moving one frame, a numeric argument can specify an arbitrary number. apropos -- List debugger commands related to a word or subject. breakpoint -- Commands for operating on breakpoints (see 'help b' for shorthand.) command -- Commands for managing custom LLDB commands. disassemble -- Disassemble specified instructions in the current target. Defaults to the current function for the current thread and stack frame. expression -- Evaluate an expression on the current thread. Displays any returned value with LLDB's default formatting. frame -- Commands for selecting and examing the current thread's stack frames. gdb-remote -- Connect to a process via remote GDB server. If no host is specifed, localhost is assumed. gui -- Switch into the curses based GUI mode. help -- Show a list of all debugger commands, or give details about a specific command. kdp-remote -- Connect to a process via remote KDP server. If no UDP port is specified, port 41139 is assumed. language -- Commands specific to a source language. log -- Commands controlling LLDB internal logging. memory -- Commands for operating on memory in the current target process. platform -- Commands to manage and create platforms. plugin -- Commands for managing LLDB plugins. process -- Commands for interacting with processes on the current platform. quit -- Quit the LLDB debugger. register -- Commands to access registers for the current thread and stack frame. reproducer -- Commands for manipulate the reproducer functionality. script -- Invoke the script interpreter with provided code and display any results. Start the interactive interpreter if no code is supplied. settings -- Commands for managing LLDB settings. source -- Commands for examining source code described by debug information for the current target process. statistics -- Print statistics about a debugging session target -- Commands for operating on debugger targets. thread -- Commands for operating on one or more threads in the current process. type -- Commands for operating on the type system. version -- Show the LLDB debugger version. watchpoint -- Commands for operating on watchpoints. add-dsym -- Add a debug symbol file to one of the target's current modules by specifying a path to a debug symbols file, or using the options to specify a module to download symbols for. More (Y/n/a): n (lldb)  (lldb) regoinvalid settings set interpreter.prompt-on-quit false

Hide Details

Session logs for test failures/errors/unexpected successes will go into directory '/Users/buildslave/jenkins/workspace/lldb-cmake-sanitized/test/logs' Command invoked: /Users/buildslave/jenkins/workspace/lldb-cmake-sanitized/llvm-project/lldb/test/API/dotest.py --arch=x86_64 -s /Users/buildslave/jenkins/workspace/lldb-cmake-sanitized/lldb-build/lldb-test-traces -S nm -u CXXFLAGS -u CFLAGS --executable /Users/buildslave/jenkins/workspace/lldb-cmake-sanitized/lldb-build/./bin/lldb --dsymutil /Users/buildslave/jenkins/workspace/lldb-cmake-sanitized/lldb-build/./bin/dsymutil --filecheck /Users/buildslave/jenkins/workspace/lldb-cmake-sanitized/lldb-build/./bin/FileCheck -C /Users/buildslave/jenkins/workspace/lldb-cmake-sanitized/host-compiler/bin/clang --codesign-identity lldb_codesign --server /Users/buildslave/jenkins/workspace/lldb-cmake-sanitized/lldb-build/./bin/debugserver --arch x86_64 --build-dir /Users/buildslave/jenkins/workspace/lldb-cmake-sanitized/lldb-build/lldb-test-build.noindex -s=/Users/buildslave/jenkins/workspace/lldb-cmake-sanitized/test/logs -t --env TERM=vt100 --env LLVM_LIBS_DIR=/Users/buildslave/jenkins/workspace/lldb-cmake-sanitized/lldb-build/./lib --build-dir /Users/buildslave/jenkins/workspace/lldb-cmake-sanitized/lldb-build/tools/lldb/lldb-test-build.noindex --lldb-module-cache-dir /Users/buildslave/jenkins/workspace/lldb-cmake-sanitized/lldb-build/tools/lldb/lldb-test-build.noindex/module-cache-lldb/lldb-api --clang-module-cache-dir /Users/buildslave/jenkins/workspace/lldb-cmake-sanitized/lldb-build/tools/lldb/lldb-test-build.noindex/module-cache-clang/lldb-api /Users/buildslave/jenkins/workspace/lldb-cmake-sanitized/llvm-project/lldb/packages/Python/lldbsuite/test/iohandler/completion -p TestIOHandlerCompletion.py Change dir to: /Users/buildslave/jenkins/workspace/lldb-cmake-sanitized/llvm-project/lldb/packages/Python/lldbsuite/test/iohandler/completion runCmd: settings set symbols.enable-external-lookup false output:

Hide Details

runCmd: settings set plugin.process.gdb-remote.packet-timeout 60 output:

Hide Details

runCmd: settings set symbols.clang-modules-cache-path "/Users/buildslave/jenkins/workspace/lldb-cmake-sanitized/lldb-build/tools/lldb/lldb-test-build.noindex/module-cache-lldb/lldb-api" output:

Hide Details

runCmd: settings set use-color false output:

Hide Details

FAIL: LLDB (/Users/buildslave/jenkins/workspace/lldb-cmake-sanitized/host-compiler/bin/clang-10-x86_64) :: test_completion (TestIOHandlerCompletion.IOHandlerCompletionTest) tearing down the child process....

Hide Details

CLEANUP ERROR: LLDB (/Users/buildslave/jenkins/workspace/lldb-cmake-sanitized/host-compiler/bin/clang-10-x86_64) :: test_completion (TestIOHandlerCompletion.IOHandlerCompletionTest) Restore dir to: /Users/buildslave/jenkins/workspace/lldb-cmake-sanitized/lldb-build/tools/lldb/test ====================================================================== ERROR: test_completion (TestIOHandlerCompletion.IOHandlerCompletionTest) ---------------------------------------------------------------------- Traceback (most recent call last): File "/Users/buildslave/jenkins/workspace/lldb-cmake-sanitized/llvm-project/lldb/packages/Python/lldbsuite/test/iohandler/completion/TestIOHandlerCompletion.py", line 52, in test_completion self.quit() File "/Users/buildslave/jenkins/workspace/lldb-cmake-sanitized/llvm-project/lldb/packages/Python/lldbsuite/test/lldbpexpect.py", line 61, in quit self.child.close(force=not gracefully) File "/Users/buildslave/jenkins/workspace/lldb-cmake-sanitized/llvm-project/lldb/third_party/Python/module/pexpect-4.6/pexpect/pty_spawn.py", line 327, in close self.ptyproc.close(force=force) File "/System/Library/Frameworks/Python.framework/Versions/2.7/lib/python2.7/contextlib.py", line 35, in __exit__ self.gen.throw(type, value, traceback) File "/Users/buildslave/jenkins/workspace/lldb-cmake-sanitized/llvm-project/lldb/third_party/Python/module/pexpect-4.6/pexpect/pty_spawn.py", line 25, in _wrap_ptyprocess_err raise ExceptionPexpect(*e.args) ExceptionPexpect: Could not terminate the child. Config=x86_64-/Users/buildslave/jenkins/workspace/lldb-cmake-sanitized/host-compiler/bin/clang-10 ---------------------------------------------------------------------- Ran 1 test in 3.932s

Hide Details

RESULT: FAILED (0 passes, 0 failures, 1 errors, 0 skipped, 0 expected failures, 0 unexpected successes)

Hide Details

******************** PASS: lldb-shell :: SymbolFile/NativePDB/ast-methods.cpp (753 of 1779) PASS: lldb-api :: macosx/find-dsym/deep-bundle/TestDeepBundle.py (754 of 1779) PASS: lldb-unit :: Expression/./ExpressionTests/DiagnosticManagerTest.FixedExpression (755 of 1779) PASS: lldb-api :: lang/cpp/char8_t/TestCxxChar8_t.py (756 of 1779) PASS: lldb-unit :: Utility/./UtilityTests/DataExtractorTest.PeekData (757 of 1779) PASS: lldb-api :: commands/expression/namespace_local_var_same_name_obj_c/TestNamespaceLocalVarSameNameObjC.py (758 of 1779) PASS: lldb-api :: commands/expression/call-throws/TestCallThatThrows.py (759 of 1779) PASS: lldb-unit :: Host/./HostTests/SocketTest.TCPListen0GetPort (760 of 1779) PASS: lldb-api :: functionalities/thread/concurrent_events/TestConcurrentSignalWatch.py (761 of 1779) PASS: lldb-unit :: Utility/./UtilityTests/StatusTest.ErrorConstructor (762 of 1779) PASS: lldb-shell :: Breakpoint/case-sensitive.test (763 of 1779) PASS: lldb-api :: functionalities/tsan/basic/TestTsanBasic.py (764 of 1779) PASS: lldb-api :: functionalities/value_md5_crash/TestValueMD5Crash.py (765 of 1779) PASS: lldb-shell :: ObjectFile/ELF/minidebuginfo-find-symbols.yaml (766 of 1779) PASS: lldb-shell :: ObjectFile/ELF/short-build-id.yaml (767 of 1779) PASS: lldb-unit :: ScriptInterpreter/Python/./ScriptInterpreterPythonTests/PythonDataObjectsTest.TestPythonListValueEquality (768 of 1779) PASS: lldb-unit :: ScriptInterpreter/Python/./ScriptInterpreterPythonTests/PythonExceptionStateTest.TestManualRestoreSemantics (769 of 1779) UNSUPPORTED: lldb-shell :: SymbolFile/NativePDB/typedefs.cpp (770 of 1779) PASS: lldb-api :: functionalities/modern-type-lookup/libcxx/TestLibCxxModernTypeLookup.py (771 of 1779) PASS: lldb-unit :: Utility/./UtilityTests/StreamTest.ShiftOperatorChars (772 of 1779) PASS: lldb-api :: commands/version/TestVersion.py (773 of 1779) PASS: lldb-unit :: Utility/./UtilityTests/OptionsWithRawTest.WhitespaceSuffix (774 of 1779) PASS: lldb-shell :: Quit/TestQuitExitCode-30.test (775 of 1779) PASS: lldb-api :: functionalities/wrong_commands/TestWrongCommands.py (776 of 1779) PASS: lldb-api :: lang/cpp/std-function-step-into-callable/TestStdFunctionStepIntoCallable.py (777 of 1779) PASS: lldb-api :: functionalities/data-formatter/varscript_formatting/TestDataFormatterVarScriptFormatting.py (778 of 1779) UNSUPPORTED: lldb-shell :: Register/x86-64-ymm16-write.test (779 of 1779) PASS: lldb-api :: functionalities/inferior-changed/TestInferiorChanged.py (780 of 1779) PASS: lldb-unit :: Utility/./UtilityTests/CompletionRequest.Constructor (781 of 1779) PASS: lldb-api :: python_api/debugger/TestDebuggerAPI.py (782 of 1779) PASS: lldb-unit :: Utility/./UtilityTests/NameMatchesTest.Contains (783 of 1779) PASS: lldb-unit :: Utility/./UtilityTests/StringListTest.JoinEmpty (784 of 1779) PASS: lldb-api :: lang/cpp/thread_local/TestThreadLocal.py (785 of 1779) PASS: lldb-unit :: Utility/./UtilityTests/ArgsTest.ReplaceArgumentAtIndexEqual (786 of 1779) PASS: lldb-shell :: SymbolFile/NativePDB/function-types-calling-conv.cpp (787 of 1779) PASS: lldb-unit :: Utility/./UtilityTests/IndexToObjectTest.ObjectForIndex (788 of 1779) PASS: lldb-unit :: Utility/./UtilityTests/Flags.AnyClear (789 of 1779) PASS: lldb-api :: functionalities/gdb_remote_client/TestRestartBug.py (790 of 1779) PASS: lldb-shell :: Breakpoint/debug_rnglist_rlestartend.test (791 of 1779) PASS: lldb-unit :: Utility/./UtilityTests/UserIDResolver.GetGroupName (792 of 1779) UNSUPPORTED: lldb-api :: functionalities/darwin_log/filter/regex/subsystem/TestDarwinLogFilterRegexSubsystem.py (793 of 1779) PASS: lldb-api :: functionalities/thread/concurrent_events/TestConcurrentWatchpointDelayWatchpointOneBreakpoint.py (794 of 1779) PASS: lldb-shell :: Settings/TestEchoCommands.test (795 of 1779) PASS: lldb-api :: commands/expression/import-std-module/vector-bool/TestBoolVector.py (796 of 1779) UNSUPPORTED: lldb-api :: functionalities/darwin_log/format/TestDarwinLogMessageFormat.py (797 of 1779) PASS: lldb-unit :: Utility/./UtilityTests/StreamTest.PutChar (798 of 1779) PASS: lldb-unit :: Utility/./UtilityTests/AnsiTerminal.KnownPrefix (799 of 1779) PASS: lldb-api :: lang/cpp/scope/TestCppScope.py (800 of 1779) PASS: lldb-unit :: Symbol/./SymbolTests/LineEntryTest.GetSameLineContiguousAddressRangeNestedInline (801 of 1779) PASS: lldb-api :: commands/expression/persistent_types/TestPersistentTypes.py (802 of 1779) PASS: lldb-unit :: Target/./TargetTests/PathMappingListTest.RelativeTests (803 of 1779) PASS: lldb-unit :: Utility/./UtilityTests/StringExtractorTest.DecodeHexU8_Exact (804 of 1779) PASS: lldb-unit :: Utility/./UtilityTests/StringListTest.Assignment (805 of 1779) PASS: lldb-api :: functionalities/jitloader_gdb/TestJITLoaderGDB.py (806 of 1779) PASS: lldb-api :: functionalities/inferior-crashing/TestInferiorCrashing.py (807 of 1779) PASS: lldb-shell :: ObjectFile/Breakpad/sections.test (808 of 1779) PASS: lldb-unit :: Utility/./UtilityTests/StringListTest.GetMaxStringLengthEqualSize (809 of 1779) PASS: lldb-unit :: UnwindAssembly/x86/./UnwindAssemblyx86Tests/Testx86AssemblyInspectionEngine.TestPushR14 (810 of 1779) PASS: lldb-api :: functionalities/tail_call_frames/inlining_and_tail_calls/TestInliningAndTailCalls.py (811 of 1779) PASS: lldb-api :: functionalities/data-formatter/data-formatter-synth/TestDataFormatterSynth.py (812 of 1779) PASS: lldb-api :: macosx/function-starts/TestFunctionStarts.py (813 of 1779) PASS: lldb-shell :: SymbolFile/DWARF/debug-types-basic.test (814 of 1779) PASS: lldb-unit :: Utility/./UtilityTests/RangeTest.DoesAdjoinOrIntersect (815 of 1779) PASS: lldb-api :: functionalities/memory-region/TestMemoryRegion.py (816 of 1779) UNSUPPORTED: lldb-api :: functionalities/darwin_log/source/info/TestDarwinLogSourceInfo.py (817 of 1779) PASS: lldb-shell :: ObjectFile/Breakpad/breakpad-identification.test (818 of 1779) PASS: lldb-unit :: Utility/./UtilityTests/ArgsTest.TestOverwriteArgs (819 of 1779) PASS: lldb-unit :: Target/./TargetTests/PathMappingListTest.AbsoluteTests (820 of 1779) PASS: lldb-api :: lang/cpp/type_lookup/TestCppTypeLookup.py (821 of 1779) PASS: lldb-unit :: Expression/./ExpressionTests/DWARFExpression.DW_OP_convert (822 of 1779) PASS: lldb-unit :: Process/gdb-remote/./ProcessGdbRemoteTests/GDBRemoteCommunicationServerTest.SendErrorResponse_ErrorList (823 of 1779) PASS: lldb-api :: commands/expression/persist_objc_pointeetype/TestPersistObjCPointeeType.py (824 of 1779) PASS: lldb-unit :: Host/./HostTests/NativeProcessProtocolTest.SetBreakpointFailRead (825 of 1779) PASS: lldb-unit :: Utility/./UtilityTests/RangeTest.SetRangeBase (826 of 1779) PASS: lldb-unit :: Symbol/./SymbolTests/Type.GetTypeScopeAndBasename (827 of 1779) PASS: lldb-unit :: UnwindAssembly/x86/./UnwindAssemblyx86Tests/Testx86AssemblyInspectionEngine.TestPushRBX (828 of 1779) UNSUPPORTED: lldb-shell :: SymbolFile/PDB/func-symbols.test (829 of 1779) PASS: lldb-shell :: Settings/TestStopCommandSourceOnError.test (830 of 1779) PASS: lldb-unit :: Utility/./UtilityTests/Flags.AllSet (831 of 1779) PASS: lldb-api :: commands/settings/quoting/TestQuoting.py (832 of 1779) PASS: lldb-api :: tools/lldb-server/TestGdbRemote_qThreadStopInfo.py (833 of 1779) PASS: lldb-api :: lang/objc/objc-static-method-stripped/TestObjCStaticMethodStripped.py (834 of 1779) PASS: lldb-unit :: Utility/./UtilityTests/UUIDTest.StringConverion (835 of 1779) PASS: lldb-unit :: SymbolFile/NativePDB/./SymbolFileNativePDBTests/PDBFPOProgramToDWARFExpressionTests.UnresolvedRegisterReference (836 of 1779) PASS: lldb-shell :: Reproducer/TestReuseDirectory.test (837 of 1779) PASS: lldb-unit :: ScriptInterpreter/Python/./ScriptInterpreterPythonTests/PythonExceptionStateTest.TestDiscardSemantics (838 of 1779) PASS: lldb-shell :: Register/x86-64-read.test (839 of 1779) PASS: lldb-shell :: Driver/TestSingleQuote.test (840 of 1779) PASS: lldb-api :: lang/c/stepping/TestStepAndBreakpoints.py (841 of 1779) UNSUPPORTED: lldb-shell :: SymbolFile/PDB/variables-locations.test (842 of 1779) UNSUPPORTED: lldb-api :: tools/lldb-server/TestGdbRemoteAuxvSupport.py (843 of 1779) PASS: lldb-unit :: UnwindAssembly/x86/./UnwindAssemblyx86Tests/Testx86AssemblyInspectionEngine.TestPushR15 (844 of 1779) PASS: lldb-unit :: Utility/./UtilityTests/StringListTest.LongestCommonPrefix (845 of 1779) PASS: lldb-unit :: Utility/./UtilityTests/DataExtractorTest.GetMaxU64 (846 of 1779) PASS: lldb-unit :: Host/./HostTests/FileSystemTest.EnumerateDirectory (847 of 1779) PASS: lldb-unit :: Utility/./UtilityTests/StreamTeeTest.GetStreamAtIndexOutOfBounds (848 of 1779) PASS: lldb-unit :: Language/Highlighting/./HighlighterTests/HighlighterTest.ClangCommas (849 of 1779) UNSUPPORTED: lldb-api :: tools/lldb-server/signal-filtering/TestGdbRemote_QPassSignals.py (850 of 1779) PASS: lldb-unit :: Utility/./UtilityTests/StreamTest.ChangingByteOrder (851 of 1779) PASS: lldb-unit :: Utility/./UtilityTests/StringExtractorTest.GetHexU8_Underflow_NoEof (852 of 1779) PASS: lldb-api :: commands/expression/class_template_specialization_empty_pack/TestClassTemplateSpecializationParametersHandling.py (853 of 1779) PASS: lldb-api :: commands/expression/context-object/TestContextObject.py (854 of 1779) PASS: lldb-api :: functionalities/data-formatter/data-formatter-objc/TestDataFormatterObjCCF.py (855 of 1779) PASS: lldb-api :: functionalities/data-formatter/data-formatter-stl/libcxx/unordered/TestDataFormatterUnordered.py (856 of 1779) PASS: lldb-unit :: Utility/./UtilityTests/BroadcasterTest.EventTypeHasListeners (857 of 1779) PASS: lldb-api :: functionalities/postmortem/elf-core/TestLinuxCore.py (858 of 1779) PASS: lldb-unit :: Utility/./UtilityTests/ArchSpecTest.MergeFromMachOUnknown (859 of 1779) PASS: lldb-api :: commands/gui/invalid-args/TestInvalidArgsGui.py (860 of 1779) PASS: lldb-unit :: Utility/./UtilityTests/StringListTest.ForRangeEmpty (861 of 1779) PASS: lldb-unit :: Utility/./UtilityTests/CompletionRequest.DuplicateFiltering (862 of 1779) PASS: lldb-api :: functionalities/data-formatter/refpointer-recursion/TestDataFormatterRefPtrRecursion.py (863 of 1779) PASS: lldb-api :: commands/expression/pr35310/TestExprsBug35310.py (864 of 1779) PASS: lldb-unit :: Utility/./UtilityTests/LogTest.Unregister (865 of 1779) PASS: lldb-api :: functionalities/breakpoint/comp_dir_symlink/TestCompDirSymLink.py (866 of 1779) PASS: lldb-api :: api/command-return-object/TestSBCommandReturnObject.py (867 of 1779) PASS: lldb-api :: commands/frame/var/TestFrameVar.py (868 of 1779) PASS: lldb-unit :: Utility/./UtilityTests/ConstStringTest.UpdateMangledCounterpart (869 of 1779) UNSUPPORTED: lldb-shell :: Breakpoint/case-insensitive.test (870 of 1779) PASS: lldb-shell :: ObjectFile/PECOFF/export-dllfunc.yaml (871 of 1779) UNSUPPORTED: lldb-api :: tools/lldb-vscode/step/TestVSCode_step.py (872 of 1779) PASS: lldb-unit :: Utility/./UtilityTests/StreamTest.PutMaxHex64ByteOrderLittle (873 of 1779) PASS: lldb-unit :: UnwindAssembly/x86/./UnwindAssemblyx86Tests/Testx86AssemblyInspectionEngine.TestStackRealign32BitDisp_x86_64 (874 of 1779) PASS: lldb-api :: functionalities/tsan/thread_leak/TestTsanThreadLeak.py (875 of 1779) PASS: lldb-unit :: Signals/./SignalsTests/UnixSignalsTest.GetInfo (876 of 1779) PASS: lldb-api :: commands/process/attach/attach_denied/TestAttachDenied.py (877 of 1779) PASS: lldb-api :: tools/lldb-server/TestGdbRemote_vCont.py (878 of 1779) PASS: lldb-unit :: SymbolFile/NativePDB/./SymbolFileNativePDBTests/PDBFPOProgramToDWARFExpressionTests.InvalidOpBinary (879 of 1779) PASS: lldb-api :: commands/target/create-no-such-arch/TestNoSuchArch.py (880 of 1779) PASS: lldb-unit :: UnwindAssembly/x86/./UnwindAssemblyx86Tests/Testx86AssemblyInspectionEngine.TestPushEDX (881 of 1779) PASS: lldb-unit :: Utility/./UtilityTests/AnsiTerminal.AtStart (882 of 1779) PASS: lldb-api :: functionalities/data-formatter/data-formatter-stl/libcxx/list/loop/TestDataFormatterLibcxxListLoop.py (883 of 1779) PASS: lldb-api :: python_api/watchpoint/TestWatchpointIter.py (884 of 1779) PASS: lldb-unit :: Utility/./UtilityTests/LogChannelEnabledTest.LogGetLogThread (885 of 1779) PASS: lldb-unit :: Utility/./UtilityTests/DataExtractorTest.GetCStrUnterminated (886 of 1779) PASS: lldb-shell :: Quit/TestQuitExitCode0.test (887 of 1779) PASS: lldb-unit :: SymbolFile/NativePDB/./SymbolFileNativePDBTests/PDBFPOProgramToDWARFExpressionTests.UnsupportedRASearch (888 of 1779) PASS: lldb-api :: functionalities/inferior-crashing/recursive-inferior/TestRecursiveInferiorStep.py (889 of 1779) PASS: lldb-shell :: Breakpoint/implicit_const_form_support.test (890 of 1779) PASS: lldb-api :: commands/expression/import-std-module/shared_ptr-dbg-info-content/TestSharedPtrDbgInfoContent.py (891 of 1779) PASS: lldb-api :: functionalities/thread/step_until/TestStepUntil.py (892 of 1779) PASS: lldb-unit :: Utility/./UtilityTests/BinaryStreamTest.PutSLEB128SevenBytes (893 of 1779) PASS: lldb-api :: functionalities/breakpoint/source_regexp/TestSourceRegexBreakpoints.py (894 of 1779) PASS: lldb-unit :: Utility/./UtilityTests/RangeTest.Clear (895 of 1779) PASS: lldb-unit :: Utility/./UtilityTests/ArgsTest.ReplaceArgumentAtIndexShort (896 of 1779) PASS: lldb-unit :: Utility/./UtilityTests/CompletionRequest.TryCompleteCurrentArgMode (897 of 1779) PASS: lldb-unit :: Utility/./UtilityTests/Flags.Test (898 of 1779) PASS: lldb-unit :: Target/./TargetTests/ExecutionContextTest.GetByteOrder (899 of 1779) UNSUPPORTED: lldb-shell :: SymbolFile/PDB/function-nested-block.test (900 of 1779) PASS: lldb-unit :: Utility/./UtilityTests/StreamTest.PutHex16ByteOrderBig (901 of 1779) UNSUPPORTED: lldb-api :: lang/objc/rdar-12408181/TestRdar12408181.py (902 of 1779) PASS: lldb-unit :: Host/./HostTests/SocketTest.DomainListenConnectAccept (903 of 1779) PASS: lldb-api :: tools/lldb-server/TestGdbRemoteThreadsInStopReply.py (904 of 1779) PASS: lldb-api :: commands/command/history/TestCommandHistory.py (905 of 1779) PASS: lldb-api :: lang/c/global_variables/TestGlobalVariables.py (906 of 1779) PASS: lldb-unit :: Utility/./UtilityTests/StringListTest.AppendStringCString (907 of 1779) PASS: lldb-unit :: Utility/./UtilityTests/ArgsTest.TestSingleArgWithQuotedSpace (908 of 1779) PASS: lldb-unit :: Process/minidump/./LLDBMinidumpTests/MinidumpParserTest.GetMemoryRegionInfo (909 of 1779) PASS: lldb-unit :: ScriptInterpreter/Python/./ScriptInterpreterPythonTests/PythonDataObjectsTest.TestObjectAttributes (910 of 1779) UNSUPPORTED: lldb-api :: functionalities/thread/create_during_step/TestCreateDuringStep.py (911 of 1779) PASS: lldb-unit :: Utility/./UtilityTests/OptionsWithRawTest.MultiWordSuffix (912 of 1779) PASS: lldb-unit :: Utility/./UtilityTests/ScalarTest.Scalar_512 (913 of 1779) PASS: lldb-unit :: Target/./TargetTests/ModuleCacheTest.GetAndPut (914 of 1779) PASS: lldb-api :: lang/cpp/gmodules-templates/TestGModules.py (915 of 1779) PASS: lldb-api :: functionalities/data-formatter/data-formatter-stl/libcxx/multimap/TestDataFormatterLibccMultiMap.py (916 of 1779) PASS: lldb-shell :: ObjectFile/PECOFF/sections-names.yaml (917 of 1779) PASS: lldb-unit :: Utility/./UtilityTests/TimerTest.CategoryTimesNested (918 of 1779) PASS: lldb-unit :: Utility/./UtilityTests/StringListTest.AppendListCStringArray (919 of 1779) PASS: lldb-unit :: Expression/./ExpressionTests/DWARFExpression.DW_OP_pick (920 of 1779) PASS: lldb-unit :: Utility/./UtilityTests/OptionsWithRawTest.EmptyArgsOnlySuffix (921 of 1779) PASS: lldb-api :: commands/expression/ir-interpreter/TestIRInterpreter.py (922 of 1779) PASS: lldb-unit :: Utility/./UtilityTests/ArgsTest.TestMultipleArgs (923 of 1779) PASS: lldb-shell :: ExecControl/StopHook/stop-hook.test (924 of 1779) PASS: lldb-unit :: UnwindAssembly/x86/./UnwindAssemblyx86Tests/Testx86AssemblyInspectionEngine.Test32bitFramelessSmallStackFrame (925 of 1779) PASS: lldb-api :: lang/objc/modules-auto-import/TestModulesAutoImport.py (926 of 1779) PASS: lldb-unit :: Expression/./ExpressionTests/DiagnosticManagerTest.PutString (927 of 1779) UNSUPPORTED: lldb-api :: functionalities/data-formatter/data-formatter-stl/libcxx/function/TestLibCxxFunction.py (928 of 1779) PASS: lldb-api :: lang/cpp/namespace_definitions/TestNamespaceDefinitions.py (929 of 1779) PASS: lldb-unit :: Language/CPlusPlus/./LanguageCPlusPlusTests/CPlusPlusLanguage.MethodNameParsing (930 of 1779) UNSUPPORTED: lldb-api :: python_api/disassemble-raw-data/TestDisassemble_VST1_64.py (931 of 1779) UNSUPPORTED: lldb-api :: lang/objc/objc-dynamic-value/TestObjCDynamicValue.py (932 of 1779) PASS: lldb-unit :: Utility/./UtilityTests/StreamTeeTest.Constructor2Streams (933 of 1779) PASS: lldb-unit :: Process/minidump/./LLDBMinidumpTests/RegisterContextMinidump.CheckRegisterContextMinidump_ARM (934 of 1779) PASS: lldb-unit :: Expression/./ExpressionTests/CppModuleConfigurationTest.LibCppV2 (935 of 1779) UNSUPPORTED: lldb-shell :: SymbolFile/NativePDB/stack_unwinding01.cpp (936 of 1779) UNSUPPORTED: lldb-shell :: SymbolFile/PDB/enums-layout.test (937 of 1779) PASS: lldb-api :: commands/expression/import-std-module/conflicts/TestStdModuleWithConflicts.py (938 of 1779) PASS: lldb-unit :: Utility/./UtilityTests/UriParserTest.MinimalPortPath (939 of 1779) PASS: lldb-api :: lang/objc/real-definition/TestRealDefinition.py (940 of 1779) PASS: lldb-api :: commands/expression/radar_9673664/TestExprHelpExamples.py (941 of 1779) PASS: lldb-unit :: Expression/./ExpressionTests/CppModuleConfigurationTest.Linux (942 of 1779) PASS: lldb-api :: commands/expression/namespace_local_var_same_name_cpp_and_c/TestNamespaceLocalVarSameNameCppAndC.py (943 of 1779) PASS: lldb-unit :: Host/./HostTests/FileSystemTest.FileAndDirectoryComponents (944 of 1779) PASS: lldb-api :: commands/expression/import-std-module/list-basic/TestBasicList.py (945 of 1779) PASS: lldb-unit :: Utility/./UtilityTests/RegularExpression.Empty (946 of 1779) PASS: lldb-unit :: Utility/./UtilityTests/StringListTest.JoinThree (947 of 1779) PASS: lldb-api :: lang/c/local_variables/TestLocalVariables.py (948 of 1779) PASS: lldb-api :: lang/objc/foundation/TestObjCMethods.py (949 of 1779) PASS: lldb-api :: python_api/signals/TestSignalsAPI.py (950 of 1779) PASS: lldb-api :: functionalities/data-formatter/data-formatter-objc/TestDataFormatterObjNSException.py (951 of 1779) PASS: lldb-api :: lang/cpp/global_variables/TestCPPGlobalVariables.py (952 of 1779) PASS: lldb-api :: lang/c/forward/TestForwardDeclaration.py (953 of 1779) PASS: lldb-api :: functionalities/data-formatter/data-formatter-stl/libstdcpp/unique_ptr/invalid/TestDataFormatterInvalidStdUniquePtr.py (954 of 1779) PASS: lldb-shell :: ObjectFile/Breakpad/sections-trailing-func.test (955 of 1779) PASS: lldb-unit :: Utility/./UtilityTests/StateTest.Formatv (956 of 1779) PASS: lldb-api :: functionalities/testid/TestTestId.py (957 of 1779) PASS: lldb-unit :: Utility/./UtilityTests/StreamTest.PutBytesAsRawHex8ToMixedEndian (958 of 1779) PASS: lldb-unit :: SymbolFile/DWARF/./SymbolFileDWARFTests/SymbolFileDWARFTests.TestAbbrevOutOfOrder (959 of 1779) PASS: lldb-api :: functionalities/postmortem/mach-core/TestMachCore.py (960 of 1779) PASS: lldb-unit :: Expression/./ExpressionTests/DiagnosticManagerTest.PutStringMultiple (961 of 1779) PASS: lldb-shell :: SymbolFile/DWARF/dir-separator-no-comp-dir.s (962 of 1779) UNSUPPORTED: lldb-api :: functionalities/darwin_log/filter/exact_match/category/TestDarwinLogFilterMatchCategory.py (963 of 1779) PASS: lldb-unit :: Process/gdb-remote/./ProcessGdbRemoteTests/GDBRemoteClientBaseTest.SendContinueAndWait (964 of 1779) PASS: lldb-unit :: Language/CPlusPlus/./LanguageCPlusPlusTests/CPlusPlusLanguage.FindAlternateFunctionManglings (965 of 1779) UNSUPPORTED: lldb-api :: lang/c/typedef/Testtypedef.py (966 of 1779) PASS: lldb-shell :: SymbolFile/DWARF/array-sizes.s (967 of 1779) PASS: lldb-unit :: Target/./TargetTests/PathMappingListTest.RemapRoot (968 of 1779) PASS: lldb-api :: functionalities/plugins/python_os_plugin/TestPythonOSPlugin.py (969 of 1779) PASS: lldb-api :: lang/objc/foundation/TestConstStrings.py (970 of 1779) PASS: lldb-unit :: Host/./HostTests/SocketTest.TCPListen0ConnectAccept (971 of 1779) PASS: lldb-unit :: Host/./HostTests/SocketTest.UDPGetConnectURI (972 of 1779) PASS: lldb-unit :: Process/minidump/./LLDBMinidumpTests/MinidumpParserTest.GetPidWow64 (973 of 1779) PASS: lldb-unit :: Utility/./UtilityTests/DataExtractorTest.GetMaxS64 (974 of 1779) PASS: lldb-unit :: ScriptInterpreter/Python/./ScriptInterpreterPythonTests/PythonDataObjectsTest.TestPythonTupleValues (975 of 1779) PASS: lldb-unit :: Utility/./UtilityTests/StringListTest.GetMaxStringLengthEmpty (976 of 1779) PASS: lldb-api :: lang/objc/objc-ivar-stripped/TestObjCIvarStripped.py (977 of 1779) UNSUPPORTED: lldb-shell :: ObjectFile/ELF/minidebuginfo-no-lzma.yaml (978 of 1779) PASS: lldb-unit :: Utility/./UtilityTests/FileSpecTest.FileAndDirectoryComponents (979 of 1779) PASS: lldb-unit :: Language/Highlighting/./HighlighterTests/HighlighterTest.ClangCursorPosAfterOtherToken (980 of 1779) PASS: lldb-api :: commands/watchpoints/watchpoint_on_vectors/TestValueOfVectorVariable.py (981 of 1779) UNSUPPORTED: lldb-api :: functionalities/darwin_log/filter/exact_match/activity/TestDarwinLogFilterMatchActivity.py (982 of 1779) PASS: lldb-unit :: Utility/./UtilityTests/Predicate.WaitForValueEqualTo (983 of 1779) PASS: lldb-unit :: Utility/./UtilityTests/UUIDTest.RelationalOperators (984 of 1779) PASS: lldb-unit :: Utility/./UtilityTests/FileSpecTest.CopyByAppendingPathComponent (985 of 1779) PASS: lldb-api :: python_api/class_members/TestSBTypeClassMembers.py (986 of 1779) PASS: lldb-shell :: SymbolFile/DWARF/debug-line-basic.s (987 of 1779) PASS: lldb-unit :: UnwindAssembly/x86/./UnwindAssemblyx86Tests/Testx86AssemblyInspectionEngine.TestSubRSP (988 of 1779) PASS: lldb-api :: commands/watchpoints/watchpoint_disable/TestWatchpointDisable.py (989 of 1779) PASS: lldb-api :: functionalities/breakpoint/auto_continue/TestBreakpointAutoContinue.py (990 of 1779) PASS: lldb-api :: lang/cpp/class_types/TestClassTypes.py (991 of 1779) PASS: lldb-unit :: Core/./LLDBCoreTests/StreamCallbackTest.Callback (992 of 1779) PASS: lldb-unit :: UnwindAssembly/x86/./UnwindAssemblyx86Tests/Testx86AssemblyInspectionEngine.TestSimple32bitFrameFunction (993 of 1779) PASS: lldb-api :: functionalities/modern-type-lookup/basic/TestBasicModernTypeLookup.py (994 of 1779) PASS: lldb-api :: functionalities/thread/concurrent_events/TestConcurrentSignalDelayWatch.py (995 of 1779) PASS: lldb-unit :: Utility/./UtilityTests/StringListTest.SplitIntoLinesSingleTrailingCR (996 of 1779) PASS: lldb-api :: commands/command/script_alias/TestCommandScriptAlias.py (997 of 1779) PASS: lldb-unit :: Process/gdb-remote/./ProcessGdbRemoteTests/GDBRemoteCommunicationClientTest.GetModulesInfo_UUID20 (998 of 1779) PASS: lldb-unit :: Utility/./UtilityTests/OptionsWithRawTest.ArgsButNoDelimiter (999 of 1779) PASS: lldb-unit :: ScriptInterpreter/Python/./ScriptInterpreterPythonTests/PythonExceptionStateTest.TestExceptionStateChecking (1000 of 1779) UNSUPPORTED: lldb-api :: tools/lldb-server/platform-process-connect/TestPlatformProcessConnect.py (1001 of 1779) PASS: lldb-api :: commands/frame/recognizer/TestFrameRecognizer.py (1002 of 1779) PASS: lldb-api :: functionalities/thread/concurrent_events/TestConcurrentDelaySignalWatch.py (1003 of 1779) PASS: lldb-api :: functionalities/data-formatter/data-formatter-objc/nsindexpath/TestDataFormatterNSIndexPath.py (1004 of 1779) PASS: lldb-unit :: Language/Highlighting/./HighlighterTests/HighlighterTest.ClangSquareBrackets (1005 of 1779) PASS: lldb-api :: functionalities/thread/concurrent_events/TestConcurrentTwoBreakpointsOneWatchpoint.py (1006 of 1779) UNSUPPORTED: lldb-api :: commands/expression/completion-crash-incomplete-record/TestCompletionCrashIncompleteRecord.py (1007 of 1779) PASS: lldb-api :: commands/expression/import-std-module/vector-basic/TestBasicVector.py (1008 of 1779) PASS: lldb-api :: macosx/find-app-in-bundle/TestFindAppInBundle.py (1009 of 1779) PASS: lldb-api :: lang/objc/modules-incomplete/TestIncompleteModules.py (1010 of 1779) PASS: lldb-unit :: Utility/./UtilityTests/ScalarTest.ComparisonFloat (1011 of 1779) PASS: lldb-unit :: ScriptInterpreter/Python/./ScriptInterpreterPythonTests/PythonDataObjectsTest.TestPythonTupleInitializerList (1012 of 1779) PASS: lldb-api :: functionalities/data-formatter/data-formatter-advanced/TestDataFormatterAdv.py (1013 of 1779) PASS: lldb-api :: functionalities/data-formatter/data-formatter-synthtype/TestDataFormatterSynthType.py (1014 of 1779) UNSUPPORTED: lldb-api :: android/platform/TestDefaultCacheLineSize.py (1015 of 1779) PASS: lldb-api :: commands/frame/diagnose/virtual-method-call/TestDiagnoseDereferenceVirtualMethodCall.py (1016 of 1779) PASS: lldb-api :: functionalities/data-formatter/dump_dynamic/TestDumpDynamic.py (1017 of 1779) PASS: lldb-api :: lang/objc/single-entry-dictionary/TestObjCSingleEntryDictionary.py (1018 of 1779) PASS: lldb-api :: commands/expression/expr-in-syscall/TestExpressionInSyscall.py (1019 of 1779) PASS: lldb-unit :: Host/./HostTests/MainLoopTest.TerminatesImmediately (1020 of 1779) PASS: lldb-api :: functionalities/data-formatter/data-formatter-stl/libcxx/multiset/TestDataFormatterLibcxxMultiSet.py (1021 of 1779) PASS: lldb-api :: functionalities/dynamic_value_child_count/TestDynamicValueChildCount.py (1022 of 1779) PASS: lldb-api :: commands/command/script/import/TestImport.py (1023 of 1779) PASS: lldb-api :: functionalities/data-formatter/parray/TestPrintArray.py (1024 of 1779) PASS: lldb-api :: functionalities/data-formatter/data-formatter-stl/libcxx/iterator/TestDataFormatterLibccIterator.py (1025 of 1779) PASS: lldb-unit :: ScriptInterpreter/Python/./ScriptInterpreterPythonTests/PythonDataObjectsTest.TestPythonTupleSize (1026 of 1779) PASS: lldb-unit :: Utility/./UtilityTests/RegularExpression.Match (1027 of 1779) PASS: lldb-api :: python_api/rdar-12481949/Test-rdar-12481949.py (1028 of 1779) PASS: lldb-api :: functionalities/thread/concurrent_events/TestConcurrentSignalBreak.py (1029 of 1779) PASS: lldb-unit :: ObjectFile/PECOFF/./ObjectFilePECOFFTests/PECallFrameInfoTest.Chained_eh (1030 of 1779) PASS: lldb-unit :: Language/Highlighting/./HighlighterTests/HighlighterTest.ClangCursorPosBeforeOtherToken (1031 of 1779) PASS: lldb-api :: functionalities/thread/concurrent_events/TestConcurrentWatchpointWithDelayWatchpointThreads.py (1032 of 1779) PASS: lldb-unit :: Process/gdb-remote/./ProcessGdbRemoteTests/GDBRemoteClientBaseTest.SendContinueDelegateInterface (1033 of 1779) PASS: lldb-unit :: Editline/./EditlineTests/EditlineTestFixture.EditlineReceivesSingleLineText (1034 of 1779) PASS: lldb-unit :: Utility/./UtilityTests/StringLexerTest.PutBack (1035 of 1779) PASS: lldb-unit :: Utility/./UtilityTests/StreamTeeTest.DefaultConstructor (1036 of 1779) PASS: lldb-unit :: Language/Highlighting/./HighlighterTests/HighlighterTest.ClangStringLiterals (1037 of 1779) PASS: lldb-unit :: Utility/./UtilityTests/BinaryStreamTest.PutULEB128FiveBytes (1038 of 1779) PASS: lldb-unit :: Utility/./UtilityTests/VASprintfTest.NoBufferResize (1039 of 1779) PASS: lldb-api :: lang/cpp/class_types/TestClassTypesDisassembly.py (1040 of 1779) PASS: lldb-unit :: Utility/./UtilityTests/StringExtractorTest.GetHexBytesAvail (1041 of 1779) PASS: lldb-api :: lang/cpp/nsimport/TestCppNsImport.py (1042 of 1779) PASS: lldb-api :: lang/cpp/limit-debug-info/TestWithLimitDebugInfo.py (1043 of 1779) PASS: lldb-unit :: Host/./HostTests/ConnectionFileDescriptorTest.TCPGetURIv4 (1044 of 1779) PASS: lldb-shell :: SymbolFile/DWARF/find-variable-dwo.cpp (1045 of 1779) PASS: lldb-shell :: Quit/TestQuitExitCodeHex0.test (1046 of 1779) PASS: lldb-api :: types/TestFloatTypes.py (1047 of 1779) PASS: lldb-api :: functionalities/data-formatter/data-formatter-enum-format/TestDataFormatterEnumFormat.py (1048 of 1779) PASS: lldb-unit :: SymbolFile/NativePDB/./SymbolFileNativePDBTests/PDBFPOProgramToDWARFExpressionTests.DependencyChain (1049 of 1779) PASS: lldb-api :: functionalities/gdb_remote_client/TestNoWatchpointSupportInfo.py (1050 of 1779) PASS: lldb-api :: functionalities/target-new-solib-notifications/TestModuleLoadedNotifys.py (1051 of 1779) PASS: lldb-api :: functionalities/data-formatter/nsarraysynth/TestNSArraySynthetic.py (1052 of 1779) PASS: lldb-api :: python_api/findvalue_duplist/TestSBFrameFindValue.py (1053 of 1779) PASS: lldb-unit :: Utility/./UtilityTests/StringExtractorTest.GetHexU8_Underflow (1054 of 1779) PASS: lldb-unit :: UnwindAssembly/x86/./UnwindAssemblyx86Tests/Testx86AssemblyInspectionEngine.TestPushImm (1055 of 1779) PASS: lldb-unit :: Utility/./UtilityTests/RangeTest.ContainsRangeStartingFromZero (1056 of 1779) PASS: lldb-api :: functionalities/breakpoint/debugbreak/TestDebugBreak.py (1057 of 1779) PASS: lldb-unit :: Process/gdb-remote/./ProcessGdbRemoteTests/GDBRemoteCommunicationClientTest.WriteRegisterNoSuffix (1058 of 1779) PASS: lldb-unit :: Utility/./UtilityTests/StreamTest.PutNHex8 (1059 of 1779) PASS: lldb-api :: commands/disassemble/basic/TestDisassembleBreakpoint.py (1060 of 1779) PASS: lldb-api :: commands/statistics/basic/TestStats.py (1061 of 1779) PASS: lldb-unit :: Utility/./UtilityTests/StructuredDataTest.StringDump (1062 of 1779) PASS: lldb-api :: commands/process/launch-with-shellexpand/TestLaunchWithShellExpand.py (1063 of 1779) PASS: lldb-unit :: Utility/./UtilityTests/StringListTest.LongestCommonPrefixDuplicateElement (1064 of 1779) PASS: lldb-api :: lang/objc/objc-new-syntax/TestObjCNewSyntaxArray.py (1065 of 1779) PASS: lldb-shell :: Reproducer/TestFileRepro.test (1066 of 1779) PASS: lldb-shell :: Settings/TestSettingsWrite.test (1067 of 1779) PASS: lldb-unit :: Utility/./UtilityTests/StringExtractorTest.GetHexBytes_Partial (1068 of 1779) PASS: lldb-api :: commands/watchpoints/watchpoint_commands/condition/TestWatchpointConditionCmd.py (1069 of 1779) PASS: lldb-shell :: SymbolFile/DWARF/split-dwarf-inlining.cpp (1070 of 1779) PASS: lldb-unit :: ScriptInterpreter/Python/./ScriptInterpreterPythonTests/PythonDataObjectsTest.TestPythonFile (1071 of 1779) PASS: lldb-api :: functionalities/postmortem/minidump-new/TestMiniDumpUUID.py (1072 of 1779) PASS: lldb-unit :: ScriptInterpreter/Python/./ScriptInterpreterPythonTests/PythonDataObjectsTest.TestGlobalNameResolutionNoDot (1073 of 1779) PASS: lldb-api :: tools/lldb-server/TestGdbRemoteAttach.py (1074 of 1779) PASS: lldb-api :: commands/frame/var-scope/TestFrameVariableScope.py (1075 of 1779) PASS: lldb-api :: functionalities/data-formatter/data-formatter-stl/libcxx/atomic/TestLibCxxAtomic.py (1076 of 1779) PASS: lldb-unit :: Utility/./UtilityTests/ArgsTest.BareSingleQuote (1077 of 1779) PASS: lldb-unit :: Utility/./UtilityTests/NameMatchesTest.StartsWith (1078 of 1779) PASS: lldb-unit :: ObjectFile/Breakpad/./ObjectFileBreakpadTests/Record.classify (1079 of 1779) PASS: lldb-unit :: Language/Highlighting/./HighlighterTests/HighlighterTest.Colons (1080 of 1779) PASS: lldb-unit :: Utility/./UtilityTests/StringListTest.AppendList (1081 of 1779) PASS: lldb-unit :: UnwindAssembly/x86/./UnwindAssemblyx86Tests/Testx86AssemblyInspectionEngine.TestPushRBPWithREX (1082 of 1779) PASS: lldb-api :: lang/objcxx/objcxx-ivar-vector/TestIvarVector.py (1083 of 1779) PASS: lldb-unit :: Expression/./ExpressionTests/CppModuleConfigurationTest.UnknownLibCppFile (1084 of 1779) PASS: lldb-api :: python_api/sbvalue_persist/TestSBValuePersist.py (1085 of 1779) PASS: lldb-api :: python_api/frame/inlines/TestInlinedFrame.py (1086 of 1779) PASS: lldb-api :: functionalities/data-formatter/data-formatter-stl/libcxx/list/TestDataFormatterLibcxxList.py (1087 of 1779) PASS: lldb-unit :: Utility/./UtilityTests/StringExtractorTest.GetHexU8_Underflow2_NoEof (1088 of 1779) PASS: lldb-api :: functionalities/thread/concurrent_events/TestConcurrentBreakpointOneDelayBreakpointThreads.py (1089 of 1779) PASS: lldb-shell :: SymbolFile/NativePDB/tag-types.cpp (1090 of 1779) PASS: lldb-unit :: ScriptInterpreter/Python/./ScriptInterpreterPythonTests/PythonExceptionStateTest.TestResetSemantics (1091 of 1779) PASS: lldb-unit :: Utility/./UtilityTests/StreamTest.ShiftOperatorInts (1092 of 1779) PASS: lldb-unit :: Symbol/./SymbolTests/TestClangASTContext.TestGetBasicTypeFromName (1093 of 1779) PASS: lldb-unit :: Utility/./UtilityTests/DeserializerTest.HasData (1094 of 1779) PASS: lldb-unit :: Utility/./UtilityTests/ConstStringTest.CompareStringRef (1095 of 1779) PASS: lldb-api :: python_api/watchpoint/watchlocation/TestTargetWatchAddress.py (1096 of 1779) PASS: lldb-unit :: Utility/./UtilityTests/FileSpecTest.EqualDotsPosixRoot (1097 of 1779) PASS: lldb-api :: functionalities/thread/concurrent_events/TestConcurrentTwoWatchpointsOneDelayBreakpoint.py (1098 of 1779) PASS: lldb-api :: commands/expression/import-std-module/unique_ptr-dbg-info-content/TestUniquePtrDbgInfoContent.py (1099 of 1779) PASS: lldb-unit :: Utility/./UtilityTests/OptionsWithRawTest.ArgsButNoLeadingDash (1100 of 1779) PASS: lldb-unit :: ScriptInterpreter/Python/./ScriptInterpreterPythonTests/PythonDataObjectsTest.TestPythonByteArray (1101 of 1779) PASS: lldb-api :: lang/objc/conflicting-definition/TestConflictingDefinition.py (1102 of 1779) FAIL: lldb-api :: commands/gui/basic/TestGuiBasic.py (1103 of 1779) ******************** TEST 'lldb-api :: commands/gui/basic/TestGuiBasic.py' FAILED ******************** lldb version 10.0.99 (http://labmaster3.local/git/llvm-project.git revision fce11c6904c888e6d39f71e03806a540852dec41) clang revision 17bde36a031a202ce9fe6cc1d134accbba7afb08 llvm revision 17bde36a031a202ce9fe6cc1d134accbba7afb08 LLDB library dir: /Users/buildslave/jenkins/workspace/lldb-cmake-sanitized/lldb-build/bin LLDB import library dir: /Users/buildslave/jenkins/workspace/lldb-cmake-sanitized/lldb-build/bin libstdcxx tests will not be run because: Don't know how to build with libstdcxx on macosx Skipping following debug info categories: ['dwo'] (lldb) settings set symbols.enable-external-lookup false (lldb) settings set plugin.process.gdb-remote.packet-timeout 60 (lldb) settings set symbols.clang-modules-cache-path "/Users/buildslave/jenkins/workspace/lldb-cmake-sanitized/lldb-build/tools/lldb/lldb-test-build.noindex/module-cache-lldb/lldb-api" (lldb) settings set use-color false (lldb) target create "/Users/buildslave/jenkins/workspace/lldb-cmake-sanitized/lldb-build/tools/lldb/lldb-test-build.noindex/commands/gui/basic/TestGuiBasic.test_gui/a.out" Current executable set to '/Users/buildslave/jenkins/workspace/lldb-cmake-sanitized/lldb-build/tools/lldb/lldb-test-build.noindex/commands/gui/basic/TestGuiBasic.test_gui/a.out' (x86_64). (lldb) br set -f main.c -p "// Break here" br set -f main.c -p "// Break here" Breakpoint 1: where = a.out`main + 27 at main.c:3:3, address = 0x0000000100000fab (lldb) run run Process 53160 launched: '/Users/buildslave/jenkins/workspace/lldb-cmake-sanitized/lldb-build/tools/lldb/lldb-test-build.noindex/commands/gui/basic/TestGuiBasic.test_gui/a.out' (x86_64) Process 53160 stopped * thread #1, queue = 'com.apple.main-thread', stop reason = breakpoint 1.1 frame #0: 0x0000000100000fab a.out`main(argc=1, argv=0x00007ffeefbff490) at main.c:3:3 1 int main(int argc, char **argv) { 2 int funky_var_name_that_should_be_rendered = 22; -> 3 return 0; // Break here ^ 4 } (lldb) gui gui (B)0[?7h[?1h=| LLDB (F1) | Target (F2) | Process (F3) | Thread (F4) | View (F5) | Help (F6) | lqq<Sources>qqqqqqqqqqqqqqqqqqqqqqqqqqqqqqqqqqqqqqqqqqqqqqqqqqqqqqqqqqqqqqqqqqqqqqqqqqqqqqqqqqqqqqqqqqqqqqqqqqqqqqqqqqqqqqqqqqqqqqqqqqqqqqqqqqqqqqqqqqqqqqqqqqqqqqqqqqqqqqqqqqqqqqqqqqqqqqqqqqqqqqqqqqqqqqqqqqqqqqqqqqqqqqqqqqqqqqqqqqqqqqqqqqqqqqqqqqqqqqqqqqqqqqqqqqqqqqqqqqqqqqqqqqqqqqqqqqqqqqqqqqqqqqqqqqqqqqqqqqqqqqqqqqqqqqqqqqqqqqqqqqqqqqqqqqqqqqqqqqqqqqqqqqqqqqqqqqqqqqqqqqqqqqqqqqqqqqqqqqqqqqqqqqqklqq<Threads>qqqqqqqqqqqqqqqqqqqqqqqqqqqqqqqqqqqqqqqqqqqqqqqqqqqqqqqqqqqqqqqqqqqqqqqqqqqqqqqqqqqqqqqkx a.out`main xx `qprocess 53160xx 1 x int main(int argc, char **argv) {xxxx 2 x int funky_var_name_that_should_be_rendered = 22;xxxx 3 x` return 0; // Break here <<< Thread 1: breakpoint 1.1 xxxx 4 x }xxxx 5 xxxxxxxxxxxxxxxxxxxxxxxxxxxxxxxxxxxxxxxxxxxxxxxxxxxxxxxxxxxxxxxxxxxxxxxxxxxxxxxxxxxxxxxxxxxxxxxxxxxxxxxxxxxxxxxxxxxxxxxxxxxxxxxxxxxxxxxxxlqq<Help>qqqqqqqqqqqqqqqqqqqqqqqqqqqqqqqqqqqqqqqqqqqqqqqqqqqqqqqqqqqqqqqqqqqqqqqqqqqqqqqkxxxxx Welcome to the LLDB curses GUI.xxxxxxxxxxxx Press the TAB key to change the selected view.xxxxxx Each view has its own keyboard shortcuts, press 'h' to open a dialog to display them. xxxxxxxxxxxx Common key bindings for all views:xxxxxxxxxxxxtab - Select next viewxxxxxxh - Show help dialog with view specific key bindingsxxxxxx, - Page upxxxxxx. - Page downxxxxxxup - Select previousxxxxxxdown - Select nextxxxxxxleft - Unexpand or select parentxxxxxxright - Expandxxxxxx page-up - Page upxxxxxx page-down - Page downxxxxxmqqqqqqqqqqqqqqqqqqqqqqqqqqqqqqqqqqqqqqqqqqqqqqqqqqqqqqqqqqqqqq[Press any key to exit]qqjxxxxxxxxxxxxxxxxxxxxxxxxxxxxxxxxxxxmqqqqqqqqqqqqqqqqqqqqqqqqqqqqqqqqqqqqqqqqqqqqqqqqqqqqqqqqqqqqqqqqqqqqqqqqqqqqqqqqqqqqqqqqqqqqqqqqqqqqqqqqqqqqqqqqqqqqqqqqqqqqqqqqqqqqqqqqqqqqqqqqqqqqqqqqqqqqqqqqqqqqqqqqqqqqqqqqqqqqqqqqqqqqqqqqqqqqqqqqqqqqqqqqqqqqqqqqqqqqqqqqqqqqqqqqqqqqqqqqqqqqqqqqqqqqqqqqqqqqqqqqqqqqqqqqqqqqqqqqqqqqqqqqqqqqqqqqqqqqqqqqqqqqqqqqqqqqqqqqqqqqqqqqqqqqqqqqqqqqqqqqqqqqqqqqqqqqqqqqqqqqqqqqqqqqqqqqqqqqqqqqqqqqqqqqqqqqqqjxxlqq<Variables>qqqqqqqqqqqqqqqqqqqqqqqqqqqqqqqqqqqqqqqqqqqqqqqqqqqqqqqqqqqqqqqqqqqqqqqqqqqqqqqqqqqqqqqqqqqqqqqqqqqqqqqqqqqqqqqqqqqqqqqqqqqqqqqqqqqqqqqqqqqqqqqqqqqqqqqqqqqqqqqqqqqqqqqqqqqqqqqqqqqqqqqqqqqqqqqqqqqqqqqqqqqqqqqqqqqqqqqqqqqqqqqqqqqqqqqqqqqqqqqqqqqqqqqqqqqqqqqqqqqqqqqqqqqqqqqqqqqqqqqqqqqqqqqqqqqqqqqqqqqqqqqqqqqqqqqqqqqqqqqqqqqqqqqqqqqqqqqqqqqqqqqqqqqqqqqqqqqqqqqqqqqqqqqqqqqqqqqqqqqqqqqqqkxxx (int) argc = 1xxxx `q(char **) argv = 0x00007ffeefbff490xxxx (int) funky_var_name_that_should_be_rendered = 22xxxxxxxxxxxxxxxxxxxxxxxxxxxxxxxxxxxxxxxxxxxxxxxxxxxxxxxxxxxxxxxxxxxxxxxxxxxxxxxxxxxxxxxxxxxxxxxxxxxxxxxmqqqqqqqqqqqqqqqqqqqqqqqqqqqqqqqqqqqqqqqqqqqqqqqqqqqqqqqqqqqqqqqqqqqqqqqqqqqqqqqqqqqqqqqqqqqqqqqqqqqqqqqqqqqqqqqqqqqqqqqqqqqqqqqqqqqqqqqqqqqqqqqqqqqqqqqqqqqqqqqqqqqqqqqqqqqqqqqqqqqqqqqqqqqqqqqqqqqqqqqqqqqqqqqqqqqqqqqqqqqqqqqqqqqqqqqqqqqqqqqqqqqqqqqqqqqqqqqqqqqqqqqqqqqqqqqqqqqqqqqqqqqqqqqqqqqqqqqqqqqqqqqqqqqqqqqqqqqqqqqqqqqqqqqqqqqqqqqqqqqqqqqqqqqqqqqqqqqqqqqqqqqqqqqqqqqqqqqqqqqqqqqqqqqqqqqqqqqqqqjmqqqqqqqqqqqqqqqqqqqqqqqqqqqqqqqqqqqqqqqqqqqqqqqqqqqqqqqqqqqqqqqqqqqqqqqqqqqqqqqqqqqqqqqqqqqqqqqqqqjProcess: 53160 stopped Thread: 0x4984a9 Frame: 0 PC = 0x0000000100000fab lqq<Sources>qqqqqqqqqqqqqqqqqqqqqqqqqqqqqqqqqqqqqqqqqqqqqqqqqqqqqqqqqqqqqqqqqqqqqqqqqqqqqqqqqqqqqqqqqqqqqqqqqqqqqqqqqqqqqqqqqqqqqqqqqqqqqqqqqqqqqqqqqqqqqqqqqqqqqqqqqqqqqqqqqqqqqqqqqqqqqqqqqqqqqqqqqqqqqqqqqqqqqqqqqqqqqqqqqqqqqqqqqqqqqqqqqqqqqqqqqqqqqqqqqqqqqqqqqqqqqqqqqqqqqqqqqqqqqqqqqqqqqqqqqqqqqqqqqqqqqqqqqqqqqqqqqqqqqqqqqqqqqqqqqqqqqqqqqqqqqqqqqqqqqqqqqqqqqqqqqqqqqqqqqqqqqqqqqqqqqqqqqqqqqqqqqqqk xx xx xx xx xx xx xx xx xx xx xx xx xx xx xx xx xx xx xx xx xx xx xx xx xx xx xx xx xx xx xx xx xx xx xx xx xx xx xx x x x  x x  x x  x x x x  x x  x x  x x   x x   x x   x x   x x   x x   x x   x x   x x  x x  x x x xx xx xx xx xx xx xx xx mqqqqqqqqqqqqqqqqqqqqqqqqqqqqqqqqqqqqqqqqqqqqqqqqqqqqqqqqqqqqqqqqqqqqqqqqqqqqqqqqqqqqqqqqqqqqqqqqqqqqqqqqqqqqqqqqqqqqqqqqqqqqqqqqqqqqqqqqqqqqqqqqqqqqqqqqqqqqqqqqqqqqqqqqqqqqqqqqqqqqqqqqqqqqqqqqqqqqqqqqqqqqqqqqqqqqqqqqqqqqqqqqqqqqqqqqqqqqqqqqqqqqqqqqqqqqqqqqqqqqqqqqqqqqqqqqqqqqqqqqqqqqqqqqqqqqqqqqqqqqqqqqqqqqqqqqqqqqqqqqqqqqqqqqqqqqqqqqqqqqqqqqqqqqqqqqqqqqqqqqqqqqqqqqqqqqqqqqqqqqqqqqqqqqqqqqqqqqqqj [?1l>(lldb) gui gui (B)0[?7h[?1h=| LLDB (F1) | Target (F2) | Process (F3) | Thread (F4) | View (F5) | Help (F6) | lqq<Sources>qqqqqqqqqqqqqqqqqqqqqqqqqqqqqqqqqqqqqqqqqqqqqqqqqqqqqqqqqqqqqqqqqqqqqqqqqqqqqqqqqqqqqqqqqqqqqqqqqqqqqqqqqqqqqqqqqqqqqqqqqqqqqqqqqqqqqqqqqqqqqqqqqqqqqqqqqqqqqqqqqqqqqqqqqqqqqqqqqqqqqqqqqqqqqqqqqqqqqqqqqqqqqqqqqqqqqqqqqqqqqqqqqqqqqqqqqqqqqqqqqqqqqqqqqqqqqqqqqqqqqqqqqqqqqqqqqqqqqqqqqqqqqqqqqqqqqqqqqqqqqqqqqqqqqqqqqqqqqqqqqqqqqqqqqqqqqqqqqqqqqqqqqqqqqqqqqqqqqqqqqqqqqqqqqqqqqqqqqqqqqqqqqqqklqq<Threads>qqqqqqqqqqqqqqqqqqqqqqqqqqqqqqqqqqqqqqqqqqqqqqqqqqqqqqqqqqqqqqqqqqqqqqqqqqqqqqqqqqqqqqqkx a.out`main xx `qprocess 53160xx 1 x int main(int argc, char **argv) {xxxx 2 x int funky_var_name_that_should_be_rendered = 22;xxxx 3 x` return 0; // Break here <<< Thread 1: breakpoint 1.1 xxxx 4 x }xxxx 5 xxxxxxxxxxxxxxxxxxxxxxxxxxxxxxxxxxxxxxxxxxxxxxxxxxxxxxxxxxxxxxxxxxxxxxxxxxxxxxxxxxxxxxxxxxxxxxxxxxxxxxxxxxxxxxxxxxxxxxxxxxxxxxxxxxxxxxxxxxxxxxxxxxxxxxxxxxxxxxxxxxxxxxxxxxxxxxxxxxxxxxxxxxxxxxxxxxxxxxxxxxxxxxxxxxxxxxxxxxxxxxxxxxxxxxxxxxxxxxxxxxxxmqqqqqqqqqqqqqqqqqqqqqqqqqqqqqqqqqqqqqqqqqqqqqqqqqqqqqqqqqqqqqqqqqqqqqqqqqqqqqqqqqqqqqqqqqqqqqqqqqqqqqqqqqqqqqqqqqqqqqqqqqqqqqqqqqqqqqqqqqqqqqqqqqqqqqqqqqqqqqqqqqqqqqqqqqqqqqqqqqqqqqqqqqqqqqqqqqqqqqqqqqqqqqqqqqqqqqqqqqqqqqqqqqqqqqqqqqqqqqqqqqqqqqqqqqqqqqqqqqqqqqqqqqqqqqqqqqqqqqqqqqqqqqqqqqqqqqqqqqqqqqqqqqqqqqqqqqqqqqqqqqqqqqqqqqqqqqqqqqqqqqqqqqqqqqqqqqqqqqqqqqqqqqqqqqqqqqqqqqqqqqqqqqqqqqqqqqqqqqqjxxlqq<Variables>qqqqqqqqqqqqqqqqqqqqqqqqqqqqqqqqqqqqqqqqqqqqqqqqqqqqqqqqqqqqqqqqqqqqqqqqqqqqqqqqqqqqqqqqqqqqqqqqqqqqqqqqqqqqqqqqqqqqqqqqqqqqqqqqqqqqqqqqqqqqqqqqqqqqqqqqqqqqqqqqqqqqqqqqqqqqqqqqqqqqqqqqqqqqqqqqqqqqqqqqqqqqqqqqqqqqqqqqqqqqqqqqqqqqqqqqqqqqqqqqqqqqqqqqqqqqqqqqqqqqqqqqqqqqqqqqqqqqqqqqqqqqqqqqqqqqqqqqqqqqqqqqqqqqqqqqqqqqqqqqqqqqqqqqqqqqqqqqqqqqqqqqqqqqqqqqqqqqqqqqqqqqqqqqqqqqqqqqqqqqqqqqqkxxx (int) argc = 1xxxx `q(char **) argv = 0x00007ffeefbff490xxxx (int) funky_var_name_that_should_be_rendered = 22xxxxxxxxxxxxxxxxxxxxxxxxxxxxxxxxxxxxxxxxxxxxxxxxxxxxxxxxxxxxxxxxxxxxxxxxxxxxxxxxxxxxxxxxxxxxxxxxxxxxxxxmqqqqqqqqqqqqqqqqqqqqqqqqqqqqqqqqqqqqqqqqqqqqqqqqqqqqqqqqqqqqqqqqqqqqqqqqqqqqqqqqqqqqqqqqqqqqqqqqqqqqqqqqqqqqqqqqqqqqqqqqqqqqqqqqqqqqqqqqqqqqqqqqqqqqqqqqqqqqqqqqqqqqqqqqqqqqqqqqqqqqqqqqqqqqqqqqqqqqqqqqqqqqqqqqqqqqqqqqqqqqqqqqqqqqqqqqqqqqqqqqqqqqqqqqqqqqqqqqqqqqqqqqqqqqqqqqqqqqqqqqqqqqqqqqqqqqqqqqqqqqqqqqqqqqqqqqqqqqqqqqqqqqqqqqqqqqqqqqqqqqqqqqqqqqqqqqqqqqqqqqqqqqqqqqqqqqqqqqqqqqqqqqqqqqqqqqqqqqqqjmqqqqqqqqqqqqqqqqqqqqqqqqqqqqqqqqqqqqqqqqqqqqqqqqqqqqqqqqqqqqqqqqqqqqqqqqqqqqqqqqqqqqqqqqqqqqqqqqqqjProcess: 53160 stopped Thread: 0x4984a9 Frame: 0 PC = 0x0000000100000fab [?1l>(lldb) settings set interpreter.prompt-on-quit false

Hide Details

Session logs for test failures/errors/unexpected successes will go into directory '/Users/buildslave/jenkins/workspace/lldb-cmake-sanitized/test/logs' Command invoked: /Users/buildslave/jenkins/workspace/lldb-cmake-sanitized/llvm-project/lldb/test/API/dotest.py --arch=x86_64 -s /Users/buildslave/jenkins/workspace/lldb-cmake-sanitized/lldb-build/lldb-test-traces -S nm -u CXXFLAGS -u CFLAGS --executable /Users/buildslave/jenkins/workspace/lldb-cmake-sanitized/lldb-build/./bin/lldb --dsymutil /Users/buildslave/jenkins/workspace/lldb-cmake-sanitized/lldb-build/./bin/dsymutil --filecheck /Users/buildslave/jenkins/workspace/lldb-cmake-sanitized/lldb-build/./bin/FileCheck -C /Users/buildslave/jenkins/workspace/lldb-cmake-sanitized/host-compiler/bin/clang --codesign-identity lldb_codesign --server /Users/buildslave/jenkins/workspace/lldb-cmake-sanitized/lldb-build/./bin/debugserver --arch x86_64 --build-dir /Users/buildslave/jenkins/workspace/lldb-cmake-sanitized/lldb-build/lldb-test-build.noindex -s=/Users/buildslave/jenkins/workspace/lldb-cmake-sanitized/test/logs -t --env TERM=vt100 --env LLVM_LIBS_DIR=/Users/buildslave/jenkins/workspace/lldb-cmake-sanitized/lldb-build/./lib --build-dir /Users/buildslave/jenkins/workspace/lldb-cmake-sanitized/lldb-build/tools/lldb/lldb-test-build.noindex --lldb-module-cache-dir /Users/buildslave/jenkins/workspace/lldb-cmake-sanitized/lldb-build/tools/lldb/lldb-test-build.noindex/module-cache-lldb/lldb-api --clang-module-cache-dir /Users/buildslave/jenkins/workspace/lldb-cmake-sanitized/lldb-build/tools/lldb/lldb-test-build.noindex/module-cache-clang/lldb-api /Users/buildslave/jenkins/workspace/lldb-cmake-sanitized/llvm-project/lldb/packages/Python/lldbsuite/test/commands/gui/basic -p TestGuiBasic.py Change dir to: /Users/buildslave/jenkins/workspace/lldb-cmake-sanitized/llvm-project/lldb/packages/Python/lldbsuite/test/commands/gui/basic runCmd: settings set symbols.enable-external-lookup false output:

Hide Details

runCmd: settings set plugin.process.gdb-remote.packet-timeout 60 output:

Hide Details

runCmd: settings set symbols.clang-modules-cache-path "/Users/buildslave/jenkins/workspace/lldb-cmake-sanitized/lldb-build/tools/lldb/lldb-test-build.noindex/module-cache-lldb/lldb-api" output:

Hide Details

runCmd: settings set use-color false output:

Hide Details

FAIL: LLDB (/Users/buildslave/jenkins/workspace/lldb-cmake-sanitized/host-compiler/bin/clang-10-x86_64) :: test_gui (TestGuiBasic.BasicGuiCommandTest) tearing down the child process....

Hide Details

CLEANUP ERROR: LLDB (/Users/buildslave/jenkins/workspace/lldb-cmake-sanitized/host-compiler/bin/clang-10-x86_64) :: test_gui (TestGuiBasic.BasicGuiCommandTest) Restore dir to: /Users/buildslave/jenkins/workspace/lldb-cmake-sanitized/lldb-build/tools/lldb/test ====================================================================== ERROR: test_gui (TestGuiBasic.BasicGuiCommandTest) ---------------------------------------------------------------------- Traceback (most recent call last): File "/Users/buildslave/jenkins/workspace/lldb-cmake-sanitized/llvm-project/lldb/packages/Python/lldbsuite/test/commands/gui/basic/TestGuiBasic.py", line 60, in test_gui self.quit() File "/Users/buildslave/jenkins/workspace/lldb-cmake-sanitized/llvm-project/lldb/packages/Python/lldbsuite/test/lldbpexpect.py", line 61, in quit self.child.close(force=not gracefully) File "/Users/buildslave/jenkins/workspace/lldb-cmake-sanitized/llvm-project/lldb/third_party/Python/module/pexpect-4.6/pexpect/pty_spawn.py", line 327, in close self.ptyproc.close(force=force) File "/System/Library/Frameworks/Python.framework/Versions/2.7/lib/python2.7/contextlib.py", line 35, in __exit__ self.gen.throw(type, value, traceback) File "/Users/buildslave/jenkins/workspace/lldb-cmake-sanitized/llvm-project/lldb/third_party/Python/module/pexpect-4.6/pexpect/pty_spawn.py", line 25, in _wrap_ptyprocess_err raise ExceptionPexpect(*e.args) ExceptionPexpect: Could not terminate the child. Config=x86_64-/Users/buildslave/jenkins/workspace/lldb-cmake-sanitized/host-compiler/bin/clang-10 ---------------------------------------------------------------------- Ran 1 test in 8.102s

Hide Details

RESULT: FAILED (0 passes, 0 failures, 1 errors, 0 skipped, 0 expected failures, 0 unexpected successes)

Hide Details

******************** PASS: lldb-shell :: ObjectFile/ELF/netbsd-core-amd64.test (1104 of 1779) UNSUPPORTED: lldb-api :: linux/mix-dwo-and-regular-objects/TestMixedDwarfBinary.py (1105 of 1779) PASS: lldb-api :: api/multiple-targets/TestMultipleTargets.py (1106 of 1779) PASS: lldb-shell :: ObjectFile/ELF/PT_TLS-overlap-PT_LOAD.yaml (1107 of 1779) PASS: lldb-unit :: Utility/./UtilityTests/RangeTest.Constructor (1108 of 1779) PASS: lldb-api :: functionalities/signal/handle-abrt/TestHandleAbort.py (1109 of 1779) PASS: lldb-unit :: Utility/./UtilityTests/SerializationRountripTest.SerializeDeserializePod (1110 of 1779) UNSUPPORTED: lldb-api :: linux/sepdebugsymlink/TestTargetSymbolsSepDebugSymlink.py (1111 of 1779) PASS: lldb-unit :: SymbolFile/NativePDB/./SymbolFileNativePDBTests/PDBFPOProgramToDWARFExpressionTests.MultipleIndependentAssignments (1112 of 1779) UNSUPPORTED: lldb-shell :: SymbolFile/PDB/udt-layout.test (1113 of 1779) PASS: lldb-unit :: Utility/./UtilityTests/ProcessInstanceInfo.Dump (1114 of 1779) PASS: lldb-unit :: Utility/./UtilityTests/BinaryStreamTest.PutULEB128SixBytes (1115 of 1779) PASS: lldb-unit :: ObjectFile/ELF/./ObjectFileELFTests/ObjectFileELFTest.GetSymtab_NoSymEntryPointArmAddressClass (1116 of 1779) PASS: lldb-api :: lang/objc/exceptions/TestObjCExceptions.py (1117 of 1779) PASS: lldb-shell :: Expr/TestTypeOfDeclTypeExpr.test (1118 of 1779) PASS: lldb-unit :: Utility/./UtilityTests/GeneratorTest.Get (1119 of 1779) PASS: lldb-unit :: SymbolFile/DWARF/./SymbolFileDWARFTests/SymbolFileDWARFTests.TestAbbrevOrder1Start1 (1120 of 1779) PASS: lldb-unit :: Host/./HostTests/MainLoopTest.DetectsEOF (1121 of 1779) PASS: lldb-api :: functionalities/thread/concurrent_events/TestConcurrentWatchBreakDelay.py (1122 of 1779) PASS: lldb-unit :: UnwindAssembly/x86/./UnwindAssemblyx86Tests/Testx86AssemblyInspectionEngine.Test64bitFramelessSmallStackFrame (1123 of 1779) PASS: lldb-api :: functionalities/data-formatter/data-formatter-stl/libcxx/bitset/TestDataFormatterLibcxxBitset.py (1124 of 1779) PASS: lldb-api :: functionalities/recursion/TestValueObjectRecursion.py (1125 of 1779) PASS: lldb-api :: types/TestFloatTypesExpr.py (1126 of 1779) PASS: lldb-unit :: Utility/./UtilityTests/StringExtractorTest.GetHexU8_Underflow2 (1127 of 1779) PASS: lldb-unit :: Process/minidump/./LLDBMinidumpTests/MinidumpParserTest.GetFilteredModuleList (1128 of 1779) PASS: lldb-unit :: Utility/./UtilityTests/StringExtractorTest.GetHexU8_Extra_NoEof (1129 of 1779) PASS: lldb-unit :: Utility/./UtilityTests/ScalarTest.RightShiftOperator (1130 of 1779) PASS: lldb-unit :: Utility/./UtilityTests/ArgsTest.ReplaceArgumentAtIndexFarOutOfRange (1131 of 1779) UNSUPPORTED: lldb-api :: lang/cpp/function-template-parameter-pack/TestFunctionTemplateParameterPack.py (1132 of 1779) PASS: lldb-unit :: Utility/./UtilityTests/UriParserTest.SchemeHostSeparator3 (1133 of 1779) PASS: lldb-unit :: Utility/./UtilityTests/BinaryStreamTest.PutULEB128ThreeBytes (1134 of 1779) PASS: lldb-shell :: SymbolFile/DWARF/find-method-local-struct.cpp (1135 of 1779) PASS: lldb-api :: functionalities/breakpoint/breakpoint_conditions/TestBreakpointConditions.py (1136 of 1779) PASS: lldb-api :: tools/lldb-server/TestGdbRemoteKill.py (1137 of 1779) PASS: lldb-unit :: Utility/./UtilityTests/StringExtractorTest.DecodeHexU8_Underflow (1138 of 1779) PASS: lldb-unit :: Utility/./UtilityTests/BinaryStreamTest.PutULEB128TwoBytes (1139 of 1779) PASS: lldb-api :: commands/disassemble/basic/TestFrameDisassemble.py (1140 of 1779) PASS: lldb-unit :: Utility/./UtilityTests/GeneratorTest.Create (1141 of 1779) UNSUPPORTED: lldb-shell :: SymbolFile/NativePDB/local-variables.cpp (1142 of 1779) PASS: lldb-api :: arm/emulation/TestEmulations.py (1143 of 1779) PASS: lldb-unit :: Language/Highlighting/./HighlighterTests/HighlighterTest.DefaultHighlighterWithCursor (1144 of 1779) PASS: lldb-unit :: ScriptInterpreter/Python/./ScriptInterpreterPythonTests/PythonDataObjectsTest.TestPythonInteger (1145 of 1779) PASS: lldb-shell :: SymbolFile/NativePDB/break-by-line.cpp (1146 of 1779) PASS: lldb-unit :: Utility/./UtilityTests/RangeTest.NotEqual (1147 of 1779) PASS: lldb-api :: functionalities/data-formatter/data-formatter-synthval/TestDataFormatterSynthVal.py (1148 of 1779) PASS: lldb-api :: commands/watchpoints/watchpoint_commands/TestWatchpointCommands.py (1149 of 1779) PASS: lldb-unit :: Language/Highlighting/./HighlighterTests/HighlighterTest.DefaultHighlighter (1150 of 1779) PASS: lldb-api :: commands/expression/import-std-module/empty-module/TestEmptyStdModule.py (1151 of 1779) PASS: lldb-unit :: Utility/./UtilityTests/LogChannelTest.List (1152 of 1779) PASS: lldb-api :: commands/command/script/TestCommandScript.py (1153 of 1779) PASS: lldb-api :: commands/frame/diagnose/dereference-function-return/TestDiagnoseDereferenceFunctionReturn.py (1154 of 1779) PASS: lldb-unit :: Host/./HostTests/MainLoopTest.Signal (1155 of 1779) PASS: lldb-unit :: Utility/./UtilityTests/VMRange.ContainsAddr (1156 of 1779) PASS: lldb-unit :: Process/minidump/./LLDBMinidumpTests/MinidumpParserTest.GetMemory (1157 of 1779) PASS: lldb-api :: lang/cpp/namespace/TestNamespaceLookup.py (1158 of 1779) PASS: lldb-shell :: Driver/TestNoUseColor.test (1159 of 1779) PASS: lldb-unit :: Core/./LLDBCoreTests/MangledTest.EmptyForInvalidName (1160 of 1779) PASS: lldb-api :: functionalities/type_completion/TestTypeCompletion.py (1161 of 1779) PASS: lldb-unit :: UnwindAssembly/x86/./UnwindAssemblyx86Tests/Testx86AssemblyInspectionEngine.TestSimplex86_64Augmented (1162 of 1779) UNSUPPORTED: lldb-api :: functionalities/thread/multi_break/TestMultipleBreakpoints.py (1163 of 1779) PASS: lldb-shell :: SymbolFile/DWARF/forward-declarations.s (1164 of 1779) PASS: lldb-unit :: Utility/./UtilityTests/StringExtractorTest.InitEmpty (1165 of 1779) PASS: lldb-api :: python_api/watchpoint/watchlocation/TestSetWatchlocation.py (1166 of 1779) PASS: lldb-api :: python_api/module_section/TestModuleAndSection.py (1167 of 1779) PASS: lldb-unit :: Utility/./UtilityTests/StringListTest.InsertStringAtIndexStart (1168 of 1779) PASS: lldb-unit :: Utility/./UtilityTests/UUIDTest.SetFromStringRef (1169 of 1779) PASS: lldb-unit :: Utility/./UtilityTests/AnsiTerminal.Empty (1170 of 1779) PASS: lldb-unit :: Utility/./UtilityTests/BinaryStreamTest.PutULEB128EightBytes (1171 of 1779) PASS: lldb-unit :: Process/gdb-remote/./ProcessGdbRemoteTests/GDBRemoteClientBaseTest.SendContinueAndInterrupt2PacketBug (1172 of 1779) PASS: lldb-api :: commands/expression/invalid-args/TestInvalidArgsExpression.py (1173 of 1779) PASS: lldb-unit :: Expression/./ExpressionTests/CppModuleConfigurationTest.MissingLibCpp (1174 of 1779) PASS: lldb-api :: commands/expression/import-std-module/deque-dbg-info-content/TestDbgInfoContentDeque.py (1175 of 1779) PASS: lldb-api :: functionalities/thread/concurrent_events/TestConcurrentTwoWatchpointsOneSignal.py (1176 of 1779) UNSUPPORTED: lldb-api :: tools/lldb-vscode/launch/TestVSCode_launch.py (1177 of 1779) PASS: lldb-api :: functionalities/data-formatter/synthcapping/TestSyntheticCapping.py (1178 of 1779) PASS: lldb-shell :: SymbolFile/DWARF/split-dwarf-multiple-cu.ll (1179 of 1779) PASS: lldb-api :: functionalities/tail_call_frames/disambiguate_tail_call_seq/TestDisambiguateTailCallSeq.py (1180 of 1779) PASS: lldb-unit :: Utility/./UtilityTests/VMRange.ContainsRange (1181 of 1779) UNSUPPORTED: lldb-api :: functionalities/data-formatter/data-formatter-stl/libstdcpp/unique_ptr/TestDataFormatterStdUniquePtr.py (1182 of 1779) UNSUPPORTED: lldb-api :: functionalities/longjmp/TestLongjmp.py (1183 of 1779) PASS: lldb-api :: lang/c/register_variables/TestRegisterVariables.py (1184 of 1779) PASS: lldb-unit :: UnwindAssembly/x86/./UnwindAssemblyx86Tests/Testx86AssemblyInspectionEngine.TestPush0 (1185 of 1779) PASS: lldb-api :: lang/c/vla/TestVLA.py (1186 of 1779) PASS: lldb-unit :: ScriptInterpreter/Python/./ScriptInterpreterPythonTests/PythonDataObjectsTest.TestPythonListToStructuredList (1187 of 1779) PASS: lldb-unit :: Utility/./UtilityTests/StringListTest.ForRange (1188 of 1779) PASS: lldb-api :: functionalities/gdb_remote_client/TestRecognizeBreakpoint.py (1189 of 1779) PASS: lldb-unit :: Utility/./UtilityTests/EnvironmentTest.EnvpConversion (1190 of 1779) PASS: lldb-unit :: Host/./HostTests/FileSystemTest.MakeAbsolute (1191 of 1779) PASS: lldb-api :: commands/expression/xvalue/TestXValuePrinting.py (1192 of 1779) PASS: lldb-api :: lang/cpp/frame-var-anon-unions/TestFrameVariableAnonymousUnions.py (1193 of 1779) PASS: lldb-api :: sanity/TestModuleCacheSanity.py (1194 of 1779) PASS: lldb-api :: commands/help/TestHelp.py (1195 of 1779) PASS: lldb-api :: commands/expression/import-std-module/weak_ptr/TestWeakPtr.py (1196 of 1779) PASS: lldb-shell :: Reproducer/TestDump.test (1197 of 1779) UNSUPPORTED: lldb-api :: functionalities/darwin_log/filter/regex/message/TestDarwinLogFilterRegexMessage.py (1198 of 1779) PASS: lldb-unit :: ScriptInterpreter/Python/./ScriptInterpreterPythonTests/PythonDataObjectsTest.TestPythonDictionaryManipulation (1199 of 1779) UNSUPPORTED: lldb-api :: functionalities/data-formatter/data-formatter-stl/libstdcpp/vector/TestDataFormatterStdVector.py (1200 of 1779) PASS: lldb-unit :: UnwindAssembly/x86/./UnwindAssemblyx86Tests/Testx86AssemblyInspectionEngine.TestPushEBX (1201 of 1779) PASS: lldb-unit :: Utility/./UtilityTests/StringExtractorTest.GetHexU8_InvalidHex (1202 of 1779) PASS: lldb-api :: lang/cpp/llvm-style/TestLLVMStyle.py (1203 of 1779) PASS: lldb-api :: commands/expression/import-std-module/basic/TestImportStdModule.py (1204 of 1779) PASS: lldb-api :: functionalities/thread/concurrent_events/TestConcurrentManyCrash.py (1205 of 1779) PASS: lldb-api :: functionalities/tsan/cpp_global_location/TestTsanCPPGlobalLocation.py (1206 of 1779) PASS: lldb-unit :: Language/Highlighting/./HighlighterTests/HighlighterTest.ClangCursorOutOfBounds (1207 of 1779) UNSUPPORTED: lldb-api :: lang/cpp/printf/TestPrintf.py (1208 of 1779) PASS: lldb-shell :: ObjectFile/MachO/subsections.yaml (1209 of 1779) PASS: lldb-unit :: Symbol/./SymbolTests/LineEntryTest.GetSameLineContiguousAddressRangeNoInlines (1210 of 1779) PASS: lldb-api :: functionalities/breakpoint/step_over_breakpoint/TestStepOverBreakpoint.py (1211 of 1779) PASS: lldb-unit :: Utility/./UtilityTests/TimerTest.CategoryTimesStats (1212 of 1779) PASS: lldb-api :: commands/expression/test/TestExprs.py (1213 of 1779) PASS: lldb-api :: commands/expression/formatters/TestFormatters.py (1214 of 1779) UNSUPPORTED: lldb-api :: functionalities/data-formatter/data-formatter-stl/libstdcpp/tuple/TestDataFormatterStdTuple.py (1215 of 1779) PASS: lldb-unit :: Host/./HostTests/TaskPoolTest.TaskMap (1216 of 1779) PASS: lldb-unit :: Process/minidump/./LLDBMinidumpTests/MinidumpParserTest.GetMiscInfo_no_stream (1217 of 1779) PASS: lldb-unit :: UnwindAssembly/x86/./UnwindAssemblyx86Tests/Testx86AssemblyInspectionEngine.TestPushExtended (1218 of 1779) UNSUPPORTED: lldb-api :: functionalities/darwin_log/filter/exact_match/subsystem/TestDarwinLogFilterMatchSubsystem.py (1219 of 1779) PASS: lldb-api :: functionalities/thread/concurrent_events/TestConcurrentManyBreakpoints.py (1220 of 1779) PASS: lldb-api :: lang/cpp/rvalue-references/TestRvalueReferences.py (1221 of 1779) PASS: lldb-api :: commands/expression/call-function/TestCallBuiltinFunction.py (1222 of 1779) PASS: lldb-unit :: Utility/./UtilityTests/UriParserTest.TypicalPortPath (1223 of 1779) PASS: lldb-unit :: Process/gdb-remote/./ProcessGdbRemoteTests/GDBRemoteCommunicationClientTest.SendStartTracePacket (1224 of 1779) PASS: lldb-api :: lang/cpp/class-template-parameter-pack/TestClassTemplateParameterPack.py (1225 of 1779) PASS: lldb-unit :: Host/./HostTests/SocketTest.TCPGetAddress (1226 of 1779) UNSUPPORTED: lldb-api :: functionalities/thread/thread_specific_break_plus_condition/TestThreadSpecificBpPlusCondition.py (1227 of 1779) PASS: lldb-api :: lang/cpp/static_methods/TestCPPStaticMethods.py (1228 of 1779) PASS: lldb-api :: lang/objc/foundation/TestObjCMethodsNSArray.py (1229 of 1779) PASS: lldb-unit :: Core/./LLDBCoreTests/RichManglingContextTest.FromCxxMethodName (1230 of 1779) PASS: lldb-unit :: Host/./HostTests/TaskPoolTest.AddTask (1231 of 1779) PASS: lldb-api :: functionalities/thread/concurrent_events/TestConcurrentDelaySignalBreak.py (1232 of 1779) UNSUPPORTED: lldb-shell :: Register/x86-ymm-read.test (1233 of 1779) PASS: lldb-shell :: SymbolFile/DWARF/find-qualified-variable.cpp (1234 of 1779) PASS: lldb-unit :: Utility/./UtilityTests/StringExtractorTest.GetHexBytesAvail_OddPair (1235 of 1779) PASS: lldb-unit :: Utility/./UtilityTests/OptionsWithRawTest.EmptySuffix (1236 of 1779) PASS: lldb-unit :: Language/Highlighting/./HighlighterTests/HighlighterTest.Keywords (1237 of 1779) PASS: lldb-unit :: Utility/./UtilityTests/ArgsTest.ReplaceArgumentAtIndexOutOfRange (1238 of 1779) PASS: lldb-api :: functionalities/data-formatter/data-formatter-python-synth/TestDataFormatterPythonSynth.py (1239 of 1779) PASS: lldb-api :: tools/lldb-server/TestGdbRemoteExpeditedRegisters.py (1240 of 1779) PASS: lldb-unit :: Utility/./UtilityTests/StringListTest.LongestCommonPrefixEmpty (1241 of 1779) PASS: lldb-api :: functionalities/tail_call_frames/ambiguous_tail_call_seq2/TestAmbiguousTailCallSeq2.py (1242 of 1779) PASS: lldb-api :: functionalities/data-formatter/data-formatter-objc/TestDataFormatterObjCNSDate.py (1243 of 1779) PASS: lldb-api :: lang/cpp/dynamic-value-same-basename/TestDynamicValueSameBase.py (1244 of 1779) PASS: lldb-unit :: Expression/./ExpressionTests/DiagnosticManagerTest.HasFixits (1245 of 1779) PASS: lldb-api :: commands/expression/persistent_types/TestNestedPersistentTypes.py (1246 of 1779) PASS: lldb-api :: commands/add-dsym/uuid/TestAddDsymCommand.py (1247 of 1779) PASS: lldb-unit :: Utility/./UtilityTests/VMRange.Ordering (1248 of 1779) PASS: lldb-api :: functionalities/postmortem/elf-core/thread_crash/TestLinuxCoreThreads.py (1249 of 1779) PASS: lldb-api :: python_api/watchpoint/TestSetWatchpoint.py (1250 of 1779) PASS: lldb-shell :: Reproducer/Modules/TestModuleCXX.test (1251 of 1779) PASS: lldb-api :: lang/cpp/inlines/TestInlines.py (1252 of 1779) PASS: lldb-unit :: Utility/./UtilityTests/BinaryStreamTest.PutSLEB128FourBytes (1253 of 1779) PASS: lldb-api :: commands/frame/diagnose/array/TestArray.py (1254 of 1779) PASS: lldb-unit :: ScriptInterpreter/Python/./ScriptInterpreterPythonTests/PythonDataObjectsTest.TestPythonBytes (1255 of 1779) PASS: lldb-api :: commands/expression/diagnostics/TestExprDiagnostics.py (1256 of 1779) PASS: lldb-api :: lang/cpp/operators/TestCppOperators.py (1257 of 1779) PASS: lldb-unit :: Utility/./UtilityTests/DataExtractorTest.GetCStrEmpty (1258 of 1779) PASS: lldb-api :: functionalities/modern-type-lookup/basic-objc/TestBasicObjcModernTypeLookup.py (1259 of 1779) PASS: lldb-unit :: Utility/./UtilityTests/UriParserTest.BadPort2 (1260 of 1779) PASS: lldb-api :: functionalities/thread/concurrent_events/TestConcurrentDelayWatchBreak.py (1261 of 1779) PASS: lldb-unit :: Process/minidump/./LLDBMinidumpTests/MinidumpParserTest.FindMemoryRangeWithFullMemoryMinidump (1262 of 1779) PASS: lldb-api :: functionalities/data-formatter/hexcaps/TestDataFormatterHexCaps.py (1263 of 1779) PASS: lldb-unit :: Host/./HostTests/MainLoopTest.UnmonitoredSignal (1264 of 1779) PASS: lldb-unit :: ScriptInterpreter/Python/./ScriptInterpreterPythonTests/PythonDataObjectsTest.TestPythonListManipulation (1265 of 1779) PASS: lldb-api :: functionalities/data-formatter/nssetsynth/TestNSSetSynthetic.py (1266 of 1779) PASS: lldb-unit :: Symbol/./SymbolTests/TestClangASTContext.TestRemoveFastQualifiers (1267 of 1779) PASS: lldb-api :: commands/log/invalid-args/TestInvalidArgsLog.py (1268 of 1779) PASS: lldb-unit :: UnwindAssembly/x86/./UnwindAssemblyx86Tests/Testx86AssemblyInspectionEngine.TestSimplei386ugmented (1269 of 1779) PASS: lldb-api :: lang/c/modules/TestCModules.py (1270 of 1779) PASS: lldb-unit :: ScriptInterpreter/Python/./ScriptInterpreterPythonTests/PythonDataObjectsTest.TestPythonTupleToStructuredList (1271 of 1779) PASS: lldb-unit :: Utility/./UtilityTests/BinaryStreamTest.PutULEB128OneByte (1272 of 1779) PASS: lldb-unit :: Process/minidump/./LLDBMinidumpTests/MinidumpParserTest.GetMemoryRegionInfoLinuxMaps (1273 of 1779) PASS: lldb-unit :: SymbolFile/NativePDB/./SymbolFileNativePDBTests/PDBFPOProgramToDWARFExpressionTests.UnresolvedRegisterAssignmentReference (1274 of 1779) PASS: lldb-unit :: Utility/./UtilityTests/LogTest.LLDB_LOG_nullptr (1275 of 1779) PASS: lldb-api :: commands/expression/completion-in-lambda-and-unnnamed-class/TestCompletionInLambdaAndUnnamedClass.py (1276 of 1779) PASS: lldb-unit :: Utility/./UtilityTests/ArchSpecTest.OperatorBool (1277 of 1779) PASS: lldb-shell :: SymbolFile/DWARF/find-method.cpp (1278 of 1779) PASS: lldb-api :: python_api/value/TestValueAPI.py (1279 of 1779) PASS: lldb-shell :: SymbolFile/NativePDB/globals-fundamental.cpp (1280 of 1779) PASS: lldb-shell :: ObjectFile/ELF/PT_LOAD-overlap-PT_TLS.yaml (1281 of 1779) PASS: lldb-unit :: Utility/./UtilityTests/VMRange.SetEndAddress (1282 of 1779) PASS: lldb-api :: functionalities/breakpoint/global_constructor/TestBreakpointInGlobalConstructor.py (1283 of 1779) PASS: lldb-unit :: Utility/./UtilityTests/StreamTeeTest.Write (1284 of 1779) PASS: lldb-api :: lang/objc/objc-ivar-protocols/TestIvarProtocols.py (1285 of 1779) PASS: lldb-unit :: SymbolFile/NativePDB/./SymbolFileNativePDBTests/PDBFPOProgramToDWARFExpressionTests.SingleAssignmentRegisterRef (1286 of 1779) PASS: lldb-shell :: Driver/TestCore.test (1287 of 1779) PASS: lldb-shell :: SymbolFile/DWARF/debug-names-compressed.cpp (1288 of 1779) PASS: lldb-unit :: Core/./LLDBCoreTests/UniqueCStringMap.NoDefaultConstructor (1289 of 1779) PASS: lldb-api :: functionalities/abbreviation/TestCommonShortSpellings.py (1290 of 1779) PASS: lldb-unit :: Utility/./UtilityTests/DataExtractorTest.GetCStrAtEnd (1291 of 1779) UNSUPPORTED: lldb-shell :: ExecControl/StopHook/stop-hook-threads.test (1292 of 1779) PASS: lldb-shell :: SymbolFile/DWARF/parallel-indexing-stress.s (1293 of 1779) PASS: lldb-unit :: Utility/./UtilityTests/BinaryStreamTest.PutSLEB128TwoBytes (1294 of 1779) PASS: lldb-unit :: Utility/./UtilityTests/StreamTest.PutHex32ByteOrderLittle (1295 of 1779) PASS: lldb-unit :: Utility/./UtilityTests/BinaryStreamTest.PutSLEB128OneByte (1296 of 1779) PASS: lldb-api :: lang/objc/radar-9691614/TestObjCMethodReturningBOOL.py (1297 of 1779) PASS: lldb-api :: functionalities/breakpoint/breakpoint_ids/TestBreakpointIDs.py (1298 of 1779) PASS: lldb-unit :: Process/gdb-remote/./ProcessGdbRemoteTests/GDBRemoteCommunicationClientTest.GetMemoryRegionInfoInvalidResponse (1299 of 1779) PASS: lldb-unit :: Expression/./ExpressionTests/CppModuleConfigurationTest.UnrelatedLibrary (1300 of 1779) PASS: lldb-unit :: Host/./HostTests/FileSystemTest.Resolve (1301 of 1779) PASS: lldb-unit :: Utility/./UtilityTests/LogChannelEnabledTest.log_options (1302 of 1779) PASS: lldb-api :: functionalities/non-overlapping-index-variable-i/TestIndexVariable.py (1303 of 1779) PASS: lldb-unit :: UnwindAssembly/x86/./UnwindAssemblyx86Tests/Testx86AssemblyInspectionEngine.TestPushESI (1304 of 1779) PASS: lldb-api :: functionalities/thread/concurrent_events/TestConcurrentNWatchNBreak.py (1305 of 1779) PASS: lldb-unit :: Utility/./UtilityTests/StreamTest.ShiftOperatorStrings (1306 of 1779) PASS: lldb-api :: lang/cpp/unicode-literals/TestUnicodeLiterals.py (1307 of 1779) UNSUPPORTED: lldb-shell :: Register/x86-64-gp-write.test (1308 of 1779) PASS: lldb-api :: lang/objc/objc-struct-return/TestObjCStructReturn.py (1309 of 1779) PASS: lldb-api :: commands/expression/scoped_enums/TestScopedEnumType.py (1310 of 1779) PASS: lldb-api :: types/TestIntegerTypesExpr.py (1311 of 1779) PASS: lldb-shell :: Commands/command-script-import.test (1312 of 1779) PASS: lldb-shell :: SymbolFile/DWARF/debug_loc.s (1313 of 1779) PASS: lldb-unit :: Host/./HostTests/NativeProcessProtocolTest.ReadCStringFromMemory_CrossPageBoundary (1314 of 1779) PASS: lldb-unit :: Utility/./UtilityTests/UriParserTest.Minimal (1315 of 1779) PASS: lldb-api :: functionalities/thread/exit_during_break/TestExitDuringBreak.py (1316 of 1779) UNSUPPORTED: lldb-shell :: SymbolFile/DWARF/debug-types-expressions.test (1317 of 1779) PASS: lldb-api :: lang/objc/objc-new-syntax/TestObjCNewSyntaxLiteral.py (1318 of 1779) PASS: lldb-api :: functionalities/thread/num_threads/TestNumThreads.py (1319 of 1779) PASS: lldb-api :: functionalities/thread/backtrace_limit/TestBacktraceLimit.py (1320 of 1779) PASS: lldb-unit :: Signals/./SignalsTests/UnixSignalsTest.Iteration (1321 of 1779) PASS: lldb-unit :: Utility/./UtilityTests/StringListTest.ShiftCString (1322 of 1779) PASS: lldb-api :: python_api/breakpoint/TestBreakpointAPI.py (1323 of 1779) PASS: lldb-api :: functionalities/data-formatter/data-formatter-stl/libcxx/vector/TestDataFormatterLibcxxVector.py (1324 of 1779) PASS: lldb-unit :: ScriptInterpreter/Python/./ScriptInterpreterPythonTests/PythonDataObjectsTest.TestDictionaryResolutionWithDot (1325 of 1779) PASS: lldb-unit :: Utility/./UtilityTests/BinaryStreamTest.PutSLEB128SixBytes (1326 of 1779) PASS: lldb-api :: python_api/interpreter/TestCommandInterpreterAPI.py (1327 of 1779) PASS: lldb-unit :: Process/gdb-remote/./ProcessGdbRemoteTests/GDBRemoteClientBaseTest.SendContinueAndAsyncSignal (1328 of 1779) PASS: lldb-api :: functionalities/breakpoint/breakpoint_command/TestBreakpointCommandsFromPython.py (1329 of 1779) PASS: lldb-unit :: Process/gdb-remote/./ProcessGdbRemoteTests/GDBRemoteCommunicationServerTest.SendErrorResponse_UnimplementedError (1330 of 1779) PASS: lldb-api :: commands/command/delete/TestCommandDelete.py (1331 of 1779) PASS: lldb-unit :: Utility/./UtilityTests/StringExtractorTest.GetNameColonValueNoColon (1332 of 1779) PASS: lldb-unit :: Signals/./SignalsTests/UnixSignalsTest.VersionChange (1333 of 1779) PASS: lldb-api :: tools/lldb-server/TestLldbGdbServer.py (1334 of 1779) PASS: lldb-unit :: Process/gdb-remote/./ProcessGdbRemoteTests/GDBRemoteCommunicationServerTest.SendErrorResponse_StringError (1335 of 1779) PASS: lldb-unit :: Utility/./UtilityTests/OptionsWithRawTest.SingleWhitespaceInput (1336 of 1779) PASS: lldb-shell :: SymbolFile/DWARF/compilercontext.ll (1337 of 1779) PASS: lldb-api :: functionalities/gdb_remote_client/TestGDBRemoteClient.py (1338 of 1779) PASS: lldb-unit :: Utility/./UtilityTests/ConstStringTest.MangledCounterpart (1339 of 1779) PASS: lldb-api :: lang/objc/ptr_refs/TestPtrRefsObjC.py (1340 of 1779) PASS: lldb-api :: functionalities/float-display/TestFloatDisplay.py (1341 of 1779) PASS: lldb-unit :: Utility/./UtilityTests/ScalarTest.Equality (1342 of 1779) PASS: lldb-api :: functionalities/thread/concurrent_events/TestConcurrentSignalWatchBreak.py (1343 of 1779) PASS: lldb-api :: functionalities/data-formatter/data-formatter-stl/libcxx/map/TestDataFormatterLibccMap.py (1344 of 1779) PASS: lldb-api :: lang/objc/forward-decl/TestForwardDecl.py (1345 of 1779) PASS: lldb-unit :: Interpreter/./InterpreterTests/CompletionTest.DirCompletionAbsolute (1346 of 1779) PASS: lldb-api :: commands/watchpoints/multiple_hits/TestMultipleHits.py (1347 of 1779) PASS: lldb-unit :: Utility/./UtilityTests/LogChannelEnabledTest.LLDB_LOG_ERROR (1348 of 1779) UNSUPPORTED: lldb-shell :: Unwind/unwind-plan-dwarf-dump.test (1349 of 1779) PASS: lldb-unit :: Utility/./UtilityTests/DataExtractorTest.GetMaxU64_unchecked (1350 of 1779) PASS: lldb-api :: python_api/thread/TestThreadAPI.py (1351 of 1779) PASS: lldb-api :: python_api/interpreter/TestRunCommandInterpreterAPI.py (1352 of 1779) PASS: lldb-shell :: Breakpoint/single-file-split-dwarf.test (1353 of 1779) PASS: lldb-api :: functionalities/breakpoint/address_breakpoints/TestAddressBreakpoints.py (1354 of 1779) PASS: lldb-api :: lang/objc/objc-builtin-types/TestObjCBuiltinTypes.py (1355 of 1779) PASS: lldb-unit :: Host/./HostTests/SocketTest.DomainGetConnectURI (1356 of 1779) PASS: lldb-shell :: ObjectFile/ELF/many-sections.s (1357 of 1779) PASS: lldb-shell :: Settings/TestFrameFormatNoColor.test (1358 of 1779) PASS: lldb-api :: commands/expression/ir-interpreter-phi-nodes/TestIRInterpreterPHINodes.py (1359 of 1779) PASS: lldb-api :: commands/expression/vector_of_enums/TestVectorOfEnums.py (1360 of 1779) PASS: lldb-unit :: Symbol/./SymbolTests/TestClangASTContext.TestBuiltinTypeForEncodingAndBitSize (1361 of 1779) PASS: lldb-unit :: Expression/./ExpressionTests/ClangHostTest.MacOSX (1362 of 1779) PASS: lldb-unit :: SymbolFile/DWARF/./SymbolFileDWARFTests/DWARFASTParserClangTests.EnsureAllDIEsInDeclContextHaveBeenParsedParsesOnlyMatchingEntries (1363 of 1779) PASS: lldb-api :: lang/objc/variadic_methods/TestVariadicMethods.py (1364 of 1779) PASS: lldb-shell :: ObjectFile/ELF/gnu-debuglink.yaml (1365 of 1779) PASS: lldb-unit :: Utility/./UtilityTests/ReproducerTest.SetCapture (1366 of 1779) PASS: lldb-shell :: SymbolFile/DWARF/childless-compile-unit.s (1367 of 1779) PASS: lldb-api :: tools/lldb-server/commandline/TestStubReverseConnect.py (1368 of 1779) PASS: lldb-api :: commands/expression/save_jit_objects/TestSaveJITObjects.py (1369 of 1779) PASS: lldb-shell :: Settings/TestDisableColor.test (1370 of 1779) PASS: lldb-unit :: Utility/./UtilityTests/RangeTest.ContainsEndInclusive (1371 of 1779) PASS: lldb-unit :: Utility/./UtilityTests/EnvironmentTest.EnvpConstruction (1372 of 1779) PASS: lldb-api :: functionalities/tail_call_frames/thread_step_out_message/TestArtificialFrameStepOutMessage.py (1373 of 1779) PASS: lldb-unit :: Utility/./UtilityTests/RecordReplayTest.InstrumentedBarRef (1374 of 1779) PASS: lldb-api :: lang/objc/objc-dyn-sbtype/TestObjCDynamicSBType.py (1375 of 1779) PASS: lldb-unit :: ScriptInterpreter/Python/./ScriptInterpreterPythonTests/PythonDataObjectsTest.TestPythonStringToStructuredString (1376 of 1779) PASS: lldb-api :: functionalities/tsan/global_location/TestTsanGlobalLocation.py (1377 of 1779) PASS: lldb-unit :: Utility/./UtilityTests/SerializationRountripTest.SerializeDeserializeObjectPointer (1378 of 1779) UNSUPPORTED: lldb-api :: functionalities/darwin_log/filter/regex/activity/TestDarwinLogFilterRegexActivity.py (1379 of 1779) PASS: lldb-api :: functionalities/data-formatter/vector-types/TestVectorTypesFormatting.py (1380 of 1779) PASS: lldb-unit :: Symbol/./SymbolTests/DWARFCallFrameInfoTest.Basic_eh (1381 of 1779) PASS: lldb-shell :: SymbolFile/Breakpad/line-table-mixed-path-styles.test (1382 of 1779) PASS: lldb-api :: functionalities/thread/concurrent_events/TestConcurrentDelayedCrashWithBreakpointWatchpoint.py (1383 of 1779) PASS: lldb-api :: commands/apropos/with-process/TestAproposWithProcess.py (1384 of 1779) PASS: lldb-api :: lang/cpp/trivial_abi/TestTrivialABI.py (1385 of 1779) PASS: lldb-unit :: Utility/./UtilityTests/NameMatchesTest.Ignore (1386 of 1779) PASS: lldb-unit :: Symbol/./SymbolTests/TestClangASTContext.TestRecordHasFields (1387 of 1779) PASS: lldb-api :: functionalities/data-formatter/synthupdate/TestSyntheticFilterRecompute.py (1388 of 1779) PASS: lldb-shell :: SymbolFile/DWARF/debug-types-signature-loop.s (1389 of 1779) PASS: lldb-api :: python_api/lldbutil/iter/TestLLDBIterator.py (1390 of 1779) PASS: lldb-unit :: Symbol/./SymbolTests/TestClangASTContext.TemplateArguments (1391 of 1779) PASS: lldb-api :: python_api/hello_world/TestHelloWorld.py (1392 of 1779) PASS: lldb-shell :: ObjectFile/ELF/section-types-edgecases.yaml (1393 of 1779) PASS: lldb-unit :: UnwindAssembly/x86/./UnwindAssemblyx86Tests/Testx86AssemblyInspectionEngine.TestPopR13 (1394 of 1779) PASS: lldb-api :: lang/cpp/chained-calls/TestCppChainedCalls.py (1395 of 1779) PASS: lldb-api :: lang/c/blocks/TestBlocks.py (1396 of 1779) PASS: lldb-unit :: Utility/./UtilityTests/StringListTest.GetSize (1397 of 1779) PASS: lldb-api :: lang/cpp/unsigned_types/TestUnsignedTypes.py (1398 of 1779) PASS: lldb-api :: macosx/indirect_symbol/TestIndirectSymbols.py (1399 of 1779) PASS: lldb-unit :: Utility/./UtilityTests/StringListTest.LongestCommonPrefixNoPrefix (1400 of 1779) PASS: lldb-api :: lang/objcxx/cxx-bridged-po/TestObjCXXBridgedPO.py (1401 of 1779) PASS: lldb-unit :: Utility/./UtilityTests/RecordReplayTest.InstrumentedFooSameThis (1402 of 1779) PASS: lldb-api :: macosx/duplicate-archive-members/TestDuplicateMembers.py (1403 of 1779) PASS: lldb-unit :: Process/minidump/./LLDBMinidumpTests/RegisterContextMinidump.ConvertMinidumpContext_x86_32 (1404 of 1779) PASS: lldb-api :: python_api/symbol-context/two-files/TestSymbolContextTwoFiles.py (1405 of 1779) PASS: lldb-shell :: Reproducer/Functionalities/TestStepping.test (1406 of 1779) PASS: lldb-api :: functionalities/abbreviation/TestAbbreviations.py (1407 of 1779) PASS: lldb-unit :: Interpreter/./InterpreterTests/OptionArgParserTest.toScriptLanguage (1408 of 1779) PASS: lldb-api :: functionalities/gdb_remote_client/TestWriteMemory.py (1409 of 1779) PASS: lldb-shell :: BuildScript/script-args.test (1410 of 1779) PASS: lldb-unit :: Expression/./ExpressionTests/DiagnosticManagerTest.GetStringMultiline (1411 of 1779) PASS: lldb-unit :: Utility/./UtilityTests/ArgsTest.ReplaceArgumentAtIndexLonger (1412 of 1779) UNSUPPORTED: lldb-api :: tools/lldb-vscode/attach/TestVSCode_attach.py (1413 of 1779) PASS: lldb-unit :: Utility/./UtilityTests/ArchSpecTest.TestParseMachCPUDashSubtypeTripleSimple (1414 of 1779) PASS: lldb-unit :: UnwindAssembly/x86/./UnwindAssemblyx86Tests/Testx86AssemblyInspectionEngine.TestPopEBP (1415 of 1779) UNSUPPORTED: lldb-shell :: Register/x86-64-ymm16-read.test (1416 of 1779) PASS: lldb-unit :: ScriptInterpreter/Python/./ScriptInterpreterPythonTests/PythonDataObjectsTest.TestModuleNameResolutionNoDot (1417 of 1779) PASS: lldb-api :: tools/lldb-server/inferior-crash/TestGdbRemoteAbort.py (1418 of 1779) PASS: lldb-api :: commands/process/launch/TestProcessLaunch.py (1419 of 1779) PASS: lldb-api :: lang/cpp/call-function/TestCallCPPFunction.py (1420 of 1779) PASS: lldb-api :: macosx/version_zero/TestGetVersionZeroVersion.py (1421 of 1779) PASS: lldb-unit :: UnwindAssembly/x86/./UnwindAssemblyx86Tests/Testx86AssemblyInspectionEngine.TestSpArithx86_64Augmented (1422 of 1779) PASS: lldb-api :: commands/expression/call-function/TestCallStdStringFunction.py (1423 of 1779) PASS: lldb-api :: functionalities/load_unload/TestLoadUnload.py (1424 of 1779) PASS: lldb-shell :: Breakpoint/debug_rnglistx_rlex.test (1425 of 1779) PASS: lldb-unit :: Process/minidump/./LLDBMinidumpTests/MinidumpParserTest.GetPid (1426 of 1779) PASS: lldb-api :: functionalities/data-formatter/data-formatter-stl/libcxx/initializerlist/TestInitializerList.py (1427 of 1779) PASS: lldb-api :: lang/c/strings/TestCStrings.py (1428 of 1779) PASS: lldb-api :: commands/expression/rdar44436068/Test128BitsInteger.py (1429 of 1779) PASS: lldb-api :: functionalities/thread/concurrent_events/TestConcurrentCrashWithBreak.py (1430 of 1779) PASS: lldb-api :: commands/expression/dont_allow_jit/TestAllowJIT.py (1431 of 1779) PASS: lldb-api :: lang/cpp/virtual/TestVirtual.py (1432 of 1779) PASS: lldb-api :: lang/cpp/breakpoint-commands/TestCPPBreakpointCommands.py (1433 of 1779) PASS: lldb-unit :: ObjectFile/Breakpad/./ObjectFileBreakpadTests/StackCFIRecord.parse (1434 of 1779) PASS: lldb-unit :: UnwindAssembly/x86/./UnwindAssemblyx86Tests/Testx86AssemblyInspectionEngine.TestPushECX (1435 of 1779) PASS: lldb-unit :: Symbol/./SymbolTests/TestClangASTContext.TestUnifyAccessSpecifiers (1436 of 1779) UNSUPPORTED: lldb-api :: tools/lldb-vscode/stackTrace/TestVSCode_stackTrace.py (1437 of 1779) UNSUPPORTED: lldb-api :: tools/lldb-vscode/variables/TestVSCode_variables.py (1438 of 1779) PASS: lldb-api :: lang/objc/objc-runtime-ivars/TestRuntimeIvars.py (1439 of 1779) PASS: lldb-unit :: Utility/./UtilityTests/RangeTest.LessThanInvalid (1440 of 1779) UNSUPPORTED: lldb-api :: arm/breakpoint-thumb-codesection/TestBreakpointThumbCodesection.py (1441 of 1779) PASS: lldb-shell :: SymbolFile/Breakpad/line-table.test (1442 of 1779) PASS: lldb-unit :: Utility/./UtilityTests/FileSpecTest.EqualDotsPosix (1443 of 1779) PASS: lldb-shell :: ObjectFile/ELF/PT_LOAD.yaml (1444 of 1779) PASS: lldb-unit :: Utility/./UtilityTests/UserIDResolver.GetUserName (1445 of 1779) PASS: lldb-api :: functionalities/signal/raise/TestRaise.py (1446 of 1779) PASS: lldb-api :: python_api/function_symbol/TestSymbolAPI.py (1447 of 1779) PASS: lldb-api :: functionalities/thread/concurrent_events/TestConcurrentTwoWatchpointsOneBreakpoint.py (1448 of 1779) PASS: lldb-api :: functionalities/data-formatter/data-formatter-skip-summary/TestDataFormatterSkipSummary.py (1449 of 1779) PASS: lldb-unit :: ObjectFile/Breakpad/./ObjectFileBreakpadTests/PublicRecord.parse (1450 of 1779) PASS: lldb-api :: functionalities/thread/thread_specific_break/TestThreadSpecificBreakpoint.py (1451 of 1779) PASS: lldb-api :: types/TestDoubleTypes.py (1452 of 1779) PASS: lldb-shell :: Commands/CommandScriptImmediateOutput/CommandScriptImmediateOutputConsole.test (1453 of 1779) PASS: lldb-unit :: Utility/./UtilityTests/RangeTest.SizeTypes (1454 of 1779) PASS: lldb-unit :: ObjectFile/Breakpad/./ObjectFileBreakpadTests/FuncRecord.parse (1455 of 1779) PASS: lldb-unit :: Process/gdb-remote/./ProcessGdbRemoteTests/GDBRemoteCommunicationClientTest.WriteRegister (1456 of 1779) PASS: lldb-api :: lang/cpp/unique-types/TestUniqueTypes.py (1457 of 1779) PASS: lldb-api :: commands/expression/import-std-module/forward_list-dbg-info-content/TestDbgInfoContentForwardList.py (1458 of 1779) PASS: lldb-unit :: Language/CPlusPlus/./LanguageCPlusPlusTests/CPlusPlusLanguage.ExtractContextAndIdentifier (1459 of 1779) PASS: lldb-unit :: Process/gdb-remote/./ProcessGdbRemoteTests/GDBRemoteClientBaseTest.SendContinueDelegateStructuredDataReceipt (1460 of 1779) PASS: lldb-unit :: Utility/./UtilityTests/OptionsWithRawTest.TerminatedQuote (1461 of 1779) PASS: lldb-unit :: Expression/./ExpressionTests/CppModuleConfigurationTest.IgnoreLibStdCpp (1462 of 1779) PASS: lldb-unit :: Utility/./UtilityTests/StringExtractorTest.GetHexBytes_Underflow (1463 of 1779) PASS: lldb-unit :: Utility/./UtilityTests/TimerTest.CategoryTimes2 (1464 of 1779) PASS: lldb-unit :: Utility/./UtilityTests/ScalarTest.Comparison (1465 of 1779) PASS: lldb-unit :: Host/./HostTests/File.GetWaitableHandleFileno (1466 of 1779) PASS: lldb-api :: lang/cpp/diamond/TestDiamond.py (1467 of 1779) UNSUPPORTED: lldb-api :: functionalities/data-formatter/data-formatter-stl/libstdcpp/map/TestDataFormatterStdMap.py (1468 of 1779) PASS: lldb-unit :: Utility/./UtilityTests/StringListTest.AppendStringMove (1469 of 1779) PASS: lldb-unit :: Utility/./UtilityTests/StringListTest.ShiftMove (1470 of 1779) PASS: lldb-unit :: Core/./LLDBCoreTests/RichManglingContextTest.SwitchProvider (1471 of 1779) PASS: lldb-shell :: Breakpoint/jitbp_elf.test (1472 of 1779) PASS: lldb-api :: lang/c/conflicting-symbol/TestConflictingSymbol.py (1473 of 1779) PASS: lldb-unit :: Utility/./UtilityTests/ArchSpecTest.MergeFrom (1474 of 1779) PASS: lldb-api :: commands/watchpoints/multiple_threads/TestWatchpointMultipleThreads.py (1475 of 1779) PASS: lldb-shell :: SymbolFile/DWARF/find-basic-function.cpp (1476 of 1779) UNSUPPORTED: lldb-api :: api/multiple-debuggers/TestMultipleDebuggers.py (1477 of 1779) PASS: lldb-unit :: Utility/./UtilityTests/RangeDataVector.FindEntryThatContains (1478 of 1779) PASS: lldb-shell :: SymbolFile/NativePDB/ast-types.cpp (1479 of 1779) PASS: lldb-shell :: Watchpoint/SetErrorCases.test (1480 of 1779) PASS: lldb-unit :: Utility/./UtilityTests/ArgsTest.EscapeLLDBCommandArgument (1481 of 1779) PASS: lldb-unit :: Utility/./UtilityTests/RangeTest.LessThan (1482 of 1779) PASS: lldb-api :: commands/command/nested_alias/TestNestedAlias.py (1483 of 1779) PASS: lldb-unit :: UnwindAssembly/x86/./UnwindAssemblyx86Tests/Testx86AssemblyInspectionEngine.TestPopRBPWithREX (1484 of 1779) PASS: lldb-unit :: Utility/./UtilityTests/LogChannelTest.Enable (1485 of 1779) PASS: lldb-shell :: ObjectFile/Breakpad/uuid-matching-mac.test (1486 of 1779) PASS: lldb-unit :: Utility/./UtilityTests/FileSpecTest.GuessPathStyle (1487 of 1779) PASS: lldb-api :: commands/settings/TestSettings.py (1488 of 1779) PASS: lldb-api :: commands/command/script/import/rdar-12586188/TestRdar12586188.py (1489 of 1779) PASS: lldb-shell :: Commands/command-source.test (1490 of 1779) PASS: lldb-unit :: Utility/./UtilityTests/StreamTeeTest.AppendStream (1491 of 1779) PASS: lldb-unit :: UnwindAssembly/x86/./UnwindAssemblyx86Tests/Testx86AssemblyInspectionEngine.Testi386IgnoredRegisters (1492 of 1779) PASS: lldb-api :: functionalities/data-formatter/data-formatter-ptr-to-array/TestPtrToArrayFormatting.py (1493 of 1779) PASS: lldb-api :: commands/frame/diagnose/dereference-argument/TestDiagnoseDereferenceArgument.py (1494 of 1779) PASS: lldb-shell :: ObjectFile/ELF/minidebuginfo-corrupt-xz.yaml (1495 of 1779) PASS: lldb-api :: commands/command/source/TestCommandSource.py (1496 of 1779) PASS: lldb-unit :: Utility/./UtilityTests/LogChannelEnabledTest.LogThread (1497 of 1779) UNSUPPORTED: lldb-shell :: SymbolFile/PDB/calling-conventions.test (1498 of 1779) PASS: lldb-unit :: Utility/./UtilityTests/OptionsWithRawTest.SingleWordSuffix (1499 of 1779) PASS: lldb-api :: lang/cpp/signed_types/TestSignedTypes.py (1500 of 1779) PASS: lldb-api :: lang/cpp/extern_c/TestExternCSymbols.py (1501 of 1779) PASS: lldb-unit :: Utility/./UtilityTests/StreamTeeTest.SetStreamAtIndexOverwrite (1502 of 1779) PASS: lldb-api :: functionalities/tail_call_frames/disambiguate_paths_to_common_sink/TestDisambiguatePathsToCommonSink.py (1503 of 1779) PASS: lldb-unit :: UnwindAssembly/x86/./UnwindAssemblyx86Tests/Testx86AssemblyInspectionEngine.TestSubESP (1504 of 1779) PASS: lldb-api :: lang/objc/objc-optimized/TestObjcOptimized.py (1505 of 1779) PASS: lldb-api :: python_api/objc_type/TestObjCType.py (1506 of 1779) PASS: lldb-api :: source-manager/TestSourceManager.py (1507 of 1779) UNSUPPORTED: lldb-shell :: Register/x86-64-xmm16-write.test (1508 of 1779) PASS: lldb-api :: commands/expression/import-std-module/weak_ptr-dbg-info-content/TestDbgInfoContentWeakPtr.py (1509 of 1779) PASS: lldb-api :: lang/objc/foundation/TestObjCMethodsString.py (1510 of 1779) PASS: lldb-api :: python_api/value/linked_list/TestValueAPILinkedList.py (1511 of 1779) PASS: lldb-api :: python_api/watchpoint/condition/TestWatchpointConditionAPI.py (1512 of 1779) PASS: lldb-unit :: ScriptInterpreter/Python/./ScriptInterpreterPythonTests/PythonDataObjectsTest.TestResetting (1513 of 1779) PASS: lldb-unit :: Utility/./UtilityTests/FileSpecTest.RemoveLastPathComponent (1514 of 1779) PASS: lldb-api :: functionalities/thread/jump/TestThreadJump.py (1515 of 1779) PASS: lldb-api :: functionalities/data-formatter/data-formatter-stl/libcxx/set/TestDataFormatterLibcxxSet.py (1516 of 1779) PASS: lldb-api :: functionalities/breakpoint/cpp/TestCPPBreakpointLocations.py (1517 of 1779) PASS: lldb-unit :: ScriptInterpreter/Python/./ScriptInterpreterPythonTests/PythonDataObjectsTest.TestExtractingUInt64ThroughStructuredData (1518 of 1779) PASS: lldb-unit :: Process/gdb-remote/./ProcessGdbRemoteTests/GDBRemoteCommunicationClientTest.SendGetTraceConfigPacket (1519 of 1779) PASS: lldb-api :: lang/cpp/char1632_t/TestChar1632T.py (1520 of 1779) PASS: lldb-api :: functionalities/memory/find/TestMemoryFind.py (1521 of 1779) PASS: lldb-unit :: UnwindAssembly/x86/./UnwindAssemblyx86Tests/Testx86AssemblyInspectionEngine.TestDisassemblyMidFunctionEpilogues (1522 of 1779) PASS: lldb-shell :: SymbolFile/NativePDB/global-classes.cpp (1523 of 1779) UNSUPPORTED: lldb-api :: lang/objc/bitfield_ivars/TestBitfieldIvars.py (1524 of 1779) PASS: lldb-api :: commands/watchpoints/hello_watchpoint/TestMyFirstWatchpoint.py (1525 of 1779) PASS: lldb-api :: functionalities/modern-type-lookup/objc-modules/TestObjModulesModernTypeLookup.py (1526 of 1779) PASS: lldb-unit :: Utility/./UtilityTests/CompletionRequest.FakeLastArg (1527 of 1779) PASS: lldb-unit :: Utility/./UtilityTests/StreamTest.PutRawBytesToMixedEndian (1528 of 1779) PASS: lldb-shell :: SymbolFile/sizeless-symbol.test (1529 of 1779) PASS: lldb-api :: functionalities/breakpoint/scripted_bkpt/TestScriptedResolver.py (1530 of 1779) PASS: lldb-unit :: Utility/./UtilityTests/StringExtractorTest.GetHexBytesAvail_FullString (1531 of 1779) PASS: lldb-unit :: Utility/./UtilityTests/StringListTest.RemoveBlankLines (1532 of 1779) PASS: lldb-unit :: Utility/./UtilityTests/RegularExpression.Valid (1533 of 1779) PASS: lldb-unit :: Utility/./UtilityTests/VASprintfTest.EncodingError (1534 of 1779) PASS: lldb-api :: lang/objc/modules-inline-functions/TestModulesInlineFunctions.py (1535 of 1779) PASS: lldb-unit :: UnwindAssembly/x86/./UnwindAssemblyx86Tests/Testx86AssemblyInspectionEngine.TestPopEDI (1536 of 1779) PASS: lldb-api :: lang/objc/objc-ivar-offsets/TestObjCIvarOffsets.py (1537 of 1779) PASS: lldb-shell :: BuildScript/toolchain-clang.test (1538 of 1779) PASS: lldb-api :: functionalities/data-formatter/user-format-vs-summary/TestUserFormatVsSummary.py (1539 of 1779) PASS: lldb-unit :: Utility/./UtilityTests/RangeTest.ContainsAddrInvalid (1540 of 1779) PASS: lldb-api :: functionalities/thread/thread_exit/TestThreadExit.py (1541 of 1779) PASS: lldb-unit :: ScriptInterpreter/Python/./ScriptInterpreterPythonTests/PythonExceptionStateTest.TestAutoRestoreChanged (1542 of 1779) PASS: lldb-api :: functionalities/ptr_refs/TestPtrRefs.py (1543 of 1779) UNSUPPORTED: lldb-api :: commands/expression/macros/TestMacros.py (1544 of 1779) UNSUPPORTED: lldb-api :: functionalities/data-formatter/data-formatter-stl/libstdcpp/iterator/TestDataFormatterStdIterator.py (1545 of 1779) PASS: lldb-api :: functionalities/breakpoint/consecutive_breakpoints/TestConsecutiveBreakpoints.py (1546 of 1779) PASS: lldb-api :: api/check_public_api_headers/TestPublicAPIHeaders.py (1547 of 1779) PASS: lldb-unit :: Utility/./UtilityTests/Flags.Reset (1548 of 1779) PASS: lldb-unit :: Interpreter/./InterpreterTests/CompletionTest.DirCompletionUsername (1549 of 1779) PASS: lldb-unit :: Utility/./UtilityTests/ScalarTest.GetValue (1550 of 1779) PASS: lldb-shell :: SymbolFile/NativePDB/disassembly.cpp (1551 of 1779) PASS: lldb-api :: functionalities/thread/backtrace_all/TestBacktraceAll.py (1552 of 1779) PASS: lldb-unit :: Utility/./UtilityTests/BinaryStreamTest.PutSLEB128FiveBytes (1553 of 1779) PASS: lldb-unit :: ObjectFile/ELF/./ObjectFileELFTests/ObjectFileELFTest.GetModuleSpecifications_EarlySectionHeaders (1554 of 1779) PASS: lldb-unit :: UnwindAssembly/x86/./UnwindAssemblyx86Tests/Testx86AssemblyInspectionEngine.TestSpillRegToStackViaMOVi386 (1555 of 1779) UNSUPPORTED: lldb-api :: benchmarks/expression/TestRepeatedExprs.py (1556 of 1779) PASS: lldb-unit :: Host/./HostTests/TaskPoolTest.RunTasks (1557 of 1779) PASS: lldb-unit :: SymbolFile/NativePDB/./SymbolFileNativePDBTests/PDBFPOProgramToDWARFExpressionTests.UnresolvedCyclicRegisterAssignmentReference (1558 of 1779) PASS: lldb-shell :: SymbolFile/DWARF/debug-types-dwo-cross-reference.cpp (1559 of 1779) PASS: lldb-unit :: Utility/./UtilityTests/ArgsTest.TestQuotedTrailingBackslash (1560 of 1779) PASS: lldb-api :: functionalities/breakpoint/breakpoint_command/TestRegexpBreakCommand.py (1561 of 1779) PASS: lldb-api :: lang/cpp/dynamic-value/TestDynamicValue.py (1562 of 1779) PASS: lldb-unit :: Process/minidump/./LLDBMinidumpTests/MinidumpParserTest.GetMemoryRegionInfoFromMemory64List (1563 of 1779) PASS: lldb-api :: functionalities/thread/create_after_attach/TestCreateAfterAttach.py (1564 of 1779) PASS: lldb-unit :: Utility/./UtilityTests/ListenerTest.GetEventWait (1565 of 1779) PASS: lldb-unit :: Utility/./UtilityTests/StatusTest.Formatv (1566 of 1779) PASS: lldb-api :: python_api/sblaunchinfo/TestSBLaunchInfo.py (1567 of 1779) PASS: lldb-api :: tools/lldb-server/inferior-crash/TestGdbRemoteSegFault.py (1568 of 1779) PASS: lldb-unit :: SymbolFile/NativePDB/./SymbolFileNativePDBTests/PDBFPOProgramToDWARFExpressionTests.InvalidAssignmentMultiple (1569 of 1779) PASS: lldb-shell :: SymbolFile/Breakpad/symtab.test (1570 of 1779) PASS: lldb-unit :: Symbol/./SymbolTests/DWARFCallFrameInfoTest.Basic_dwarf3 (1571 of 1779) PASS: lldb-shell :: SymbolFile/DWARF/find-variable-file.cpp (1572 of 1779) PASS: lldb-unit :: debugserver/./debugserverTests/RNBSocket.LoopBackListenIPv4 (1573 of 1779) PASS: lldb-unit :: Utility/./UtilityTests/StringLexerTest.NextIfList (1574 of 1779) PASS: lldb-shell :: Driver/TestProcessAttach.test (1575 of 1779) PASS: lldb-unit :: Utility/./UtilityTests/RecordReplayTest.InstrumentedFoo (1576 of 1779) PASS: lldb-api :: functionalities/data-formatter/ostypeformatting/TestFormattersOsType.py (1577 of 1779) PASS: lldb-shell :: ObjectFile/ELF/PT_LOAD-empty.yaml (1578 of 1779) PASS: lldb-shell :: SymbolFile/DWARF/find-basic-type.cpp (1579 of 1779) PASS: lldb-unit :: Utility/./UtilityTests/StreamTeeTest.SetStreamAtIndexOutOfBounds (1580 of 1779) PASS: lldb-api :: functionalities/data-formatter/data-formatter-objc/TestDataFormatterObjCNSData.py (1581 of 1779) PASS: lldb-unit :: Utility/./UtilityTests/StreamTeeTest.GetStreamAtIndexOutOfBoundsEmpty (1582 of 1779) PASS: lldb-unit :: Host/./HostTests/FileSystemTest.GetByteSize (1583 of 1779) PASS: lldb-unit :: Symbol/./SymbolTests/PostfixExpression.ParseOneExpression (1584 of 1779) PASS: lldb-api :: types/TestDoubleTypesExpr.py (1585 of 1779) PASS: lldb-unit :: Utility/./UtilityTests/UriParserTest.BracketedHostname (1586 of 1779) PASS: lldb-api :: lang/cpp/overloaded-functions/TestOverloadedFunctions.py (1587 of 1779) PASS: lldb-unit :: Utility/./UtilityTests/FileSpecTest.EqualDotsWindows (1588 of 1779) PASS: lldb-api :: functionalities/breakpoint/move_nearest/TestMoveNearest.py (1589 of 1779) PASS: lldb-unit :: Utility/./UtilityTests/ArgsTest.TestArgv (1590 of 1779) PASS: lldb-api :: lang/cpp/nested-class-other-compilation-unit/TestNestedClassWithParentInAnotherCU.py (1591 of 1779) PASS: lldb-unit :: Utility/./UtilityTests/StringExtractorTest.GetHexBytes (1592 of 1779) PASS: lldb-unit :: UnwindAssembly/x86/./UnwindAssemblyx86Tests/Testx86AssemblyInspectionEngine.TestPopESI (1593 of 1779) UNSUPPORTED: lldb-api :: benchmarks/stepping/TestSteppingSpeed.py (1594 of 1779) PASS: lldb-unit :: UnwindAssembly/x86/./UnwindAssemblyx86Tests/Testx86AssemblyInspectionEngine.Test64bitFramelessBigStackFrame (1595 of 1779) PASS: lldb-api :: functionalities/data-formatter/data-formatter-proper-plurals/TestFormattersOneIsSingular.py (1596 of 1779) PASS: lldb-api :: lang/objc/blocks/TestObjCIvarsInBlocks.py (1597 of 1779) PASS: lldb-shell :: SymbolFile/Breakpad/line-table-discontinuous-file-ids.test (1598 of 1779) UNSUPPORTED: lldb-api :: functionalities/thread/break_after_join/TestBreakAfterJoin.py (1599 of 1779) PASS: lldb-shell :: ObjectFile/ELF/build-id-case.yaml (1600 of 1779) PASS: lldb-unit :: Platform/./LLDBPlatformTests/PlatformDarwinTest.TestParseVersionBuildDir (1601 of 1779) PASS: lldb-unit :: Utility/./UtilityTests/StringListTest.Clear (1602 of 1779) PASS: lldb-shell :: Register/x86-64-ymm-read.test (1603 of 1779) PASS: lldb-api :: lang/cpp/gmodules/TestWithModuleDebugging.py (1604 of 1779) PASS: lldb-api :: commands/frame/diagnose/bad-reference/TestBadReference.py (1605 of 1779) PASS: lldb-unit :: Utility/./UtilityTests/RangeTest.EqualInvalid (1606 of 1779) PASS: lldb-unit :: Utility/./UtilityTests/RangeTest.ClearWithStarAddress (1607 of 1779) PASS: lldb-shell :: Commands/command-backtrace.test (1608 of 1779) PASS: lldb-api :: tools/lldb-server/TestGdbRemoteHostInfo.py (1609 of 1779) PASS: lldb-api :: functionalities/data-formatter/data-formatter-disabling/TestDataFormatterDisabling.py (1610 of 1779) PASS: lldb-unit :: Utility/./UtilityTests/BinaryStreamTest.PutULEB128Zero (1611 of 1779) PASS: lldb-unit :: Target/./TargetTests/ExecutionContextTest.GetByteOrderProcess (1612 of 1779) PASS: lldb-unit :: Process/gdb-remote/./ProcessGdbRemoteTests/GDBRemoteClientBaseTest.InterruptNoResponse (1613 of 1779) UNSUPPORTED: lldb-shell :: Unwind/eh-frame-small-fde.test (1614 of 1779) PASS: lldb-api :: functionalities/breakpoint/cpp_exception/TestCPPExceptionBreakpoint.py (1615 of 1779) PASS: lldb-api :: functionalities/inferior-assert/TestInferiorAssert.py (1616 of 1779) PASS: lldb-unit :: Utility/./UtilityTests/StringListTest.InsertStringAtIndexMove (1617 of 1779) PASS: lldb-unit :: Utility/./UtilityTests/BinaryStreamTest.PutSLEB128ThreeBytes (1618 of 1779) PASS: lldb-unit :: Utility/./UtilityTests/UriParserTest.PortOverflow (1619 of 1779) PASS: lldb-api :: functionalities/thread/exit_during_step/TestExitDuringStep.py (1620 of 1779) PASS: lldb-unit :: Utility/./UtilityTests/StreamTest.PutStringAsRawHex8 (1621 of 1779) PASS: lldb-api :: lang/cpp/namespace_conflicts/TestNamespaceConflicts.py (1622 of 1779) PASS: lldb-unit :: Utility/./UtilityTests/StringListTest.PopBack (1623 of 1779) UNSUPPORTED: lldb-shell :: Register/x86-64-xmm16-read.test (1624 of 1779) PASS: lldb-unit :: Utility/./UtilityTests/StringListTest.JoinMultiCharSeparator (1625 of 1779) PASS: lldb-unit :: ScriptInterpreter/Python/./ScriptInterpreterPythonTests/PythonDataObjectsTest.TestGlobalNameResolutionWithDot (1626 of 1779) PASS: lldb-api :: python_api/frame/TestFrames.py (1627 of 1779) PASS: lldb-unit :: Process/minidump/./LLDBMinidumpTests/MinidumpParserTest.GetThreadContext_x86_32 (1628 of 1779) PASS: lldb-api :: lang/objc/ivar-IMP/TestObjCiVarIMP.py (1629 of 1779) PASS: lldb-unit :: Utility/./UtilityTests/VMRange.Clear (1630 of 1779) PASS: lldb-api :: sample_test/TestSampleTest.py (1631 of 1779) PASS: lldb-shell :: SymbolFile/DWARF/debug_ranges-missing-section.s (1632 of 1779) PASS: lldb-api :: lang/objc/objc-property/TestObjCProperty.py (1633 of 1779) PASS: lldb-unit :: Utility/./UtilityTests/StringExtractorTest.GetNameColonValueNoSemicolon (1634 of 1779) PASS: lldb-shell :: Minidump/Windows/find-module.test (1635 of 1779) PASS: lldb-unit :: ScriptInterpreter/Python/./ScriptInterpreterPythonTests/PythonDataObjectsTest.TestPythonIntegerToStr (1636 of 1779) PASS: lldb-unit :: ScriptInterpreter/Python/./ScriptInterpreterPythonTests/PythonDataObjectsTest.TestPythonCallableCheck (1637 of 1779) PASS: lldb-shell :: SymbolFile/Breakpad/line-table-edgecases.test (1638 of 1779) PASS: lldb-api :: functionalities/data-formatter/data-formatter-objc/TestDataFormatterObjCNSURL.py (1639 of 1779) PASS: lldb-unit :: Utility/./UtilityTests/StringLexerTest.Next (1640 of 1779) PASS: lldb-api :: functionalities/asan/TestMemoryHistory.py (1641 of 1779) PASS: lldb-unit :: UnwindAssembly/x86/./UnwindAssemblyx86Tests/Testx86AssemblyInspectionEngine.TestStackRealignMSVC_i386 (1642 of 1779) PASS: lldb-shell :: Minidump/dump-all.test (1643 of 1779) PASS: lldb-api :: functionalities/data-formatter/data-formatter-objc/TestDataFormatterObjCNSError.py (1644 of 1779) UNSUPPORTED: lldb-shell :: Register/x86-64-zmm-write.test (1645 of 1779) PASS: lldb-api :: functionalities/history/TestHistoryRecall.py (1646 of 1779) PASS: lldb-unit :: ScriptInterpreter/Python/./ScriptInterpreterPythonTests/PythonDataObjectsTest.TestPythonDictionaryToStructuredDictionary (1647 of 1779) PASS: lldb-unit :: Host/./HostTests/SocketTest.DecodeHostAndPort (1648 of 1779) PASS: lldb-unit :: Process/gdb-remote/./ProcessGdbRemoteTests/GDBRemoteClientBaseTest.SendContinueAndInterrupt (1649 of 1779) PASS: lldb-unit :: Utility/./UtilityTests/StreamTest.PutBytesAsRawHex8ToLittleEndian (1650 of 1779) PASS: lldb-api :: commands/watchpoints/watchpoint_size/TestWatchpointSizes.py (1651 of 1779) PASS: lldb-unit :: Symbol/./SymbolTests/SymbolsTest.TerminateLocateExecutableSymbolFileForUnknownExecutableAndUnknownSymbolFile (1652 of 1779) PASS: lldb-api :: lang/cpp/global_operators/TestCppGlobalOperators.py (1653 of 1779) XFAIL: lldb-shell :: Unwind/prefer-debug-over-eh-frame.test (1654 of 1779) PASS: lldb-api :: functionalities/data-formatter/data-formatter-stl/libcxx/vbool/TestDataFormatterLibcxxVBool.py (1655 of 1779) UNSUPPORTED: lldb-api :: functionalities/tty/TestTerminal.py (1656 of 1779) PASS: lldb-unit :: Utility/./UtilityTests/NameMatchesTest.RegularExpression (1657 of 1779) PASS: lldb-unit :: Utility/./UtilityTests/VASprintfTest.BufferResize (1658 of 1779) PASS: lldb-shell :: SymbolFile/DWARF/find-basic-variable.cpp (1659 of 1779) PASS: lldb-api :: commands/reproducer/invalid-args/TestInvalidArgsReproducer.py (1660 of 1779) PASS: lldb-api :: commands/expression/issue_11588/Test11588.py (1661 of 1779) PASS: lldb-shell :: ObjectFile/ELF/section-permissions.yaml (1662 of 1779) PASS: lldb-shell :: SymbolFile/NativePDB/bitfields.cpp (1663 of 1779) PASS: lldb-unit :: Host/./HostTests/FileSystemTest.OpenErrno (1664 of 1779) UNSUPPORTED: lldb-shell :: SymbolFile/PDB/compilands.test (1665 of 1779) PASS: lldb-unit :: Utility/./UtilityTests/RangeTest.ContainsRange (1666 of 1779) PASS: lldb-unit :: Utility/./UtilityTests/RangeTest.NotEqualInvalid (1667 of 1779) UNSUPPORTED: lldb-api :: commands/expression/completion-crash2/TestCompletionCrash2.py (1668 of 1779) PASS: lldb-unit :: Host/./HostTests/Host.GetEnvironment (1669 of 1779) PASS: lldb-unit :: Utility/./UtilityTests/StringExtractorTest.GetHexU8_Extra (1670 of 1779) PASS: lldb-unit :: Host/./HostTests/FileSystemTest.GetPermissions (1671 of 1779) PASS: lldb-api :: commands/expression/import_builtin_fileid/TestImportBuiltinFileID.py (1672 of 1779) PASS: lldb-api :: functionalities/stats_api/TestStatisticsAPI.py (1673 of 1779) PASS: lldb-api :: functionalities/memory/cache/TestMemoryCache.py (1674 of 1779) PASS: lldb-api :: functionalities/data-formatter/compactvectors/TestCompactVectors.py (1675 of 1779) UNSUPPORTED: lldb-shell :: SymbolFile/PDB/type-quals.test (1676 of 1779) PASS: lldb-unit :: Utility/./UtilityTests/StringListTest.SetSize (1677 of 1779) PASS: lldb-api :: functionalities/breakpoint/breakpoint_names/TestBreakpointNames.py (1678 of 1779) PASS: lldb-unit :: Process/gdb-remote/./ProcessGdbRemoteTests/GDBRemoteCommunicationClientTest.TestPacketSpeedJSON (1679 of 1779) PASS: lldb-unit :: Utility/./UtilityTests/RangeTest.ContainsEndInclusiveInvalid (1680 of 1779) PASS: lldb-unit :: Utility/./UtilityTests/Flags.AnySet (1681 of 1779) PASS: lldb-api :: commands/expression/import-std-module/vector-of-vectors/TestVectorOfVectors.py (1682 of 1779) PASS: lldb-unit :: Process/gdb-remote/./ProcessGdbRemoteTests/GDBRemoteCommunicationServerTest.SendErrorResponse_ErrorNumber (1683 of 1779) PASS: lldb-unit :: ScriptInterpreter/Python/./ScriptInterpreterPythonTests/PythonDataObjectsTest.TestTypeNameResolutionNoDot (1684 of 1779) UNSUPPORTED: lldb-api :: benchmarks/startup/TestStartupDelays.py (1685 of 1779) PASS: lldb-unit :: Utility/./UtilityTests/BroadcasterTest.BroadcastEvent (1686 of 1779) UNSUPPORTED: lldb-shell :: SymbolFile/PDB/expressions.test (1687 of 1779) PASS: lldb-unit :: Utility/./UtilityTests/AnsiTerminal.WhiteSpace (1688 of 1779) PASS: lldb-shell :: ObjectFile/PECOFF/basic-info-arm.yaml (1689 of 1779) PASS: lldb-api :: commands/expression/rdar42038760/TestScalarURem.py (1690 of 1779) PASS: lldb-unit :: Utility/./UtilityTests/AnsiTerminal.Unknown (1691 of 1779) PASS: lldb-unit :: Utility/./UtilityTests/StreamTest.PutCStringWithStringRef (1692 of 1779) PASS: lldb-api :: python_api/symbol-context/TestSymbolContext.py (1693 of 1779) UNSUPPORTED: lldb-shell :: Register/x86-64-zmm-read.test (1694 of 1779) PASS: lldb-api :: lang/objc/modules-cache/TestClangModulesCache.py (1695 of 1779) PASS: lldb-unit :: Utility/./UtilityTests/StringExtractorTest.GetNameColonValueSuccess (1696 of 1779) PASS: lldb-api :: functionalities/return-value/TestReturnValue.py (1697 of 1779) PASS: lldb-unit :: Utility/./UtilityTests/Flags.AllClear (1698 of 1779) PASS: lldb-api :: lang/c/tls_globals/TestTlsGlobals.py (1699 of 1779) PASS: lldb-api :: functionalities/target_var/TestTargetVar.py (1700 of 1779) UNSUPPORTED: lldb-api :: commands/watchpoints/variable_out_of_scope/TestWatchedVarHitWhenInScope.py (1701 of 1779) PASS: lldb-shell :: ObjectFile/ELF/section-overlap.yaml (1702 of 1779) PASS: lldb-api :: functionalities/asan/TestReportData.py (1703 of 1779) PASS: lldb-unit :: Core/./LLDBCoreTests/RichManglingContextTest.IPDRealloc (1704 of 1779) PASS: lldb-unit :: Utility/./UtilityTests/UriParserTest.SchemeHostSeparator (1705 of 1779) PASS: lldb-api :: python_api/exprpath_synthetic/TestExprPathSynthetic.py (1706 of 1779) PASS: lldb-api :: lang/objc/objc-super/TestObjCSuper.py (1707 of 1779) PASS: lldb-unit :: Process/gdb-remote/./ProcessGdbRemoteTests/GDBRemoteCommunicationTest.ReadPacket_checksum (1708 of 1779) PASS: lldb-api :: lang/objc/global_ptrs/TestGlobalObjects.py (1709 of 1779) PASS: lldb-api :: functionalities/data-formatter/stringprinter/TestStringPrinter.py (1710 of 1779) PASS: lldb-unit :: Utility/./UtilityTests/BinaryStreamTest.PutSLEB128One (1711 of 1779) PASS: lldb-unit :: Utility/./UtilityTests/BinaryStreamTest.PutULEB128NineBytes (1712 of 1779) PASS: lldb-api :: lang/objc/foundation/TestFoundationDisassembly.py (1713 of 1779) PASS: lldb-unit :: UnwindAssembly/x86/./UnwindAssemblyx86Tests/Testx86AssemblyInspectionEngine.Test32bitFramelessBigStackFrame (1714 of 1779) PASS: lldb-unit :: Utility/./UtilityTests/AnsiTerminal.Basic (1715 of 1779) PASS: lldb-unit :: Core/./LLDBCoreTests/MangledTest.ResultForValidName (1716 of 1779) PASS: lldb-api :: lang/cpp/wchar_t/TestCxxWCharT.py (1717 of 1779) UNSUPPORTED: lldb-shell :: SymbolFile/PDB/typedefs.test (1718 of 1779) PASS: lldb-unit :: Utility/./UtilityTests/BinaryStreamTest.PutULEB128FourBytes (1719 of 1779) PASS: lldb-unit :: Process/gdb-remote/./ProcessGdbRemoteTests/GDBRemoteCommunicationClientTest.GetModulesInfo (1720 of 1779) PASS: lldb-unit :: Process/minidump/./LLDBMinidumpTests/RegisterContextMinidump.ConvertMinidumpContext_x86_64 (1721 of 1779) PASS: lldb-unit :: Host/./HostTests/FileSystemTest.Exists (1722 of 1779) UNSUPPORTED: lldb-api :: commands/register/register/intel_xtended_registers/mpx_bound_violation/TestBoundViolation.py (1723 of 1779) PASS: lldb-api :: macosx/order/TestOrderFile.py (1724 of 1779) PASS: lldb-api :: commands/target/stop-hooks/TestStopHooks.py (1725 of 1779) PASS: lldb-shell :: Settings/TestSettingsSet.test (1726 of 1779) UNSUPPORTED: lldb-api :: functionalities/exec/TestExec.py (1727 of 1779) PASS: lldb-unit :: Utility/./UtilityTests/StringLexerTest.NextIf (1728 of 1779) PASS: lldb-unit :: Utility/./UtilityTests/StringLexerTest.HasAtLeast (1729 of 1779) PASS: lldb-api :: functionalities/data-formatter/setvaluefromcstring/TestSetValueFromCString.py (1730 of 1779) PASS: lldb-unit :: Host/./HostTests/NativeProcessProtocolTest.SetBreakpointFailWrite (1731 of 1779) PASS: lldb-unit :: Utility/./UtilityTests/StringExtractorTest.GetHexBytesAvail_Partial (1732 of 1779) PASS: lldb-api :: commands/expression/dollar-in-variable/TestDollarInVariable.py (1733 of 1779) PASS: lldb-api :: functionalities/mtc/simple/TestMTCSimple.py (1734 of 1779) PASS: lldb-api :: lang/objc/objc-class-method/TestObjCClassMethod.py (1735 of 1779) PASS: lldb-unit :: Utility/./UtilityTests/RangeDataVector.FindEntryThatContains_Overlap (1736 of 1779) PASS: lldb-api :: tools/lldb-server/register-reading/TestGdbRemoteGPacket.py (1737 of 1779) PASS: lldb-unit :: Host/./HostTests/FileActionTest.Open (1738 of 1779) PASS: lldb-shell :: Reproducer/Functionalities/TestImageList.test (1739 of 1779) PASS: lldb-unit :: Utility/./UtilityTests/OptionsWithRawTest.UnterminatedQuote (1740 of 1779) PASS: lldb-unit :: Utility/./UtilityTests/StringListTest.GetMaxStringLengthDecreasingSize (1741 of 1779) PASS: lldb-api :: functionalities/data-formatter/boolreference/TestFormattersBoolRefPtr.py (1742 of 1779) PASS: lldb-api :: functionalities/breakpoint/breakpoint_ignore_count/TestBreakpointIgnoreCount.py (1743 of 1779) PASS: lldb-api :: commands/expression/import-std-module/forward_list-basic/TestBasicForwardList.py (1744 of 1779) PASS: lldb-shell :: Reproducer/Functionalities/TestDataFormatter.test (1745 of 1779) PASS: lldb-shell :: Reproducer/TestSynchronous.test (1746 of 1779) PASS: lldb-unit :: UnwindAssembly/x86/./UnwindAssemblyx86Tests/Testx86AssemblyInspectionEngine.TestDisassemblyJunkBytes (1747 of 1779) PASS: lldb-unit :: Utility/./UtilityTests/SerializationRountripTest.SerializeDeserializePodPointers (1748 of 1779) PASS: lldb-api :: functionalities/breakpoint/serialize/TestBreakpointSerialization.py (1749 of 1779) UNSUPPORTED: lldb-api :: functionalities/data-formatter/data-formatter-stl/libstdcpp/string/TestDataFormatterStdString.py (1750 of 1779) PASS: lldb-unit :: Language/Highlighting/./HighlighterTests/HighlighterTest.ClangEmptyInput (1751 of 1779) PASS: lldb-api :: python_api/value/change_values/TestChangeValueAPI.py (1752 of 1779) PASS: lldb-api :: python_api/lldbutil/process/TestPrintStackTraces.py (1753 of 1779) PASS: lldb-unit :: Language/Highlighting/./HighlighterTests/HighlighterTest.ClangPPDirectives (1754 of 1779) PASS: lldb-unit :: Utility/./UtilityTests/Flags.Clear (1755 of 1779) PASS: lldb-api :: python_api/disassemble-raw-data/TestDisassembleRawData.py (1756 of 1779) UNSUPPORTED: lldb-shell :: SymbolFile/PDB/vbases.test (1757 of 1779) PASS: lldb-unit :: Utility/./UtilityTests/ScalarTest.Division (1758 of 1779) PASS: lldb-api :: lang/objcxx/hide-runtime-values/TestObjCXXHideRuntimeValues.py (1759 of 1779) PASS: lldb-api :: functionalities/unwind/sigtramp/TestSigtrampUnwind.py (1760 of 1779) PASS: lldb-api :: python_api/lldbutil/frame/TestFrameUtils.py (1761 of 1779) PASS: lldb-unit :: Utility/./UtilityTests/UriParserTest.BadPort (1762 of 1779) PASS: lldb-api :: python_api/process/read-mem-cstring/TestReadMemCString.py (1763 of 1779) UNSUPPORTED: lldb-api :: macosx/macabi/TestMacABImacOSFramework.py (1764 of 1779) PASS: lldb-api :: lang/objc/rdar-10967107/TestRdar10967107.py (1765 of 1779) PASS: lldb-api :: lang/c/bitfields/TestBitfields.py (1766 of 1779) PASS: lldb-api :: lang/cpp/class_static/TestStaticVariables.py (1767 of 1779) PASS: lldb-api :: types/TestIntegerTypes.py (1768 of 1779) PASS: lldb-api :: functionalities/thread/concurrent_events/TestConcurrentWatchBreak.py (1769 of 1779) PASS: lldb-api :: functionalities/tail_call_frames/sbapi_support/TestTailCallFrameSBAPI.py (1770 of 1779) PASS: lldb-api :: commands/frame/diagnose/complicated-expression/TestComplicatedExpression.py (1771 of 1779) PASS: lldb-api :: commands/expression/radar_8638051/Test8638051.py (1772 of 1779) PASS: lldb-api :: lang/objc/foundation/TestSymbolTable.py (1773 of 1779) PASS: lldb-api :: commands/watchpoints/watchpoint_commands/command/TestWatchpointCommandPython.py (1774 of 1779) PASS: lldb-api :: functionalities/data-formatter/data-formatter-objc/nsstring/TestDataFormatterNSString.py (1775 of 1779) PASS: lldb-api :: commands/expression/two-files/TestObjCTypeQueryFromOtherCompileUnit.py (1776 of 1779) PASS: lldb-api :: commands/target/basic/TestTargetCommand.py (1777 of 1779) PASS: lldb-api :: lang/objc/objc-struct-argument/TestObjCStructArgument.py (1778 of 1779) PASS: lldb-api :: lang/objc/hidden-ivars/TestHiddenIvars.py (1779 of 1779) Testing Time: 1654.92s ******************** Failing Tests (3): lldb-api :: commands/expression/multiline-completion/TestMultilineCompletion.py lldb-api :: iohandler/completion/TestIOHandlerCompletion.py lldb-api :: commands/gui/basic/TestGuiBasic.py

Hide Details

Hide Details

Slowest Tests: -------------------------------------------------------------------------- 113.09s: lldb-api :: commands/expression/import-std-module/stack/TestStack.py 122.62s: lldb-api :: lang/c/anonymous/TestAnonymous.py 122.95s: lldb-api :: lang/objc/hidden-ivars/TestHiddenIvars.py 125.12s: lldb-api :: python_api/target/TestTargetAPI.py 129.56s: lldb-api :: lang/objc/objc-new-syntax/TestObjCNewSyntaxArray.py 136.41s: lldb-api :: lang/objc/objc-new-syntax/TestObjCNewSyntaxDictionary.py 137.73s: lldb-api :: api/check_public_api_headers/TestPublicAPIHeaders.py 146.65s: lldb-api :: lang/cpp/namespace/TestNamespaceLookup.py 148.79s: lldb-api :: lang/objc/exceptions/TestObjCExceptions.py 151.41s: lldb-api :: functionalities/load_unload/TestLoadUnload.py 154.98s: lldb-api :: functionalities/return-value/TestReturnValue.py 157.96s: lldb-api :: functionalities/recursion/TestValueObjectRecursion.py 176.61s: lldb-api :: tools/lldb-server/TestLldbGdbServer.py 177.63s: lldb-api :: lang/objc/objc-new-syntax/TestObjCNewSyntaxLiteral.py 211.35s: lldb-api :: lang/objc/foundation/TestObjCMethods.py 226.99s: lldb-api :: lang/cpp/enum_types/TestCPP11EnumTypes.py 233.23s: lldb-api :: api/multithreaded/TestMultithreaded.py 342.48s: lldb-api :: types/TestIntegerTypes.py 490.13s: lldb-api :: types/TestIntegerTypesExpr.py 707.96s: lldb-api :: lang/objc/foundation/TestFoundationDisassembly.py

Hide Details

Tests Times: -------------------------------------------------------------------------- [ Range ] :: [ Percentage ] :: [ Count ] -------------------------------------------------------------------------- [ 0s, 50s) :: [************************************ ] :: [1643/1779] [ 50s,100s) :: [** ] :: [ 108/1779] [100s,150s) :: [ ] :: [ 15/1779] [150s,200s) :: [ ] :: [ 7/1779] [200s,250s) :: [ ] :: [ 3/1779] [250s,300s) :: [ ] :: [ 0/1779] [300s,350s) :: [ ] :: [ 0/1779] [350s,400s) :: [ ] :: [ 1/1779] [400s,450s) :: [ ] :: [ 0/1779] [450s,500s) :: [ ] :: [ 0/1779] [500s,550s) :: [ ] :: [ 1/1779] [550s,600s) :: [ ] :: [ 0/1779] [600s,650s) :: [ ] :: [ 0/1779] [650s,700s) :: [ ] :: [ 0/1779] [700s,750s) :: [ ] :: [ 1/1779] Expected Passes : 1633 Expected Failures : 6 Unsupported Tests : 137 Unexpected Failures: 3 FAILED: tools/lldb/test/CMakeFiles/check-lldb-lit cd /Users/buildslave/jenkins/workspace/lldb-cmake-sanitized/lldb-build/tools/lldb/test && /usr/bin/python /Users/buildslave/jenkins/workspace/lldb-cmake-sanitized/lldb-build/./bin/llvm-lit -v --time-tests --shuffle --xunit-xml-output=/Users/buildslave/jenkins/workspace/lldb-cmake-sanitized/test/results.xml -v --timeout 1200 /Users/buildslave/jenkins/workspace/lldb-cmake-sanitized/lldb-build/tools/lldb/test ninja: build stopped: subcommand failed. Command failed Command: ['/usr/bin/env', 'TERM=vt100', '/usr/local/bin/ninja', '-v', 'check-lldb'] [Pipeline] } [Pipeline] // timeout [Pipeline] } [Pipeline] // stage [Pipeline] stage [Pipeline] { (Declarative: Post Actions) [Pipeline] scanForIssues No credentials specified [Clang (LLVM based)] Sleeping for 5 seconds due to JENKINS-32191... [Clang (LLVM based)] Parsing console log (workspace: '/Users/buildslave/jenkins/workspace/lldb-cmake-sanitized') [Pipeline] junit Recording test results [Pipeline] } [Pipeline] // stage [Pipeline] } [Pipeline] // withEnv [Pipeline] } [Pipeline] // node [Pipeline] End of Pipeline [BFA] Scanning build for known causes... [BFA] Found failure cause(s): [BFA] Ninja target failed from category Compile [BFA] Regression test failed from category Test [BFA] Done. 0s ERROR: script returned exit code 1 Finished: FAILURE