FailedConsole Output

Skipping 7,824 KB.. Full Log
ompiler/bin/clang-10
----------------------------------------------------------------------
Ran 1 test in 2.965s

Hide Details

RESULT: FAILED (0 passes, 0 failures, 1 errors, 0 skipped, 0 expected failures, 0 unexpected successes)

Hide Details

******************** PASS: lldb-unit :: Utility/./UtilityTests/StreamTest.QuotedCString (299 of 1779) PASS: lldb-unit :: Utility/./UtilityTests/StringListTest.LongestCommonPrefix (300 of 1779) UNSUPPORTED: lldb-api :: functionalities/darwin_log/filter/regex/subsystem/TestDarwinLogFilterRegexSubsystem.py (301 of 1779) PASS: lldb-api :: commands/frame/diagnose/virtual-method-call/TestDiagnoseDereferenceVirtualMethodCall.py (302 of 1779) PASS: lldb-unit :: Utility/./UtilityTests/StreamTest.PutStringAsRawHex8 (303 of 1779) PASS: lldb-api :: lang/objc/hidden-ivars/TestHiddenIvars.py (304 of 1779) PASS: lldb-unit :: Editline/./EditlineTests/EditlineTestFixture.EditlineReceivesSingleLineText (305 of 1779) PASS: lldb-api :: functionalities/show_location/TestShowLocationDwarf5.py (306 of 1779) PASS: lldb-unit :: Utility/./UtilityTests/GeneratorTest.GetOrCreate (307 of 1779) PASS: lldb-unit :: Utility/./UtilityTests/UUIDTest.SetFromStringRef (308 of 1779) PASS: lldb-api :: functionalities/thread/concurrent_events/TestConcurrentDelaySignalWatch.py (309 of 1779) PASS: lldb-unit :: SymbolFile/NativePDB/./SymbolFileNativePDBTests/PDBFPOProgramToDWARFExpressionTests.InvalidAssignmentSingle (310 of 1779) PASS: lldb-shell :: SymbolFile/Breakpad/unwind-via-stack-win.test (311 of 1779) PASS: lldb-unit :: Utility/./UtilityTests/FileSpecTest.AppendPathComponent (312 of 1779) PASS: lldb-unit :: ScriptInterpreter/Python/./ScriptInterpreterPythonTests/PythonDataObjectsTest.TestPythonTupleSize (313 of 1779) PASS: lldb-unit :: Symbol/./SymbolTests/LineEntryTest.GetSameLineContiguousAddressRangeOneInline (314 of 1779) PASS: lldb-api :: lang/objc/ptr_refs/TestPtrRefsObjC.py (315 of 1779) PASS: lldb-shell :: ObjectFile/PECOFF/basic-info-arm.yaml (316 of 1779) UNSUPPORTED: lldb-api :: tools/lldb-server/signal-filtering/TestGdbRemote_QPassSignals.py (317 of 1779) UNSUPPORTED: lldb-api :: functionalities/darwin_log/filter/regex/activity/TestDarwinLogFilterRegexActivity.py (318 of 1779) PASS: lldb-unit :: Utility/./UtilityTests/BinaryStreamTest.PutULEB128MaxValue (319 of 1779) PASS: lldb-unit :: ScriptInterpreter/Python/./ScriptInterpreterPythonTests/PythonDataObjectsTest.TestPythonListToStructuredList (320 of 1779) UNSUPPORTED: lldb-api :: tools/lldb-server/thread-name/TestGdbRemoteThreadName.py (321 of 1779) PASS: lldb-unit :: Language/Highlighting/./HighlighterTests/HighlighterTest.ClangScalarLiterals (322 of 1779) PASS: lldb-unit :: UnwindAssembly/x86/./UnwindAssemblyx86Tests/Testx86AssemblyInspectionEngine.TestPushRBPWithREX (323 of 1779) PASS: lldb-api :: commands/command/script/import/TestImport.py (324 of 1779) PASS: lldb-unit :: Utility/./UtilityTests/StringListTest.GetMaxStringLengthMixed (325 of 1779) PASS: lldb-api :: lang/objc/objc-new-syntax/TestObjCNewSyntaxArray.py (326 of 1779) PASS: lldb-api :: functionalities/pre_run_dylibs/TestPreRunDylibs.py (327 of 1779) UNSUPPORTED: lldb-shell :: SymbolFile/PDB/class-layout.test (328 of 1779) PASS: lldb-unit :: ScriptInterpreter/Python/./ScriptInterpreterPythonTests/PythonDataObjectsTest.TestModuleNameResolutionNoDot (329 of 1779) PASS: lldb-unit :: SymbolFile/DWARF/./SymbolFileDWARFTests/SymbolFileDWARFTests.TestAbbrevOrder1Start5 (330 of 1779) PASS: lldb-api :: lang/objc/objc-class-method/TestObjCClassMethod.py (331 of 1779) PASS: lldb-unit :: ScriptInterpreter/Python/./ScriptInterpreterPythonTests/PythonDataObjectsTest.TestPythonByteArray (332 of 1779) PASS: lldb-unit :: SymbolFile/NativePDB/./SymbolFileNativePDBTests/PDBFPOProgramToDWARFExpressionTests.InvalidOpUnary (333 of 1779) PASS: lldb-unit :: Process/gdb-remote/./ProcessGdbRemoteTests/GDBRemoteCommunicationClientTest.WriteRegisterNoSuffix (334 of 1779) PASS: lldb-unit :: Utility/./UtilityTests/VMRange.SetEndAddress (335 of 1779) PASS: lldb-shell :: ObjectFile/ELF/section-addresses.yaml (336 of 1779) PASS: lldb-unit :: Utility/./UtilityTests/ScalarTest.Scalar_512 (337 of 1779) PASS: lldb-unit :: Utility/./UtilityTests/OptionsWithRawTest.LeadingSpaceArgs (338 of 1779) PASS: lldb-unit :: Symbol/./SymbolTests/TestClangASTContext.TestConvertAccessTypeToAccessSpecifier (339 of 1779) PASS: lldb-api :: functionalities/inferior-crashing/TestInferiorCrashingStep.py (340 of 1779) PASS: lldb-unit :: Utility/./UtilityTests/OptionsWithRawTest.WhitespaceInput (341 of 1779) PASS: lldb-unit :: Expression/./ExpressionTests/CppModuleConfigurationTest.AmbiguousCLib (342 of 1779) PASS: lldb-api :: lang/cpp/class-template-parameter-pack/TestClassTemplateParameterPack.py (343 of 1779) PASS: lldb-unit :: UnwindAssembly/x86/./UnwindAssemblyx86Tests/Testx86AssemblyInspectionEngine.TestPushEBX (344 of 1779) PASS: lldb-api :: python_api/frame/get-variables/TestGetVariables.py (345 of 1779) UNSUPPORTED: lldb-api :: benchmarks/libcxxmap/TestBenchmarkLibcxxMap.py (346 of 1779) PASS: lldb-unit :: Expression/./ExpressionTests/CppModuleConfigurationTest.MissingLibCpp (347 of 1779) PASS: lldb-unit :: Utility/./UtilityTests/Predicate.WaitForValueEqualTo (348 of 1779) PASS: lldb-unit :: Utility/./UtilityTests/FileSpecTest.IsRelative (349 of 1779) PASS: lldb-api :: lang/cpp/nsimport/TestCppNsImport.py (350 of 1779) PASS: lldb-shell :: ObjectFile/ELF/PT_TLS-overlap-PT_LOAD.yaml (351 of 1779) PASS: lldb-api :: commands/expression/rdar44436068/Test128BitsInteger.py (352 of 1779) PASS: lldb-unit :: Interpreter/./InterpreterTests/OptionArgParserTest.toBoolean (353 of 1779) PASS: lldb-api :: lang/cpp/llvm-style/TestLLVMStyle.py (354 of 1779) PASS: lldb-unit :: UnwindAssembly/x86/./UnwindAssemblyx86Tests/Testx86AssemblyInspectionEngine.TestReturnDetect (355 of 1779) PASS: lldb-unit :: Process/minidump/./LLDBMinidumpTests/MinidumpParserTest.GetMemory (356 of 1779) PASS: lldb-unit :: Utility/./UtilityTests/StreamTeeTest.Assignment (357 of 1779) PASS: lldb-shell :: ObjectFile/PECOFF/subsections.yaml (358 of 1779) PASS: lldb-shell :: SymbolFile/Breakpad/symtab-macho.test (359 of 1779) PASS: lldb-unit :: UnwindAssembly/x86/./UnwindAssemblyx86Tests/Testx86AssemblyInspectionEngine.TestSubESP (360 of 1779) PASS: lldb-api :: commands/expression/unicode-in-variable/TestUnicodeInVariable.py (361 of 1779) PASS: lldb-unit :: SymbolFile/NativePDB/./SymbolFileNativePDBTests/PDBFPOProgramToDWARFExpressionTests.UnresolvedDependentCyclicRegisterAssignmentReference (362 of 1779) PASS: lldb-unit :: Language/CPlusPlus/./LanguageCPlusPlusTests/CPlusPlusLanguage.CPlusPlusNameParser (363 of 1779) PASS: lldb-unit :: Language/Highlighting/./HighlighterTests/HighlighterTest.DefaultHighlighterWithCursorOutOfBounds (364 of 1779) UNSUPPORTED: lldb-api :: commands/watchpoints/multi_watchpoint_slots/TestWatchpointMultipleSlots.py (365 of 1779) PASS: lldb-unit :: ScriptInterpreter/Python/./ScriptInterpreterPythonTests/PythonExceptionStateTest.TestAutoRestoreChanged (366 of 1779) PASS: lldb-unit :: ScriptInterpreter/Python/./ScriptInterpreterPythonTests/PythonDataObjectsTest.TestPythonStringToStructuredString (367 of 1779) PASS: lldb-unit :: Utility/./UtilityTests/StringExtractorTest.GetHexBytes_Underflow (368 of 1779) PASS: lldb-api :: functionalities/data-formatter/user-format-vs-summary/TestUserFormatVsSummary.py (369 of 1779) PASS: lldb-api :: functionalities/thread/concurrent_events/TestConcurrentSignalWatchBreak.py (370 of 1779) PASS: lldb-unit :: Utility/./UtilityTests/StringLexerTest.PutBack (371 of 1779) PASS: lldb-unit :: Utility/./UtilityTests/ProcessInfoTest.Constructor (372 of 1779) PASS: lldb-api :: commands/gui/invalid-args/TestInvalidArgsGui.py (373 of 1779) PASS: lldb-unit :: Utility/./UtilityTests/StringListTest.SplitIntoLinesEmpty (374 of 1779) PASS: lldb-unit :: Utility/./UtilityTests/StringListTest.AppendListCStringArray (375 of 1779) PASS: lldb-shell :: Driver/TestNoUseColor.test (376 of 1779) PASS: lldb-api :: lang/cpp/std-function-step-into-callable/TestStdFunctionStepIntoCallable.py (377 of 1779) PASS: lldb-api :: lang/objc/single-entry-dictionary/TestObjCSingleEntryDictionary.py (378 of 1779) PASS: lldb-api :: functionalities/thread/concurrent_events/TestConcurrentWatchpointDelayWatchpointOneBreakpoint.py (379 of 1779) PASS: lldb-unit :: Utility/./UtilityTests/ConstStringTest.UpdateMangledCounterpart (380 of 1779) PASS: lldb-api :: commands/expression/namespace_local_var_same_name_cpp_and_c/TestNamespaceLocalVarSameNameCppAndC.py (381 of 1779) PASS: lldb-unit :: Utility/./UtilityTests/LogChannelEnabledTest.log_options (382 of 1779) PASS: lldb-unit :: Utility/./UtilityTests/OptionsWithRawTest.UnterminatedQuote (383 of 1779) PASS: lldb-unit :: Utility/./UtilityTests/RangeTest.EqualInvalid (384 of 1779) PASS: lldb-unit :: Language/CPlusPlus/./LanguageCPlusPlusTests/CPlusPlusLanguage.ExtractContextAndIdentifier (385 of 1779) PASS: lldb-api :: functionalities/thread/jump/TestThreadJump.py (386 of 1779) PASS: lldb-shell :: Reproducer/TestGDBRemoteRepro.test (387 of 1779) UNSUPPORTED: lldb-shell :: Expr/TestIRMemoryMapWindows.test (388 of 1779) PASS: lldb-unit :: Host/./HostTests/NativeProcessProtocolTest.SetBreakpointFailRead (389 of 1779) PASS: lldb-shell :: SymbolFile/DWARF/find-function-regex.cpp (390 of 1779) PASS: lldb-api :: commands/expression/call-function/TestCallBuiltinFunction.py (391 of 1779) PASS: lldb-shell :: ObjectFile/ELF/section-overlap.yaml (392 of 1779) PASS: lldb-unit :: Utility/./UtilityTests/FileSpecTest.CopyByAppendingPathComponent (393 of 1779) PASS: lldb-unit :: UnwindAssembly/x86/./UnwindAssemblyx86Tests/Testx86AssemblyInspectionEngine.TestPushR12 (394 of 1779) PASS: lldb-api :: commands/expression/invalid-args/TestInvalidArgsExpression.py (395 of 1779) PASS: lldb-unit :: UnwindAssembly/x86/./UnwindAssemblyx86Tests/Testx86AssemblyInspectionEngine.TestPopRBX (396 of 1779) UNSUPPORTED: lldb-api :: benchmarks/startup/TestStartupDelays.py (397 of 1779) PASS: lldb-api :: lang/cpp/namespace/TestNamespace.py (398 of 1779) PASS: lldb-unit :: Utility/./UtilityTests/StringListTest.ShiftMove (399 of 1779) PASS: lldb-unit :: Process/gdb-remote/./ProcessGdbRemoteTests/GDBRemoteClientBaseTest.SendPacketAndReceiveResponseWithOutputSupport (400 of 1779) PASS: lldb-unit :: Utility/./UtilityTests/ArgsTest.TestAppendArg (401 of 1779) PASS: lldb-unit :: Editline/./EditlineTests/EditlineTestFixture.EditlineReceivesMultiLineText (402 of 1779) PASS: lldb-unit :: Expression/./ExpressionTests/DiagnosticManagerTest.HasFixits (403 of 1779) PASS: lldb-unit :: Utility/./UtilityTests/StringExtractorTest.GetHexBytes_Partial (404 of 1779) PASS: lldb-api :: commands/settings/TestSettings.py (405 of 1779) PASS: lldb-api :: functionalities/target-new-solib-notifications/TestModuleLoadedNotifys.py (406 of 1779) UNSUPPORTED: lldb-shell :: SymbolFile/PDB/typedefs.test (407 of 1779) PASS: lldb-api :: lang/c/anonymous/TestAnonymous.py (408 of 1779) PASS: lldb-unit :: Utility/./UtilityTests/UUIDTest.Validity (409 of 1779) PASS: lldb-unit :: Utility/./UtilityTests/UUIDTest.RelationalOperators (410 of 1779) UNSUPPORTED: lldb-api :: commands/watchpoints/variable_out_of_scope/TestWatchedVarHitWhenInScope.py (411 of 1779) PASS: lldb-shell :: ObjectFile/ELF/aarch64-relocations.yaml (412 of 1779) PASS: lldb-unit :: ScriptInterpreter/Python/./ScriptInterpreterPythonTests/PythonDataObjectsTest.TestPythonTupleToStructuredList (413 of 1779) PASS: lldb-unit :: Utility/./UtilityTests/LogChannelTest.List (414 of 1779) PASS: lldb-api :: functionalities/data-formatter/language_category_updates/TestDataFormatterLanguageCategoryUpdates.py (415 of 1779) PASS: lldb-api :: functionalities/thread/concurrent_events/TestConcurrentTwoBreakpointsOneSignal.py (416 of 1779) PASS: lldb-unit :: UnwindAssembly/x86/./UnwindAssemblyx86Tests/Testx86AssemblyInspectionEngine.TestPushEAX (417 of 1779) PASS: lldb-api :: python_api/watchpoint/watchlocation/TestSetWatchlocation.py (418 of 1779) PASS: lldb-api :: functionalities/tsan/cpp_global_location/TestTsanCPPGlobalLocation.py (419 of 1779) PASS: lldb-unit :: Symbol/./SymbolTests/TestClangASTContext.TestGetBasicTypeFromName (420 of 1779) PASS: lldb-unit :: Process/gdb-remote/./ProcessGdbRemoteTests/GDBRemoteCommunicationClientTest.SendStartTracePacket (421 of 1779) PASS: lldb-shell :: SymbolFile/DWARF/array-sizes.s (422 of 1779) PASS: lldb-api :: types/TestIntegerTypes.py (423 of 1779) PASS: lldb-api :: functionalities/thread/concurrent_events/TestConcurrentBreakpointDelayBreakpointOneSignal.py (424 of 1779) PASS: lldb-unit :: Utility/./UtilityTests/OptionsWithRawTest.WhitespaceSuffix (425 of 1779) PASS: lldb-api :: functionalities/postmortem/elf-core/gcore/TestGCore.py (426 of 1779) PASS: lldb-unit :: Utility/./UtilityTests/BinaryStreamTest.PutSLEB128SevenBytes (427 of 1779) PASS: lldb-unit :: Utility/./UtilityTests/DeserializerTest.HasData (428 of 1779) PASS: lldb-unit :: Utility/./UtilityTests/StreamTest.PutHex32ByteOrderLittle (429 of 1779) PASS: lldb-shell :: Breakpoint/single-file-split-dwarf.test (430 of 1779) PASS: lldb-unit :: Target/./TargetTests/ExecutionContextTest.GetByteOrderProcess (431 of 1779) PASS: lldb-api :: functionalities/tail_call_frames/thread_step_out_or_return/TestSteppingOutWithArtificialFrames.py (432 of 1779) PASS: lldb-api :: functionalities/backticks/TestBackticksWithoutATarget.py (433 of 1779) PASS: lldb-api :: functionalities/breakpoint/breakpoint_by_line_and_column/TestBreakpointByLineAndColumn.py (434 of 1779) PASS: lldb-shell :: Minidump/Windows/find-module.test (435 of 1779) PASS: lldb-api :: commands/reproducer/invalid-args/TestInvalidArgsReproducer.py (436 of 1779) PASS: lldb-shell :: Reproducer/Modules/TestModuleCXX.test (437 of 1779) PASS: lldb-unit :: Symbol/./SymbolTests/LineEntryTest.GetSameLineContiguousAddressRangeNoInlines (438 of 1779) PASS: lldb-unit :: Process/gdb-remote/./ProcessGdbRemoteTests/GDBRemoteClientBaseTest.SendContinueAndAsyncPacket (439 of 1779) PASS: lldb-unit :: Utility/./UtilityTests/LogTest.Register (440 of 1779) PASS: lldb-api :: functionalities/data-formatter/synthcapping/TestSyntheticCapping.py (441 of 1779) PASS: lldb-unit :: Process/gdb-remote/./ProcessGdbRemoteTests/GDBRemoteCommunicationClientTest.GetMemoryRegionInfo (442 of 1779) PASS: lldb-shell :: Quit/TestQuitExitCode-30.test (443 of 1779) PASS: lldb-shell :: Settings/TestModuleCacheSanity.test (444 of 1779) PASS: lldb-unit :: Utility/./UtilityTests/Flags.Reset (445 of 1779) PASS: lldb-api :: functionalities/data-formatter/data-formatter-objc/TestDataFormatterObjCExpr.py (446 of 1779) PASS: lldb-api :: lang/cpp/class_static/TestStaticVariables.py (447 of 1779) PASS: lldb-unit :: Utility/./UtilityTests/BinaryStreamTest.PutULEB128Zero (448 of 1779) PASS: lldb-unit :: UnwindAssembly/x86/./UnwindAssemblyx86Tests/Testx86AssemblyInspectionEngine.TestSpArithx86_64Augmented (449 of 1779) PASS: lldb-unit :: Utility/./UtilityTests/StringListTest.InsertStringAtIndexMove (450 of 1779) PASS: lldb-api :: functionalities/thread/concurrent_events/TestConcurrentManyCrash.py (451 of 1779) PASS: lldb-unit :: Core/./LLDBCoreTests/RichManglingContextTest.FromCxxMethodName (452 of 1779) PASS: lldb-shell :: SymbolFile/DWARF/gnu-style-compression.cpp (453 of 1779) PASS: lldb-shell :: SymbolFile/DWARF/forward-declarations.s (454 of 1779) PASS: lldb-unit :: ScriptInterpreter/Python/./ScriptInterpreterPythonTests/PythonDataObjectsTest.TestObjectAttributes (455 of 1779) PASS: lldb-unit :: Interpreter/./InterpreterTests/CompletionTest.DirCompletionAbsolute (456 of 1779) PASS: lldb-unit :: Expression/./ExpressionTests/CppModuleConfigurationTest.IgnoreLibStdCpp (457 of 1779) PASS: lldb-api :: functionalities/thread/thread_specific_break/TestThreadSpecificBreakpoint.py (458 of 1779) PASS: lldb-api :: functionalities/data-formatter/hexcaps/TestDataFormatterHexCaps.py (459 of 1779) PASS: lldb-api :: commands/frame/var/TestFrameVar.py (460 of 1779) PASS: lldb-api :: functionalities/dynamic_value_child_count/TestDynamicValueChildCount.py (461 of 1779) PASS: lldb-unit :: Utility/./UtilityTests/BinaryStreamTest.PutSLEB128Zero (462 of 1779) PASS: lldb-shell :: BuildScript/modes.test (463 of 1779) PASS: lldb-api :: functionalities/dead-strip/TestDeadStrip.py (464 of 1779) PASS: lldb-unit :: UnwindAssembly/x86/./UnwindAssemblyx86Tests/Testx86AssemblyInspectionEngine.Test64bitFramelessSmallStackFrame (465 of 1779) PASS: lldb-unit :: Symbol/./SymbolTests/TestClangASTContext.TestRecordHasFields (466 of 1779) PASS: lldb-api :: functionalities/thread/concurrent_events/TestConcurrentSignalDelayBreak.py (467 of 1779) PASS: lldb-api :: functionalities/data-formatter/data-formatter-script/TestDataFormatterScript.py (468 of 1779) PASS: lldb-api :: commands/expression/dont_allow_jit/TestAllowJIT.py (469 of 1779) PASS: lldb-api :: functionalities/breakpoint/breakpoint_ignore_count/TestBreakpointIgnoreCount.py (470 of 1779) PASS: lldb-api :: functionalities/paths/TestPaths.py (471 of 1779) PASS: lldb-shell :: Settings/TestStopCommandSourceOnError.test (472 of 1779) PASS: lldb-unit :: Process/minidump/./LLDBMinidumpTests/MinidumpParserTest.GetFilteredModuleList (473 of 1779) PASS: lldb-unit :: Utility/./UtilityTests/StringLexerTest.NextIfList (474 of 1779) PASS: lldb-api :: commands/expression/persistent_variables/TestPersistentVariables.py (475 of 1779) PASS: lldb-unit :: Utility/./UtilityTests/EnvironmentTest.EnvpConstruction (476 of 1779) PASS: lldb-unit :: Utility/./UtilityTests/StringListTest.GetMaxStringLengthEqualSize (477 of 1779) PASS: lldb-api :: lang/cpp/enum_types/TestCPP11EnumTypes.py (478 of 1779) PASS: lldb-api :: lang/cpp/this/TestCPPThis.py (479 of 1779) PASS: lldb-api :: commands/expression/pr35310/TestExprsBug35310.py (480 of 1779) PASS: lldb-api :: functionalities/thread/concurrent_events/TestConcurrentManyBreakpoints.py (481 of 1779) PASS: lldb-api :: lang/cpp/auto/TestCPPAuto.py (482 of 1779) PASS: lldb-api :: commands/expression/xvalue/TestXValuePrinting.py (483 of 1779) PASS: lldb-api :: functionalities/data-formatter/data-formatter-stl/libstdcpp/unique_ptr/invalid/TestDataFormatterInvalidStdUniquePtr.py (484 of 1779) PASS: lldb-api :: python_api/findvalue_duplist/TestSBFrameFindValue.py (485 of 1779) PASS: lldb-api :: functionalities/value_md5_crash/TestValueMD5Crash.py (486 of 1779) PASS: lldb-unit :: Utility/./UtilityTests/Flags.GetBitSize (487 of 1779) PASS: lldb-api :: commands/expression/completion/TestExprCompletion.py (488 of 1779) XFAIL: lldb-shell :: Register/x86-mm-xmm-read.test (489 of 1779) PASS: lldb-api :: functionalities/breakpoint/breakpoint_command/TestRegexpBreakCommand.py (490 of 1779) PASS: lldb-unit :: Utility/./UtilityTests/StatusTest.ErrorConstructor (491 of 1779) PASS: lldb-unit :: Utility/./UtilityTests/ReproducerTest.SetCapture (492 of 1779) PASS: lldb-unit :: Host/./HostTests/NativeProcessProtocolTest.ReadMemoryWithoutTrap (493 of 1779) PASS: lldb-api :: commands/expression/cast_int_to_anonymous_enum/TestCastIntToAnonymousEnum.py (494 of 1779) PASS: lldb-unit :: Signals/./SignalsTests/UnixSignalsTest.Iteration (495 of 1779) PASS: lldb-unit :: Expression/./ExpressionTests/DiagnosticManagerTest.GetStringPreserveOrder (496 of 1779) PASS: lldb-api :: functionalities/inferior-crashing/recursive-inferior/TestRecursiveInferiorStep.py (497 of 1779) PASS: lldb-shell :: Reproducer/Functionalities/TestImageList.test (498 of 1779) PASS: lldb-unit :: Utility/./UtilityTests/RangeTest.Equal (499 of 1779) PASS: lldb-unit :: Utility/./UtilityTests/ConstStringTest.format_provider (500 of 1779) PASS: lldb-api :: arm/emulation/TestEmulations.py (501 of 1779) PASS: lldb-shell :: ExecControl/StopHook/stop-hook.test (502 of 1779) PASS: lldb-api :: commands/expression/options/TestExprOptions.py (503 of 1779) PASS: lldb-api :: commands/expression/test/TestExprs.py (504 of 1779) PASS: lldb-unit :: ScriptInterpreter/Python/./ScriptInterpreterPythonTests/PythonDataObjectsTest.TestPythonString (505 of 1779) PASS: lldb-api :: commands/expression/timeout/TestCallWithTimeout.py (506 of 1779) PASS: lldb-api :: functionalities/data-formatter/data-formatter-stl/libcxx/queue/TestDataFormatterLibcxxQueue.py (507 of 1779) PASS: lldb-unit :: Utility/./UtilityTests/StringListTest.CopyList (508 of 1779) PASS: lldb-shell :: Driver/TestTarget.test (509 of 1779) PASS: lldb-api :: lang/c/const_variables/TestConstVariables.py (510 of 1779) PASS: lldb-api :: commands/expression/import-std-module/forward_list-dbg-info-content/TestDbgInfoContentForwardList.py (511 of 1779) PASS: lldb-shell :: ObjectFile/ELF/many-sections.s (512 of 1779) PASS: lldb-unit :: UnwindAssembly/x86/./UnwindAssemblyx86Tests/Testx86AssemblyInspectionEngine.TestDisassemblyMidFunctionEpilogues (513 of 1779) PASS: lldb-unit :: UnwindAssembly/x86/./UnwindAssemblyx86Tests/Testx86AssemblyInspectionEngine.TestPopRBPWithREX (514 of 1779) PASS: lldb-api :: commands/expression/import-std-module/empty-module/TestEmptyStdModule.py (515 of 1779) PASS: lldb-unit :: Utility/./UtilityTests/TildeExpressionResolver.ResolveFullPath (516 of 1779) PASS: lldb-api :: functionalities/gdb_remote_client/TestNoWatchpointSupportInfo.py (517 of 1779) PASS: lldb-api :: commands/help/TestHelp.py (518 of 1779) PASS: lldb-unit :: Utility/./UtilityTests/SerializationRountripTest.SerializeDeserializeObjectPointer (519 of 1779) PASS: lldb-shell :: Minidump/disassemble-no-module.yaml (520 of 1779) PASS: lldb-shell :: Settings/TestEchoCommands.test (521 of 1779) PASS: lldb-api :: lang/c/step-target/TestStepTarget.py (522 of 1779) UNSUPPORTED: lldb-api :: python_api/disassemble-raw-data/TestDisassemble_VST1_64.py (523 of 1779) PASS: lldb-unit :: Process/minidump/./LLDBMinidumpTests/MinidumpParserTest.GetLinuxProcStatus (524 of 1779) PASS: lldb-unit :: Utility/./UtilityTests/StringExtractorTest.GetHexU8_Underflow_NoEof (525 of 1779) PASS: lldb-unit :: Utility/./UtilityTests/RangeTest.LessThan (526 of 1779) PASS: lldb-unit :: Utility/./UtilityTests/FileSpecTest.GetNormalizedPath (527 of 1779) PASS: lldb-unit :: Expression/./ExpressionTests/ClangHostTest.MacOSX (528 of 1779) PASS: lldb-api :: types/TestDoubleTypesExpr.py (529 of 1779) PASS: lldb-unit :: Utility/./UtilityTests/DataExtractorTest.GetMaxU64 (530 of 1779) PASS: lldb-api :: lang/objc/modules-auto-import/TestModulesAutoImport.py (531 of 1779) UNSUPPORTED: lldb-api :: android/platform/TestDefaultCacheLineSize.py (532 of 1779) PASS: lldb-api :: functionalities/breakpoint/step_over_breakpoint/TestStepOverBreakpoint.py (533 of 1779) PASS: lldb-api :: functionalities/testid/TestTestId.py (534 of 1779) PASS: lldb-unit :: Utility/./UtilityTests/StringListTest.ShiftStdString (535 of 1779) PASS: lldb-api :: python_api/watchpoint/TestSetWatchpoint.py (536 of 1779) PASS: lldb-unit :: Utility/./UtilityTests/RangeTest.DoesAdjoinOrIntersect (537 of 1779) PASS: lldb-unit :: Utility/./UtilityTests/UriParserTest.SchemeHostSeparator3 (538 of 1779) PASS: lldb-api :: tools/lldb-server/TestGdbRemote_vCont.py (539 of 1779) PASS: lldb-unit :: Symbol/./SymbolTests/Type.GetTypeScopeAndBasename (540 of 1779) PASS: lldb-unit :: Utility/./UtilityTests/TimerTest.CategoryTimes (541 of 1779) PASS: lldb-shell :: SymbolFile/DWARF/debug-types-line-tables.s (542 of 1779) PASS: lldb-unit :: Utility/./UtilityTests/StringExtractorTest.GetHexBytesAvail_OddPair (543 of 1779) PASS: lldb-shell :: Quit/TestQuitExitCodeImplicit0.test (544 of 1779) PASS: lldb-api :: functionalities/type_lookup/TestTypeLookup.py (545 of 1779) PASS: lldb-unit :: Process/minidump/./LLDBMinidumpTests/MinidumpParserTest.GetPidWow64 (546 of 1779) PASS: lldb-shell :: SymbolFile/NativePDB/break-by-line.cpp (547 of 1779) PASS: lldb-api :: functionalities/thread/concurrent_events/TestConcurrentWatchBreak.py (548 of 1779) PASS: lldb-unit :: Utility/./UtilityTests/DataExtractorTest.GetCStrEmpty (549 of 1779) PASS: lldb-api :: python_api/sbstructureddata/TestStructuredDataAPI.py (550 of 1779) PASS: lldb-unit :: UnwindAssembly/x86/./UnwindAssemblyx86Tests/Testx86AssemblyInspectionEngine.TestSimple32bitFrameFunction (551 of 1779) PASS: lldb-shell :: ObjectFile/Breakpad/discontiguous-sections.test (552 of 1779) PASS: lldb-unit :: Utility/./UtilityTests/ProcessInstanceInfo.DumpTable (553 of 1779) PASS: lldb-api :: lang/objc/objc-struct-return/TestObjCStructReturn.py (554 of 1779) PASS: lldb-api :: commands/expression/persistent_types/TestPersistentTypes.py (555 of 1779) PASS: lldb-api :: tools/lldb-server/TestAppleSimulatorOSType.py (556 of 1779) PASS: lldb-unit :: Utility/./UtilityTests/EventTest.DumpEventDataBytes (557 of 1779) PASS: lldb-unit :: Utility/./UtilityTests/StringListTest.JoinNonSpace (558 of 1779) PASS: lldb-api :: commands/source/info/TestSourceInfo.py (559 of 1779) PASS: lldb-api :: lang/objc/orderedset/TestOrderedSet.py (560 of 1779) PASS: lldb-api :: lang/objc/real-definition/TestRealDefinition.py (561 of 1779) PASS: lldb-api :: python_api/debugger/TestDebuggerAPI.py (562 of 1779) PASS: lldb-unit :: Utility/./UtilityTests/StringExtractorTest.GetU64LittleEndian (563 of 1779) PASS: lldb-shell :: ObjectFile/PECOFF/uuid.yaml (564 of 1779) PASS: lldb-api :: lang/c/local_types/TestUseClosestType.py (565 of 1779) PASS: lldb-api :: api/multiple-targets/TestMultipleTargets.py (566 of 1779) PASS: lldb-unit :: Utility/./UtilityTests/ScalarTest.APIntConstructor (567 of 1779) PASS: lldb-api :: lang/cpp/function_refs/TestFunctionRefs.py (568 of 1779) PASS: lldb-unit :: Symbol/./SymbolTests/LineEntryTest.GetSameLineContiguousAddressRangeNestedInline (569 of 1779) PASS: lldb-unit :: SymbolFile/DWARF/./SymbolFileDWARFTests/SymbolFileDWARFTests.TestAbbrevOrder1Start1 (570 of 1779) PASS: lldb-unit :: Utility/./UtilityTests/StringExtractorTest.GetHexBytesAvail_Partial (571 of 1779) PASS: lldb-unit :: Utility/./UtilityTests/StringExtractorTest.DecodeHexU8_InvalidHex2 (572 of 1779) PASS: lldb-api :: functionalities/data-formatter/data-formatter-objc/TestDataFormatterObjCCF.py (573 of 1779) PASS: lldb-unit :: Utility/./UtilityTests/RangeTest.DefaultConstructor (574 of 1779) PASS: lldb-unit :: Process/gdb-remote/./ProcessGdbRemoteTests/GDBRemoteCommunicationClientTest.GetModulesInfoInvalidResponse (575 of 1779) PASS: lldb-api :: functionalities/data-formatter/data-formatter-objc/TestDataFormatterObjCNSError.py (576 of 1779) PASS: lldb-api :: lang/cpp/scope/TestCppScope.py (577 of 1779) PASS: lldb-shell :: SymbolFile/NativePDB/bitfields.cpp (578 of 1779) PASS: lldb-api :: functionalities/data-formatter/ostypeformatting/TestFormattersOsType.py (579 of 1779) PASS: lldb-api :: functionalities/completion/TestCompletion.py (580 of 1779) PASS: lldb-unit :: Utility/./UtilityTests/StreamTest.PutMaxHex64ByteOrderLittle (581 of 1779) PASS: lldb-api :: functionalities/breakpoint/cpp/TestCPPBreakpointLocations.py (582 of 1779) PASS: lldb-api :: functionalities/memory/find/TestMemoryFind.py (583 of 1779) PASS: lldb-unit :: Utility/./UtilityTests/RecordReplayTest.InstrumentedBarPtr (584 of 1779) PASS: lldb-unit :: Utility/./UtilityTests/ConstStringTest.MangledCounterpart (585 of 1779) PASS: lldb-api :: python_api/lldbutil/iter/TestRegistersIterator.py (586 of 1779) PASS: lldb-api :: lang/cpp/inlines/TestInlines.py (587 of 1779) PASS: lldb-api :: commands/expression/persist_objc_pointeetype/TestPersistObjCPointeeType.py (588 of 1779) PASS: lldb-unit :: Language/Highlighting/./HighlighterTests/HighlighterTest.ClangCursorPosBeforeOtherToken (589 of 1779) PASS: lldb-shell :: Driver/TestFile.test (590 of 1779) PASS: lldb-unit :: UnwindAssembly/x86/./UnwindAssemblyx86Tests/Testx86AssemblyInspectionEngine.TestAddESP (591 of 1779) UNSUPPORTED: lldb-api :: functionalities/data-formatter/data-formatter-stl/libstdcpp/vbool/TestDataFormatterStdVBool.py (592 of 1779) PASS: lldb-api :: functionalities/signal/raise/TestRaise.py (593 of 1779) PASS: lldb-unit :: Utility/./UtilityTests/UriParserTest.Empty (594 of 1779) PASS: lldb-api :: functionalities/data-formatter/nsarraysynth/TestNSArraySynthetic.py (595 of 1779) PASS: lldb-api :: lang/objc/objc-ivar-protocols/TestIvarProtocols.py (596 of 1779) PASS: lldb-api :: lang/objc/rdar-11355592/TestRdar11355592.py (597 of 1779) PASS: lldb-api :: tools/lldb-server/TestGdbRemoteRegisterState.py (598 of 1779) PASS: lldb-shell :: Host/TestCustomShell.test (599 of 1779) PASS: lldb-shell :: Minidump/Windows/Sigsegv/sigsegv.test (600 of 1779) PASS: lldb-unit :: Utility/./UtilityTests/UriParserTest.BracketedHostnameWithColon (601 of 1779) PASS: lldb-unit :: ObjectFile/ELF/./ObjectFileELFTests/ObjectFileELFTest.GetModuleSpecifications_EarlySectionHeaders (602 of 1779) PASS: lldb-unit :: Expression/./ExpressionTests/ClangHostTest.ComputeClangResourceDirectory (603 of 1779) PASS: lldb-unit :: Symbol/./SymbolTests/DWARFCallFrameInfoTest.Basic_dwarf3 (604 of 1779) PASS: lldb-unit :: UnwindAssembly/x86/./UnwindAssemblyx86Tests/Testx86AssemblyInspectionEngine.TestPushRBP (605 of 1779) PASS: lldb-api :: lang/objc/foundation/TestObjectDescriptionAPI.py (606 of 1779) PASS: lldb-unit :: Utility/./UtilityTests/StreamTest.PutPtr (607 of 1779) PASS: lldb-api :: functionalities/tail_call_frames/thread_step_out_message/TestArtificialFrameStepOutMessage.py (608 of 1779) UNSUPPORTED: lldb-api :: functionalities/thread/thread_specific_break_plus_condition/TestThreadSpecificBpPlusCondition.py (609 of 1779) PASS: lldb-unit :: Utility/./UtilityTests/ArgsTest.TestMultipleArgs (610 of 1779) PASS: lldb-shell :: SymbolFile/NativePDB/nested-types.cpp (611 of 1779) PASS: lldb-shell :: SymbolFile/DWARF/parallel-indexing-stress.s (612 of 1779) PASS: lldb-unit :: Utility/./UtilityTests/LogChannelTest.EnableOptions (613 of 1779) PASS: lldb-api :: lang/cpp/operator-overload/TestOperatorOverload.py (614 of 1779) PASS: lldb-api :: lang/cpp/symbols/TestSymbols.py (615 of 1779) PASS: lldb-unit :: Utility/./UtilityTests/ArgsTest.TestUnknownEscape (616 of 1779) UNSUPPORTED: lldb-api :: functionalities/darwin_log/filter/exact_match/activity/TestDarwinLogFilterMatchActivity.py (617 of 1779) PASS: lldb-unit :: Target/./TargetTests/ExecutionContextTest.GetByteOrder (618 of 1779) PASS: lldb-unit :: Expression/./ExpressionTests/CppModuleConfigurationTest.MissingUsrInclude (619 of 1779) PASS: lldb-unit :: Utility/./UtilityTests/StreamTeeTest.SetStreamAtIndexOverwrite (620 of 1779) PASS: lldb-api :: python_api/module_section/TestModuleAndSection.py (621 of 1779) PASS: lldb-api :: lang/c/unions/TestUnionMembers.py (622 of 1779) PASS: lldb-shell :: ObjectFile/ELF/compressed-sections.yaml (623 of 1779) PASS: lldb-unit :: Utility/./UtilityTests/UriParserTest.LongPath (624 of 1779) PASS: lldb-unit :: Utility/./UtilityTests/UriParserTest.BracketedHostname (625 of 1779) PASS: lldb-unit :: Utility/./UtilityTests/ConstStringTest.CompareConstString (626 of 1779) PASS: lldb-unit :: Utility/./UtilityTests/StringListTest.InsertStringAtIndexEnd (627 of 1779) PASS: lldb-unit :: Utility/./UtilityTests/BinaryStreamTest.PutSLEB128TwoBytes (628 of 1779) PASS: lldb-api :: commands/add-dsym/uuid/TestAddDsymCommand.py (629 of 1779) PASS: lldb-api :: functionalities/thread/concurrent_events/TestConcurrentNWatchNBreak.py (630 of 1779) PASS: lldb-shell :: SymbolFile/DWARF/compilercontext.ll (631 of 1779) PASS: lldb-unit :: Utility/./UtilityTests/RegisterValueTest.GetSet8 (632 of 1779) PASS: lldb-shell :: ObjectFile/ELF/PT_LOAD-overlap.yaml (633 of 1779) PASS: lldb-unit :: Utility/./UtilityTests/BinaryStreamTest.PutULEB128EightBytes (634 of 1779) UNSUPPORTED: lldb-shell :: Register/x86-64-xmm16-read.test (635 of 1779) PASS: lldb-unit :: Host/./HostTests/FileSystemTest.GetPermissions (636 of 1779) UNSUPPORTED: lldb-shell :: SymbolFile/NativePDB/stack_unwinding01.cpp (637 of 1779) UNSUPPORTED: lldb-api :: functionalities/breakpoint/hardware_breakpoints/hardware_breakpoint_on_multiple_threads/TestHWBreakMultiThread.py (638 of 1779) PASS: lldb-shell :: ObjectFile/Breakpad/sections-trailing-func.test (639 of 1779) PASS: lldb-api :: functionalities/tail_call_frames/ambiguous_tail_call_seq2/TestAmbiguousTailCallSeq2.py (640 of 1779) PASS: lldb-unit :: Utility/./UtilityTests/StringListTest.AppendStringMove (641 of 1779) PASS: lldb-unit :: Host/./HostTests/FileSystemTest.GetByteSize (642 of 1779) PASS: lldb-api :: lang/c/array_types/TestArrayTypes.py (643 of 1779) PASS: lldb-unit :: Utility/./UtilityTests/ProcessInstanceInfo.Dump (644 of 1779) PASS: lldb-unit :: Expression/./ExpressionTests/DiagnosticManagerTest.AppendMessageAttachToLastDiag (645 of 1779) PASS: lldb-api :: functionalities/stats_api/TestStatisticsAPI.py (646 of 1779) PASS: lldb-unit :: Breakpoint/./LLDBBreakpointTests/BreakpointIDTest.StringIsBreakpointName (647 of 1779) PASS: lldb-api :: lang/cpp/stl/TestSTL.py (648 of 1779) PASS: lldb-api :: commands/expression/import_builtin_fileid/TestImportBuiltinFileID.py (649 of 1779) PASS: lldb-unit :: ObjectFile/PECOFF/./ObjectFilePECOFFTests/PECallFrameInfoTest.Basic_eh (650 of 1779) PASS: lldb-unit :: Language/Highlighting/./HighlighterTests/HighlighterTest.ClangStringLiterals (651 of 1779) PASS: lldb-unit :: Utility/./UtilityTests/VASprintfTest.NoBufferResize (652 of 1779) PASS: lldb-unit :: Host/./HostTests/FileSystemTest.EnumerateDirectory (653 of 1779) UNSUPPORTED: lldb-api :: tools/lldb-server/libraries-svr4/TestGdbRemoteLibrariesSvr4Support.py (654 of 1779) FAIL: lldb-api :: commands/expression/multiline-completion/TestMultilineCompletion.py (655 of 1779) ******************** TEST 'lldb-api :: commands/expression/multiline-completion/TestMultilineCompletion.py' FAILED ******************** lldb version 10.0.99 (http://labmaster3.local/git/llvm-project.git revision fce11c6904c888e6d39f71e03806a540852dec41) clang revision 9bd542dcd5b8d681a535fa2b5c5d0cf7193be0e1 llvm revision 9bd542dcd5b8d681a535fa2b5c5d0cf7193be0e1 LLDB library dir: /Users/buildslave/jenkins/workspace/lldb-cmake-sanitized/lldb-build/bin LLDB import library dir: /Users/buildslave/jenkins/workspace/lldb-cmake-sanitized/lldb-build/bin libstdcxx tests will not be run because: Don't know how to build with libstdcxx on macosx Skipping following debug info categories: ['dwo'] (lldb) settings set symbols.enable-external-lookup false (lldb) settings set plugin.process.gdb-remote.packet-timeout 60 (lldb) settings set symbols.clang-modules-cache-path "/Users/buildslave/jenkins/workspace/lldb-cmake-sanitized/lldb-build/tools/lldb/lldb-test-build.noindex/module-cache-lldb/lldb-api" (lldb) settings set use-color false (lldb) target create "/Users/buildslave/jenkins/workspace/lldb-cmake-sanitized/lldb-build/tools/lldb/lldb-test-build.noindex/commands/expression/multiline-completion/TestMultilineCompletion.test_basic_completion/a.out" Current executable set to '/Users/buildslave/jenkins/workspace/lldb-cmake-sanitized/lldb-build/tools/lldb/lldb-test-build.noindex/commands/expression/multiline-completion/TestMultilineCompletion.test_basic_completion/a.out' (x86_64). (lldb) b main b main Breakpoint 1: where = a.out`main + 18 at main.c:2:7, address = 0x0000000100000fa2 (lldb) run run Process 19170 launched: '/Users/buildslave/jenkins/workspace/lldb-cmake-sanitized/lldb-build/tools/lldb/lldb-test-build.noindex/commands/expression/multiline-completion/TestMultilineCompletion.test_basic_completion/a.out' (x86_64) Process 19170 stopped * thread #1, queue = 'com.apple.main-thread', stop reason = breakpoint 1.1 frame #0: 0x0000000100000fa2 a.out`main(argc=1, argv=0x00007ffeefbff430) at main.c:2:7 1 int main(int argc, char **argv) { -> 2 int to_complete = 0; ^ 3 return to_complete; 4 } (lldb) expr expr Enter expressions, then terminate with an empty line to evaluate: to_  1:  1: to_ to_  1: to_complete

Hide Details

 1: to_complete 2:  2:  (int) $0 = 0 (lldb) settings set interpreter.prompt-on-quit false

Hide Details

Session logs for test failures/errors/unexpected successes will go into directory '/Users/buildslave/jenkins/workspace/lldb-cmake-sanitized/test/logs' Command invoked: /Users/buildslave/jenkins/workspace/lldb-cmake-sanitized/llvm-project/lldb/test/API/dotest.py --arch=x86_64 -s /Users/buildslave/jenkins/workspace/lldb-cmake-sanitized/lldb-build/lldb-test-traces -S nm -u CXXFLAGS -u CFLAGS --executable /Users/buildslave/jenkins/workspace/lldb-cmake-sanitized/lldb-build/./bin/lldb --dsymutil /Users/buildslave/jenkins/workspace/lldb-cmake-sanitized/lldb-build/./bin/dsymutil --filecheck /Users/buildslave/jenkins/workspace/lldb-cmake-sanitized/lldb-build/./bin/FileCheck -C /Users/buildslave/jenkins/workspace/lldb-cmake-sanitized/host-compiler/bin/clang --codesign-identity lldb_codesign --server /Users/buildslave/jenkins/workspace/lldb-cmake-sanitized/lldb-build/./bin/debugserver --arch x86_64 --build-dir /Users/buildslave/jenkins/workspace/lldb-cmake-sanitized/lldb-build/lldb-test-build.noindex -s=/Users/buildslave/jenkins/workspace/lldb-cmake-sanitized/test/logs -t --env TERM=vt100 --env LLVM_LIBS_DIR=/Users/buildslave/jenkins/workspace/lldb-cmake-sanitized/lldb-build/./lib --build-dir /Users/buildslave/jenkins/workspace/lldb-cmake-sanitized/lldb-build/tools/lldb/lldb-test-build.noindex --lldb-module-cache-dir /Users/buildslave/jenkins/workspace/lldb-cmake-sanitized/lldb-build/tools/lldb/lldb-test-build.noindex/module-cache-lldb/lldb-api --clang-module-cache-dir /Users/buildslave/jenkins/workspace/lldb-cmake-sanitized/lldb-build/tools/lldb/lldb-test-build.noindex/module-cache-clang/lldb-api /Users/buildslave/jenkins/workspace/lldb-cmake-sanitized/llvm-project/lldb/packages/Python/lldbsuite/test/commands/expression/multiline-completion -p TestMultilineCompletion.py Change dir to: /Users/buildslave/jenkins/workspace/lldb-cmake-sanitized/llvm-project/lldb/packages/Python/lldbsuite/test/commands/expression/multiline-completion runCmd: settings set symbols.enable-external-lookup false output:

Hide Details

runCmd: settings set plugin.process.gdb-remote.packet-timeout 60 output:

Hide Details

runCmd: settings set symbols.clang-modules-cache-path "/Users/buildslave/jenkins/workspace/lldb-cmake-sanitized/lldb-build/tools/lldb/lldb-test-build.noindex/module-cache-lldb/lldb-api" output:

Hide Details

runCmd: settings set use-color false output:

Hide Details

FAIL: LLDB (/Users/buildslave/jenkins/workspace/lldb-cmake-sanitized/host-compiler/bin/clang-10-x86_64) :: test_basic_completion (TestMultilineCompletion.MultilineCompletionTest) tearing down the child process....

Hide Details

CLEANUP ERROR: LLDB (/Users/buildslave/jenkins/workspace/lldb-cmake-sanitized/host-compiler/bin/clang-10-x86_64) :: test_basic_completion (TestMultilineCompletion.MultilineCompletionTest) Restore dir to: /Users/buildslave/jenkins/workspace/lldb-cmake-sanitized/lldb-build/tools/lldb/test ====================================================================== ERROR: test_basic_completion (TestMultilineCompletion.MultilineCompletionTest) Test that we can complete a simple multiline expression ---------------------------------------------------------------------- Traceback (most recent call last): File "/Users/buildslave/jenkins/workspace/lldb-cmake-sanitized/llvm-project/lldb/packages/Python/lldbsuite/test/commands/expression/multiline-completion/TestMultilineCompletion.py", line 30, in test_basic_completion self.quit() File "/Users/buildslave/jenkins/workspace/lldb-cmake-sanitized/llvm-project/lldb/packages/Python/lldbsuite/test/lldbpexpect.py", line 61, in quit self.child.close(force=not gracefully) File "/Users/buildslave/jenkins/workspace/lldb-cmake-sanitized/llvm-project/lldb/third_party/Python/module/pexpect-4.6/pexpect/pty_spawn.py", line 327, in close self.ptyproc.close(force=force) File "/System/Library/Frameworks/Python.framework/Versions/2.7/lib/python2.7/contextlib.py", line 35, in __exit__ self.gen.throw(type, value, traceback) File "/Users/buildslave/jenkins/workspace/lldb-cmake-sanitized/llvm-project/lldb/third_party/Python/module/pexpect-4.6/pexpect/pty_spawn.py", line 25, in _wrap_ptyprocess_err raise ExceptionPexpect(*e.args) ExceptionPexpect: Could not terminate the child. Config=x86_64-/Users/buildslave/jenkins/workspace/lldb-cmake-sanitized/host-compiler/bin/clang-10 ---------------------------------------------------------------------- Ran 1 test in 7.863s

Hide Details

RESULT: FAILED (0 passes, 0 failures, 1 errors, 0 skipped, 0 expected failures, 0 unexpected successes)

Hide Details

******************** PASS: lldb-shell :: Commands/command-backtrace.test (656 of 1779) PASS: lldb-unit :: Expression/./ExpressionTests/DWARFExpression.DW_OP_pick (657 of 1779) PASS: lldb-api :: functionalities/data-formatter/data-formatter-cpp/TestDataFormatterCpp.py (658 of 1779) PASS: lldb-unit :: Utility/./UtilityTests/StringListTest.CopyListSingle (659 of 1779) PASS: lldb-shell :: Driver/TestConvenienceVariables.test (660 of 1779) UNSUPPORTED: lldb-shell :: Register/x86-zmm-read.test (661 of 1779) PASS: lldb-api :: lang/objc/foundation/TestObjCMethods2.py (662 of 1779) PASS: lldb-api :: commands/process/launch/TestProcessLaunch.py (663 of 1779) PASS: lldb-api :: functionalities/thread/step_until/TestStepUntil.py (664 of 1779) PASS: lldb-unit :: Utility/./UtilityTests/Flags.Test (665 of 1779) PASS: lldb-api :: lang/cpp/namespace/TestNamespaceLookup.py (666 of 1779) PASS: lldb-shell :: ObjectFile/PECOFF/dep-modules.yaml (667 of 1779) PASS: lldb-unit :: Utility/./UtilityTests/StringListTest.ForRange (668 of 1779) PASS: lldb-unit :: Process/minidump/./LLDBMinidumpTests/MinidumpParserTest.GetArchitecture (669 of 1779) PASS: lldb-unit :: Symbol/./SymbolTests/DWARFCallFrameInfoTest.Basic_dwarf4 (670 of 1779) PASS: lldb-unit :: Utility/./UtilityTests/RangeTest.ContainsEndInclusiveInvalid (671 of 1779) PASS: lldb-unit :: UnwindAssembly/x86/./UnwindAssemblyx86Tests/Testx86AssemblyInspectionEngine.TestSimplei386ugmented (672 of 1779) PASS: lldb-api :: functionalities/breakpoint/breakpoint_conditions/TestBreakpointConditions.py (673 of 1779) PASS: lldb-unit :: Process/minidump/./LLDBMinidumpTests/RegisterContextMinidump.ConvertMinidumpContext_x86_64 (674 of 1779) UNSUPPORTED: lldb-api :: functionalities/darwin_log/format/TestDarwinLogMessageFormat.py (675 of 1779) UNSUPPORTED: lldb-shell :: SymbolFile/PDB/variables-locations.test (676 of 1779) PASS: lldb-unit :: Utility/./UtilityTests/RangeDataVector.FindEntryThatContains (677 of 1779) PASS: lldb-unit :: UnwindAssembly/x86/./UnwindAssemblyx86Tests/Testx86AssemblyInspectionEngine.TestSimple64bitFrameFunction (678 of 1779) PASS: lldb-unit :: Language/Highlighting/./HighlighterTests/HighlighterTest.ClangPPDirectives (679 of 1779) PASS: lldb-api :: functionalities/tail_call_frames/disambiguate_call_site/TestDisambiguateCallSite.py (680 of 1779) PASS: lldb-unit :: UnwindAssembly/x86/./UnwindAssemblyx86Tests/Testx86AssemblyInspectionEngine.TestCALLNextInsn (681 of 1779) PASS: lldb-shell :: ObjectFile/PECOFF/sections-names.yaml (682 of 1779) PASS: lldb-unit :: Host/./HostTests/SocketAddressTest.Set (683 of 1779) PASS: lldb-api :: commands/expression/import-std-module/deque-basic/TestBasicDeque.py (684 of 1779) PASS: lldb-unit :: Utility/./UtilityTests/BinaryStreamTest.PutULEB128FiveBytes (685 of 1779) PASS: lldb-api :: functionalities/thread/thread_exit/TestThreadExit.py (686 of 1779) PASS: lldb-api :: commands/process/attach-resume/TestAttachResume.py (687 of 1779) PASS: lldb-shell :: ObjectFile/ELF/basic-info.yaml (688 of 1779) PASS: lldb-api :: lang/objc/modules-incomplete/TestIncompleteModules.py (689 of 1779) PASS: lldb-unit :: Utility/./UtilityTests/AnsiTerminal.Empty (690 of 1779) PASS: lldb-shell :: ObjectFile/Breakpad/sections.test (691 of 1779) PASS: lldb-shell :: Settings/TestFrameFormatColor.test (692 of 1779) PASS: lldb-unit :: SymbolFile/NativePDB/./SymbolFileNativePDBTests/PDBFPOProgramToDWARFExpressionTests.MultipleIndependentAssignments (693 of 1779) PASS: lldb-unit :: Utility/./UtilityTests/ArchSpecTest.Compatibility (694 of 1779) PASS: lldb-api :: commands/expression/radar_9673664/TestExprHelpExamples.py (695 of 1779) PASS: lldb-unit :: Utility/./UtilityTests/StreamTest.PutCharNull (696 of 1779) PASS: lldb-shell :: ObjectFile/ELF/PT_LOAD-overlap-section.yaml (697 of 1779) PASS: lldb-shell :: Commands/command-source.test (698 of 1779) PASS: lldb-unit :: Utility/./UtilityTests/CompletionRequest.TryCompleteCurrentArgBad (699 of 1779) PASS: lldb-api :: tools/lldb-server/TestLldbGdbServer.py (700 of 1779) PASS: lldb-api :: python_api/sblaunchinfo/TestSBLaunchInfo.py (701 of 1779) PASS: lldb-api :: functionalities/breakpoint/scripted_bkpt/TestScriptedResolver.py (702 of 1779) PASS: lldb-unit :: Host/./HostTests/SocketTest.TCPListen0ConnectAccept (703 of 1779) UNSUPPORTED: lldb-shell :: SymbolFile/PDB/function-nested-block.test (704 of 1779) UNSUPPORTED: lldb-shell :: SymbolFile/PDB/compilands.test (705 of 1779) PASS: lldb-shell :: SymbolFile/DWARF/dwarf5_locations.s (706 of 1779) PASS: lldb-api :: python_api/target/TestTargetAPI.py (707 of 1779) PASS: lldb-api :: lang/objc/objc++/TestObjCXX.py (708 of 1779) PASS: lldb-unit :: Utility/./UtilityTests/FileSpecTest.EqualDotsWindows (709 of 1779) PASS: lldb-api :: commands/expression/import-std-module/deque-dbg-info-content/TestDbgInfoContentDeque.py (710 of 1779) PASS: lldb-shell :: Commands/CommandScriptImmediateOutput/CommandScriptImmediateOutputFile.test (711 of 1779) PASS: lldb-api :: functionalities/tail_call_frames/sbapi_support/TestTailCallFrameSBAPI.py (712 of 1779) PASS: lldb-shell :: Driver/TestProcessAttach.test (713 of 1779) PASS: lldb-api :: commands/frame/language/TestGuessLanguage.py (714 of 1779) PASS: lldb-unit :: Host/./HostTests/NativeProcessProtocolTest.SetBreakpointFailVerify (715 of 1779) PASS: lldb-api :: functionalities/breakpoint/breakpoint_hit_count/TestBreakpointHitCount.py (716 of 1779) UNSUPPORTED: lldb-shell :: Breakpoint/ppc64-localentry.test (717 of 1779) PASS: lldb-api :: functionalities/breakpoint/cpp_exception/TestCPPExceptionBreakpoint.py (718 of 1779) PASS: lldb-api :: functionalities/inferior-changed/TestInferiorChanged.py (719 of 1779) PASS: lldb-unit :: Utility/./UtilityTests/VASprintfTest.BufferResize (720 of 1779) PASS: lldb-api :: api/command-return-object/TestSBCommandReturnObject.py (721 of 1779) PASS: lldb-unit :: tools/lldb-server/tests/./LLDBServerTests/TestBase.LaunchModePreservesEnvironment (722 of 1779) PASS: lldb-api :: functionalities/data-formatter/data-formatter-stl/libcxx/list/loop/TestDataFormatterLibcxxListLoop.py (723 of 1779) PASS: lldb-unit :: Target/./TargetTests/ModuleCacheTest.GetAndPutUuidExists (724 of 1779) PASS: lldb-api :: lang/cpp/global_operators/TestCppGlobalOperators.py (725 of 1779) PASS: lldb-api :: functionalities/thread/create_after_attach/TestCreateAfterAttach.py (726 of 1779) PASS: lldb-shell :: SymbolFile/DWARF/debug-line-basic.s (727 of 1779) PASS: lldb-unit :: Utility/./UtilityTests/StringExtractorTest.GetHexBytesAvail_Underflow (728 of 1779) PASS: lldb-api :: python_api/file_handle/TestFileHandle.py (729 of 1779) PASS: lldb-shell :: SymbolFile/DWARF/dwarf5-index-is-used.cpp (730 of 1779) PASS: lldb-api :: types/TestIntegerTypesExpr.py (731 of 1779) UNSUPPORTED: lldb-api :: benchmarks/continue/TestBenchmarkContinue.py (732 of 1779) PASS: lldb-shell :: Register/x86-64-gp-read.test (733 of 1779) PASS: lldb-unit :: Host/./HostTests/ConnectionFileDescriptorTest.TCPGetURIv4 (734 of 1779) PASS: lldb-shell :: ObjectFile/ELF/base-address.yaml (735 of 1779) PASS: lldb-unit :: Utility/./UtilityTests/ScalarTest.Promotion (736 of 1779) PASS: lldb-unit :: SymbolFile/DWARF/./SymbolFileDWARFTests/DWARFASTParserClangTests.EnsureAllDIEsInDeclContextHaveBeenParsedParsesOnlyMatchingEntries (737 of 1779) PASS: lldb-api :: functionalities/thread/concurrent_events/TestConcurrentTwoBreakpointThreads.py (738 of 1779) PASS: lldb-api :: lang/objc/global_ptrs/TestGlobalObjects.py (739 of 1779) PASS: lldb-shell :: Reproducer/TestSynchronous.test (740 of 1779) PASS: lldb-unit :: UnwindAssembly/x86/./UnwindAssemblyx86Tests/Testx86AssemblyInspectionEngine.TestSimplex86_64Augmented (741 of 1779) UNSUPPORTED: lldb-api :: tools/lldb-vscode/variables/TestVSCode_variables.py (742 of 1779) PASS: lldb-api :: commands/frame/diagnose/bad-reference/TestBadReference.py (743 of 1779) PASS: lldb-api :: commands/settings/quoting/TestQuoting.py (744 of 1779) PASS: lldb-unit :: Utility/./UtilityTests/StreamTest.PutChar (745 of 1779) PASS: lldb-api :: python_api/exprpath_synthetic/TestExprPathSynthetic.py (746 of 1779) PASS: lldb-api :: lang/objc/foundation/TestConstStrings.py (747 of 1779) PASS: lldb-unit :: Utility/./UtilityTests/StructuredDataTest.ParseJSONFromFile (748 of 1779) PASS: lldb-api :: functionalities/thread/concurrent_events/TestConcurrentSignalBreak.py (749 of 1779) PASS: lldb-unit :: Utility/./UtilityTests/StreamTest.PutBytesAsRawHex8ToMixedEndian (750 of 1779) PASS: lldb-unit :: Utility/./UtilityTests/LogTest.Unregister (751 of 1779) PASS: lldb-shell :: Quit/TestQuitExitCode0.test (752 of 1779) PASS: lldb-unit :: Utility/./UtilityTests/ArchSpecTest.TestParseMachCPUDashSubtypeTripleSimple (753 of 1779) PASS: lldb-api :: functionalities/recursion/TestValueObjectRecursion.py (754 of 1779) PASS: lldb-api :: commands/expression/import-std-module/unique_ptr/TestUniquePtr.py (755 of 1779) PASS: lldb-api :: macosx/order/TestOrderFile.py (756 of 1779) PASS: lldb-api :: lang/objc/objc-foundation-dictionary-empty/TestNSDictionary0.py (757 of 1779) PASS: lldb-api :: functionalities/data-formatter/data-formatter-stl/libcxx/unordered/TestDataFormatterUnordered.py (758 of 1779) PASS: lldb-unit :: Utility/./UtilityTests/BinaryStreamTest.PutSLEB128ThreeBytes (759 of 1779) PASS: lldb-api :: lang/cpp/accelerator-table/TestCPPAccelerator.py (760 of 1779) UNSUPPORTED: lldb-api :: functionalities/breakpoint/breakpoint_in_delayslot/TestAvoidBreakpointInDelaySlot.py (761 of 1779) PASS: lldb-shell :: SymbolFile/DWARF/dir-separator-windows.s (762 of 1779) PASS: lldb-api :: functionalities/data-formatter/data-formatter-python-synth/TestDataFormatterPythonSynth.py (763 of 1779) PASS: lldb-api :: lang/objc/objc-runtime-ivars/TestRuntimeIvars.py (764 of 1779) PASS: lldb-api :: lang/objc/forward-decl/TestForwardDecl.py (765 of 1779) PASS: lldb-unit :: Utility/./UtilityTests/UriParserTest.BracketedHostnamePort (766 of 1779) PASS: lldb-unit :: Utility/./UtilityTests/RangeTest.Clear (767 of 1779) UNSUPPORTED: lldb-api :: functionalities/thread/concurrent_events/TestConcurrentManySignals.py (768 of 1779) PASS: lldb-api :: lang/objc/objc-baseclass-sbtype/TestObjCBaseClassSBType.py (769 of 1779) PASS: lldb-unit :: UnwindAssembly/x86/./UnwindAssemblyx86Tests/Testx86AssemblyInspectionEngine.TestSpillRegToStackViaMOVx86_64 (770 of 1779) PASS: lldb-api :: functionalities/data-formatter/frameformat_smallstruct/TestFrameFormatSmallStruct.py (771 of 1779) PASS: lldb-unit :: ObjectFile/Breakpad/./ObjectFileBreakpadTests/PublicRecord.parse (772 of 1779) PASS: lldb-unit :: Utility/./UtilityTests/BinaryStreamTest.PutULEB128SixBytes (773 of 1779) UNSUPPORTED: lldb-shell :: Register/x86-gp-write.test (774 of 1779) PASS: lldb-api :: commands/expression/import-std-module/no-std-module/TestMissingStdModule.py (775 of 1779) PASS: lldb-unit :: SymbolFile/NativePDB/./SymbolFileNativePDBTests/PDBFPOProgramToDWARFExpressionTests.DependencyChain (776 of 1779) PASS: lldb-api :: functionalities/deleted-executable/TestDeletedExecutable.py (777 of 1779) PASS: lldb-unit :: Utility/./UtilityTests/NameMatchesTest.Contains (778 of 1779) PASS: lldb-shell :: Quit/TestQuitExitCodeHexA.test (779 of 1779) PASS: lldb-api :: lang/cpp/namespace_conflicts/TestNamespaceConflicts.py (780 of 1779) PASS: lldb-api :: commands/expression/dollar-in-variable/TestDollarInVariable.py (781 of 1779) UNSUPPORTED: lldb-api :: commands/expression/completion-crash1/TestCompletionCrash1.py (782 of 1779) PASS: lldb-unit :: Symbol/./SymbolTests/TestClangASTContext.TestRemoveFastQualifiers (783 of 1779) PASS: lldb-api :: functionalities/thread/concurrent_events/TestConcurrentTwoWatchpointsOneBreakpoint.py (784 of 1779) PASS: lldb-api :: lang/objc/conflicting-definition/TestConflictingDefinition.py (785 of 1779) PASS: lldb-api :: python_api/name_lookup/TestNameLookup.py (786 of 1779) PASS: lldb-unit :: Target/./TargetTests/PathMappingListTest.RemapRoot (787 of 1779) PASS: lldb-unit :: UnwindAssembly/x86/./UnwindAssemblyx86Tests/Testx86AssemblyInspectionEngine.TestPopR14 (788 of 1779) PASS: lldb-unit :: Process/gdb-remote/./ProcessGdbRemoteTests/GDBRemoteCommunicationClientTest.SendSignalsToIgnore (789 of 1779) PASS: lldb-api :: functionalities/asan/TestMemoryHistory.py (790 of 1779) PASS: lldb-unit :: Utility/./UtilityTests/UserIDResolver.GetGroupName (791 of 1779) PASS: lldb-shell :: SymbolFile/DWARF/debug_aranges-empty-section.s (792 of 1779) PASS: lldb-unit :: Process/gdb-remote/./ProcessGdbRemoteTests/GDBRemoteCommunicationClientTest.SendStopTracePacket (793 of 1779) PASS: lldb-unit :: UnwindAssembly/x86/./UnwindAssemblyx86Tests/Testx86AssemblyInspectionEngine.TestStackRealignMSVC_i386 (794 of 1779) PASS: lldb-api :: lang/objc/modules/TestObjCModules.py (795 of 1779) PASS: lldb-api :: lang/objc/foundation/TestObjCMethodsString.py (796 of 1779) PASS: lldb-api :: lang/c/set_values/TestSetValues.py (797 of 1779) PASS: lldb-unit :: Utility/./UtilityTests/StreamTest.PutCStringWithStringRef (798 of 1779) PASS: lldb-unit :: Utility/./UtilityTests/StringListTest.SplitIntoLinesSingleTrailingCR (799 of 1779) PASS: lldb-api :: lang/objc/objc-optimized/TestObjcOptimized.py (800 of 1779) PASS: lldb-unit :: Utility/./UtilityTests/OptionsWithRawTest.EmptySuffix (801 of 1779) PASS: lldb-api :: functionalities/breakpoint/breakpoint_command/TestBreakpointCommandsFromPython.py (802 of 1779) PASS: lldb-api :: commands/frame/var-scope/TestFrameVariableScope.py (803 of 1779) PASS: lldb-api :: types/TestRecursiveTypes.py (804 of 1779) PASS: lldb-unit :: UnwindAssembly/x86/./UnwindAssemblyx86Tests/Testx86AssemblyInspectionEngine.TestPushEBP (805 of 1779) PASS: lldb-unit :: UnwindAssembly/x86/./UnwindAssemblyx86Tests/Testx86AssemblyInspectionEngine.TestPushRBX (806 of 1779) PASS: lldb-api :: functionalities/postmortem/elf-core/TestLinuxCore.py (807 of 1779) PASS: lldb-unit :: Utility/./UtilityTests/AnsiTerminal.KnownPrefix (808 of 1779) PASS: lldb-unit :: Utility/./UtilityTests/Flags.AnySet (809 of 1779) PASS: lldb-unit :: Language/Highlighting/./HighlighterTests/HighlighterTest.HighlighterSelectionPath (810 of 1779) PASS: lldb-api :: functionalities/gdb_remote_client/TestStopPCs.py (811 of 1779) PASS: lldb-shell :: SymbolFile/Breakpad/line-table-missing-file.test (812 of 1779) PASS: lldb-unit :: debugserver/./debugserverTests/RNBSocket.LoopBackConnectIPv4 (813 of 1779) PASS: lldb-unit :: UnwindAssembly/x86/./UnwindAssemblyx86Tests/Testx86AssemblyInspectionEngine.TestDisassemblyJunkBytes (814 of 1779) PASS: lldb-unit :: Utility/./UtilityTests/BinaryStreamTest.PutULEB128One (815 of 1779) PASS: lldb-unit :: Target/./TargetTests/PathMappingListTest.AbsoluteTests (816 of 1779) PASS: lldb-api :: commands/process/attach/attach_denied/TestAttachDenied.py (817 of 1779) PASS: lldb-api :: functionalities/data-formatter/data-formatter-objc/TestDataFormatterObjCKVO.py (818 of 1779) PASS: lldb-shell :: BuildScript/script-args.test (819 of 1779) PASS: lldb-unit :: Utility/./UtilityTests/CompletionRequest.DuplicateFiltering (820 of 1779) PASS: lldb-unit :: Host/./HostTests/NativeProcessProtocolTest.SetBreakpoint (821 of 1779) PASS: lldb-unit :: Utility/./UtilityTests/SerializationRountripTest.SerializeDeserializeCString (822 of 1779) PASS: lldb-unit :: Host/./HostTests/TaskPoolTest.TaskMap (823 of 1779) PASS: lldb-unit :: Process/gdb-remote/./ProcessGdbRemoteTests/GDBRemoteCommunicationClientTest.WriteRegister (824 of 1779) PASS: lldb-unit :: Utility/./UtilityTests/StreamTeeTest.DefaultConstructor (825 of 1779) PASS: lldb-unit :: Utility/./UtilityTests/StreamTest.PutHex64ByteOrderLittle (826 of 1779) PASS: lldb-unit :: Utility/./UtilityTests/BroadcasterTest.BroadcastEvent (827 of 1779) PASS: lldb-unit :: Utility/./UtilityTests/StringExtractorTest.GetHexU8_InvalidHex_NoEof (828 of 1779) PASS: lldb-api :: commands/watchpoints/watchpoint_commands/condition/TestWatchpointConditionCmd.py (829 of 1779) PASS: lldb-unit :: Utility/./UtilityTests/RegularExpression.Invalid (830 of 1779) PASS: lldb-api :: python_api/process/TestProcessAPI.py (831 of 1779) PASS: lldb-api :: functionalities/thread/concurrent_events/TestConcurrentDelayWatchBreak.py (832 of 1779) PASS: lldb-api :: functionalities/target_var/TestTargetVar.py (833 of 1779) PASS: lldb-api :: functionalities/history/TestHistoryRecall.py (834 of 1779) PASS: lldb-unit :: Utility/./UtilityTests/FileSpecTest.RemoveLastPathComponent (835 of 1779) PASS: lldb-shell :: Breakpoint/case-sensitive.test (836 of 1779) PASS: lldb-api :: lang/c/enum_types/TestEnumTypes.py (837 of 1779) PASS: lldb-unit :: Utility/./UtilityTests/StreamTest.ShiftOperatorInts (838 of 1779) PASS: lldb-unit :: Utility/./UtilityTests/UriParserTest.MinimalPort (839 of 1779) PASS: lldb-unit :: Utility/./UtilityTests/ConstStringTest.NullAndEmptyStates (840 of 1779) PASS: lldb-api :: functionalities/data-formatter/data-formatter-stl/libcxx/multiset/TestDataFormatterLibcxxMultiSet.py (841 of 1779) PASS: lldb-unit :: Utility/./UtilityTests/StringExtractorTest.InitMisc (842 of 1779) PASS: lldb-unit :: Utility/./UtilityTests/RegularExpression.Empty (843 of 1779) PASS: lldb-api :: commands/expression/import-std-module/stack/TestStack.py (844 of 1779) PASS: lldb-api :: functionalities/data-formatter/typedef_array/TestTypedefArray.py (845 of 1779) PASS: lldb-unit :: Utility/./UtilityTests/NameMatchesTest.RegularExpression (846 of 1779) PASS: lldb-api :: commands/expression/import-std-module/queue/TestQueue.py (847 of 1779) PASS: lldb-api :: commands/watchpoints/hello_watchpoint/TestMyFirstWatchpoint.py (848 of 1779) PASS: lldb-api :: lang/c/struct_types/TestStructTypes.py (849 of 1779) PASS: lldb-unit :: ScriptInterpreter/Python/./ScriptInterpreterPythonTests/PythonExceptionStateTest.TestAutoRestoreSemantics (850 of 1779) PASS: lldb-unit :: ObjectFile/Breakpad/./ObjectFileBreakpadTests/StackWinRecord.parse (851 of 1779) PASS: lldb-unit :: Utility/./UtilityTests/StringLexerTest.AdvanceIf (852 of 1779) PASS: lldb-unit :: Utility/./UtilityTests/StreamTeeTest.GetStreamAtIndexOutOfBoundsEmpty (853 of 1779) PASS: lldb-unit :: Process/minidump/./LLDBMinidumpTests/MinidumpParserTest.MinidumpModuleOrder (854 of 1779) PASS: lldb-api :: python_api/value/TestValueAPI.py (855 of 1779) PASS: lldb-unit :: Utility/./UtilityTests/FileSpecTest.PrependPathComponent (856 of 1779) PASS: lldb-unit :: Utility/./UtilityTests/StringListTest.InsertStringAtIndexOutOfBounds (857 of 1779) PASS: lldb-api :: lang/cpp/extern_c/TestExternCSymbols.py (858 of 1779) PASS: lldb-api :: lang/objc/objc-checker/TestObjCCheckers.py (859 of 1779) UNSUPPORTED: lldb-api :: functionalities/unwind/standard/TestStandardUnwind.py (860 of 1779) PASS: lldb-unit :: Process/minidump/./LLDBMinidumpTests/MinidumpParserTest.GetMemoryRegionInfoLinuxMaps (861 of 1779) PASS: lldb-api :: functionalities/data-formatter/data-formatter-stl/libcxx/vector/TestDataFormatterLibcxxVector.py (862 of 1779) PASS: lldb-unit :: Utility/./UtilityTests/StatusTest.ErrorConversion (863 of 1779) PASS: lldb-api :: lang/cpp/unique-types/TestUniqueTypes.py (864 of 1779) PASS: lldb-unit :: Utility/./UtilityTests/UriParserTest.SchemeHostSeparator4 (865 of 1779) PASS: lldb-api :: functionalities/load_unload/TestLoadUnload.py (866 of 1779) PASS: lldb-api :: lang/objc/foundation/TestObjCMethodsNSError.py (867 of 1779) PASS: lldb-unit :: Expression/./ExpressionTests/CppModuleConfigurationTest.Linux (868 of 1779) PASS: lldb-api :: functionalities/data-formatter/data-formatter-objc/nsindexpath/TestDataFormatterNSIndexPath.py (869 of 1779) PASS: lldb-unit :: Utility/./UtilityTests/DataExtractorTest.PeekData (870 of 1779) PASS: lldb-unit :: Utility/./UtilityTests/StreamTest.PutNHex8 (871 of 1779) PASS: lldb-unit :: Process/minidump/./LLDBMinidumpTests/MinidumpParserTest.GetMemoryRegionInfoFromMemoryList (872 of 1779) PASS: lldb-shell :: SymbolFile/DWARF/debug-names-compressed.cpp (873 of 1779) UNSUPPORTED: lldb-shell :: SymbolFile/PDB/vbases.test (874 of 1779) PASS: lldb-unit :: Utility/./UtilityTests/OptionsWithRawTest.SingleWordSuffix (875 of 1779) PASS: lldb-shell :: ObjectFile/MachO/subsections.yaml (876 of 1779) PASS: lldb-api :: lang/objc/unicode-string/TestUnicodeString.py (877 of 1779) PASS: lldb-unit :: Utility/./UtilityTests/RegularExpression.Match (878 of 1779) PASS: lldb-api :: commands/watchpoints/watchpoint_commands/TestWatchpointCommands.py (879 of 1779) PASS: lldb-unit :: Utility/./UtilityTests/StringLexerTest.Next (880 of 1779) PASS: lldb-shell :: SymbolFile/DWARF/debug_ranges.s (881 of 1779) PASS: lldb-api :: functionalities/data-formatter/data-formatter-objc/TestDataFormatterObjNSException.py (882 of 1779) PASS: lldb-unit :: Utility/./UtilityTests/UriParserTest.BadPort2 (883 of 1779) PASS: lldb-unit :: Utility/./UtilityTests/RangeTest.ContainsRange (884 of 1779) PASS: lldb-unit :: Utility/./UtilityTests/StreamTest.ShiftOperatorPtr (885 of 1779) PASS: lldb-unit :: UnwindAssembly/x86/./UnwindAssemblyx86Tests/Testx86AssemblyInspectionEngine.Test64bitFramelessBigStackFrame (886 of 1779) PASS: lldb-unit :: Utility/./UtilityTests/StreamTest.PutBytesAsRawHex8ToBigEndian (887 of 1779) PASS: lldb-api :: python_api/value/change_values/TestChangeValueAPI.py (888 of 1779) PASS: lldb-api :: commands/apropos/with-process/TestAproposWithProcess.py (889 of 1779) PASS: lldb-api :: commands/frame/diagnose/dereference-argument/TestDiagnoseDereferenceArgument.py (890 of 1779) PASS: lldb-shell :: SymbolFile/DWARF/find-inline-method.s (891 of 1779) PASS: lldb-unit :: Utility/./UtilityTests/StatusTest.Formatv (892 of 1779) UNSUPPORTED: lldb-api :: functionalities/darwin_log/source/debug/TestDarwinLogSourceDebug.py (893 of 1779) PASS: lldb-shell :: SymbolFile/NativePDB/ast-functions.cpp (894 of 1779) PASS: lldb-unit :: Process/minidump/./LLDBMinidumpTests/MinidumpParserTest.FindMemoryRangeWithFullMemoryMinidump (895 of 1779) PASS: lldb-api :: lang/c/conflicting-symbol/TestConflictingSymbol.py (896 of 1779) PASS: lldb-shell :: Settings/TestSettingsWrite.test (897 of 1779) PASS: lldb-unit :: Utility/./UtilityTests/ScalarTest.Comparison (898 of 1779) PASS: lldb-unit :: ScriptInterpreter/Python/./ScriptInterpreterPythonTests/PythonDataObjectsTest.TestPythonIntegerToStr (899 of 1779) PASS: lldb-api :: tools/lldb-server/TestGdbRemote_qThreadStopInfo.py (900 of 1779) PASS: lldb-api :: functionalities/data-formatter/boolreference/TestFormattersBoolRefPtr.py (901 of 1779) PASS: lldb-unit :: Language/CPlusPlus/./LanguageCPlusPlusTests/CPlusPlusLanguage.MethodNameParsing (902 of 1779) UNSUPPORTED: lldb-api :: benchmarks/turnaround/TestCompileRunToBreakpointTurnaround.py (903 of 1779) PASS: lldb-shell :: Expr/TestMultilineExpr.test (904 of 1779) UNSUPPORTED: lldb-api :: functionalities/darwin_log/source/info/TestDarwinLogSourceInfo.py (905 of 1779) PASS: lldb-api :: lang/cpp/exceptions/TestCPPExceptionBreakpoints.py (906 of 1779) PASS: lldb-unit :: Symbol/./SymbolTests/TestClangASTContext.TestIsClangType (907 of 1779) UNSUPPORTED: lldb-shell :: Breakpoint/case-insensitive.test (908 of 1779) PASS: lldb-api :: functionalities/data-formatter/type_summary_list_script/TestTypeSummaryListScript.py (909 of 1779) PASS: lldb-unit :: Utility/./UtilityTests/BinaryStreamTest.PutULEB128NineBytes (910 of 1779) PASS: lldb-shell :: ObjectFile/ELF/netbsd-core-amd64.test (911 of 1779) PASS: lldb-unit :: Host/./HostTests/MainLoopTest.Signal (912 of 1779) PASS: lldb-api :: functionalities/gdb_remote_client/TestGDBRemoteClient.py (913 of 1779) PASS: lldb-unit :: Utility/./UtilityTests/FileSpecTest.FormatFileSpec (914 of 1779) PASS: lldb-unit :: UnwindAssembly/x86/./UnwindAssemblyx86Tests/Testx86AssemblyInspectionEngine.Test32bitFramelessSmallStackFrame (915 of 1779) UNSUPPORTED: lldb-api :: tools/lldb-vscode/launch/TestVSCode_launch.py (916 of 1779) PASS: lldb-unit :: Utility/./UtilityTests/BinaryStreamTest.PutULEB128FourBytes (917 of 1779) PASS: lldb-unit :: Utility/./UtilityTests/StringListTest.DefaultConstructor (918 of 1779) PASS: lldb-unit :: Utility/./UtilityTests/DataExtractorTest.GetMaxU64_unchecked (919 of 1779) PASS: lldb-unit :: Host/./HostTests/NativeProcessProtocolTest.SetBreakpointFailWrite (920 of 1779) PASS: lldb-api :: python_api/lldbutil/TestSwigVersion.py (921 of 1779) PASS: lldb-unit :: ScriptInterpreter/Python/./ScriptInterpreterPythonTests/PythonDataObjectsTest.TestPythonIntegerToStructuredInteger (922 of 1779) PASS: lldb-api :: lang/objc/objc-ivar-stripped/TestObjCIvarStripped.py (923 of 1779) PASS: lldb-api :: commands/target/create-deps/TestTargetCreateDeps.py (924 of 1779) PASS: lldb-unit :: Utility/./UtilityTests/DataExtractorTest.GetCStrAtNullOffset (925 of 1779) PASS: lldb-unit :: Utility/./UtilityTests/StringExtractorTest.GetHexBytes (926 of 1779) PASS: lldb-api :: lang/cpp/offsetof/TestOffsetofCpp.py (927 of 1779) PASS: lldb-unit :: Utility/./UtilityTests/OptionsWithRawTest.QuotedSuffix (928 of 1779) PASS: lldb-api :: lang/objc/blocks/TestObjCIvarsInBlocks.py (929 of 1779) PASS: lldb-unit :: Utility/./UtilityTests/StringListTest.AppendStringStdString (930 of 1779) PASS: lldb-api :: driver/batch_mode/TestBatchMode.py (931 of 1779) PASS: lldb-api :: commands/expression/fixits/TestFixIts.py (932 of 1779) PASS: lldb-unit :: ScriptInterpreter/Python/./ScriptInterpreterPythonTests/PythonExceptionStateTest.TestExceptionStateChecking (933 of 1779) PASS: lldb-api :: functionalities/type_completion/TestTypeCompletion.py (934 of 1779) PASS: lldb-api :: lang/objc/foundation/TestObjCMethods.py (935 of 1779) PASS: lldb-api :: functionalities/jitloader_gdb/TestJITLoaderGDB.py (936 of 1779) PASS: lldb-unit :: Utility/./UtilityTests/RecordReplayTest.InstrumentedBar (937 of 1779) PASS: lldb-api :: functionalities/breakpoint/consecutive_breakpoints/TestConsecutiveBreakpoints.py (938 of 1779) UNSUPPORTED: lldb-api :: tools/lldb-vscode/attach/TestVSCode_attach.py (939 of 1779) PASS: lldb-unit :: Utility/./UtilityTests/UriParserTest.SchemeHostSeparator2 (940 of 1779) PASS: lldb-unit :: Utility/./UtilityTests/StreamTest.ShiftOperatorUInts (941 of 1779) PASS: lldb-unit :: Host/./HostTests/MainLoopTest.UnmonitoredSignal (942 of 1779) PASS: lldb-shell :: SymbolFile/DWARF/apple-index-is-used.cpp (943 of 1779) PASS: lldb-api :: functionalities/postmortem/minidump/TestMiniDump.py (944 of 1779) PASS: lldb-unit :: ScriptInterpreter/Python/./ScriptInterpreterPythonTests/PythonDataObjectsTest.TestOwnedReferences (945 of 1779) UNSUPPORTED: lldb-shell :: SymbolFile/PDB/udt-layout.test (946 of 1779) PASS: lldb-shell :: ObjectFile/ELF/duplicate-section.yaml (947 of 1779) PASS: lldb-api :: functionalities/abbreviation/TestCommonShortSpellings.py (948 of 1779) PASS: lldb-unit :: Process/minidump/./LLDBMinidumpTests/MinidumpParserTest.GetThreadContext_x86_64 (949 of 1779) PASS: lldb-unit :: Process/gdb-remote/./ProcessGdbRemoteTests/GDBRemoteCommunicationServerTest.SendErrorResponse_StringError (950 of 1779) PASS: lldb-unit :: Utility/./UtilityTests/Predicate.WaitForValueNotEqualTo (951 of 1779) PASS: lldb-api :: lang/cpp/limit-debug-info/TestWithLimitDebugInfo.py (952 of 1779) PASS: lldb-unit :: Utility/./UtilityTests/VASprintfTest.EncodingError (953 of 1779) PASS: lldb-unit :: Target/./TargetTests/ModuleCacheTest.GetAndPut (954 of 1779) PASS: lldb-api :: python_api/objc_type/TestObjCType.py (955 of 1779) PASS: lldb-api :: macosx/indirect_symbol/TestIndirectSymbols.py (956 of 1779) PASS: lldb-unit :: Utility/./UtilityTests/VMRange.IsValid (957 of 1779) PASS: lldb-shell :: Breakpoint/debug_rnglistx_rlex.test (958 of 1779) PASS: lldb-unit :: ObjectFile/Breakpad/./ObjectFileBreakpadTests/FuncRecord.parse (959 of 1779) PASS: lldb-shell :: ObjectFile/ELF/netbsd-exec-8.99.30-amd64.yaml (960 of 1779) PASS: lldb-api :: functionalities/breakpoint/auto_continue/TestBreakpointAutoContinue.py (961 of 1779) PASS: lldb-unit :: ObjectFile/Breakpad/./ObjectFileBreakpadTests/FileRecord.parse (962 of 1779) PASS: lldb-unit :: Host/./HostTests/NativeProcessProtocolTest.ReadCStringFromMemory (963 of 1779) PASS: lldb-unit :: Utility/./UtilityTests/ArgsTest.ReplaceArgumentAtIndexFarOutOfRange (964 of 1779) PASS: lldb-api :: functionalities/ubsan/basic/TestUbsanBasic.py (965 of 1779) PASS: lldb-api :: lang/cpp/unsigned_types/TestUnsignedTypes.py (966 of 1779) PASS: lldb-api :: commands/command/nested_alias/TestNestedAlias.py (967 of 1779) PASS: lldb-unit :: Symbol/./SymbolTests/SymbolsTest.LocateExecutableSymbolFileForUnknownExecutableAndMissingSymbolFile (968 of 1779) PASS: lldb-unit :: Utility/./UtilityTests/CompletionRequest.FakeLastArg (969 of 1779) PASS: lldb-shell :: Process/TestEnvironment.test (970 of 1779) PASS: lldb-unit :: Core/./LLDBCoreTests/StreamCallbackTest.Callback (971 of 1779) PASS: lldb-unit :: ObjectFile/PECOFF/./ObjectFilePECOFFTests/PECallFrameInfoTest.Chained_eh (972 of 1779) PASS: lldb-unit :: Utility/./UtilityTests/LogTest.LLDB_LOG_nullptr (973 of 1779) PASS: lldb-shell :: SymbolFile/DWARF/find-variable-file.cpp (974 of 1779) PASS: lldb-unit :: Utility/./UtilityTests/BinaryStreamTest.PutSLEB128FourBytes (975 of 1779) PASS: lldb-unit :: UnwindAssembly/x86/./UnwindAssemblyx86Tests/Testx86AssemblyInspectionEngine.TestStackRealign32BitDisp_x86_64 (976 of 1779) PASS: lldb-api :: commands/watchpoints/multiple_hits/TestMultipleHits.py (977 of 1779) PASS: lldb-unit :: SymbolFile/NativePDB/./SymbolFileNativePDBTests/PDBFPOProgramToDWARFExpressionTests.SingleAssignmentRegisterRef (978 of 1779) PASS: lldb-unit :: Utility/./UtilityTests/ArgsTest.StringListConstructor (979 of 1779) PASS: lldb-unit :: Utility/./UtilityTests/CompletionRequest.TryCompleteCurrentArgGood (980 of 1779) PASS: lldb-api :: functionalities/data-formatter/data-formatter-skip-summary/TestDataFormatterSkipSummary.py (981 of 1779) PASS: lldb-unit :: Target/./TargetTests/ModuleCacheTest.GetAndPutStrangeHostname (982 of 1779) PASS: lldb-unit :: Utility/./UtilityTests/UUIDTest.StringConverion (983 of 1779) PASS: lldb-api :: python_api/watchpoint/condition/TestWatchpointConditionAPI.py (984 of 1779) PASS: lldb-api :: lang/c/modules/TestCModules.py (985 of 1779) PASS: lldb-unit :: Host/./HostTests/SocketTest.DomainListenConnectAccept (986 of 1779) PASS: lldb-unit :: Utility/./UtilityTests/StringExtractorTest.GetHexBytes_FullString (987 of 1779) PASS: lldb-api :: macosx/lc-note/kern-ver-str/TestKernVerStrLCNOTE.py (988 of 1779) PASS: lldb-api :: functionalities/thread/concurrent_events/TestConcurrentWatchpointWithDelayWatchpointThreads.py (989 of 1779) PASS: lldb-unit :: ScriptInterpreter/Python/./ScriptInterpreterPythonTests/PythonDataObjectsTest.TestPythonDictionaryValueEquality (990 of 1779) PASS: lldb-api :: lang/cpp/template/TestTemplateArgs.py (991 of 1779) PASS: lldb-unit :: Utility/./UtilityTests/UriParserTest.SchemeHostSeparator (992 of 1779) PASS: lldb-unit :: Utility/./UtilityTests/StringExtractorTest.GetHexU8_Underflow2 (993 of 1779) PASS: lldb-api :: functionalities/breakpoint/objc/TestObjCBreakpoints.py (994 of 1779) PASS: lldb-unit :: Utility/./UtilityTests/ArchSpecTest.TestParseMachCPUDashSubtypeTripleExtra (995 of 1779) PASS: lldb-unit :: Interpreter/./InterpreterTests/CompletionTest.DirCompletionUsername (996 of 1779) PASS: lldb-unit :: Process/minidump/./LLDBMinidumpTests/MinidumpParserTest.GetThreadContext_x86_32 (997 of 1779) PASS: lldb-shell :: ObjectFile/Breakpad/uuid-matching-mac.test (998 of 1779) PASS: lldb-unit :: Expression/./ExpressionTests/CppModuleConfigurationTest.LinuxLocalLibCpp (999 of 1779) PASS: lldb-api :: commands/watchpoints/watchpoint_commands/command/TestWatchpointCommandPython.py (1000 of 1779) PASS: lldb-api :: commands/watchpoints/watchpoint_set_command/TestWatchLocationWithWatchSet.py (1001 of 1779) PASS: lldb-unit :: Process/gdb-remote/./ProcessGdbRemoteTests/GDBRemoteClientBaseTest.SendContinueAndInterrupt (1002 of 1779) PASS: lldb-unit :: Target/./TargetTests/PathMappingListTest.RelativeTests (1003 of 1779) PASS: lldb-unit :: Utility/./UtilityTests/DataExtractorTest.GetMaxS64 (1004 of 1779) PASS: lldb-shell :: ObjectFile/ELF/build-id-case.yaml (1005 of 1779) PASS: lldb-unit :: Utility/./UtilityTests/FileSpecTest.EqualDotsPosix (1006 of 1779) PASS: lldb-api :: functionalities/data-formatter/data-formatter-objc/TestDataFormatterObjCNSContainer.py (1007 of 1779) PASS: lldb-unit :: Utility/./UtilityTests/DataExtractorTest.GetBitfield (1008 of 1779) PASS: lldb-unit :: Utility/./UtilityTests/StringExtractorTest.DecodeHexU8_Underflow2 (1009 of 1779) PASS: lldb-unit :: Host/./HostTests/File.GetWaitableHandleFileno (1010 of 1779) PASS: lldb-unit :: Utility/./UtilityTests/StringListTest.GetSize (1011 of 1779) PASS: lldb-unit :: Host/./HostTests/MainLoopTest.TerminatesImmediately (1012 of 1779) PASS: lldb-shell :: SymbolFile/DWARF/debug_rnglists.s (1013 of 1779) PASS: lldb-unit :: Process/minidump/./LLDBMinidumpTests/MinidumpParserTest.GetMemoryRegionInfoFromMemory64List (1014 of 1779) PASS: lldb-api :: lang/objcxx/hide-runtime-values/TestObjCXXHideRuntimeValues.py (1015 of 1779) PASS: lldb-api :: functionalities/data-formatter/vector-types/TestVectorTypesFormatting.py (1016 of 1779) PASS: lldb-unit :: Utility/./UtilityTests/OptionsWithRawTest.MultiWordSuffix (1017 of 1779) PASS: lldb-unit :: Utility/./UtilityTests/ArchSpecTest.MergeFromMachOUnknown (1018 of 1779) PASS: lldb-unit :: Utility/./UtilityTests/RecordReplayTest.InstrumentedBarRef (1019 of 1779) PASS: lldb-unit :: Utility/./UtilityTests/StringExtractorTest.GetHexBytes_OddPair2 (1020 of 1779) PASS: lldb-api :: commands/watchpoints/watchpoint_size/TestWatchpointSizes.py (1021 of 1779) UNSUPPORTED: lldb-api :: tools/lldb-vscode/stackTrace/TestVSCode_stackTrace.py (1022 of 1779) PASS: lldb-api :: lang/cpp/const_this/TestConstThis.py (1023 of 1779) PASS: lldb-unit :: Utility/./UtilityTests/ArgsTest.BareSingleQuote (1024 of 1779) PASS: lldb-api :: python_api/watchpoint/TestWatchpointIgnoreCount.py (1025 of 1779) PASS: lldb-unit :: Utility/./UtilityTests/StreamTeeTest.Constructor1Stream (1026 of 1779) PASS: lldb-api :: functionalities/postmortem/minidump-new/TestMiniDumpUUID.py (1027 of 1779) UNSUPPORTED: lldb-api :: tools/lldb-server/TestGdbRemoteModuleInfo.py (1028 of 1779) PASS: lldb-api :: functionalities/data-formatter/data-formatter-categories/TestDataFormatterCategories.py (1029 of 1779) PASS: lldb-api :: lang/objc/variadic_methods/TestVariadicMethods.py (1030 of 1779) PASS: lldb-shell :: ObjectFile/MachO/lc_version_min.yaml (1031 of 1779) PASS: lldb-api :: macosx/universal/TestUniversal.py (1032 of 1779) PASS: lldb-api :: python_api/watchpoint/watchlocation/TestTargetWatchAddress.py (1033 of 1779) PASS: lldb-shell :: SymbolFile/Breakpad/line-table-discontinuous-file-ids.test (1034 of 1779) PASS: lldb-unit :: Utility/./UtilityTests/OptionsWithRawTest.EmptySuffixSingleWhitespace (1035 of 1779) PASS: lldb-api :: lang/cpp/call-function/TestCallCPPFunction.py (1036 of 1779) PASS: lldb-unit :: Utility/./UtilityTests/StateTest.Formatv (1037 of 1779) PASS: lldb-unit :: Utility/./UtilityTests/VMRange.ContainsAddr (1038 of 1779) PASS: lldb-unit :: Utility/./UtilityTests/StringListTest.JoinEmpty (1039 of 1779) PASS: lldb-api :: api/log/TestAPILog.py (1040 of 1779) PASS: lldb-api :: lang/cpp/lambdas/TestLambdas.py (1041 of 1779) PASS: lldb-unit :: Utility/./UtilityTests/ArgsTest.ReplaceArgumentAtIndexEqual (1042 of 1779) PASS: lldb-unit :: Utility/./UtilityTests/StringListTest.Clear (1043 of 1779) PASS: lldb-unit :: Utility/./UtilityTests/SerializationRountripTest.SerializeDeserializePod (1044 of 1779) PASS: lldb-unit :: ScriptInterpreter/Python/./ScriptInterpreterPythonTests/PythonDataObjectsTest.TestBorrowedReferences (1045 of 1779) PASS: lldb-unit :: Utility/./UtilityTests/ScalarTest.ComparisonFloat (1046 of 1779) PASS: lldb-unit :: Utility/./UtilityTests/StreamTest.PutULEB128 (1047 of 1779) PASS: lldb-shell :: SymbolFile/NativePDB/global-classes.cpp (1048 of 1779) PASS: lldb-api :: functionalities/data-formatter/type_summary_list_arg/TestTypeSummaryListArg.py (1049 of 1779) PASS: lldb-api :: functionalities/plugins/python_os_plugin/TestPythonOSPlugin.py (1050 of 1779) PASS: lldb-shell :: Commands/command-script-import.test (1051 of 1779) PASS: lldb-api :: functionalities/data-formatter/compactvectors/TestCompactVectors.py (1052 of 1779) PASS: lldb-shell :: SymbolFile/DWARF/split-dwarf-inlining.cpp (1053 of 1779) PASS: lldb-unit :: Symbol/./SymbolTests/TestClangASTContext.TemplateArguments (1054 of 1779) PASS: lldb-unit :: Utility/./UtilityTests/ScalarTest.CastOperations (1055 of 1779) PASS: lldb-api :: lang/cpp/gmodules/TestWithModuleDebugging.py (1056 of 1779) PASS: lldb-shell :: Driver/LocalLLDBInit.test (1057 of 1779) PASS: lldb-api :: functionalities/thread/concurrent_events/TestConcurrentCrashWithSignal.py (1058 of 1779) PASS: lldb-api :: python_api/formatters/TestFormattersSBAPI.py (1059 of 1779) PASS: lldb-api :: commands/expression/two-files/TestObjCTypeQueryFromOtherCompileUnit.py (1060 of 1779) PASS: lldb-api :: lang/cpp/global_variables/TestCPPGlobalVariables.py (1061 of 1779) PASS: lldb-api :: api/listeners/TestListener.py (1062 of 1779) PASS: lldb-shell :: SymbolFile/DWARF/dir-separator-no-comp-dir-relative-name.s (1063 of 1779) PASS: lldb-shell :: SymbolFile/Breakpad/line-table.test (1064 of 1779) PASS: lldb-shell :: SymbolFile/DWARF/find-method.cpp (1065 of 1779) PASS: lldb-api :: commands/expression/call-throws/TestCallThatThrows.py (1066 of 1779) PASS: lldb-api :: macosx/safe-to-func-call/TestSafeFuncCalls.py (1067 of 1779) PASS: lldb-api :: commands/frame/diagnose/array/TestArray.py (1068 of 1779) PASS: lldb-api :: lang/objc/modules-cache/TestClangModulesCache.py (1069 of 1779) PASS: lldb-unit :: Utility/./UtilityTests/StreamTest.PutRawBytesToLittleEndian (1070 of 1779) PASS: lldb-unit :: ScriptInterpreter/Python/./ScriptInterpreterPythonTests/PythonDataObjectsTest.TestInstanceNameResolutionNoDot (1071 of 1779) PASS: lldb-api :: python_api/function_symbol/TestSymbolAPI.py (1072 of 1779) PASS: lldb-api :: lang/cpp/diamond/TestDiamond.py (1073 of 1779) PASS: lldb-unit :: Utility/./UtilityTests/StringLexerTest.GetUnlexed (1074 of 1779) UNSUPPORTED: lldb-api :: commands/expression/completion-crash-incomplete-record/TestCompletionCrashIncompleteRecord.py (1075 of 1779) PASS: lldb-unit :: Process/gdb-remote/./ProcessGdbRemoteTests/GDBRemoteCommunicationServerTest.SendErrorResponse_ErrorList (1076 of 1779) PASS: lldb-api :: functionalities/breakpoint/require_hw_breakpoints/TestRequireHWBreakpoints.py (1077 of 1779) PASS: lldb-unit :: Core/./LLDBCoreTests/UniqueCStringMap.NoDefaultConstructor (1078 of 1779) PASS: lldb-api :: functionalities/data-formatter/data-formatter-objc/TestDataFormatterObjCNSDate.py (1079 of 1779) PASS: lldb-unit :: Utility/./UtilityTests/LogChannelEnabledTest.LLDB_LOG_ERROR (1080 of 1779) PASS: lldb-shell :: Minidump/breakpad-symbols.test (1081 of 1779) UNSUPPORTED: lldb-api :: lang/c/typedef/Testtypedef.py (1082 of 1779) PASS: lldb-unit :: Utility/./UtilityTests/StringExtractorTest.GetNameColonValueNoSemicolon (1083 of 1779) PASS: lldb-unit :: Utility/./UtilityTests/StringListTest.AppendList (1084 of 1779) PASS: lldb-api :: functionalities/data-formatter/format-propagation/TestFormatPropagation.py (1085 of 1779) PASS: lldb-unit :: Utility/./UtilityTests/BinaryStreamTest.PutSLEB128MaxValue (1086 of 1779) PASS: lldb-unit :: Host/./HostTests/FileSystemTest.Resolve (1087 of 1779) PASS: lldb-api :: functionalities/multidebugger_commands/TestMultipleDebuggersCommands.py (1088 of 1779) PASS: lldb-api :: lang/cpp/chained-calls/TestCppChainedCalls.py (1089 of 1779) PASS: lldb-shell :: SymbolFile/DWARF/find-method-local-struct.cpp (1090 of 1779) PASS: lldb-api :: functionalities/step_scripted/TestStepScripted.py (1091 of 1779) PASS: lldb-api :: functionalities/rerun/TestRerun.py (1092 of 1779) PASS: lldb-api :: functionalities/breakpoint/comp_dir_symlink/TestCompDirSymLink.py (1093 of 1779) PASS: lldb-api :: lang/cpp/template-function/TestTemplateFunctions.py (1094 of 1779) PASS: lldb-api :: functionalities/breakpoint/address_breakpoints/TestBadAddressBreakpoints.py (1095 of 1779) PASS: lldb-unit :: Utility/./UtilityTests/StringListTest.JoinSingle (1096 of 1779) PASS: lldb-api :: functionalities/data-formatter/nssetsynth/TestNSSetSynthetic.py (1097 of 1779) UNSUPPORTED: lldb-api :: tools/lldb-server/TestGdbRemoteAuxvSupport.py (1098 of 1779) PASS: lldb-shell :: SymbolFile/NativePDB/source-list.cpp (1099 of 1779) PASS: lldb-unit :: Process/minidump/./LLDBMinidumpTests/MinidumpParserTest.GetExceptionStream (1100 of 1779) UNSUPPORTED: lldb-shell :: Register/x86-64-gp-write.test (1101 of 1779) PASS: lldb-unit :: Host/./HostTests/SocketTest.TCPGetAddress (1102 of 1779) PASS: lldb-api :: api/multithreaded/TestMultithreaded.py (1103 of 1779) PASS: lldb-unit :: Utility/./UtilityTests/RecordReplayTest.InstrumentedFoo (1104 of 1779) PASS: lldb-unit :: Host/./HostTests/FileActionTest.Open (1105 of 1779) PASS: lldb-api :: functionalities/data-formatter/data-formatter-objc/nsstring/TestDataFormatterNSString.py (1106 of 1779) PASS: lldb-api :: functionalities/thread/concurrent_events/TestConcurrentCrashWithBreak.py (1107 of 1779) PASS: lldb-unit :: UnwindAssembly/x86/./UnwindAssemblyx86Tests/Testx86AssemblyInspectionEngine.TestPushR14 (1108 of 1779) PASS: lldb-unit :: Host/./HostTests/ProcessLaunchInfoTest.Constructor (1109 of 1779) PASS: lldb-shell :: SymbolFile/DWARF/find-qualified-variable.cpp (1110 of 1779) PASS: lldb-shell :: Unwind/trap_frame_sym_ctx.test (1111 of 1779) PASS: lldb-api :: functionalities/gdb_remote_client/TestArmRegisterDefinition.py (1112 of 1779) PASS: lldb-unit :: Utility/./UtilityTests/StringListTest.InsertStringAtIndexStart (1113 of 1779) PASS: lldb-unit :: debugserver/./debugserverTests/RNBSocket.LoopBackConnectIPv6 (1114 of 1779) PASS: lldb-unit :: Process/gdb-remote/./ProcessGdbRemoteTests/GDBRemoteClientBaseTest.SendContinueAndWait (1115 of 1779) PASS: lldb-api :: functionalities/gdb_remote_client/TestPlatformClient.py (1116 of 1779) PASS: lldb-api :: functionalities/tsan/basic/TestTsanBasic.py (1117 of 1779) PASS: lldb-api :: lang/objcxx/class-name-clash/TestNameClash.py (1118 of 1779) PASS: lldb-unit :: Host/./HostTests/SocketTest.UDPGetConnectURI (1119 of 1779) PASS: lldb-unit :: Process/gdb-remote/./ProcessGdbRemoteTests/GDBRemoteClientBaseTest.SendContinueAndInterrupt2PacketBug (1120 of 1779) PASS: lldb-unit :: Utility/./UtilityTests/StringExtractorTest.GetU32LittleEndian (1121 of 1779) PASS: lldb-unit :: Symbol/./SymbolTests/Type.CompilerContextPattern (1122 of 1779) PASS: lldb-api :: functionalities/unwind/noreturn/TestNoreturnUnwind.py (1123 of 1779) UNSUPPORTED: lldb-api :: functionalities/darwin_log/filter/exact_match/message/TestDarwinLogFilterMatchMessage.py (1124 of 1779) UNSUPPORTED: lldb-shell :: SymbolFile/PDB/variables.test (1125 of 1779) PASS: lldb-unit :: Utility/./UtilityTests/GeneratorTest.Create (1126 of 1779) PASS: lldb-api :: functionalities/unwind/noreturn/module-end/TestNoReturnModuleEnd.py (1127 of 1779) PASS: lldb-shell :: Reproducer/Functionalities/TestStepping.test (1128 of 1779) PASS: lldb-api :: commands/watchpoints/watchpoint_commands/command/TestWatchpointCommandLLDB.py (1129 of 1779) PASS: lldb-api :: functionalities/data-formatter/data-formatter-objc/TestDataFormatterObjCNSBundle.py (1130 of 1779) PASS: lldb-shell :: SymbolFile/NativePDB/ast-types.cpp (1131 of 1779) PASS: lldb-unit :: Utility/./UtilityTests/BinaryStreamTest.PutSLEB128One (1132 of 1779) PASS: lldb-api :: functionalities/breakpoint/breakpoint_names/TestBreakpointNames.py (1133 of 1779) PASS: lldb-api :: functionalities/signal/TestSendSignal.py (1134 of 1779) PASS: lldb-unit :: Expression/./ExpressionTests/DWARFExpression.DW_OP_convert (1135 of 1779) PASS: lldb-api :: commands/register/register/register_command/TestRegisters.py (1136 of 1779) PASS: lldb-api :: functionalities/tail_call_frames/ambiguous_tail_call_seq1/TestAmbiguousTailCallSeq1.py (1137 of 1779) PASS: lldb-unit :: Utility/./UtilityTests/OptionsWithRawTest.EmptyArgsOnlySuffix (1138 of 1779) PASS: lldb-api :: functionalities/process_group/TestChangeProcessGroup.py (1139 of 1779) PASS: lldb-unit :: Utility/./UtilityTests/StringListTest.InsertStringAtIndexStdString (1140 of 1779) PASS: lldb-shell :: Settings/TestDisassemblyFormat.test (1141 of 1779) PASS: lldb-unit :: Utility/./UtilityTests/StringListTest.SetSize (1142 of 1779) UNSUPPORTED: lldb-api :: functionalities/data-formatter/data-formatter-stl/libstdcpp/smart_ptr/TestDataFormatterStdSmartPtr.py (1143 of 1779) PASS: lldb-api :: functionalities/gdb_remote_client/TestRecognizeBreakpoint.py (1144 of 1779) PASS: lldb-api :: commands/frame/diagnose/complicated-expression/TestComplicatedExpression.py (1145 of 1779) PASS: lldb-api :: python_api/signals/TestSignalsAPI.py (1146 of 1779) PASS: lldb-unit :: Utility/./UtilityTests/StructuredDataTest.StringDump (1147 of 1779) PASS: lldb-api :: python_api/section/TestSectionAPI.py (1148 of 1779) PASS: lldb-shell :: Python/crashlog.test (1149 of 1779) UNSUPPORTED: lldb-api :: tools/lldb-vscode/breakpoint/TestVSCode_setExceptionBreakpoints.py (1150 of 1779) PASS: lldb-api :: commands/target/create-no-such-arch/TestNoSuchArch.py (1151 of 1779) PASS: lldb-api :: lang/cpp/gmodules-templates/TestGModules.py (1152 of 1779) PASS: lldb-unit :: Host/./HostTests/TaskPoolTest.RunTasks (1153 of 1779) UNSUPPORTED: lldb-shell :: Register/x86-ymm-write.test (1154 of 1779) UNSUPPORTED: lldb-api :: benchmarks/expression/TestExpressionCmd.py (1155 of 1779) PASS: lldb-unit :: Utility/./UtilityTests/ArgsTest.ReplaceArgumentAtIndexLonger (1156 of 1779) PASS: lldb-shell :: SymbolFile/DWARF/find-basic-variable.cpp (1157 of 1779) PASS: lldb-api :: functionalities/signal/handle-abrt/TestHandleAbort.py (1158 of 1779) PASS: lldb-shell :: SymbolFile/DWARF/debug-types-signature-loop.s (1159 of 1779) UNSUPPORTED: lldb-shell :: SymbolFile/dissassemble-entry-point.s (1160 of 1779) PASS: lldb-unit :: Utility/./UtilityTests/StringListTest.GetMaxStringLengthIncreasingSize (1161 of 1779) PASS: lldb-unit :: ScriptInterpreter/Python/./ScriptInterpreterPythonTests/PythonDataObjectsTest.TestPythonListValueEquality (1162 of 1779) PASS: lldb-api :: commands/platform/basic/TestPlatformCommand.py (1163 of 1779) PASS: lldb-api :: commands/expression/radar_8638051/Test8638051.py (1164 of 1779) PASS: lldb-unit :: Utility/./UtilityTests/FileSpecTest.EqualDotsPosixRoot (1165 of 1779) PASS: lldb-unit :: Utility/./UtilityTests/StringListTest.ShiftCString (1166 of 1779) PASS: lldb-shell :: SymbolFile/Breakpad/unwind-via-stack-cfi.test (1167 of 1779) PASS: lldb-api :: types/TestFloatTypesExpr.py (1168 of 1779) PASS: lldb-api :: lang/cpp/dynamic-value/TestCppValueCast.py (1169 of 1779) PASS: lldb-api :: functionalities/thread/concurrent_events/TestConcurrentCrashWithWatchpoint.py (1170 of 1779) PASS: lldb-unit :: Utility/./UtilityTests/AnsiTerminal.AtEnd (1171 of 1779) PASS: lldb-unit :: Utility/./UtilityTests/ArgsTest.TestInsertArg (1172 of 1779) PASS: lldb-unit :: Utility/./UtilityTests/StringListTest.ForRangeEmpty (1173 of 1779) PASS: lldb-api :: python_api/process/io/TestProcessIO.py (1174 of 1779) PASS: lldb-api :: commands/expression/save_jit_objects/TestSaveJITObjects.py (1175 of 1779) PASS: lldb-unit :: UnwindAssembly/x86/./UnwindAssemblyx86Tests/Testx86AssemblyInspectionEngine.TestLEAVE (1176 of 1779) PASS: lldb-unit :: Utility/./UtilityTests/EnvironmentTest.EnvpConversion (1177 of 1779) PASS: lldb-api :: python_api/disassemble-raw-data/TestDisassembleRawData.py (1178 of 1779) PASS: lldb-unit :: Utility/./UtilityTests/RangeTest.LessThanInvalid (1179 of 1779) PASS: lldb-unit :: ScriptInterpreter/Python/./ScriptInterpreterPythonTests/PythonDataObjectsTest.TestPythonCallableInvoke (1180 of 1779) PASS: lldb-unit :: Utility/./UtilityTests/StreamTest.PutHex8 (1181 of 1779) PASS: lldb-api :: functionalities/data-formatter/data-formatter-stl/libcxx/map/TestDataFormatterLibccMap.py (1182 of 1779) PASS: lldb-api :: commands/expression/import-std-module/unique_ptr-dbg-info-content/TestUniquePtrDbgInfoContent.py (1183 of 1779) PASS: lldb-unit :: Interpreter/./InterpreterTests/OptionArgParserTest.toScriptLanguage (1184 of 1779) PASS: lldb-unit :: Expression/./ExpressionTests/CppModuleConfigurationTest.LibCppV2 (1185 of 1779) PASS: lldb-unit :: Interpreter/./InterpreterTests/OptionArgParserTest.toChar (1186 of 1779) PASS: lldb-unit :: Host/./HostTests/Host.WaitStatusFormat (1187 of 1779) PASS: lldb-unit :: ScriptInterpreter/Python/./ScriptInterpreterPythonTests/PythonDataObjectsTest.TestPythonTupleInitializerList (1188 of 1779) PASS: lldb-api :: macosx/find-dsym/deep-bundle/TestDeepBundle.py (1189 of 1779) UNSUPPORTED: lldb-api :: linux/mix-dwo-and-regular-objects/TestMixedDwarfBinary.py (1190 of 1779) PASS: lldb-api :: functionalities/postmortem/netbsd-core/TestNetBSDCore.py (1191 of 1779) PASS: lldb-api :: functionalities/data-formatter/data-formatter-stl/libcxx/multimap/TestDataFormatterLibccMultiMap.py (1192 of 1779) PASS: lldb-shell :: Breakpoint/split-dwarf5-debug-stroffsets.test (1193 of 1779) PASS: lldb-unit :: debugserver/./debugserverTests/RNBSocket.LoopBackListenIPv6 (1194 of 1779) PASS: lldb-api :: lang/cpp/modules-import/TestCXXModulesImport.py (1195 of 1779) PASS: lldb-unit :: UnwindAssembly/x86/./UnwindAssemblyx86Tests/Testx86AssemblyInspectionEngine.TestStackRealign8BitDisp_i386 (1196 of 1779) PASS: lldb-api :: functionalities/tail_call_frames/unambiguous_sequence/TestUnambiguousTailCalls.py (1197 of 1779) PASS: lldb-api :: commands/expression/import-std-module/forward_list-basic/TestBasicForwardList.py (1198 of 1779) PASS: lldb-shell :: Reproducer/TestFileRepro.test (1199 of 1779) PASS: lldb-unit :: Utility/./UtilityTests/SerializationRountripTest.SerializeDeserializePodReferences (1200 of 1779) PASS: lldb-unit :: Utility/./UtilityTests/Flags.IsClear (1201 of 1779) PASS: lldb-unit :: Utility/./UtilityTests/BinaryStreamTest.PutSLEB128FiveBytes (1202 of 1779) PASS: lldb-api :: functionalities/thread/num_threads/TestNumThreads.py (1203 of 1779) PASS: lldb-shell :: Breakpoint/split-dwarf-5-addrbase.test (1204 of 1779) PASS: lldb-shell :: Reproducer/TestReuseDirectory.test (1205 of 1779) PASS: lldb-unit :: Utility/./UtilityTests/StreamTest.PutCharWhitespace (1206 of 1779) PASS: lldb-unit :: Host/./HostTests/NativeProcessProtocolTest.ReadCStringFromMemory_CrossPageBoundary (1207 of 1779) UNSUPPORTED: lldb-shell :: SymbolFile/PDB/type-quals.test (1208 of 1779) PASS: lldb-unit :: Utility/./UtilityTests/ProcessInstanceInfo.DumpTable_invalidUID (1209 of 1779) PASS: lldb-api :: functionalities/breakpoint/breakpoint_language/TestBreakpointLanguage.py (1210 of 1779) UNSUPPORTED: lldb-api :: functionalities/darwin_log/basic/TestDarwinLogBasic.py (1211 of 1779) PASS: lldb-unit :: Utility/./UtilityTests/LogChannelEnabledTest.LogVerboseThread (1212 of 1779) PASS: lldb-unit :: Utility/./UtilityTests/RangeTest.Slide (1213 of 1779) PASS: lldb-unit :: Host/./HostTests/HostInfoTest.GetHostname (1214 of 1779) PASS: lldb-unit :: ScriptInterpreter/Python/./ScriptInterpreterPythonTests/PythonExceptionStateTest.TestAcquisitionSemantics (1215 of 1779) UNSUPPORTED: lldb-api :: lang/cpp/static_members/TestCPPStaticMembers.py (1216 of 1779) PASS: lldb-unit :: Utility/./UtilityTests/AnsiTerminal.AtStart (1217 of 1779) PASS: lldb-unit :: Language/Highlighting/./HighlighterTests/HighlighterTest.Colons (1218 of 1779) PASS: lldb-unit :: Utility/./UtilityTests/RangeTest.Union (1219 of 1779) PASS: lldb-shell :: Commands/command-regex-unalias.test (1220 of 1779) PASS: lldb-unit :: Utility/./UtilityTests/StreamTeeTest.Write (1221 of 1779) PASS: lldb-api :: functionalities/multiword-commands/TestMultiWordCommands.py (1222 of 1779) UNSUPPORTED: lldb-api :: functionalities/data-formatter/data-formatter-stl/libstdcpp/map/TestDataFormatterStdMap.py (1223 of 1779) PASS: lldb-unit :: Host/./HostTests/MainLoopTest.DetectsEOF (1224 of 1779) UNSUPPORTED: lldb-api :: benchmarks/libcxxlist/TestBenchmarkLibcxxList.py (1225 of 1779) PASS: lldb-api :: commands/expression/weak_symbols/TestWeakSymbols.py (1226 of 1779) PASS: lldb-api :: commands/command/delete/TestCommandDelete.py (1227 of 1779) UNSUPPORTED: lldb-shell :: Register/x86-gp-read.test (1228 of 1779) PASS: lldb-unit :: Symbol/./SymbolTests/PostfixExpression.ParseOneExpression (1229 of 1779) PASS: lldb-unit :: Expression/./ExpressionTests/DiagnosticManagerTest.GetStringMultiline (1230 of 1779) PASS: lldb-unit :: Process/gdb-remote/./ProcessGdbRemoteTests/GDBRemoteCommunicationTest.ReadPacket_checksum (1231 of 1779) UNSUPPORTED: lldb-api :: linux/add-symbols/TestTargetSymbolsAddCommand.py (1232 of 1779) PASS: lldb-unit :: UnwindAssembly/x86/./UnwindAssemblyx86Tests/Testx86AssemblyInspectionEngine.TestPushEDX (1233 of 1779) PASS: lldb-unit :: Utility/./UtilityTests/AnsiTerminal.WhiteSpace (1234 of 1779) UNSUPPORTED: lldb-shell :: Register/x86-ymm-read.test (1235 of 1779) PASS: lldb-unit :: Utility/./UtilityTests/AnsiTerminal.Twice (1236 of 1779) UNSUPPORTED: lldb-api :: functionalities/process_save_core/TestProcessSaveCore.py (1237 of 1779) UNSUPPORTED: lldb-api :: functionalities/darwin_log/filter/regex/message/TestDarwinLogFilterRegexMessage.py (1238 of 1779) PASS: lldb-unit :: Utility/./UtilityTests/ArchSpecTest.OperatorBool (1239 of 1779) PASS: lldb-unit :: Utility/./UtilityTests/BinaryStreamTest.PutULEB128SevenBytes (1240 of 1779) PASS: lldb-shell :: Minidump/dump-all.test (1241 of 1779) PASS: lldb-unit :: Utility/./UtilityTests/RangeTest.SetRangeBase (1242 of 1779) PASS: lldb-api :: functionalities/breakpoint/breakpoint_locations/TestBreakpointLocations.py (1243 of 1779) PASS: lldb-unit :: ObjectFile/Breakpad/./ObjectFileBreakpadTests/Record.classify (1244 of 1779) PASS: lldb-unit :: Utility/./UtilityTests/ScalarTest.Equality (1245 of 1779) PASS: lldb-shell :: Breakpoint/debug_addrx.test (1246 of 1779) PASS: lldb-api :: commands/expression/namespace_local_var_same_name_obj_c/TestNamespaceLocalVarSameNameObjC.py (1247 of 1779) PASS: lldb-api :: lang/objc/objc-new-syntax/TestObjCNewSyntaxDictionary.py (1248 of 1779) PASS: lldb-api :: lang/c/vla/TestVLA.py (1249 of 1779) PASS: lldb-api :: functionalities/memory/cache/TestMemoryCache.py (1250 of 1779) PASS: lldb-shell :: BuildScript/compiler-full-path.test (1251 of 1779) PASS: lldb-unit :: Utility/./UtilityTests/DataExtractorTest.GetCStr (1252 of 1779) PASS: lldb-api :: commands/log/invalid-args/TestInvalidArgsLog.py (1253 of 1779) UNSUPPORTED: lldb-api :: functionalities/darwin_log/filter/exact_match/category/TestDarwinLogFilterMatchCategory.py (1254 of 1779) PASS: lldb-unit :: ObjectFile/ELF/./ObjectFileELFTests/ObjectFileELFTest.SectionsResolveConsistently (1255 of 1779) PASS: lldb-api :: functionalities/data-formatter/data-formatter-named-summaries/TestDataFormatterNamedSummaries.py (1256 of 1779) PASS: lldb-api :: lang/cpp/class_types/TestClassTypes.py (1257 of 1779) PASS: lldb-unit :: Utility/./UtilityTests/StringListTest.PopBack (1258 of 1779) PASS: lldb-unit :: SymbolFile/NativePDB/./SymbolFileNativePDBTests/PDBFPOProgramToDWARFExpressionTests.UnresolvedRegisterAssignmentReference (1259 of 1779) PASS: lldb-unit :: Utility/./UtilityTests/ArgsTest.TestQuotedTrailingBackslash (1260 of 1779) PASS: lldb-api :: lang/c/shared_lib_stripped_symbols/TestSharedLibStrippedSymbols.py (1261 of 1779) PASS: lldb-unit :: Utility/./UtilityTests/StringExtractorTest.GetHexBytes_OddPair (1262 of 1779) PASS: lldb-unit :: Utility/./UtilityTests/StringListTest.AppendListCStringArrayEmpty (1263 of 1779) PASS: lldb-unit :: Process/gdb-remote/./ProcessGdbRemoteTests/GDBRemoteClientBaseTest.SendContinueDelegateInterface (1264 of 1779) PASS: lldb-api :: lang/c/stepping/TestThreadStepping.py (1265 of 1779) PASS: lldb-api :: linux/builtin_trap/TestBuiltinTrap.py (1266 of 1779) UNSUPPORTED: lldb-api :: benchmarks/expression/TestRepeatedExprs.py (1267 of 1779) PASS: lldb-unit :: Utility/./UtilityTests/NameMatchesTest.EndsWith (1268 of 1779) PASS: lldb-api :: macosx/load-kext/TestLoadKext.py (1269 of 1779) PASS: lldb-unit :: Utility/./UtilityTests/LogChannelEnabledTest.LogThread (1270 of 1779) PASS: lldb-unit :: UnwindAssembly/x86/./UnwindAssemblyx86Tests/Testx86AssemblyInspectionEngine.TestSpillRegToStackViaMOVi386 (1271 of 1779) PASS: lldb-unit :: Utility/./UtilityTests/VMRange.Comparison (1272 of 1779) UNSUPPORTED: lldb-api :: functionalities/data-formatter/data-formatter-stl/libstdcpp/iterator/TestDataFormatterStdIterator.py (1273 of 1779) PASS: lldb-unit :: Utility/./UtilityTests/OptionsWithRawTest.SingleWhitespaceInput (1274 of 1779) PASS: lldb-api :: python_api/breakpoint/TestBreakpointAPI.py (1275 of 1779) PASS: lldb-api :: commands/expression/call-function/TestCallStopAndContinue.py (1276 of 1779) UNSUPPORTED: lldb-shell :: SymbolFile/NativePDB/ast-functions-msvc.cpp (1277 of 1779) PASS: lldb-unit :: Core/./LLDBCoreTests/MangledTest.NameIndexes_FindFunctionSymbols (1278 of 1779) PASS: lldb-unit :: Symbol/./SymbolTests/TestClangASTContext.TestUnifyAccessSpecifiers (1279 of 1779) PASS: lldb-unit :: ScriptInterpreter/Python/./ScriptInterpreterPythonTests/PythonExceptionStateTest.TestDiscardSemantics (1280 of 1779) PASS: lldb-api :: functionalities/postmortem/minidump-new/TestMiniDumpNew.py (1281 of 1779) UNSUPPORTED: lldb-api :: functionalities/thread/multi_break/TestMultipleBreakpoints.py (1282 of 1779) PASS: lldb-api :: commands/command/script_alias/TestCommandScriptAlias.py (1283 of 1779) PASS: lldb-unit :: UnwindAssembly/x86/./UnwindAssemblyx86Tests/Testx86AssemblyInspectionEngine.TestPopEDI (1284 of 1779) PASS: lldb-shell :: Reproducer/TestDriverOptions.test (1285 of 1779) PASS: lldb-api :: commands/expression/import-std-module/vector-of-vectors/TestVectorOfVectors.py (1286 of 1779) UNSUPPORTED: lldb-api :: macosx/macabi/TestMacABImacOSFramework.py (1287 of 1779) PASS: lldb-unit :: Utility/./UtilityTests/StringListTest.RemoveBlankLines (1288 of 1779) UNSUPPORTED: lldb-shell :: SymbolFile/PDB/ast-restore.test (1289 of 1779) PASS: lldb-api :: tools/lldb-server/inferior-crash/TestGdbRemoteSegFault.py (1290 of 1779) PASS: lldb-shell :: SymbolFile/Breakpad/line-table-edgecases.test (1291 of 1779) PASS: lldb-unit :: Utility/./UtilityTests/CompletionRequest.DuplicateFilteringWithComments (1292 of 1779) UNSUPPORTED: lldb-shell :: SymbolFile/PDB/calling-conventions.test (1293 of 1779) PASS: lldb-shell :: SymbolFile/DWARF/debug_ranges-missing-section.s (1294 of 1779) PASS: lldb-unit :: Host/./HostTests/TaskPoolTest.AddTask (1295 of 1779) PASS: lldb-api :: functionalities/breakpoint/global_constructor/TestBreakpointInGlobalConstructor.py (1296 of 1779) PASS: lldb-unit :: Utility/./UtilityTests/StreamTest.PutSLEB128 (1297 of 1779) UNSUPPORTED: lldb-shell :: ObjectFile/ELF/minidebuginfo-no-lzma.yaml (1298 of 1779) PASS: lldb-shell :: SymbolFile/NativePDB/function-types-classes.cpp (1299 of 1779) PASS: lldb-shell :: Driver/TestSingleQuote.test (1300 of 1779) PASS: lldb-api :: commands/expression/context-object/TestContextObject.py (1301 of 1779) PASS: lldb-api :: commands/expression/import-std-module/shared_ptr/TestSharedPtr.py (1302 of 1779) PASS: lldb-unit :: Process/gdb-remote/./ProcessGdbRemoteTests/GDBRemoteCommunicationServerTest.SendErrorResponse_ErrorNumber (1303 of 1779) PASS: lldb-unit :: Utility/./UtilityTests/ArgsTest.EscapeLLDBCommandArgument (1304 of 1779) PASS: lldb-api :: python_api/thread/TestThreadAPI.py (1305 of 1779) PASS: lldb-unit :: debugserver/./debugserverTests/RNBSocket.AnyListen (1306 of 1779) PASS: lldb-api :: commands/expression/persistent_ptr_update/TestPersistentPtrUpdate.py (1307 of 1779) PASS: lldb-api :: python_api/symbol-context/two-files/TestSymbolContextTwoFiles.py (1308 of 1779) PASS: lldb-unit :: ObjectFile/ELF/./ObjectFileELFTests/ObjectFileELFTest.GetSymtab_NoSymEntryPointArmThumbAddressClass (1309 of 1779) PASS: lldb-unit :: Expression/./ExpressionTests/CppModuleConfigurationTest.AmbiguousLibCpp (1310 of 1779) PASS: lldb-api :: python_api/sbvalue_persist/TestSBValuePersist.py (1311 of 1779) PASS: lldb-api :: functionalities/data-formatter/stringprinter/TestStringPrinter.py (1312 of 1779) PASS: lldb-unit :: ScriptInterpreter/Python/./ScriptInterpreterPythonTests/PythonDataObjectsTest.TestResetting (1313 of 1779) PASS: lldb-unit :: Utility/./UtilityTests/UserIDResolver.GetUserName (1314 of 1779) PASS: lldb-api :: python_api/process/read-mem-cstring/TestReadMemCString.py (1315 of 1779) PASS: lldb-api :: functionalities/data-formatter/data-formatter-stl/libcxx/optional/TestDataFormatterLibcxxOptional.py (1316 of 1779) PASS: lldb-api :: functionalities/data-formatter/data-formatter-stl/libcxx/forward_list/TestDataFormatterLibcxxForwardList.py (1317 of 1779) PASS: lldb-api :: functionalities/breakpoint/move_nearest/TestMoveNearest.py (1318 of 1779) PASS: lldb-unit :: Expression/./ExpressionTests/DiagnosticManagerTest.GetStringSeverityLabels (1319 of 1779) PASS: lldb-api :: commands/expression/issue_11588/Test11588.py (1320 of 1779) PASS: lldb-api :: python_api/symbol-context/TestSymbolContext.py (1321 of 1779) PASS: lldb-unit :: Utility/./UtilityTests/StringListTest.LongestCommonPrefixDuplicateElement (1322 of 1779) PASS: lldb-api :: commands/command/script/TestCommandScript.py (1323 of 1779) PASS: lldb-unit :: Utility/./UtilityTests/ArgsTest.AppendArguments (1324 of 1779) UNSUPPORTED: lldb-shell :: SymbolFile/NativePDB/typedefs.cpp (1325 of 1779) PASS: lldb-api :: lang/c/tls_globals/TestTlsGlobals.py (1326 of 1779) PASS: lldb-unit :: Utility/./UtilityTests/StreamTest.PutHex32ByteOrderBig (1327 of 1779) PASS: lldb-api :: commands/expression/call-function/TestCallStdStringFunction.py (1328 of 1779) PASS: lldb-unit :: ScriptInterpreter/Python/./ScriptInterpreterPythonTests/PythonDataObjectsTest.TestTypeNameResolutionNoDot (1329 of 1779) PASS: lldb-unit :: Utility/./UtilityTests/ListenerTest.GetEventImmediate (1330 of 1779) PASS: lldb-api :: functionalities/data-formatter/dump_dynamic/TestDumpDynamic.py (1331 of 1779) PASS: lldb-unit :: Language/Highlighting/./HighlighterTests/HighlighterTest.ClangSquareBrackets (1332 of 1779) PASS: lldb-unit :: ScriptInterpreter/Python/./ScriptInterpreterPythonTests/PythonDataObjectsTest.TestPythonListManipulation (1333 of 1779) PASS: lldb-api :: functionalities/data-formatter/setvaluefromcstring/TestSetValueFromCString.py (1334 of 1779) PASS: lldb-unit :: Utility/./UtilityTests/StringListTest.LongestCommonPrefixSingleElement (1335 of 1779) PASS: lldb-unit :: Utility/./UtilityTests/Flags.AllClear (1336 of 1779) PASS: lldb-unit :: ObjectFile/Breakpad/./ObjectFileBreakpadTests/StackCFIRecord.parse (1337 of 1779) PASS: lldb-api :: lang/c/global_variables/TestGlobalVariables.py (1338 of 1779) PASS: lldb-unit :: Utility/./UtilityTests/StringListTest.Join (1339 of 1779) PASS: lldb-unit :: tools/lldb-server/tests/./LLDBServerTests/StandardStartupTest.TestStopReplyContainsThreadPcs (1340 of 1779) PASS: lldb-unit :: Utility/./UtilityTests/BinaryStreamTest.PutSLEB128EightBytes (1341 of 1779) PASS: lldb-unit :: Host/./HostTests/SocketTest.DecodeHostAndPort (1342 of 1779) PASS: lldb-api :: python_api/value/linked_list/TestValueAPILinkedList.py (1343 of 1779) PASS: lldb-api :: python_api/frame/TestFrames.py (1344 of 1779) PASS: lldb-unit :: Language/Highlighting/./HighlighterTests/HighlighterTest.ClangCommas (1345 of 1779) PASS: lldb-api :: commands/expression/import-std-module/sysroot/TestStdModuleSysroot.py (1346 of 1779) PASS: lldb-unit :: ObjectFile/Breakpad/./ObjectFileBreakpadTests/ModuleRecord.parse (1347 of 1779) PASS: lldb-api :: commands/expression/inline-namespace/TestInlineNamespace.py (1348 of 1779) PASS: lldb-shell :: ObjectFile/Breakpad/breakpad-identification.test (1349 of 1779) UNSUPPORTED: lldb-api :: commands/register/register/intel_xtended_registers/TestMPXRegisters.py (1350 of 1779) PASS: lldb-api :: commands/expression/scoped_enums/TestScopedEnumType.py (1351 of 1779) PASS: lldb-unit :: Process/gdb-remote/./ProcessGdbRemoteTests/GDBRemoteCommunicationClientTest.SendGetMetaDataPacket (1352 of 1779) PASS: lldb-unit :: Utility/./UtilityTests/StringExtractorTest.InitEmpty (1353 of 1779) PASS: lldb-unit :: Utility/./UtilityTests/ArgsTest.TestQuotedUnknownEscape (1354 of 1779) PASS: lldb-shell :: SymbolFile/NativePDB/function-types-calling-conv.cpp (1355 of 1779) PASS: lldb-unit :: Utility/./UtilityTests/ArgsTest.TestArgv (1356 of 1779) PASS: lldb-unit :: Utility/./UtilityTests/StringListTest.Assignment (1357 of 1779) PASS: lldb-api :: python_api/hello_world/TestHelloWorld.py (1358 of 1779) UNSUPPORTED: lldb-api :: commands/expression/completion-crash2/TestCompletionCrash2.py (1359 of 1779) PASS: lldb-api :: lang/cpp/namespace_definitions/TestNamespaceDefinitions.py (1360 of 1779) PASS: lldb-api :: python_api/sbvalue_const_addrof/TestSBValueConstAddrOf.py (1361 of 1779) PASS: lldb-unit :: Process/minidump/./LLDBMinidumpTests/MinidumpParserTest.FindMemoryRange (1362 of 1779) PASS: lldb-unit :: SymbolFile/DWARF/./SymbolFileDWARFTests/SymbolFileDWARFTests.TestAbbrevInvalidNULLTag (1363 of 1779) PASS: lldb-unit :: Utility/./UtilityTests/ArchSpecTest.TripleComponentsWereSpecified (1364 of 1779) PASS: lldb-unit :: Symbol/./SymbolTests/PostfixExpression.ParseFPOProgram (1365 of 1779) PASS: lldb-shell :: SymbolFile/NativePDB/globals-fundamental.cpp (1366 of 1779) PASS: lldb-api :: lang/objc/objc-stepping/TestObjCStepping.py (1367 of 1779) PASS: lldb-api :: functionalities/data-formatter/parray/TestPrintArray.py (1368 of 1779) PASS: lldb-api :: lang/objc/objc-static-method/TestObjCStaticMethod.py (1369 of 1779) PASS: lldb-unit :: Target/./TargetTests/ExecutionContextTest.GetByteOrderTarget (1370 of 1779) PASS: lldb-unit :: UnwindAssembly/x86/./UnwindAssemblyx86Tests/Testx86AssemblyInspectionEngine.TestPushExtended (1371 of 1779) PASS: lldb-api :: functionalities/data-formatter/data-formatter-smart-array/TestDataFormatterSmartArray.py (1372 of 1779) PASS: lldb-api :: functionalities/modern-type-lookup/objc-modules/TestObjModulesModernTypeLookup.py (1373 of 1779) UNSUPPORTED: lldb-api :: lang/objc/rdar-12408181/TestRdar12408181.py (1374 of 1779) PASS: lldb-unit :: Host/./HostTests/MainLoopTest.ReadObject (1375 of 1779) PASS: lldb-api :: commands/statistics/basic/TestStats.py (1376 of 1779) PASS: lldb-unit :: Utility/./UtilityTests/TimeoutTest.Construction (1377 of 1779) PASS: lldb-api :: functionalities/ubsan/user-expression/TestUbsanUserExpression.py (1378 of 1779) PASS: lldb-api :: functionalities/gdb_remote_client/TestGDBRemoteLoad.py (1379 of 1779) PASS: lldb-unit :: Utility/./UtilityTests/SerializationRountripTest.SerializeDeserializePodPointers (1380 of 1779) PASS: lldb-unit :: Utility/./UtilityTests/FileSpecTest.GuessPathStyle (1381 of 1779) PASS: lldb-api :: tools/lldb-server/inferior-crash/TestGdbRemoteAbort.py (1382 of 1779) PASS: lldb-api :: lang/cpp/char8_t/TestCxxChar8_t.py (1383 of 1779) PASS: lldb-api :: functionalities/wrong_commands/TestWrongCommands.py (1384 of 1779) PASS: lldb-unit :: Utility/./UtilityTests/StringExtractorTest.GetHexU8_Exact_NoEof (1385 of 1779) PASS: lldb-unit :: Utility/./UtilityTests/VMRange.Ordering (1386 of 1779) PASS: lldb-shell :: SymbolFile/DWARF/find-basic-function.cpp (1387 of 1779) PASS: lldb-shell :: Reproducer/TestRelativePath.test (1388 of 1779) PASS: lldb-unit :: Expression/./ExpressionTests/DiagnosticManagerTest.GetStringNoDiags (1389 of 1779) PASS: lldb-api :: functionalities/thread/concurrent_events/TestConcurrentBreakpointsDelayedBreakpointOneWatchpoint.py (1390 of 1779) PASS: lldb-shell :: SymbolFile/NativePDB/globals-bss.cpp (1391 of 1779) PASS: lldb-api :: commands/frame/diagnose/dereference-function-return/TestDiagnoseDereferenceFunctionReturn.py (1392 of 1779) PASS: lldb-api :: functionalities/tsan/multiple/TestTsanMultiple.py (1393 of 1779) PASS: lldb-unit :: Utility/./UtilityTests/ScalarTest.GetValue (1394 of 1779) PASS: lldb-unit :: Expression/./ExpressionTests/DiagnosticManagerTest.AddDiagnostic (1395 of 1779) PASS: lldb-api :: functionalities/thread/concurrent_events/TestConcurrentSignalNWatchNBreak.py (1396 of 1779) PASS: lldb-unit :: Utility/./UtilityTests/ConstStringTest.CompareStringRef (1397 of 1779) PASS: lldb-unit :: Signals/./SignalsTests/UnixSignalsTest.VersionChange (1398 of 1779) PASS: lldb-unit :: UnwindAssembly/x86/./UnwindAssemblyx86Tests/Testx86AssemblyInspectionEngine.TestPushImm (1399 of 1779) PASS: lldb-shell :: Register/x86-64-read.test (1400 of 1779) PASS: lldb-unit :: Language/Highlighting/./HighlighterTests/HighlighterTest.ClangBraces (1401 of 1779) PASS: lldb-unit :: Process/minidump/./LLDBMinidumpTests/MinidumpParserTest.GetPid (1402 of 1779) UNSUPPORTED: lldb-api :: linux/thread/create_during_instruction_step/TestCreateDuringInstructionStep.py (1403 of 1779) PASS: lldb-unit :: Language/CPlusPlus/./LanguageCPlusPlusTests/CPlusPlusLanguage.FindAlternateFunctionManglings (1404 of 1779) PASS: lldb-unit :: ObjectFile/Breakpad/./ObjectFileBreakpadTests/LineRecord.parse (1405 of 1779) PASS: lldb-unit :: Expression/./ExpressionTests/CppModuleConfigurationTest.UnknownLibCppFile (1406 of 1779) PASS: lldb-unit :: Host/./HostTests/SocketTest.DomainGetConnectURI (1407 of 1779) PASS: lldb-api :: commands/expression/import-std-module/weak_ptr-dbg-info-content/TestDbgInfoContentWeakPtr.py (1408 of 1779) PASS: lldb-unit :: Platform/./LLDBPlatformTests/PlatformDarwinTest.TestParseVersionBuildDir (1409 of 1779) PASS: lldb-shell :: Quit/TestQuitExitCodeHex0.test (1410 of 1779) UNSUPPORTED: lldb-api :: python_api/event/TestEvents.py (1411 of 1779) PASS: lldb-unit :: Language/Highlighting/./HighlighterTests/HighlighterTest.FallbackHighlighter (1412 of 1779) PASS: lldb-unit :: Host/./HostTests/FileSystemTest.Exists (1413 of 1779) PASS: lldb-unit :: Utility/./UtilityTests/StringExtractorTest.GetHexU8_Extra (1414 of 1779) PASS: lldb-api :: lang/objc/foundation/TestRuntimeTypes.py (1415 of 1779) PASS: lldb-shell :: SymbolFile/DWARF/find-basic-namespace.cpp (1416 of 1779) PASS: lldb-shell :: SymbolFile/DWARF/debug_loc.s (1417 of 1779) PASS: lldb-shell :: SymbolFile/DWARF/find-variable-dwo.cpp (1418 of 1779) PASS: lldb-api :: lang/cpp/dynamic-value/TestDynamicValue.py (1419 of 1779) PASS: lldb-api :: functionalities/data-formatter/varscript_formatting/TestDataFormatterVarScriptFormatting.py (1420 of 1779) PASS: lldb-unit :: UnwindAssembly/x86/./UnwindAssemblyx86Tests/Testx86AssemblyInspectionEngine.Test32BitOnlyInstruction (1421 of 1779) PASS: lldb-api :: lang/cpp/stl/TestStdCXXDisassembly.py (1422 of 1779) PASS: lldb-shell :: Settings/TestFrameFormatNoColor.test (1423 of 1779) PASS: lldb-shell :: BuildScript/toolchain-clang.test (1424 of 1779) PASS: lldb-unit :: Process/gdb-remote/./ProcessGdbRemoteTests/GDBRemoteClientBaseTest.SendContinueAndLateInterrupt (1425 of 1779) PASS: lldb-api :: lang/objc/foundation/TestObjCMethodsNSArray.py (1426 of 1779) PASS: lldb-unit :: Interpreter/./InterpreterTests/CompletionTest.FileCompletionAbsolute (1427 of 1779) PASS: lldb-unit :: Utility/./UtilityTests/StreamTeeTest.Flush (1428 of 1779) PASS: lldb-unit :: Process/minidump/./LLDBMinidumpTests/MinidumpParserTest.GetThreadsAndGetThreadContext (1429 of 1779) PASS: lldb-shell :: SymbolFile/DWARF/debug_ranges_and_rnglists.test (1430 of 1779) PASS: lldb-unit :: Utility/./UtilityTests/LogChannelEnabledTest.LogGetLogThread (1431 of 1779) PASS: lldb-api :: commands/expression/anonymous-struct/TestCallUserAnonTypedef.py (1432 of 1779) PASS: lldb-shell :: SymbolFile/DWARF/debug-types-dwarf5.s (1433 of 1779) PASS: lldb-unit :: Utility/./UtilityTests/OptionsWithRawTest.EmptyInput (1434 of 1779) PASS: lldb-shell :: SymbolFile/DWARF/debug-types-dwo-cross-reference.cpp (1435 of 1779) PASS: lldb-unit :: UnwindAssembly/x86/./UnwindAssemblyx86Tests/Testx86AssemblyInspectionEngine.TestAddRSP (1436 of 1779) PASS: lldb-unit :: Language/Highlighting/./HighlighterTests/HighlighterTest.ClangCursorPos (1437 of 1779) PASS: lldb-unit :: SymbolFile/NativePDB/./SymbolFileNativePDBTests/PDBFPOProgramToDWARFExpressionTests.InvalidAssignmentMultiple (1438 of 1779) PASS: lldb-api :: python_api/sbtype_typeclass/TestSBTypeTypeClass.py (1439 of 1779) PASS: lldb-unit :: Language/Highlighting/./HighlighterTests/HighlighterTest.HighlighterSelectionType (1440 of 1779) PASS: lldb-api :: macosx/add-dsym/TestAddDsymMidExecutionCommand.py (1441 of 1779) UNSUPPORTED: lldb-api :: arm/breakpoint-it/TestBreakpointIt.py (1442 of 1779) PASS: lldb-api :: commands/watchpoints/multiple_threads/TestWatchpointMultipleThreads.py (1443 of 1779) PASS: lldb-api :: functionalities/thread/concurrent_events/TestConcurrentDelayedCrashWithBreakpointSignal.py (1444 of 1779) PASS: lldb-api :: functionalities/postmortem/wow64_minidump/TestWow64MiniDump.py (1445 of 1779) PASS: lldb-unit :: ScriptInterpreter/Python/./ScriptInterpreterPythonTests/PythonDataObjectsTest.TestPythonDictionaryManipulation (1446 of 1779) PASS: lldb-unit :: ObjectFile/ELF/./ObjectFileELFTests/ObjectFileELFTest.GetSymtab_NoSymEntryPointArmAddressClass (1447 of 1779) PASS: lldb-unit :: Utility/./UtilityTests/StreamTest.PutHex16ByteOrderLittle (1448 of 1779) PASS: lldb-api :: functionalities/data-formatter/data-formatter-stl/libcxx/vbool/TestDataFormatterLibcxxVBool.py (1449 of 1779) PASS: lldb-api :: tools/lldb-server/TestGdbRemoteThreadsInStopReply.py (1450 of 1779) PASS: lldb-unit :: Utility/./UtilityTests/ArgsTest.DoubleQuotedItem (1451 of 1779) PASS: lldb-api :: commands/process/launch-with-shellexpand/TestLaunchWithShellExpand.py (1452 of 1779) PASS: lldb-api :: lang/cpp/virtual/TestVirtual.py (1453 of 1779) PASS: lldb-shell :: Expr/TestTypeOfDeclTypeExpr.test (1454 of 1779) PASS: lldb-shell :: SymbolFile/DWARF/find-basic-type.cpp (1455 of 1779) PASS: lldb-unit :: UnwindAssembly/x86/./UnwindAssemblyx86Tests/Testx86AssemblyInspectionEngine.TestPushR15 (1456 of 1779) PASS: lldb-unit :: Utility/./UtilityTests/ArgsTest.GetQuotedCommandString (1457 of 1779) PASS: lldb-api :: lang/c/offsetof/TestOffsetof.py (1458 of 1779) PASS: lldb-api :: functionalities/gdb_remote_client/TestRestartBug.py (1459 of 1779) PASS: lldb-unit :: Utility/./UtilityTests/StringExtractorTest.GetU32BigEndian (1460 of 1779) PASS: lldb-api :: functionalities/thread/step_out/TestThreadStepOut.py (1461 of 1779) PASS: lldb-api :: commands/apropos/basic/TestApropos.py (1462 of 1779) PASS: lldb-api :: macosx/thread-names/TestInterruptThreadNames.py (1463 of 1779) PASS: lldb-api :: functionalities/tail_call_frames/disambiguate_paths_to_common_sink/TestDisambiguatePathsToCommonSink.py (1464 of 1779) PASS: lldb-unit :: Utility/./UtilityTests/BinaryStreamTest.PutULEB128ThreeBytes (1465 of 1779) PASS: lldb-unit :: Expression/./ExpressionTests/DiagnosticManagerTest.FixedExpression (1466 of 1779) PASS: lldb-unit :: Utility/./UtilityTests/ArgsTest.ReplaceArgumentAtIndexShort (1467 of 1779) PASS: lldb-unit :: Utility/./UtilityTests/RangeTest.SizeTypes (1468 of 1779) PASS: lldb-unit :: Utility/./UtilityTests/RegularExpression.CopyAssignment (1469 of 1779) PASS: lldb-api :: lang/cpp/thread_local/TestThreadLocal.py (1470 of 1779) PASS: lldb-unit :: SymbolFile/DWARF/./SymbolFileDWARFTests/SymbolFileDWARFTests.TestAbbrevOutOfOrder (1471 of 1779) PASS: lldb-unit :: Utility/./UtilityTests/AnsiTerminal.Unknown (1472 of 1779) PASS: lldb-api :: lang/c/local_variables/TestLocalVariables.py (1473 of 1779) PASS: lldb-api :: functionalities/breakpoint/source_regexp/TestSourceRegexBreakpoints.py (1474 of 1779) UNSUPPORTED: lldb-shell :: Register/x86-64-ymm16-write.test (1475 of 1779) PASS: lldb-shell :: SymbolFile/Breakpad/stack-cfi-parsing.test (1476 of 1779) PASS: lldb-unit :: Utility/./UtilityTests/CompletionRequest.TryCompleteCurrentArgMode (1477 of 1779) PASS: lldb-api :: commands/expression/po_verbosity/TestPoVerbosity.py (1478 of 1779) PASS: lldb-api :: functionalities/thread/concurrent_events/TestConcurrentTwoBreakpointsOneWatchpoint.py (1479 of 1779) PASS: lldb-unit :: Utility/./UtilityTests/StringListTest.GetMaxStringLengthEmpty (1480 of 1779) PASS: lldb-unit :: Utility/./UtilityTests/Flags.AnyClear (1481 of 1779) PASS: lldb-unit :: Host/./HostTests/SocketAddressTest.GetAddressInfo (1482 of 1779) PASS: lldb-api :: lang/cpp/unicode-literals/TestUnicodeLiterals.py (1483 of 1779) PASS: lldb-shell :: SymbolFile/NativePDB/function-types-builtins.cpp (1484 of 1779) PASS: lldb-api :: functionalities/breakpoint/breakpoint_ids/TestBreakpointIDs.py (1485 of 1779) PASS: lldb-api :: commands/frame/diagnose/local-variable/TestLocalVariable.py (1486 of 1779) PASS: lldb-api :: functionalities/breakpoint/debugbreak/TestDebugBreak.py (1487 of 1779) PASS: lldb-api :: functionalities/tsan/global_location/TestTsanGlobalLocation.py (1488 of 1779) PASS: lldb-unit :: Host/./HostTests/FileSystemTest.MakeAbsolute (1489 of 1779) PASS: lldb-unit :: Utility/./UtilityTests/StringExtractorTest.GetNameColonValueContainsColon (1490 of 1779) UNSUPPORTED: lldb-api :: lang/objc/bitfield_ivars/TestBitfieldIvars.py (1491 of 1779) PASS: lldb-api :: macosx/find-dsym/bundle-with-dot-in-filename/TestBundleWithDotInFilename.py (1492 of 1779) PASS: lldb-unit :: Utility/./UtilityTests/BinaryStreamTest.PutSLEB128SixBytes (1493 of 1779) PASS: lldb-api :: commands/watchpoints/step_over_watchpoint/TestStepOverWatchpoint.py (1494 of 1779) PASS: lldb-unit :: Process/gdb-remote/./ProcessGdbRemoteTests/GDBRemoteClientBaseTest.SendContinueAndAsyncSignal (1495 of 1779) PASS: lldb-unit :: Utility/./UtilityTests/StringExtractorTest.GetHexU8_Extra_NoEof (1496 of 1779) PASS: lldb-unit :: Core/./LLDBCoreTests/RichManglingContextTest.SwitchProvider (1497 of 1779) PASS: lldb-api :: commands/quit/TestQuit.py (1498 of 1779) PASS: lldb-unit :: Utility/./UtilityTests/UriParserTest.Minimal (1499 of 1779) PASS: lldb-unit :: Expression/./ExpressionTests/DiagnosticManagerTest.PutStringMultiple (1500 of 1779) UNSUPPORTED: lldb-api :: functionalities/signal/handle-segv/TestHandleSegv.py (1501 of 1779) PASS: lldb-api :: functionalities/step-avoids-no-debug/TestStepNoDebug.py (1502 of 1779) PASS: lldb-unit :: Host/./HostTests/FileSystemTest.Readable (1503 of 1779) PASS: lldb-api :: functionalities/var_path/TestVarPath.py (1504 of 1779) PASS: lldb-unit :: Process/gdb-remote/./ProcessGdbRemoteTests/GDBRemoteCommunicationClientTest.TestPacketSpeedJSON (1505 of 1779) PASS: lldb-api :: lang/objc/objc-property/TestObjCProperty.py (1506 of 1779) PASS: lldb-api :: tools/lldb-server/TestGdbRemoteSingleStep.py (1507 of 1779) PASS: lldb-shell :: Breakpoint/debug_rnglist_basic.test (1508 of 1779) PASS: lldb-api :: functionalities/data-formatter/data-formatter-stl/libcxx/bitset/TestDataFormatterLibcxxBitset.py (1509 of 1779) PASS: lldb-unit :: ScriptInterpreter/Python/./ScriptInterpreterPythonTests/PythonDataObjectsTest.TestPythonDictionaryToStructuredDictionary (1510 of 1779) PASS: lldb-unit :: ScriptInterpreter/Python/./ScriptInterpreterPythonTests/PythonDataObjectsTest.TestPythonStringToStr (1511 of 1779) PASS: lldb-unit :: Utility/./UtilityTests/ArgsTest.GetArgumentArrayRef (1512 of 1779) PASS: lldb-unit :: Utility/./UtilityTests/UriParserTest.MinimalPath (1513 of 1779) PASS: lldb-unit :: Host/./HostTests/SocketTest.UDPConnect (1514 of 1779) UNSUPPORTED: lldb-api :: commands/register/register/intel_xtended_registers/mpx_bound_violation/TestBoundViolation.py (1515 of 1779) UNSUPPORTED: lldb-shell :: SymbolFile/PDB/expressions.test (1516 of 1779) PASS: lldb-unit :: Process/gdb-remote/./ProcessGdbRemoteTests/GDBRemoteCommunicationClientTest.SendGetTraceConfigPacket (1517 of 1779) PASS: lldb-unit :: SymbolFile/NativePDB/./SymbolFileNativePDBTests/PDBFPOProgramToDWARFExpressionTests.UnknownOp (1518 of 1779) PASS: lldb-api :: commands/expression/entry-bp/TestExprEntryBP.py (1519 of 1779) PASS: lldb-unit :: UnwindAssembly/x86/./UnwindAssemblyx86Tests/Testx86AssemblyInspectionEngine.TestPush0 (1520 of 1779) PASS: lldb-api :: commands/frame/select/TestFrameSelect.py (1521 of 1779) PASS: lldb-unit :: Process/gdb-remote/./ProcessGdbRemoteTests/GDBRemoteCommunicationClientTest.GetMemoryRegionInfoInvalidResponse (1522 of 1779) PASS: lldb-unit :: Host/./HostTests/FileSystemTest.FileAndDirectoryComponents (1523 of 1779) PASS: lldb-api :: functionalities/abbreviation/TestAbbreviations.py (1524 of 1779) PASS: lldb-api :: python_api/sbdata/TestSBData.py (1525 of 1779) PASS: lldb-api :: commands/target/stop-hooks/TestStopHooks.py (1526 of 1779) PASS: lldb-unit :: Host/./HostTests/SocketTest.TCPListen0GetPort (1527 of 1779) PASS: lldb-shell :: SymbolFile/DWARF/dwarf5-partial-index.cpp (1528 of 1779) PASS: lldb-unit :: Utility/./UtilityTests/StringExtractorTest.GetHexU8_Underflow (1529 of 1779) PASS: lldb-api :: lang/cpp/operators/TestCppOperators.py (1530 of 1779) PASS: lldb-unit :: UnwindAssembly/x86/./UnwindAssemblyx86Tests/Testx86AssemblyInspectionEngine.TestPushECX (1531 of 1779) UNSUPPORTED: lldb-shell :: SymbolFile/NativePDB/local-variables.cpp (1532 of 1779) PASS: lldb-unit :: SymbolFile/NativePDB/./SymbolFileNativePDBTests/PDBFPOProgramToDWARFExpressionTests.UnresolvedCyclicRegisterAssignmentReference (1533 of 1779) PASS: lldb-unit :: Process/gdb-remote/./ProcessGdbRemoteTests/GDBRemoteCommunicationClientTest.SendGetDataPacket (1534 of 1779) PASS: lldb-unit :: Core/./LLDBCoreTests/MangledTest.ResultForValidName (1535 of 1779) PASS: lldb-api :: types/TestDoubleTypes.py (1536 of 1779) PASS: lldb-unit :: UnwindAssembly/x86/./UnwindAssemblyx86Tests/Testx86AssemblyInspectionEngine.Testi386IgnoredRegisters (1537 of 1779) PASS: lldb-unit :: Host/./HostTests/HostInfoTest.GetAugmentedArchSpec (1538 of 1779) PASS: lldb-api :: commands/expression/persistent_types/TestNestedPersistentTypes.py (1539 of 1779) PASS: lldb-api :: functionalities/gdb_remote_client/TestWriteMemory.py (1540 of 1779) PASS: lldb-api :: functionalities/breakpoint/breakpoint_options/TestBreakpointOptions.py (1541 of 1779) PASS: lldb-api :: functionalities/mtc/simple/TestMTCSimple.py (1542 of 1779) PASS: lldb-unit :: Symbol/./SymbolTests/DWARFCallFrameInfoTest.Basic_eh (1543 of 1779) PASS: lldb-unit :: Expression/./ExpressionTests/CppModuleConfigurationTest.Sysroot (1544 of 1779) PASS: lldb-api :: lang/cpp/dynamic-value-same-basename/TestDynamicValueSameBase.py (1545 of 1779) PASS: lldb-unit :: Utility/./UtilityTests/StringListTest.JoinMultiCharSeparator (1546 of 1779) PASS: lldb-unit :: Utility/./UtilityTests/ArgsTest.TestSingleQuotedArgWithSpace (1547 of 1779) PASS: lldb-api :: lang/objcxx/cxx-bridged-po/TestObjCXXBridgedPO.py (1548 of 1779) PASS: lldb-api :: lang/c/unicode/TestUnicodeSymbols.py (1549 of 1779) PASS: lldb-api :: commands/command/script/import/rdar-12586188/TestRdar12586188.py (1550 of 1779) PASS: lldb-unit :: SymbolFile/NativePDB/./SymbolFileNativePDBTests/PDBFPOProgramToDWARFExpressionTests.UnsupportedRASearch (1551 of 1779) PASS: lldb-unit :: Utility/./UtilityTests/StringExtractorTest.DecodeHexU8_Extra (1552 of 1779) PASS: lldb-unit :: Symbol/./SymbolTests/SymbolsTest.TerminateLocateExecutableSymbolFileForUnknownExecutableAndUnknownSymbolFile (1553 of 1779) PASS: lldb-shell :: ObjectFile/ELF/short-build-id.yaml (1554 of 1779) PASS: lldb-unit :: Utility/./UtilityTests/StringLexerTest.HasAtLeast (1555 of 1779) PASS: lldb-api :: commands/expression/test/TestExprs2.py (1556 of 1779) PASS: lldb-unit :: Utility/./UtilityTests/RecordReplayTest.InstrumentedFooSameThis (1557 of 1779) PASS: lldb-api :: functionalities/data-formatter/data-formatter-objc/TestDataFormatterObjCNSData.py (1558 of 1779) UNSUPPORTED: lldb-api :: commands/expression/call-restarts/TestCallThatRestarts.py (1559 of 1779) PASS: lldb-shell :: Driver/TestCommands.test (1560 of 1779) PASS: lldb-api :: lang/mixed/TestMixedLanguages.py (1561 of 1779) PASS: lldb-api :: lang/cpp/bool/TestCPPBool.py (1562 of 1779) PASS: lldb-api :: commands/expression/import-std-module/basic/TestImportStdModule.py (1563 of 1779) PASS: lldb-unit :: Utility/./UtilityTests/OptionsWithRawTest.ArgsButNoDelimiter (1564 of 1779) UNSUPPORTED: lldb-api :: benchmarks/stepping/TestSteppingSpeed.py (1565 of 1779) PASS: lldb-api :: commands/expression/argument_passing_restrictions/TestArgumentPassingRestrictions.py (1566 of 1779) PASS: lldb-unit :: Utility/./UtilityTests/FileSpecTest.FileAndDirectoryComponents (1567 of 1779) PASS: lldb-unit :: Symbol/./SymbolTests/PostfixExpression.ToDWARF (1568 of 1779) PASS: lldb-unit :: UnwindAssembly/x86/./UnwindAssemblyx86Tests/Testx86AssemblyInspectionEngine.TestPushESI (1569 of 1779) PASS: lldb-api :: commands/target/basic/TestTargetCommand.py (1570 of 1779) PASS: lldb-api :: functionalities/data-formatter/data-formatter-stl/libcxx/string/TestDataFormatterLibcxxString.py (1571 of 1779) PASS: lldb-unit :: Utility/./UtilityTests/UriParserTest.PortOverflow (1572 of 1779) PASS: lldb-unit :: Utility/./UtilityTests/AnsiTerminal.Basic (1573 of 1779) PASS: lldb-unit :: Utility/./UtilityTests/StringLexerTest.Peek (1574 of 1779) PASS: lldb-api :: functionalities/thread/concurrent_events/TestConcurrentTwoWatchpointsOneSignal.py (1575 of 1779) UNSUPPORTED: lldb-shell :: SymbolFile/DWARF/debug-types-expressions.test (1576 of 1779) PASS: lldb-api :: functionalities/tail_call_frames/inlining_and_tail_calls/TestInliningAndTailCalls.py (1577 of 1779) PASS: lldb-api :: functionalities/tsan/thread_leak/TestTsanThreadLeak.py (1578 of 1779) UNSUPPORTED: lldb-api :: functionalities/data-formatter/data-formatter-stl/libcxx/function/TestLibCxxFunction.py (1579 of 1779) PASS: lldb-api :: lang/c/function_types/TestFunctionTypes.py (1580 of 1779) PASS: lldb-shell :: SymbolFile/NativePDB/s_constant.cpp (1581 of 1779) PASS: lldb-shell :: SymbolFile/NativePDB/tag-types.cpp (1582 of 1779) PASS: lldb-unit :: Process/minidump/./LLDBMinidumpTests/RegisterContextMinidump.CheckRegisterContextMinidump_ARM (1583 of 1779) PASS: lldb-unit :: UnwindAssembly/x86/./UnwindAssemblyx86Tests/Testx86AssemblyInspectionEngine.TestMovRSPtoRBP (1584 of 1779) XFAIL: lldb-shell :: Register/x86-64-write.test (1585 of 1779) PASS: lldb-api :: api/check_public_api_headers/TestPublicAPIHeaders.py (1586 of 1779) PASS: lldb-unit :: Utility/./UtilityTests/StringExtractorTest.GetU64BigEndian (1587 of 1779) PASS: lldb-api :: tools/lldb-server/TestGdbRemoteExitCode.py (1588 of 1779) PASS: lldb-unit :: ScriptInterpreter/Python/./ScriptInterpreterPythonTests/PythonDataObjectsTest.TestPythonBoolean (1589 of 1779) PASS: lldb-api :: python_api/lldbutil/iter/TestLLDBIterator.py (1590 of 1779) PASS: lldb-api :: commands/expression/import-std-module/list-basic/TestBasicList.py (1591 of 1779) PASS: lldb-unit :: Expression/./ExpressionTests/DiagnosticManagerTest.PutStringSeverities (1592 of 1779) PASS: lldb-api :: functionalities/thread/concurrent_events/TestConcurrentBreakpointOneDelayBreakpointThreads.py (1593 of 1779) PASS: lldb-unit :: SymbolFile/NativePDB/./SymbolFileNativePDBTests/PDBFPOProgramToDWARFExpressionTests.UnresolvedRegisterReference (1594 of 1779) PASS: lldb-unit :: Expression/./ExpressionTests/DiagnosticManagerTest.GetStringBasic (1595 of 1779) PASS: lldb-unit :: SymbolFile/DWARF/./SymbolFileDWARFTests/SymbolFileDWARFTests.TestAbbrevMissingTerminator (1596 of 1779) PASS: lldb-api :: lang/cpp/rvalue-references/TestRvalueReferences.py (1597 of 1779) PASS: lldb-unit :: ObjectFile/PECOFF/./ObjectFilePECOFFTests/PECallFrameInfoTest.Frame_reg_eh (1598 of 1779) PASS: lldb-unit :: Utility/./UtilityTests/ConstStringTest.FromMidOfBufferStringRef (1599 of 1779) PASS: lldb-unit :: Language/Highlighting/./HighlighterTests/HighlighterTest.ClangCursorOutOfBounds (1600 of 1779) PASS: lldb-api :: tools/lldb-server/TestGdbRemoteHostInfo.py (1601 of 1779) PASS: lldb-shell :: Breakpoint/implicit_const_form_support.test (1602 of 1779) PASS: lldb-unit :: Expression/./ExpressionTests/DiagnosticManagerTest.AppendMessageSubsequentDiags (1603 of 1779) PASS: lldb-api :: functionalities/load_using_paths/TestLoadUsingPaths.py (1604 of 1779) PASS: lldb-unit :: Process/minidump/./LLDBMinidumpTests/MinidumpParserTest.GetThreadContext_x86_32_wow64 (1605 of 1779) PASS: lldb-api :: functionalities/float-display/TestFloatDisplay.py (1606 of 1779) PASS: lldb-api :: commands/platform/basic/TestPlatformPython.py (1607 of 1779) PASS: lldb-unit :: Utility/./UtilityTests/StringExtractorTest.GetNameColonValueSuccess (1608 of 1779) PASS: lldb-api :: commands/expression/rdar42038760/TestScalarURem.py (1609 of 1779) PASS: lldb-api :: lang/cpp/incomplete-types/TestCppIncompleteTypes.py (1610 of 1779) PASS: lldb-api :: lang/cpp/breakpoint_in_member_func_w_non_primitive_params/TestBreakpointInMemberFuncWNonPrimitiveParams.py (1611 of 1779) PASS: lldb-api :: functionalities/source-map/TestTargetSourceMap.py (1612 of 1779) PASS: lldb-api :: functionalities/memory/read/TestMemoryRead.py (1613 of 1779) PASS: lldb-api :: functionalities/thread/concurrent_events/TestConcurrentDelaySignalBreak.py (1614 of 1779) PASS: lldb-unit :: Core/./LLDBCoreTests/RichManglingContextTest.IPDRealloc (1615 of 1779) PASS: lldb-api :: commands/expression/top-level/TestTopLevelExprs.py (1616 of 1779) PASS: lldb-api :: python_api/value/empty_class/TestValueAPIEmptyClass.py (1617 of 1779) PASS: lldb-shell :: ObjectFile/ELF/PT_LOAD-overlap-PT_INTERP.yaml (1618 of 1779) PASS: lldb-shell :: SymbolFile/DWARF/debug-types-address-ranges.s (1619 of 1779) PASS: lldb-unit :: Utility/./UtilityTests/FileSpecTest.EqualSeparator (1620 of 1779) PASS: lldb-unit :: Symbol/./SymbolTests/TestClangASTContext.TestGetBasicTypeFromEnum (1621 of 1779) PASS: lldb-unit :: Utility/./UtilityTests/TimerTest.CategoryTimes2 (1622 of 1779) PASS: lldb-api :: lang/c/shared_lib/TestSharedLib.py (1623 of 1779) PASS: lldb-unit :: Language/Highlighting/./HighlighterTests/HighlighterTest.ClangEmptyInput (1624 of 1779) PASS: lldb-unit :: Utility/./UtilityTests/StreamTeeTest.GetStreamAtIndexOutOfBounds (1625 of 1779) PASS: lldb-api :: functionalities/data-formatter/nsdictionarysynth/TestNSDictionarySynthetic.py (1626 of 1779) UNSUPPORTED: lldb-api :: functionalities/data-formatter/data-formatter-stl/libstdcpp/unique_ptr/TestDataFormatterStdUniquePtr.py (1627 of 1779) PASS: lldb-api :: types/TestFloatTypes.py (1628 of 1779) PASS: lldb-unit :: Utility/./UtilityTests/ArgsTest.ReplaceArgumentAtIndexOutOfRange (1629 of 1779) PASS: lldb-unit :: SymbolFile/NativePDB/./SymbolFileNativePDBTests/PDBFPOProgramToDWARFExpressionTests.InvalidOpBinary (1630 of 1779) PASS: lldb-unit :: Process/minidump/./LLDBMinidumpTests/RegisterContextMinidump.ConvertMinidumpContext_x86_32 (1631 of 1779) PASS: lldb-unit :: Expression/./ExpressionTests/DiagnosticManagerTest.PutString (1632 of 1779) PASS: lldb-shell :: Breakpoint/jitbp_elf.test (1633 of 1779) PASS: lldb-api :: functionalities/memory-region/TestMemoryRegion.py (1634 of 1779) PASS: lldb-api :: commands/expression/radar_9531204/TestPrintfAfterUp.py (1635 of 1779) PASS: lldb-unit :: ScriptInterpreter/Python/./ScriptInterpreterPythonTests/PythonDataObjectsTest.TestDictionaryResolutionWithDot (1636 of 1779) UNSUPPORTED: lldb-api :: lang/cpp/printf/TestPrintf.py (1637 of 1779) PASS: lldb-shell :: SymbolFile/DWARF/deterministic-build.cpp (1638 of 1779) PASS: lldb-unit :: Utility/./UtilityTests/RangeTest.ContainsEndInclusive (1639 of 1779) PASS: lldb-unit :: Utility/./UtilityTests/StringListTest.GetMaxStringLengthDecreasingSize (1640 of 1779) PASS: lldb-api :: functionalities/data-formatter/var-in-aggregate-misuse/TestVarInAggregateMisuse.py (1641 of 1779) PASS: lldb-api :: commands/expression/context-object-objc/TestContextObjectObjc.py (1642 of 1779) PASS: lldb-unit :: Utility/./UtilityTests/StringExtractorTest.GetHexBytesAvail (1643 of 1779) PASS: lldb-api :: commands/expression/completion-in-lambda-and-unnnamed-class/TestCompletionInLambdaAndUnnamedClass.py (1644 of 1779) PASS: lldb-api :: commands/expression/no-deadlock/TestExprDoesntBlock.py (1645 of 1779) PASS: lldb-unit :: Utility/./UtilityTests/StringExtractorTest.GetHexU8_Underflow2_NoEof (1646 of 1779) PASS: lldb-api :: commands/frame/diagnose/inheritance/TestDiagnoseInheritance.py (1647 of 1779) PASS: lldb-api :: lang/cpp/char1632_t/TestChar1632T.py (1648 of 1779) PASS: lldb-shell :: Breakpoint/debug_rnglist_offset_pair.test (1649 of 1779) PASS: lldb-unit :: Process/minidump/./LLDBMinidumpTests/MinidumpParserTest.GetLinuxProcStatus_no_stream (1650 of 1779) PASS: lldb-api :: functionalities/data-formatter/data-formatter-stl/libcxx/variant/TestDataFormatterLibcxxVariant.py (1651 of 1779) PASS: lldb-api :: functionalities/avoids-fd-leak/TestFdLeak.py (1652 of 1779) PASS: lldb-unit :: ScriptInterpreter/Python/./ScriptInterpreterPythonTests/PythonDataObjectsTest.TestPythonInteger (1653 of 1779) PASS: lldb-unit :: Utility/./UtilityTests/StreamTeeTest.CopyConstructor (1654 of 1779) PASS: lldb-api :: terminal/TestSTTYBeforeAndAfter.py (1655 of 1779) PASS: lldb-api :: python_api/value_var_update/TestValueVarUpdate.py (1656 of 1779) PASS: lldb-api :: functionalities/tail_call_frames/disambiguate_tail_call_seq/TestDisambiguateTailCallSeq.py (1657 of 1779) PASS: lldb-api :: functionalities/modern-type-lookup/basic/TestBasicModernTypeLookup.py (1658 of 1779) PASS: lldb-unit :: Utility/./UtilityTests/VMRange.Clear (1659 of 1779) PASS: lldb-unit :: Utility/./UtilityTests/IndexToObjectTest.ObjectForIndex (1660 of 1779) UNSUPPORTED: lldb-api :: functionalities/tty/TestTerminal.py (1661 of 1779) PASS: lldb-api :: functionalities/gdb_remote_client/TestNestedRegDefinitions.py (1662 of 1779) PASS: lldb-unit :: Utility/./UtilityTests/OptionsWithRawTest.ArgsButNoLeadingDash (1663 of 1779) PASS: lldb-unit :: UnwindAssembly/x86/./UnwindAssemblyx86Tests/Testx86AssemblyInspectionEngine.TestSubRSP (1664 of 1779) PASS: lldb-shell :: Unwind/eh-frame-dwarf-unwind.test (1665 of 1779) PASS: lldb-shell :: ObjectFile/ELF/PT_LOAD-empty.yaml (1666 of 1779) UNSUPPORTED: lldb-api :: linux/sepdebugsymlink/TestTargetSymbolsSepDebugSymlink.py (1667 of 1779) PASS: lldb-shell :: Settings/TestSettingsSet.test (1668 of 1779) PASS: lldb-api :: functionalities/archives/TestBSDArchives.py (1669 of 1779) PASS: lldb-unit :: Utility/./UtilityTests/VMRange.ContainsRange (1670 of 1779) PASS: lldb-unit :: ScriptInterpreter/Python/./ScriptInterpreterPythonTests/PythonDataObjectsTest.TestPythonTupleValues (1671 of 1779) PASS: lldb-unit :: Utility/./UtilityTests/LogChannelTest.Disable (1672 of 1779) PASS: lldb-unit :: UnwindAssembly/x86/./UnwindAssemblyx86Tests/Testx86AssemblyInspectionEngine.Test32bitFramelessBigStackFrame (1673 of 1779) PASS: lldb-unit :: Utility/./UtilityTests/ArchSpecTest.MergeFrom (1674 of 1779) PASS: lldb-api :: lang/objc/objc-new-syntax/TestObjCNewSyntaxLiteral.py (1675 of 1779) PASS: lldb-unit :: Utility/./UtilityTests/StringListTest.LongestCommonPrefixNoPrefix (1676 of 1779) PASS: lldb-shell :: ObjectFile/ELF/gnu-debuglink.yaml (1677 of 1779) PASS: lldb-shell :: SymbolFile/NativePDB/ast-methods.cpp (1678 of 1779) UNSUPPORTED: lldb-api :: functionalities/thread/state/TestThreadStates.py (1679 of 1779) PASS: lldb-unit :: Process/gdb-remote/./ProcessGdbRemoteTests/GDBRemoteCommunicationClientTest.ReadRegister (1680 of 1779) UNSUPPORTED: lldb-api :: functionalities/darwin_log/filter/exact_match/subsystem/TestDarwinLogFilterMatchSubsystem.py (1681 of 1779) PASS: lldb-api :: python_api/default-constructor/TestDefaultConstructorForAPIObjects.py (1682 of 1779) PASS: lldb-unit :: Language/Highlighting/./HighlighterTests/HighlighterTest.ClangComments (1683 of 1779) PASS: lldb-api :: functionalities/data-formatter/poarray/TestPrintObjectArray.py (1684 of 1779) PASS: lldb-unit :: Utility/./UtilityTests/StringExtractorTest.GetHexBytesAvail_FullString (1685 of 1779) UNSUPPORTED: lldb-api :: commands/expression/macros/TestMacros.py (1686 of 1779) PASS: lldb-unit :: Utility/./UtilityTests/StreamTest.ShiftOperatorStrings (1687 of 1779) PASS: lldb-api :: functionalities/data-formatter/ptr_ref_typedef/TestPtrRef2Typedef.py (1688 of 1779) UNSUPPORTED: lldb-shell :: Register/x86-64-zmm-read.test (1689 of 1779) PASS: lldb-unit :: Language/Highlighting/./HighlighterTests/HighlighterTest.Keywords (1690 of 1779) PASS: lldb-unit :: ScriptInterpreter/Python/./ScriptInterpreterPythonTests/PythonDataObjectsTest.TestPythonBytes (1691 of 1779) PASS: lldb-unit :: Utility/./UtilityTests/StringLexerTest.NextIf (1692 of 1779) PASS: lldb-api :: functionalities/thread/backtrace_limit/TestBacktraceLimit.py (1693 of 1779) PASS: lldb-api :: commands/expression/import-std-module/conflicts/TestStdModuleWithConflicts.py (1694 of 1779) PASS: lldb-api :: python_api/type/TestTypeList.py (1695 of 1779) PASS: lldb-unit :: ObjectFile/Breakpad/./ObjectFileBreakpadTests/InfoRecord.parse (1696 of 1779) PASS: lldb-shell :: SymbolFile/Breakpad/symtab.test (1697 of 1779) PASS: lldb-unit :: Utility/./UtilityTests/TimeoutTest.Format (1698 of 1779) PASS: lldb-api :: functionalities/breakpoint/breakpoint_command/TestBreakpointCommand.py (1699 of 1779) PASS: lldb-unit :: Utility/./UtilityTests/StringExtractorTest.DecodeHexU8_Underflow (1700 of 1779) UNSUPPORTED: lldb-shell :: Register/x86-64-zmm-write.test (1701 of 1779) PASS: lldb-api :: lang/cpp/frame-var-anon-unions/TestFrameVariableAnonymousUnions.py (1702 of 1779) PASS: lldb-api :: commands/watchpoints/watchpoint_on_vectors/TestValueOfVectorVariable.py (1703 of 1779) PASS: lldb-unit :: Utility/./UtilityTests/OptionsWithRawTest.TerminatedQuote (1704 of 1779) PASS: lldb-api :: functionalities/tsan/thread_numbers/TestTsanThreadNumbers.py (1705 of 1779) PASS: lldb-unit :: Utility/./UtilityTests/ArgsTest.TestTrailingBackslash (1706 of 1779) PASS: lldb-api :: functionalities/data-formatter/data-formatter-synth/TestDataFormatterSynth.py (1707 of 1779) PASS: lldb-api :: lang/objc/ivar-IMP/TestObjCiVarIMP.py (1708 of 1779) PASS: lldb-unit :: Utility/./UtilityTests/StringListTest.SplitIntoLines (1709 of 1779) PASS: lldb-unit :: Process/gdb-remote/./ProcessGdbRemoteTests/GDBRemoteCommunicationClientTest.SyncThreadState (1710 of 1779) PASS: lldb-unit :: Utility/./UtilityTests/StreamTest.PutMaxHex64ByteOrderBig (1711 of 1779) PASS: lldb-api :: functionalities/data-formatter/summary-string-onfail/Test-rdar-9974002.py (1712 of 1779) PASS: lldb-unit :: Utility/./UtilityTests/RangeTest.Constructor (1713 of 1779) PASS: lldb-unit :: Utility/./UtilityTests/StreamTest.PutBytesAsRawHex8ToLittleEndian (1714 of 1779) PASS: lldb-shell :: SymbolFile/NativePDB/disassembly.cpp (1715 of 1779) PASS: lldb-unit :: ScriptInterpreter/Python/./ScriptInterpreterPythonTests/PythonDataObjectsTest.TestGlobalNameResolutionWithDot (1716 of 1779) PASS: lldb-shell :: SymbolFile/Breakpad/unwind-via-raSearch.test (1717 of 1779) PASS: lldb-api :: tools/lldb-server/TestGdbRemoteAttach.py (1718 of 1779) PASS: lldb-api :: sample_test/TestSampleInlineTest.py (1719 of 1779) PASS: lldb-unit :: Language/Highlighting/./HighlighterTests/HighlighterTest.ClangCursorPosInOtherToken (1720 of 1779) PASS: lldb-api :: functionalities/gdb_remote_client/TestTargetXMLArch.py (1721 of 1779) UNSUPPORTED: lldb-api :: functionalities/thread/create_during_step/TestCreateDuringStep.py (1722 of 1779) PASS: lldb-unit :: Symbol/./SymbolTests/TestClangASTContext.TestBuiltinTypeForEncodingAndBitSize (1723 of 1779) PASS: lldb-unit :: Process/minidump/./LLDBMinidumpTests/MinidumpParserTest.GetPidWindows (1724 of 1779) PASS: lldb-api :: functionalities/thread/exit_during_break/TestExitDuringBreak.py (1725 of 1779) PASS: lldb-api :: macosx/function-starts/TestFunctionStarts.py (1726 of 1779) PASS: lldb-shell :: SymbolFile/sizeless-symbol.test (1727 of 1779) PASS: lldb-unit :: Language/Highlighting/./HighlighterTests/HighlighterTest.ClangCursorPosEndOfLine (1728 of 1779) PASS: lldb-unit :: UnwindAssembly/x86/./UnwindAssemblyx86Tests/Testx86AssemblyInspectionEngine.TestPopEBX (1729 of 1779) UNSUPPORTED: lldb-shell :: Process/Windows/exception_access_violation.cpp (1730 of 1779) PASS: lldb-shell :: Reproducer/TestDump.test (1731 of 1779) PASS: lldb-api :: functionalities/thread/concurrent_events/TestConcurrentTwoWatchpointsOneDelayBreakpoint.py (1732 of 1779) PASS: lldb-unit :: Signals/./SignalsTests/UnixSignalsTest.GetFilteredSignals (1733 of 1779) PASS: lldb-api :: functionalities/thread/backtrace_all/TestBacktraceAll.py (1734 of 1779) PASS: lldb-api :: commands/expression/calculator_mode/TestCalculatorMode.py (1735 of 1779) PASS: lldb-api :: lang/objc/print-obj/TestPrintObj.py (1736 of 1779) PASS: lldb-api :: functionalities/data-formatter/pyobjsynthprovider/TestPyObjSynthProvider.py (1737 of 1779) PASS: lldb-unit :: Utility/./UtilityTests/ArgsTest.TestOverwriteArgs (1738 of 1779) PASS: lldb-api :: functionalities/data-formatter/data-formatter-synthval/TestDataFormatterSynthVal.py (1739 of 1779) PASS: lldb-api :: lang/objc/rdar-10967107/TestRdar10967107.py (1740 of 1779) PASS: lldb-api :: commands/disassemble/basic/TestFrameDisassemble.py (1741 of 1779) PASS: lldb-unit :: Utility/./UtilityTests/VMRange.CollectionContains (1742 of 1779) PASS: lldb-unit :: Utility/./UtilityTests/NameMatchesTest.Ignore (1743 of 1779) PASS: lldb-api :: python_api/frame/inlines/TestInlinedFrame.py (1744 of 1779) PASS: lldb-unit :: Utility/./UtilityTests/TimerTest.CategoryTimesStats (1745 of 1779) PASS: lldb-api :: lang/objc/objc-static-method-stripped/TestObjCStaticMethodStripped.py (1746 of 1779) PASS: lldb-api :: functionalities/data-formatter/data-formatter-advanced/TestDataFormatterAdv.py (1747 of 1779) PASS: lldb-shell :: SymbolFile/DWARF/childless-compile-unit.s (1748 of 1779) PASS: lldb-api :: tools/lldb-server/register-reading/TestGdbRemoteGPacket.py (1749 of 1779) PASS: lldb-api :: functionalities/thread/concurrent_events/TestConcurrentDelayedCrashWithBreakpointWatchpoint.py (1750 of 1779) PASS: lldb-unit :: ScriptInterpreter/Python/./ScriptInterpreterPythonTests/PythonDataObjectsTest.TestExtractingUInt64ThroughStructuredData (1751 of 1779) PASS: lldb-unit :: Core/./LLDBCoreTests/RichManglingContextTest.Basic (1752 of 1779) PASS: lldb-unit :: Utility/./UtilityTests/RangeDataVector.FindEntryThatContains_Overlap (1753 of 1779) PASS: lldb-api :: lang/objc/radar-9691614/TestObjCMethodReturningBOOL.py (1754 of 1779) PASS: lldb-api :: functionalities/inferior-crashing/TestInferiorCrashing.py (1755 of 1779) PASS: lldb-unit :: debugserver/./debugserverTests/RNBSocket.LoopBackListenIPv4 (1756 of 1779) PASS: lldb-unit :: Utility/./UtilityTests/StringListTest.CopyListEmpty (1757 of 1779) PASS: lldb-unit :: Utility/./UtilityTests/ReproducerTest.SetReplay (1758 of 1779) UNSUPPORTED: lldb-api :: functionalities/data-formatter/data-formatter-stl/libstdcpp/tuple/TestDataFormatterStdTuple.py (1759 of 1779) PASS: lldb-api :: functionalities/breakpoint/breakpoint_set_restart/TestBreakpointSetRestart.py (1760 of 1779) PASS: lldb-unit :: Utility/./UtilityTests/StreamTeeTest.Constructor2Streams (1761 of 1779) PASS: lldb-api :: macosx/version_zero/TestGetVersionZeroVersion.py (1762 of 1779) UNSUPPORTED: lldb-shell :: BuildScript/toolchain-msvc.test (1763 of 1779) PASS: lldb-unit :: Utility/./UtilityTests/ArgsTest.TestSingleArg (1764 of 1779) PASS: lldb-api :: lang/objcxx/objcxx-ivar-vector/TestIvarVector.py (1765 of 1779) PASS: lldb-api :: functionalities/inferior-crashing/recursive-inferior/TestRecursiveInferior.py (1766 of 1779) UNSUPPORTED: lldb-api :: functionalities/thread/break_after_join/TestBreakAfterJoin.py (1767 of 1779) PASS: lldb-api :: commands/frame/recognizer/TestFrameRecognizer.py (1768 of 1779) PASS: lldb-api :: functionalities/conditional_break/TestConditionalBreak.py (1769 of 1779) PASS: lldb-api :: functionalities/breakpoint/address_breakpoints/TestAddressBreakpoints.py (1770 of 1779) PASS: lldb-api :: functionalities/return-value/TestReturnValue.py (1771 of 1779) PASS: lldb-api :: functionalities/data-formatter/data-formatter-objc/TestDataFormatterObjCPlain.py (1772 of 1779) PASS: lldb-api :: commands/expression/import-std-module/vector-bool/TestBoolVector.py (1773 of 1779) PASS: lldb-api :: functionalities/data-formatter/synthupdate/TestSyntheticFilterRecompute.py (1774 of 1779) PASS: lldb-api :: lang/objc/exceptions/TestObjCExceptions.py (1775 of 1779) PASS: lldb-api :: lang/objc/self/TestObjCSelf.py (1776 of 1779) PASS: lldb-api :: lang/objc/foundation/TestFoundationDisassembly.py (1777 of 1779) PASS: lldb-api :: functionalities/modern-type-lookup/basic-objc/TestBasicObjcModernTypeLookup.py (1778 of 1779) PASS: lldb-api :: functionalities/inferior-assert/TestInferiorAssert.py (1779 of 1779) Testing Time: 1643.58s ******************** Failing Tests (2): lldb-api :: iohandler/completion/TestIOHandlerCompletion.py lldb-api :: commands/expression/multiline-completion/TestMultilineCompletion.py

Hide Details

Hide Details

Slowest Tests: -------------------------------------------------------------------------- 110.03s: lldb-api :: commands/expression/import-std-module/stack/TestStack.py 112.17s: lldb-api :: functionalities/inferior-crashing/TestInferiorCrashingStep.py 116.81s: lldb-api :: lang/objc/real-definition/TestRealDefinition.py 123.05s: lldb-api :: functionalities/return-value/TestReturnValue.py 128.36s: lldb-api :: lang/c/anonymous/TestAnonymous.py 132.01s: lldb-api :: api/check_public_api_headers/TestPublicAPIHeaders.py 146.47s: lldb-api :: lang/objc/exceptions/TestObjCExceptions.py 148.14s: lldb-api :: lang/objc/objc-new-syntax/TestObjCNewSyntaxArray.py 152.36s: lldb-api :: lang/objc/objc-new-syntax/TestObjCNewSyntaxDictionary.py 158.40s: lldb-api :: lang/cpp/namespace/TestNamespaceLookup.py 160.31s: lldb-api :: functionalities/recursion/TestValueObjectRecursion.py 173.34s: lldb-api :: tools/lldb-server/TestLldbGdbServer.py 178.06s: lldb-api :: lang/objc/objc-new-syntax/TestObjCNewSyntaxLiteral.py 186.78s: lldb-api :: lang/objc/foundation/TestObjCMethods.py 225.89s: lldb-api :: api/multithreaded/TestMultithreaded.py 229.60s: lldb-api :: lang/cpp/enum_types/TestCPP11EnumTypes.py 267.85s: lldb-api :: lang/objc/hidden-ivars/TestHiddenIvars.py 375.67s: lldb-api :: types/TestIntegerTypes.py 536.29s: lldb-api :: types/TestIntegerTypesExpr.py 681.65s: lldb-api :: lang/objc/foundation/TestFoundationDisassembly.py

Hide Details

Tests Times: -------------------------------------------------------------------------- [ Range ] :: [ Percentage ] :: [ Count ] -------------------------------------------------------------------------- [ 0s, 50s) :: [************************************* ] :: [1662/1779] [ 50s,100s) :: [** ] :: [ 91/1779] [100s,150s) :: [ ] :: [ 12/1779] [150s,200s) :: [ ] :: [ 8/1779] [200s,250s) :: [ ] :: [ 2/1779] [250s,300s) :: [ ] :: [ 1/1779] [300s,350s) :: [ ] :: [ 0/1779] [350s,400s) :: [ ] :: [ 1/1779] [400s,450s) :: [ ] :: [ 0/1779] [450s,500s) :: [ ] :: [ 0/1779] [500s,550s) :: [ ] :: [ 0/1779] [550s,600s) :: [ ] :: [ 1/1779] [600s,650s) :: [ ] :: [ 0/1779] [650s,700s) :: [ ] :: [ 1/1779] Expected Passes : 1634 Expected Failures : 6 Unsupported Tests : 137 Unexpected Failures: 2 FAILED: tools/lldb/test/CMakeFiles/check-lldb-lit cd /Users/buildslave/jenkins/workspace/lldb-cmake-sanitized/lldb-build/tools/lldb/test && /usr/bin/python /Users/buildslave/jenkins/workspace/lldb-cmake-sanitized/lldb-build/./bin/llvm-lit -v --time-tests --shuffle --xunit-xml-output=/Users/buildslave/jenkins/workspace/lldb-cmake-sanitized/test/results.xml -v --timeout 1200 /Users/buildslave/jenkins/workspace/lldb-cmake-sanitized/lldb-build/tools/lldb/test ninja: build stopped: subcommand failed. Command failed Command: ['/usr/bin/env', 'TERM=vt100', '/usr/local/bin/ninja', '-v', 'check-lldb'] [Pipeline] } [Pipeline] // timeout [Pipeline] } [Pipeline] // stage [Pipeline] stage [Pipeline] { (Declarative: Post Actions) [Pipeline] scanForIssues No credentials specified [Clang (LLVM based)] Sleeping for 5 seconds due to JENKINS-32191... [Clang (LLVM based)] Parsing console log (workspace: '/Users/buildslave/jenkins/workspace/lldb-cmake-sanitized') [Pipeline] junit Recording test results [Pipeline] } [Pipeline] // stage [Pipeline] } [Pipeline] // withEnv [Pipeline] } [Pipeline] // node [Pipeline] End of Pipeline [BFA] Scanning build for known causes... [BFA] Found failure cause(s): [BFA] Ninja target failed from category Compile [BFA] Regression test failed from category Test [BFA] Done. 1s ERROR: script returned exit code 1 Finished: FAILURE