FailedConsole Output

Started by an SCM change
Running as SYSTEM
Building remotely on green-dragon-03 (Zorg 10.13.5 Xcode9.4.1) in workspace /Users/buildslave/jenkins/workspace/clang-stage1-cmake-RA-incremental
SVN Updating

Hide Details

Updating http://llvm.org/svn/llvm-project/llvm/trunk@HEAD at revision HEAD U test/Transforms/InstCombine/and-or-icmps.ll At revision 366611

Hide Details

SVN Updating

Hide Details

Updating http://llvm.org/svn/llvm-project/cfe/trunk@HEAD at revision HEAD At revision 366611

Hide Details

No changes for http://llvm.org/svn/llvm-project/cfe/trunk since the previous build No emails were triggered. New run name is 'rL:366611 - C:366592 - #63368' [clang-stage1-cmake-RA-incremental] $ /bin/sh -xe /var/folders/9t/lrs73ptj6lv644zvh1fk2_gc0000gn/T/jenkins312715121776012748.sh + rm -rf build.properties + export LLVM_REV=366611 + LLVM_REV=366611 + echo LLVM_REV=366611 + echo CLEAN=false + export MACOSX_DEPLOYMENT_TARGET=10.9 + MACOSX_DEPLOYMENT_TARGET=10.9 + echo '@@@@@@ Acquire @@@@@@' @@@@@@ Acquire @@@@@@ + set -u + '[' false = true ']' + python /opt/llvm/zorg/zorg/jenkins//build.py derive-llvm+clang Completed at: 2019-07-19T13:51:38 @@@@@@
SVN upgrade

Hide Details

@@@ SVN upgrade @@@ Completed at: 2019-07-19T13:51:38 @@@@@@
SVN upgrade

Hide Details

@@@ SVN upgrade @@@
Derive Source

Hide Details

@@@ Derive Source @@@ cd /Users/buildslave/jenkins/workspace/clang-stage1-cmake-RA-incremental/llvm 'rsync' '-auvh' '--delete' '--exclude=.svn/' '--exclude=/tools/clang' '/Users/buildslave/jenkins/workspace/clang-stage1-cmake-RA-incremental/llvm.src/' '/Users/buildslave/jenkins/workspace/clang-stage1-cmake-RA-incremental/llvm' building file list ... done test/Transforms/InstCombine/ test/Transforms/InstCombine/and-or-icmps.ll

Hide Details

sent 871.73K bytes received 48 bytes 348.71K bytes/sec total size is 353.03M speedup is 404.96 cd /Users/buildslave/jenkins/workspace/clang-stage1-cmake-RA-incremental/llvm 'rsync' '-auvh' '--delete' '--exclude=.svn/' '/Users/buildslave/jenkins/workspace/clang-stage1-cmake-RA-incremental/clang.src/' '/Users/buildslave/jenkins/workspace/clang-stage1-cmake-RA-incremental/llvm/tools/clang' building file list ... done

Hide Details

sent 450.63K bytes received 20 bytes 300.43K bytes/sec total size is 110.78M speedup is 245.82 Completed at: 2019-07-19T13:51:41 @@@@@@ + echo @@@@@@ @@@@@@ + echo '@@@@@@ BUILD @@@@@@' @@@@@@ BUILD @@@@@@ + set -u + export INSTALL_DIR=/Users/buildslave/jenkins/workspace/clang-stage1-cmake-RA-incremental/clang-install + INSTALL_DIR=/Users/buildslave/jenkins/workspace/clang-stage1-cmake-RA-incremental/clang-install + export BUILD_DIR=/Users/buildslave/jenkins/workspace/clang-stage1-cmake-RA-incremental/clang-build + BUILD_DIR=/Users/buildslave/jenkins/workspace/clang-stage1-cmake-RA-incremental/clang-build + export PATH=/usr/local/bin:/usr/local/sbin:/usr/bin:/bin:/usr/sbin:/sbin:/usr/bin:/usr/local/bin + PATH=/usr/local/bin:/usr/local/sbin:/usr/bin:/bin:/usr/sbin:/sbin:/usr/bin:/usr/local/bin + python /opt/llvm/zorg/zorg/jenkins//build.py cmake build --assertions You are using pip version 18.1, however version 19.1.1 is available. You should consider upgrading via the 'pip install --upgrade pip' command. Dependency met os_version v10.13.5 Dependency met brew cmake v3.11.2 Dependency met brew ninja v1.8.2 Dependency met pip psutil v5.4.5 Dependency met xcode v9.4.1
Cmake

Hide Details

@@@ Cmake @@@ cd /Users/buildslave/jenkins/workspace/clang-stage1-cmake-RA-incremental/clang-build '/usr/local/bin/cmake' '-G' 'Ninja' '-DCMAKE_MAKE_PROGRAM=/usr/local/bin/ninja' '-DCMAKE_INSTALL_PREFIX=/Users/buildslave/jenkins/workspace/clang-stage1-cmake-RA-incremental/clang-install' '/Users/buildslave/jenkins/workspace/clang-stage1-cmake-RA-incremental/llvm' '-DLLVM_ENABLE_LTO=Off' '-DLLVM_BUILD_EXAMPLES=On' '-DCMAKE_MACOSX_RPATH=On' '-DCMAKE_LIBTOOL=/Applications/Xcode.app/Contents/Developer/Toolchains/XcodeDefault.xctoolchain/usr/bin/libtool' '-DCMAKE_BUILD_TYPE=Release' '-DLLVM_BUILD_EXTERNAL_COMPILER_RT=On' '-DLLVM_ENABLE_ASSERTIONS=On' '-DSVN_REVISION=366611' '-DLLVM_LIT_ARGS=--xunit-xml-output=testresults.xunit.xml -v --timeout=600' -- Could NOT find Z3: Found unsuitable version "0.0.0", but required is at least "4.7.1" (found Z3_LIBRARIES-NOTFOUND) -- Found libtool - /Applications/Xcode.app/Contents/Developer/Toolchains/XcodeDefault.xctoolchain/usr/bin/libtool -- Native target architecture is X86 -- Threads enabled. -- Doxygen disabled. -- Go bindings disabled. -- Ninja version: 1.8.2 -- Found ld64 - /Applications/Xcode.app/Contents/Developer/Toolchains/XcodeDefault.xctoolchain/usr/bin/ld -- Could NOT find OCaml (missing: OCAMLFIND OCAML_VERSION OCAML_STDLIB_PATH) -- Could NOT find OCaml (missing: OCAMLFIND OCAML_VERSION OCAML_STDLIB_PATH) -- OCaml bindings disabled. -- LLVM host triple: x86_64-apple-darwin17.6.0 -- LLVM default target triple: x86_64-apple-darwin17.6.0 -- Building with -fPIC -- Constructing LLVMBuild project information -- Linker detection: ld64 -- Targeting AArch64 -- Targeting AMDGPU -- Targeting ARM -- Targeting BPF -- Targeting Hexagon -- Targeting Lanai -- Targeting Mips -- Targeting MSP430 -- Targeting NVPTX -- Targeting PowerPC -- Targeting RISCV -- Targeting Sparc -- Targeting SystemZ -- Targeting WebAssembly -- Targeting X86 -- Targeting XCore -- Clang version: 10.0.0 -- LLVM FileCheck Found: /usr/local/bin/FileCheck -- Version: 0.0.0 -- Performing Test HAVE_THREAD_SAFETY_ATTRIBUTES -- failed to compile -- Performing Test HAVE_GNU_POSIX_REGEX -- failed to compile -- Performing Test HAVE_POSIX_REGEX -- success -- Performing Test HAVE_STEADY_CLOCK -- success -- Configuring done -- Generating done CMake Warning: Manually-specified variables were not used by the project:

Hide Details

SVN_REVISION

Hide Details

Hide Details

-- Build files have been written to: /Users/buildslave/jenkins/workspace/clang-stage1-cmake-RA-incremental/clang-build Completed at: 2019-07-19T13:52:04 @@@@@@
Ninja build

Hide Details

@@@ Ninja build @@@ cd /Users/buildslave/jenkins/workspace/clang-stage1-cmake-RA-incremental/clang-build '/usr/local/bin/ninja' '-v' 'all' [1/144] cd /Users/buildslave/jenkins/workspace/clang-stage1-cmake-RA-incremental/clang-build && /Users/buildslave/jenkins/workspace/clang-stage1-cmake-RA-incremental/clang-build/bin/llvm-tblgen -gen-dfa-packetizer -I /Users/buildslave/jenkins/workspace/clang-stage1-cmake-RA-incremental/llvm/lib/Target/AMDGPU -I /Users/buildslave/jenkins/workspace/clang-stage1-cmake-RA-incremental/llvm/include -I /Users/buildslave/jenkins/workspace/clang-stage1-cmake-RA-incremental/llvm/lib/Target /Users/buildslave/jenkins/workspace/clang-stage1-cmake-RA-incremental/llvm/lib/Target/AMDGPU/R600.td -o lib/Target/AMDGPU/R600GenDFAPacketizer.inc -d lib/Target/AMDGPU/R600GenDFAPacketizer.inc.d [2/144] cd /Users/buildslave/jenkins/workspace/clang-stage1-cmake-RA-incremental/clang-build && /Users/buildslave/jenkins/workspace/clang-stage1-cmake-RA-incremental/clang-build/bin/llvm-tblgen -gen-asm-writer -I /Users/buildslave/jenkins/workspace/clang-stage1-cmake-RA-incremental/llvm/lib/Target/AMDGPU -I /Users/buildslave/jenkins/workspace/clang-stage1-cmake-RA-incremental/llvm/include -I /Users/buildslave/jenkins/workspace/clang-stage1-cmake-RA-incremental/llvm/lib/Target /Users/buildslave/jenkins/workspace/clang-stage1-cmake-RA-incremental/llvm/lib/Target/AMDGPU/R600.td -o lib/Target/AMDGPU/R600GenAsmWriter.inc -d lib/Target/AMDGPU/R600GenAsmWriter.inc.d [3/144] cd /Users/buildslave/jenkins/workspace/clang-stage1-cmake-RA-incremental/clang-build && /Users/buildslave/jenkins/workspace/clang-stage1-cmake-RA-incremental/clang-build/bin/llvm-tblgen -gen-emitter -I /Users/buildslave/jenkins/workspace/clang-stage1-cmake-RA-incremental/llvm/lib/Target/AMDGPU -I /Users/buildslave/jenkins/workspace/clang-stage1-cmake-RA-incremental/llvm/include -I /Users/buildslave/jenkins/workspace/clang-stage1-cmake-RA-incremental/llvm/lib/Target /Users/buildslave/jenkins/workspace/clang-stage1-cmake-RA-incremental/llvm/lib/Target/AMDGPU/R600.td -o lib/Target/AMDGPU/R600GenMCCodeEmitter.inc -d lib/Target/AMDGPU/R600GenMCCodeEmitter.inc.d [4/144] cd /Users/buildslave/jenkins/workspace/clang-stage1-cmake-RA-incremental/clang-build && /Users/buildslave/jenkins/workspace/clang-stage1-cmake-RA-incremental/clang-build/bin/llvm-tblgen -gen-instr-info -I /Users/buildslave/jenkins/workspace/clang-stage1-cmake-RA-incremental/llvm/lib/Target/AMDGPU -I /Users/buildslave/jenkins/workspace/clang-stage1-cmake-RA-incremental/llvm/include -I /Users/buildslave/jenkins/workspace/clang-stage1-cmake-RA-incremental/llvm/lib/Target /Users/buildslave/jenkins/workspace/clang-stage1-cmake-RA-incremental/llvm/lib/Target/AMDGPU/R600.td -o lib/Target/AMDGPU/R600GenInstrInfo.inc -d lib/Target/AMDGPU/R600GenInstrInfo.inc.d [5/144] : && /Applications/Xcode.app/Contents/Developer/Toolchains/XcodeDefault.xctoolchain/usr/bin/c++ -fPIC -fvisibility-inlines-hidden -Werror=date-time -Werror=unguarded-availability-new -std=c++11 -Wall -Wextra -Wno-unused-parameter -Wwrite-strings -Wcast-qual -Wmissing-field-initializers -pedantic -Wno-long-long -Wimplicit-fallthrough -Wcovered-switch-default -Wno-noexcept-type -Wnon-virtual-dtor -Wdelete-non-virtual-dtor -Wstring-conversion -fdiagnostics-color -O3 -isysroot /Applications/Xcode.app/Contents/Developer/Platforms/MacOSX.platform/Developer/SDKs/MacOSX10.13.sdk -mmacosx-version-min=10.9 -Wl,-search_paths_first -Wl,-headerpad_max_install_names -Wl,-dead_strip -rdynamic examples/Kaleidoscope/Chapter8/CMakeFiles/Kaleidoscope-Ch8.dir/toy.cpp.o -o bin/Kaleidoscope-Ch8 -Wl,-rpath,@loader_path/../lib -lLLVMLLVMDemangle -lLLVMLLVMSupport -lLLVMLLVMTableGen -lLLVMLLVMCore -lLLVMLLVMFuzzMutate -lLLVMLLVMIRReader -lLLVMLLVMCodeGen -lLLVMLLVMSelectionDAG -lLLVMLLVMAsmPrinter -lLLVMLLVMMIRParser -lLLVMLLVMGlobalISel -lLLVMLLVMBinaryFormat -lLLVMLLVMBitReader -lLLVMLLVMBitWriter -lLLVMLLVMBitstreamReader -lLLVMLLVMTransformUtils -lLLVMLLVMInstrumentation -lLLVMLLVMAggressiveInstCombine -lLLVMLLVMInstCombine -lLLVMLLVMScalarOpts -lLLVMLLVMipo -lLLVMLLVMVectorize -lLLVMLLVMObjCARCOpts -lLLVMLLVMCoroutines -lLLVMLLVMLinker -lLLVMLLVMAnalysis -lLLVMLLVMLTO -lLLVMLLVMMC -lLLVMLLVMMCParser -lLLVMLLVMMCDisassembler -lLLVMLLVMMCA -lLLVMLLVMObject -lLLVMLLVMObjectYAML -lLLVMLLVMOption -lLLVMLLVMRemarks -lLLVMLLVMDebugInfoDWARF -lLLVMLLVMDebugInfoGSYM -lLLVMLLVMDebugInfoMSF -lLLVMLLVMDebugInfoCodeView -lLLVMLLVMDebugInfoPDB -lLLVMLLVMSymbolize -lLLVMLLVMExecutionEngine -lLLVMLLVMInterpreter -lLLVMLLVMJITLink -lLLVMLLVMMCJIT -lLLVMLLVMOrcJIT -lLLVMLLVMRuntimeDyld -lLLVMLLVMTarget -lLLVMLLVMAArch64CodeGen -lLLVMLLVMAArch64AsmParser -lLLVMLLVMAArch64Disassembler -lLLVMLLVMAArch64Desc -lLLVMLLVMAArch64Info -lLLVMLLVMAArch64Utils -lLLVMLLVMAMDGPUCodeGen -lLLVMLLVMAMDGPUAsmParser -lLLVMLLVMAMDGPUDisassembler -lLLVMLLVMAMDGPUDesc -lLLVMLLVMAMDGPUInfo -lLLVMLLVMAMDGPUUtils -lLLVMLLVMARMCodeGen -lLLVMLLVMARMAsmParser -lLLVMLLVMARMDisassembler -lLLVMLLVMARMDesc -lLLVMLLVMARMInfo -lLLVMLLVMARMUtils -lLLVMLLVMBPFCodeGen -lLLVMLLVMBPFAsmParser -lLLVMLLVMBPFDisassembler -lLLVMLLVMBPFDesc -lLLVMLLVMBPFInfo -lLLVMLLVMHexagonCodeGen -lLLVMLLVMHexagonAsmParser -lLLVMLLVMHexagonDisassembler -lLLVMLLVMHexagonDesc -lLLVMLLVMHexagonInfo -lLLVMLLVMLanaiCodeGen -lLLVMLLVMLanaiAsmParser -lLLVMLLVMLanaiDisassembler -lLLVMLLVMLanaiDesc -lLLVMLLVMLanaiInfo -lLLVMLLVMMipsCodeGen -lLLVMLLVMMipsAsmParser -lLLVMLLVMMipsDisassembler -lLLVMLLVMMipsDesc -lLLVMLLVMMipsInfo -lLLVMLLVMMSP430CodeGen -lLLVMLLVMMSP430Desc -lLLVMLLVMMSP430Info -lLLVMLLVMMSP430AsmParser -lLLVMLLVMMSP430Disassembler -lLLVMLLVMNVPTXCodeGen -lLLVMLLVMNVPTXDesc -lLLVMLLVMNVPTXInfo -lLLVMLLVMPowerPCCodeGen -lLLVMLLVMPowerPCAsmParser -lLLVMLLVMPowerPCDisassembler -lLLVMLLVMPowerPCDesc -lLLVMLLVMPowerPCInfo -lLLVMLLVMRISCVCodeGen -lLLVMLLVMRISCVAsmParser -lLLVMLLVMRISCVDisassembler -lLLVMLLVMRISCVDesc -lLLVMLLVMRISCVInfo -lLLVMLLVMRISCVUtils -lLLVMLLVMSparcCodeGen -lLLVMLLVMSparcAsmParser -lLLVMLLVMSparcDisassembler -lLLVMLLVMSparcDesc -lLLVMLLVMSparcInfo -lLLVMLLVMSystemZCodeGen -lLLVMLLVMSystemZAsmParser -lLLVMLLVMSystemZDisassembler -lLLVMLLVMSystemZDesc -lLLVMLLVMSystemZInfo -lLLVMLLVMWebAssemblyCodeGen -lLLVMLLVMWebAssemblyAsmParser -lLLVMLLVMWebAssemblyDisassembler -lLLVMLLVMWebAssemblyDesc -lLLVMLLVMWebAssemblyInfo -lLLVMLLVMX86CodeGen -lLLVMLLVMX86AsmParser -lLLVMLLVMX86Disassembler -lLLVMLLVMX86Desc -lLLVMLLVMX86Info -lLLVMLLVMX86Utils -lLLVMLLVMXCoreCodeGen -lLLVMLLVMXCoreDisassembler -lLLVMLLVMXCoreDesc -lLLVMLLVMXCoreInfo -lLLVMLLVMAsmParser -lLLVMLLVMLineEditor -lLLVMLLVMProfileData -lLLVMLLVMCoverage -lLLVMLLVMPasses -lLLVMLLVMTextAPI -lLLVMLLVMDlltoolDriver -lLLVMLLVMLibDriver -lLLVMLLVMXRay -lLLVMLLVMWindowsManifest lib/libLLVMLTO.a lib/libLLVMRemarks.a lib/libLLVMObjCARCOpts.a lib/libLLVMPasses.a lib/libLLVMCodeGen.a lib/libLLVMTarget.a lib/libLLVMipo.a lib/libLLVMBitWriter.a lib/libLLVMLinker.a lib/libLLVMScalarOpts.a lib/libLLVMAggressiveInstCombine.a lib/libLLVMInstCombine.a lib/libLLVMInstrumentation.a lib/libLLVMVectorize.a lib/libLLVMTransformUtils.a lib/libLLVMAnalysis.a lib/libLLVMObject.a lib/libLLVMMCParser.a lib/libLLVMMC.a lib/libLLVMDebugInfoCodeView.a lib/libLLVMDebugInfoMSF.a lib/libLLVMProfileData.a lib/libLLVMIRReader.a lib/libLLVMBitReader.a lib/libLLVMBitstreamReader.a lib/libLLVMAsmParser.a lib/libLLVMCore.a lib/libLLVMRemarks.a lib/libLLVMBinaryFormat.a lib/libLLVMSupport.a -lz -lcurses -lm lib/libLLVMDemangle.a && : FAILED: bin/Kaleidoscope-Ch8 : && /Applications/Xcode.app/Contents/Developer/Toolchains/XcodeDefault.xctoolchain/usr/bin/c++ -fPIC -fvisibility-inlines-hidden -Werror=date-time -Werror=unguarded-availability-new -std=c++11 -Wall -Wextra -Wno-unused-parameter -Wwrite-strings -Wcast-qual -Wmissing-field-initializers -pedantic -Wno-long-long -Wimplicit-fallthrough -Wcovered-switch-default -Wno-noexcept-type -Wnon-virtual-dtor -Wdelete-non-virtual-dtor -Wstring-conversion -fdiagnostics-color -O3 -isysroot /Applications/Xcode.app/Contents/Developer/Platforms/MacOSX.platform/Developer/SDKs/MacOSX10.13.sdk -mmacosx-version-min=10.9 -Wl,-search_paths_first -Wl,-headerpad_max_install_names -Wl,-dead_strip -rdynamic examples/Kaleidoscope/Chapter8/CMakeFiles/Kaleidoscope-Ch8.dir/toy.cpp.o -o bin/Kaleidoscope-Ch8 -Wl,-rpath,@loader_path/../lib -lLLVMLLVMDemangle -lLLVMLLVMSupport -lLLVMLLVMTableGen -lLLVMLLVMCore -lLLVMLLVMFuzzMutate -lLLVMLLVMIRReader -lLLVMLLVMCodeGen -lLLVMLLVMSelectionDAG -lLLVMLLVMAsmPrinter -lLLVMLLVMMIRParser -lLLVMLLVMGlobalISel -lLLVMLLVMBinaryFormat -lLLVMLLVMBitReader -lLLVMLLVMBitWriter -lLLVMLLVMBitstreamReader -lLLVMLLVMTransformUtils -lLLVMLLVMInstrumentation -lLLVMLLVMAggressiveInstCombine -lLLVMLLVMInstCombine -lLLVMLLVMScalarOpts -lLLVMLLVMipo -lLLVMLLVMVectorize -lLLVMLLVMObjCARCOpts -lLLVMLLVMCoroutines -lLLVMLLVMLinker -lLLVMLLVMAnalysis -lLLVMLLVMLTO -lLLVMLLVMMC -lLLVMLLVMMCParser -lLLVMLLVMMCDisassembler -lLLVMLLVMMCA -lLLVMLLVMObject -lLLVMLLVMObjectYAML -lLLVMLLVMOption -lLLVMLLVMRemarks -lLLVMLLVMDebugInfoDWARF -lLLVMLLVMDebugInfoGSYM -lLLVMLLVMDebugInfoMSF -lLLVMLLVMDebugInfoCodeView -lLLVMLLVMDebugInfoPDB -lLLVMLLVMSymbolize -lLLVMLLVMExecutionEngine -lLLVMLLVMInterpreter -lLLVMLLVMJITLink -lLLVMLLVMMCJIT -lLLVMLLVMOrcJIT -lLLVMLLVMRuntimeDyld -lLLVMLLVMTarget -lLLVMLLVMAArch64CodeGen -lLLVMLLVMAArch64AsmParser -lLLVMLLVMAArch64Disassembler -lLLVMLLVMAArch64Desc -lLLVMLLVMAArch64Info -lLLVMLLVMAArch64Utils -lLLVMLLVMAMDGPUCodeGen -lLLVMLLVMAMDGPUAsmParser -lLLVMLLVMAMDGPUDisassembler -lLLVMLLVMAMDGPUDesc -lLLVMLLVMAMDGPUInfo -lLLVMLLVMAMDGPUUtils -lLLVMLLVMARMCodeGen -lLLVMLLVMARMAsmParser -lLLVMLLVMARMDisassembler -lLLVMLLVMARMDesc -lLLVMLLVMARMInfo -lLLVMLLVMARMUtils -lLLVMLLVMBPFCodeGen -lLLVMLLVMBPFAsmParser -lLLVMLLVMBPFDisassembler -lLLVMLLVMBPFDesc -lLLVMLLVMBPFInfo -lLLVMLLVMHexagonCodeGen -lLLVMLLVMHexagonAsmParser -lLLVMLLVMHexagonDisassembler -lLLVMLLVMHexagonDesc -lLLVMLLVMHexagonInfo -lLLVMLLVMLanaiCodeGen -lLLVMLLVMLanaiAsmParser -lLLVMLLVMLanaiDisassembler -lLLVMLLVMLanaiDesc -lLLVMLLVMLanaiInfo -lLLVMLLVMMipsCodeGen -lLLVMLLVMMipsAsmParser -lLLVMLLVMMipsDisassembler -lLLVMLLVMMipsDesc -lLLVMLLVMMipsInfo -lLLVMLLVMMSP430CodeGen -lLLVMLLVMMSP430Desc -lLLVMLLVMMSP430Info -lLLVMLLVMMSP430AsmParser -lLLVMLLVMMSP430Disassembler -lLLVMLLVMNVPTXCodeGen -lLLVMLLVMNVPTXDesc -lLLVMLLVMNVPTXInfo -lLLVMLLVMPowerPCCodeGen -lLLVMLLVMPowerPCAsmParser -lLLVMLLVMPowerPCDisassembler -lLLVMLLVMPowerPCDesc -lLLVMLLVMPowerPCInfo -lLLVMLLVMRISCVCodeGen -lLLVMLLVMRISCVAsmParser -lLLVMLLVMRISCVDisassembler -lLLVMLLVMRISCVDesc -lLLVMLLVMRISCVInfo -lLLVMLLVMRISCVUtils -lLLVMLLVMSparcCodeGen -lLLVMLLVMSparcAsmParser -lLLVMLLVMSparcDisassembler -lLLVMLLVMSparcDesc -lLLVMLLVMSparcInfo -lLLVMLLVMSystemZCodeGen -lLLVMLLVMSystemZAsmParser -lLLVMLLVMSystemZDisassembler -lLLVMLLVMSystemZDesc -lLLVMLLVMSystemZInfo -lLLVMLLVMWebAssemblyCodeGen -lLLVMLLVMWebAssemblyAsmParser -lLLVMLLVMWebAssemblyDisassembler -lLLVMLLVMWebAssemblyDesc -lLLVMLLVMWebAssemblyInfo -lLLVMLLVMX86CodeGen -lLLVMLLVMX86AsmParser -lLLVMLLVMX86Disassembler -lLLVMLLVMX86Desc -lLLVMLLVMX86Info -lLLVMLLVMX86Utils -lLLVMLLVMXCoreCodeGen -lLLVMLLVMXCoreDisassembler -lLLVMLLVMXCoreDesc -lLLVMLLVMXCoreInfo -lLLVMLLVMAsmParser -lLLVMLLVMLineEditor -lLLVMLLVMProfileData -lLLVMLLVMCoverage -lLLVMLLVMPasses -lLLVMLLVMTextAPI -lLLVMLLVMDlltoolDriver -lLLVMLLVMLibDriver -lLLVMLLVMXRay -lLLVMLLVMWindowsManifest lib/libLLVMLTO.a lib/libLLVMRemarks.a lib/libLLVMObjCARCOpts.a lib/libLLVMPasses.a lib/libLLVMCodeGen.a lib/libLLVMTarget.a lib/libLLVMipo.a lib/libLLVMBitWriter.a lib/libLLVMLinker.a lib/libLLVMScalarOpts.a lib/libLLVMAggressiveInstCombine.a lib/libLLVMInstCombine.a lib/libLLVMInstrumentation.a lib/libLLVMVectorize.a lib/libLLVMTransformUtils.a lib/libLLVMAnalysis.a lib/libLLVMObject.a lib/libLLVMMCParser.a lib/libLLVMMC.a lib/libLLVMDebugInfoCodeView.a lib/libLLVMDebugInfoMSF.a lib/libLLVMProfileData.a lib/libLLVMIRReader.a lib/libLLVMBitReader.a lib/libLLVMBitstreamReader.a lib/libLLVMAsmParser.a lib/libLLVMCore.a lib/libLLVMRemarks.a lib/libLLVMBinaryFormat.a lib/libLLVMSupport.a -lz -lcurses -lm lib/libLLVMDemangle.a && : ld: library not found for -lLLVMLLVMDemangle clang: error: linker command failed with exit code 1 (use -v to see invocation) [6/144] cd /Users/buildslave/jenkins/workspace/clang-stage1-cmake-RA-incremental/clang-build && /Users/buildslave/jenkins/workspace/clang-stage1-cmake-RA-incremental/clang-build/bin/llvm-tblgen -gen-register-info -I /Users/buildslave/jenkins/workspace/clang-stage1-cmake-RA-incremental/llvm/lib/Target/AMDGPU -I /Users/buildslave/jenkins/workspace/clang-stage1-cmake-RA-incremental/llvm/include -I /Users/buildslave/jenkins/workspace/clang-stage1-cmake-RA-incremental/llvm/lib/Target /Users/buildslave/jenkins/workspace/clang-stage1-cmake-RA-incremental/llvm/lib/Target/AMDGPU/R600.td -o lib/Target/AMDGPU/R600GenRegisterInfo.inc -d lib/Target/AMDGPU/R600GenRegisterInfo.inc.d [7/144] cd /Users/buildslave/jenkins/workspace/clang-stage1-cmake-RA-incremental/clang-build && /Users/buildslave/jenkins/workspace/clang-stage1-cmake-RA-incremental/clang-build/bin/llvm-tblgen -gen-dag-isel -I /Users/buildslave/jenkins/workspace/clang-stage1-cmake-RA-incremental/llvm/lib/Target/AMDGPU -I /Users/buildslave/jenkins/workspace/clang-stage1-cmake-RA-incremental/llvm/include -I /Users/buildslave/jenkins/workspace/clang-stage1-cmake-RA-incremental/llvm/lib/Target /Users/buildslave/jenkins/workspace/clang-stage1-cmake-RA-incremental/llvm/lib/Target/AMDGPU/R600.td -o lib/Target/AMDGPU/R600GenDAGISel.inc -d lib/Target/AMDGPU/R600GenDAGISel.inc.d [8/144] cd /Users/buildslave/jenkins/workspace/clang-stage1-cmake-RA-incremental/clang-build && /Users/buildslave/jenkins/workspace/clang-stage1-cmake-RA-incremental/clang-build/bin/llvm-tblgen -gen-subtarget -I /Users/buildslave/jenkins/workspace/clang-stage1-cmake-RA-incremental/llvm/lib/Target/AMDGPU -I /Users/buildslave/jenkins/workspace/clang-stage1-cmake-RA-incremental/llvm/include -I /Users/buildslave/jenkins/workspace/clang-stage1-cmake-RA-incremental/llvm/lib/Target /Users/buildslave/jenkins/workspace/clang-stage1-cmake-RA-incremental/llvm/lib/Target/AMDGPU/R600.td -o lib/Target/AMDGPU/R600GenSubtargetInfo.inc -d lib/Target/AMDGPU/R600GenSubtargetInfo.inc.d [9/144] cd /Users/buildslave/jenkins/workspace/clang-stage1-cmake-RA-incremental/clang-build && /Users/buildslave/jenkins/workspace/clang-stage1-cmake-RA-incremental/clang-build/bin/llvm-tblgen -gen-searchable-tables -I /Users/buildslave/jenkins/workspace/clang-stage1-cmake-RA-incremental/llvm/lib/Target/AMDGPU -I /Users/buildslave/jenkins/workspace/clang-stage1-cmake-RA-incremental/llvm/include -I /Users/buildslave/jenkins/workspace/clang-stage1-cmake-RA-incremental/llvm/lib/Target /Users/buildslave/jenkins/workspace/clang-stage1-cmake-RA-incremental/llvm/lib/Target/AMDGPU/AMDGPU.td -o lib/Target/AMDGPU/AMDGPUGenSearchableTables.inc -d lib/Target/AMDGPU/AMDGPUGenSearchableTables.inc.d [10/140] cd /Users/buildslave/jenkins/workspace/clang-stage1-cmake-RA-incremental/clang-build && /Users/buildslave/jenkins/workspace/clang-stage1-cmake-RA-incremental/clang-build/bin/llvm-tblgen -gen-register-bank -I /Users/buildslave/jenkins/workspace/clang-stage1-cmake-RA-incremental/llvm/lib/Target/AMDGPU -I /Users/buildslave/jenkins/workspace/clang-stage1-cmake-RA-incremental/llvm/include -I /Users/buildslave/jenkins/workspace/clang-stage1-cmake-RA-incremental/llvm/lib/Target /Users/buildslave/jenkins/workspace/clang-stage1-cmake-RA-incremental/llvm/lib/Target/AMDGPU/AMDGPU.td -o lib/Target/AMDGPU/AMDGPUGenRegisterBank.inc -d lib/Target/AMDGPU/AMDGPUGenRegisterBank.inc.d [11/140] cd /Users/buildslave/jenkins/workspace/clang-stage1-cmake-RA-incremental/clang-build && /Users/buildslave/jenkins/workspace/clang-stage1-cmake-RA-incremental/clang-build/bin/llvm-tblgen -gen-subtarget -I /Users/buildslave/jenkins/workspace/clang-stage1-cmake-RA-incremental/llvm/lib/Target/AMDGPU -I /Users/buildslave/jenkins/workspace/clang-stage1-cmake-RA-incremental/llvm/include -I /Users/buildslave/jenkins/workspace/clang-stage1-cmake-RA-incremental/llvm/lib/Target /Users/buildslave/jenkins/workspace/clang-stage1-cmake-RA-incremental/llvm/lib/Target/AMDGPU/AMDGPU.td -o lib/Target/AMDGPU/AMDGPUGenSubtargetInfo.inc -d lib/Target/AMDGPU/AMDGPUGenSubtargetInfo.inc.d [12/140] cd /Users/buildslave/jenkins/workspace/clang-stage1-cmake-RA-incremental/clang-build && /Users/buildslave/jenkins/workspace/clang-stage1-cmake-RA-incremental/clang-build/bin/llvm-tblgen -gen-register-info -I /Users/buildslave/jenkins/workspace/clang-stage1-cmake-RA-incremental/llvm/lib/Target/AMDGPU -I /Users/buildslave/jenkins/workspace/clang-stage1-cmake-RA-incremental/llvm/include -I /Users/buildslave/jenkins/workspace/clang-stage1-cmake-RA-incremental/llvm/lib/Target /Users/buildslave/jenkins/workspace/clang-stage1-cmake-RA-incremental/llvm/lib/Target/AMDGPU/AMDGPU.td -o lib/Target/AMDGPU/AMDGPUGenRegisterInfo.inc -d lib/Target/AMDGPU/AMDGPUGenRegisterInfo.inc.d [13/40] cd /Users/buildslave/jenkins/workspace/clang-stage1-cmake-RA-incremental/clang-build && /Users/buildslave/jenkins/workspace/clang-stage1-cmake-RA-incremental/clang-build/bin/llvm-tblgen -gen-global-isel -I /Users/buildslave/jenkins/workspace/clang-stage1-cmake-RA-incremental/llvm/lib/Target/AMDGPU -I /Users/buildslave/jenkins/workspace/clang-stage1-cmake-RA-incremental/llvm/include -I /Users/buildslave/jenkins/workspace/clang-stage1-cmake-RA-incremental/llvm/lib/Target /Users/buildslave/jenkins/workspace/clang-stage1-cmake-RA-incremental/llvm/lib/Target/AMDGPU/AMDGPUGISel.td -o lib/Target/AMDGPU/AMDGPUGenGlobalISel.inc -d lib/Target/AMDGPU/AMDGPUGenGlobalISel.inc.d [14/40] /Applications/Xcode.app/Contents/Developer/Toolchains/XcodeDefault.xctoolchain/usr/bin/c++ -DCMAKE_CFG_INTDIR=\".\" -DGTEST_HAS_RTTI=0 -D_DEBUG -D__STDC_CONSTANT_MACROS -D__STDC_FORMAT_MACROS -D__STDC_LIMIT_MACROS -Itools/llvm-config -I/Users/buildslave/jenkins/workspace/clang-stage1-cmake-RA-incremental/llvm/tools/llvm-config -I/Applications/Xcode.app/Contents/Developer/Platforms/MacOSX.platform/Developer/SDKs/MacOSX10.13.sdk/usr/include/libxml2 -Iinclude -I/Users/buildslave/jenkins/workspace/clang-stage1-cmake-RA-incremental/llvm/include -fPIC -fvisibility-inlines-hidden -Werror=date-time -Werror=unguarded-availability-new -std=c++11 -Wall -Wextra -Wno-unused-parameter -Wwrite-strings -Wcast-qual -Wmissing-field-initializers -pedantic -Wno-long-long -Wimplicit-fallthrough -Wcovered-switch-default -Wno-noexcept-type -Wnon-virtual-dtor -Wdelete-non-virtual-dtor -Wstring-conversion -fdiagnostics-color -O3 -isysroot /Applications/Xcode.app/Contents/Developer/Platforms/MacOSX.platform/Developer/SDKs/MacOSX10.13.sdk -mmacosx-version-min=10.9 -UNDEBUG -fno-exceptions -fno-rtti -MD -MT tools/llvm-config/CMakeFiles/llvm-config.dir/llvm-config.cpp.o -MF tools/llvm-config/CMakeFiles/llvm-config.dir/llvm-config.cpp.o.d -o tools/llvm-config/CMakeFiles/llvm-config.dir/llvm-config.cpp.o -c /Users/buildslave/jenkins/workspace/clang-stage1-cmake-RA-incremental/llvm/tools/llvm-config/llvm-config.cpp ninja: build stopped: subcommand failed. Command failed Command: ['/usr/local/bin/ninja', '-v', 'all'] Build step 'Execute shell' marked build as failure New run name is 'rL:366611 - C:366592 - #63368' [WARNINGS] Skipping publisher since build result is FAILURE Recording test results ERROR: Step ‘Publish JUnit test result report’ failed: Test reports were found but none of them are new. Did leafNodes run? For example, /Users/buildslave/jenkins/workspace/clang-stage1-cmake-RA-incremental/clang-build/testresults.xunit.xml is 4 min 53 sec old

Hide Details

[BFA] Scanning build for known causes... [BFA] Found failure cause(s): [BFA] Ninja target failed from category Compile [BFA] Compile Error from category Compile [BFA] Link error [BFA] Done. 0s No emails were triggered. Finished: FAILURE